test packages.x86_64-linux.nix-ci-check-gammaloop-nextest-core

Reproduce this run
Original Run
  1. 0.00 s $ /nix/store/9ypz3flqsrl5xl495mm8h645gadjsxi1-coreutils-9.11/bin/timeout --kill-after=15s 7200s /nix/store/23zk8sgzamrbmj1fday15szf7f2279s8-nix-2.34.7/bin/nix --extra-experimental-features nix-command --extra-experimental-features flakes flake clone git+https://github.com/alphal00p/gammaloop --dest /tmp/nix-ci-worker/stable-pwd/repo/
  2. 0.07 s Cloning into '/tmp/nix-ci-worker/stable-pwd/repo'...
  3. 0.75 s remote: Enumerating objects: 78084, done.
  4. 0.87 s remote: Counting objects: 0% (1/13906) remote: Counting objects: 1% (140/13906) remote: Counting objects: 2% (279/13906) remote: Counting objects: 3% (418/13906) remote: Counting objects: 4% (557/13906) remote: Counting objects: 5% (696/13906) remote: Counting objects: 6% (835/13906) remote: Counting objects: 7% (974/13906) remote: Counting objects: 8% (1113/13906) remote: Counting objects: 9% (1252/13906) remote: Counting objects: 10% (1391/13906) remote: Counting objects: 11% (1530/13906) remote: Counting objects: 12% (1669/13906) remote: Counting objects: 13% (1808/13906) remote: Counting objects: 14% (1947/13906) remote: Counting objects: 15% (2086/13906) remote: Counting objects: 16% (2225/13906) remote: Counting objects: 17% (2365/13906) remote: Counting objects: 18% (2504/13906) remote: Counting objects: 19% (2643/13906) remote: Counting objects: 20% (2782/13906) remote: Counting objects: 21% (2921/13906) remote: Counting objects: 22% (3060/13906) remote: Counting objects: 23% (3199/13906) remote: Counting objects: 24% (3338/13906) remote: Counting objects: 25% (3477/13906) remote: Counting objects: 26% (3616/13906) remote: Counting objects: 27% (3755/13906) remote: Counting objects: 28% (3894/13906) remote: Counting objects: 29% (4033/13906) remote: Counting objects: 30% (4172/13906) remote: Counting objects: 31% (4311/13906) remote: Counting objects: 32% (4450/13906) remote: Counting objects: 33% (4589/13906) remote: Counting objects: 34% (4729/13906) remote: Counting objects: 35% (4868/13906) remote: Counting objects: 36% (5007/13906) remote: Counting objects: 37% (5146/13906) remote: Counting objects: 38% (5285/13906) remote: Counting objects: 39% (5424/13906) remote: Counting objects: 40% (5563/13906) remote: Counting objects: 41% (5702/13906) remote: Counting objects: 42% (5841/13906) remote: Counting objects: 43% (5980/13906) remote: Counting objects: 44% (6119/13906) remote: Counting objects: 45% (6258/13906) remote: Counting objects: 46% (6397/13906) remote: Counting objects: 47% (6536/13906) remote: Counting objects: 48% (6675/13906) remote: Counting objects: 49% (6814/13906) remote: Counting objects: 50% (6953/13906) remote: Counting objects: 51% (7093/13906) remote: Counting objects: 52% (7232/13906) remote: Counting objects: 53% (7371/13906) remote: Counting objects: 54% (7510/13906) remote: Counting objects: 55% (7649/13906) remote: Counting objects: 56% (7788/13906) remote: Counting objects: 57% (7927/13906) remote: Counting objects: 58% (8066/13906) remote: Counting objects: 59% (8205/13906) remote: Counting objects: 60% (8344/13906) remote: Counting objects: 61% (8483/13906) remote: Counting objects: 62% (8622/13906) remote: Counting objects: 63% (8761/13906) remote: Counting objects: 64% (8900/13906) remote: Counting objects: 65% (9039/13906) remote: Counting objects: 66% (9178/13906) remote: Counting objects: 67% (9318/13906) remote: Counting objects: 68% (9457/13906) remote: Counting objects: 69% (9596/13906) remote: Counting objects: 70% (9735/13906) remote: Counting objects: 71% (9874/13906) remote: Counting objects: 72% (10013/13906) remote: Counting objects: 73% (10152/13906) remote: Counting objects: 74% (10291/13906) remote: Counting objects: 75% (10430/13906) remote: Counting objects: 76% (10569/13906) remote: Counting objects: 77% (10708/13906) remote: Counting objects: 78% (10847/13906) remote: Counting objects: 79% (10986/13906) remote: Counting objects: 80% (11125/13906) remote: Counting objects: 81% (11264/13906) remote: Counting objects: 82% (11403/13906) remote: Counting objects: 83% (11542/13906) remote: Counting objects: 84% (11682/13906) remote: Counting objects: 85% (11821/13906) remote: Counting objects: 86% (11960/13906) remote: Counting objects: 87% (12099/13906) remote: Counting objects: 88% (12238/13906) remote: Counting objects: 89% (12377/13906) remote: Counting objects: 90% (12516/13906) remote: Counting objects: 91% (12655/13906) remote: Counting objects: 92% (12794/13906) remote: Counting objects: 93% (12933/13906) remote: Counting objects: 94% (13072/13906) remote: Counting objects: 95% (13211/13906) remote: Counting objects: 96% (13350/13906) remote: Counting objects: 97% (13489/13906) remote: Counting objects: 98% (13628/13906) remote: Counting objects: 99% (13767/13906) remote: Counting objects: 100% (13906/13906) remote: Counting objects: 100% (13906/13906), done.
  5. 3.64 s remote: Compressing objects: 0% (1/3095) remote: Compressing objects: 1% (31/3095) remote: Compressing objects: 2% (62/3095) remote: Compressing objects: 3% (93/3095) remote: Compressing objects: 4% (124/3095) remote: Compressing objects: 5% (155/3095) remote: Compressing objects: 6% (186/3095) remote: Compressing objects: 7% (217/3095) remote: Compressing objects: 8% (248/3095) remote: Compressing objects: 9% (279/3095) remote: Compressing objects: 10% (310/3095) remote: Compressing objects: 11% (341/3095) remote: Compressing objects: 12% (372/3095) remote: Compressing objects: 13% (403/3095) remote: Compressing objects: 14% (434/3095) remote: Compressing objects: 15% (465/3095) remote: Compressing objects: 16% (496/3095) remote: Compressing objects: 17% (527/3095) remote: Compressing objects: 18% (558/3095) remote: Compressing objects: 19% (589/3095) remote: Compressing objects: 20% (619/3095) remote: Compressing objects: 21% (650/3095) remote: Compressing objects: 22% (681/3095) remote: Compressing objects: 23% (712/3095) remote: Compressing objects: 24% (743/3095) remote: Compressing objects: 24% (771/3095) remote: Compressing objects: 25% (774/3095) remote: Compressing objects: 26% (805/3095) remote: Compressing objects: 27% (836/3095) remote: Compressing objects: 28% (867/3095) remote: Compressing objects: 28% (882/3095) remote: Compressing objects: 29% (898/3095) remote: Compressing objects: 30% (929/3095) remote: Compressing objects: 31% (960/3095) remote: Compressing objects: 32% (991/3095) remote: Compressing objects: 33% (1022/3095) remote: Compressing objects: 34% (1053/3095) remote: Compressing objects: 35% (1084/3095) remote: Compressing objects: 36% (1115/3095) remote: Compressing objects: 37% (1146/3095) remote: Compressing objects: 38% (1177/3095) remote: Compressing objects: 39% (1208/3095) remote: Compressing objects: 40% (1238/3095) remote: Compressing objects: 41% (1269/3095) remote: Compressing objects: 42% (1300/3095) remote: Compressing objects: 43% (1331/3095) remote: Compressing objects: 44% (1362/3095) remote: Compressing objects: 45% (1393/3095) remote: Compressing objects: 46% (1424/3095) remote: Compressing objects: 47% (1455/3095) remote: Compressing objects: 48% (1486/3095) remote: Compressing objects: 49% (1517/3095) remote: Compressing objects: 50% (1548/3095) remote: Compressing objects: 51% (1579/3095) remote: Compressing objects: 52% (1610/3095) remote: Compressing objects: 53% (1641/3095) remote: Compressing objects: 54% (1672/3095) remote: Compressing objects: 55% (1703/3095) remote: Compressing objects: 56% (1734/3095) remote: Compressing objects: 57% (1765/3095) remote: Compressing objects: 58% (1796/3095) remote: Compressing objects: 59% (1827/3095) remote: Compressing objects: 60% (1857/3095) remote: Compressing objects: 61% (1888/3095) remote: Compressing objects: 62% (1919/3095) remote: Compressing objects: 63% (1950/3095) remote: Compressing objects: 64% (1981/3095) remote: Compressing objects: 65% (2012/3095) remote: Compressing objects: 66% (2043/3095) remote: Compressing objects: 67% (2074/3095) remote: Compressing objects: 68% (2105/3095) remote: Compressing objects: 69% (2136/3095) remote: Compressing objects: 70% (2167/3095) remote: Compressing objects: 71% (2198/3095) remote: Compressing objects: 72% (2229/3095) remote: Compressing objects: 73% (2260/3095) remote: Compressing objects: 74% (2291/3095) remote: Compressing objects: 75% (2322/3095) remote: Compressing objects: 76% (2353/3095) remote: Compressing objects: 77% (2384/3095) remote: Compressing objects: 78% (2415/3095) remote: Compressing objects: 79% (2446/3095) remote: Compressing objects: 80% (2476/3095) remote: Compressing objects: 81% (2507/3095) remote: Compressing objects: 82% (2538/3095) remote: Compressing objects: 83% (2569/3095) remote: Compressing objects: 84% (2600/3095) remote: Compressing objects: 85% (2631/3095) remote: Compressing objects: 86% (2662/3095) remote: Compressing objects: 87% (2693/3095) remote: Compressing objects: 88% (2724/3095) remote: Compressing objects: 89% (2755/3095) remote: Compressing objects: 90% (2786/3095) remote: Compressing objects: 91% (2817/3095) remote: Compressing objects: 92% (2848/3095) remote: Compressing objects: 93% (2879/3095) remote: Compressing objects: 94% (2910/3095) remote: Compressing objects: 95% (2941/3095) remote: Compressing objects: 96% (2972/3095) remote: Compressing objects: 97% (3003/3095) remote: Compressing objects: 98% (3034/3095) remote: Compressing objects: 99% (3065/3095) remote: Compressing objects: 100% (3095/3095) remote: Compressing objects: 100% (3095/3095), done.
  6. 7.52 s Receiving objects: 0% (1/78084) Receiving objects: 1% (781/78084) Receiving objects: 2% (1562/78084) Receiving objects: 3% (2343/78084) Receiving objects: 4% (3124/78084) Receiving objects: 5% (3905/78084) Receiving objects: 6% (4686/78084) Receiving objects: 7% (5466/78084) Receiving objects: 8% (6247/78084) Receiving objects: 9% (7028/78084) Receiving objects: 10% (7809/78084), 14.55 MiB | 29.08 MiB/s Receiving objects: 11% (8590/78084), 14.55 MiB | 29.08 MiB/s Receiving objects: 12% (9371/78084), 14.55 MiB | 29.08 MiB/s Receiving objects: 13% (10151/78084), 14.55 MiB | 29.08 MiB/s Receiving objects: 14% (10932/78084), 14.55 MiB | 29.08 MiB/s Receiving objects: 15% (11713/78084), 14.55 MiB | 29.08 MiB/s Receiving objects: 16% (12494/78084), 14.55 MiB | 29.08 MiB/s Receiving objects: 17% (13275/78084), 14.55 MiB | 29.08 MiB/s Receiving objects: 18% (14056/78084), 14.55 MiB | 29.08 MiB/s Receiving objects: 19% (14836/78084), 14.55 MiB | 29.08 MiB/s Receiving objects: 20% (15617/78084), 14.55 MiB | 29.08 MiB/s Receiving objects: 21% (16398/78084), 14.55 MiB | 29.08 MiB/s Receiving objects: 22% (17179/78084), 14.55 MiB | 29.08 MiB/s Receiving objects: 23% (17960/78084), 14.55 MiB | 29.08 MiB/s Receiving objects: 24% (18741/78084), 14.55 MiB | 29.08 MiB/s Receiving objects: 25% (19521/78084), 14.55 MiB | 29.08 MiB/s Receiving objects: 26% (20302/78084), 14.55 MiB | 29.08 MiB/s Receiving objects: 27% (21083/78084), 14.55 MiB | 29.08 MiB/s Receiving objects: 28% (21864/78084), 14.55 MiB | 29.08 MiB/s Receiving objects: 29% (22645/78084), 14.55 MiB | 29.08 MiB/s Receiving objects: 30% (23426/78084), 14.55 MiB | 29.08 MiB/s Receiving objects: 31% (24207/78084), 14.55 MiB | 29.08 MiB/s Receiving objects: 32% (24987/78084), 14.55 MiB | 29.08 MiB/s Receiving objects: 33% (25768/78084), 14.55 MiB | 29.08 MiB/s Receiving objects: 34% (26549/78084), 14.55 MiB | 29.08 MiB/s Receiving objects: 35% (27330/78084), 14.55 MiB | 29.08 MiB/s Receiving objects: 36% (28111/78084), 14.55 MiB | 29.08 MiB/s Receiving objects: 37% (28892/78084), 14.55 MiB | 29.08 MiB/s Receiving objects: 38% (29672/78084), 14.55 MiB | 29.08 MiB/s Receiving objects: 39% (30453/78084), 14.55 MiB | 29.08 MiB/s Receiving objects: 40% (31234/78084), 14.55 MiB | 29.08 MiB/s Receiving objects: 41% (32015/78084), 14.55 MiB | 29.08 MiB/s Receiving objects: 42% (32796/78084), 14.55 MiB | 29.08 MiB/s Receiving objects: 42% (33179/78084), 31.01 MiB | 31.00 MiB/s Receiving objects: 43% (33577/78084), 31.01 MiB | 31.00 MiB/s Receiving objects: 44% (34357/78084), 31.01 MiB | 31.00 MiB/s Receiving objects: 45% (35138/78084), 31.01 MiB | 31.00 MiB/s Receiving objects: 46% (35919/78084), 31.01 MiB | 31.00 MiB/s Receiving objects: 47% (36700/78084), 31.01 MiB | 31.00 MiB/s Receiving objects: 48% (37481/78084), 31.01 MiB | 31.00 MiB/s Receiving objects: 49% (38262/78084), 31.01 MiB | 31.00 MiB/s Receiving objects: 50% (39042/78084), 31.01 MiB | 31.00 MiB/s Receiving objects: 51% (39823/78084), 31.01 MiB | 31.00 MiB/s Receiving objects: 52% (40604/78084), 47.09 MiB | 30.94 MiB/s Receiving objects: 53% (41385/78084), 47.09 MiB | 30.94 MiB/s Receiving objects: 54% (42166/78084), 47.09 MiB | 30.94 MiB/s Receiving objects: 55% (42947/78084), 47.09 MiB | 30.94 MiB/s Receiving objects: 56% (43728/78084), 47.09 MiB | 30.94 MiB/s Receiving objects: 57% (44508/78084), 47.09 MiB | 30.94 MiB/s Receiving objects: 58% (45289/78084), 47.09 MiB | 30.94 MiB/s Receiving objects: 59% (46070/78084), 47.09 MiB | 30.94 MiB/s Receiving objects: 60% (46851/78084), 47.09 MiB | 30.94 MiB/s Receiving objects: 61% (47632/78084), 47.09 MiB | 30.94 MiB/s Receiving objects: 62% (48413/78084), 47.09 MiB | 30.94 MiB/s Receiving objects: 62% (48916/78084), 63.06 MiB | 30.67 MiB/s Receiving objects: 63% (49193/78084), 63.06 MiB | 30.67 MiB/s Receiving objects: 64% (49974/78084), 63.06 MiB | 30.67 MiB/s Receiving objects: 65% (50755/78084), 63.06 MiB | 30.67 MiB/s Receiving objects: 66% (51536/78084), 63.06 MiB | 30.67 MiB/s Receiving objects: 67% (52317/78084), 63.06 MiB | 30.67 MiB/s Receiving objects: 68% (53098/78084), 63.06 MiB | 30.67 MiB/s Receiving objects: 69% (53878/78084), 63.06 MiB | 30.67 MiB/s Receiving objects: 70% (54659/78084), 79.45 MiB | 31.08 MiB/s Receiving objects: 71% (55440/78084), 79.45 MiB | 31.08 MiB/s Receiving objects: 72% (56221/78084), 79.45 MiB | 31.08 MiB/s Receiving objects: 73% (57002/78084), 79.45 MiB | 31.08 MiB/s Receiving objects: 74% (57783/78084), 79.45 MiB | 31.08 MiB/s Receiving objects: 75% (58563/78084), 79.45 MiB | 31.08 MiB/s Receiving objects: 76% (59344/78084), 79.45 MiB | 31.08 MiB/s Receiving objects: 77% (60125/78084), 79.45 MiB | 31.08 MiB/s Receiving objects: 78% (60906/78084), 79.45 MiB | 31.08 MiB/s Receiving objects: 79% (61687/78084), 79.45 MiB | 31.08 MiB/s Receiving objects: 79% (62419/78084), 79.45 MiB | 31.08 MiB/s Receiving objects: 80% (62468/78084), 79.45 MiB | 31.08 MiB/s Receiving objects: 81% (63249/78084), 95.25 MiB | 31.18 MiB/s Receiving objects: 82% (64029/78084), 95.25 MiB | 31.18 MiB/s Receiving objects: 83% (64810/78084), 95.25 MiB | 31.18 MiB/s Receiving objects: 84% (65591/78084), 95.25 MiB | 31.18 MiB/s Receiving objects: 85% (66372/78084), 95.25 MiB | 31.18 MiB/s Receiving objects: 86% (67153/78084), 95.25 MiB | 31.18 MiB/s Receiving objects: 87% (67934/78084), 95.25 MiB | 31.18 MiB/s Receiving objects: 88% (68714/78084), 95.25 MiB | 31.18 MiB/s Receiving objects: 89% (69495/78084), 111.24 MiB | 31.29 MiB/s Receiving objects: 90% (70276/78084), 111.24 MiB | 31.29 MiB/s Receiving objects: 91% (71057/78084), 111.24 MiB | 31.29 MiB/s Receiving objects: 92% (71838/78084), 111.24 MiB | 31.29 MiB/s Receiving objects: 93% (72619/78084), 111.24 MiB | 31.29 MiB/s Receiving objects: 94% (73399/78084), 111.24 MiB | 31.29 MiB/s Receiving objects: 95% (74180/78084), 111.24 MiB | 31.29 MiB/s Receiving objects: 96% (74961/78084), 111.24 MiB | 31.29 MiB/s Receiving objects: 97% (75742/78084), 111.24 MiB | 31.29 MiB/s Receiving objects: 98% (76523/78084), 111.24 MiB | 31.29 MiB/s Receiving objects: 99% (77304/78084), 111.24 MiB | 31.29 MiB/s remote: Total 78084 (delta 9811), reused 11671 (delta 8715), pack-reused 64178 (from 2)
  7. 7.53 s Receiving objects: 100% (78084/78084), 111.24 MiB | 31.29 MiB/s Receiving objects: 100% (78084/78084), 120.79 MiB | 31.10 MiB/s, done.
  8. 8.42 s Resolving deltas: 0% (0/53130) Resolving deltas: 1% (532/53130) Resolving deltas: 2% (1063/53130) Resolving deltas: 3% (1594/53130) Resolving deltas: 4% (2126/53130) Resolving deltas: 5% (2658/53130) Resolving deltas: 6% (3188/53130) Resolving deltas: 7% (3720/53130) Resolving deltas: 8% (4254/53130) Resolving deltas: 9% (4783/53130) Resolving deltas: 10% (5313/53130) Resolving deltas: 11% (5845/53130) Resolving deltas: 12% (6376/53130) Resolving deltas: 13% (6907/53130) Resolving deltas: 14% (7439/53130) Resolving deltas: 15% (7970/53130) Resolving deltas: 16% (8501/53130) Resolving deltas: 17% (9033/53130) Resolving deltas: 18% (9564/53130) Resolving deltas: 19% (10095/53130) Resolving deltas: 20% (10627/53130) Resolving deltas: 21% (11158/53130) Resolving deltas: 22% (11689/53130) Resolving deltas: 23% (12220/53130) Resolving deltas: 24% (12752/53130) Resolving deltas: 25% (13283/53130) Resolving deltas: 26% (13814/53130) Resolving deltas: 27% (14348/53130) Resolving deltas: 28% (14879/53130) Resolving deltas: 29% (15408/53130) Resolving deltas: 30% (15939/53130) Resolving deltas: 31% (16471/53130) Resolving deltas: 32% (17003/53130) Resolving deltas: 33% (17533/53130) Resolving deltas: 34% (18065/53130) Resolving deltas: 35% (18598/53130) Resolving deltas: 36% (19128/53130) Resolving deltas: 37% (19659/53130) Resolving deltas: 38% (20190/53130) Resolving deltas: 39% (20721/53130) Resolving deltas: 40% (21253/53130) Resolving deltas: 41% (21786/53130) Resolving deltas: 42% (22315/53130) Resolving deltas: 43% (22846/53130) Resolving deltas: 44% (23379/53130) Resolving deltas: 45% (23909/53130) Resolving deltas: 46% (24440/53130) Resolving deltas: 47% (24972/53130) Resolving deltas: 48% (25503/53130) Resolving deltas: 49% (26035/53130) Resolving deltas: 50% (26565/53130) Resolving deltas: 51% (27097/53130) Resolving deltas: 52% (27628/53130) Resolving deltas: 53% (28159/53130) Resolving deltas: 54% (28691/53130) Resolving deltas: 55% (29223/53130) Resolving deltas: 56% (29753/53130) Resolving deltas: 57% (30285/53130) Resolving deltas: 58% (30816/53130) Resolving deltas: 59% (31349/53130) Resolving deltas: 60% (31878/53130) Resolving deltas: 61% (32410/53130) Resolving deltas: 62% (32941/53130) Resolving deltas: 63% (33472/53130) Resolving deltas: 64% (34004/53130) Resolving deltas: 65% (34536/53130) Resolving deltas: 66% (35067/53130) Resolving deltas: 67% (35598/53130) Resolving deltas: 68% (36129/53130) Resolving deltas: 69% (36660/53130) Resolving deltas: 70% (37191/53130) Resolving deltas: 71% (37723/53130) Resolving deltas: 72% (38254/53130) Resolving deltas: 73% (38785/53130) Resolving deltas: 74% (39317/53130) Resolving deltas: 75% (39848/53130) Resolving deltas: 76% (40379/53130) Resolving deltas: 77% (40911/53130) Resolving deltas: 78% (41443/53130) Resolving deltas: 79% (41973/53130) Resolving deltas: 80% (42504/53130) Resolving deltas: 81% (43037/53130) Resolving deltas: 82% (43567/53130) Resolving deltas: 83% (44098/53130) Resolving deltas: 84% (44630/53130) Resolving deltas: 85% (45162/53130) Resolving deltas: 86% (45692/53130) Resolving deltas: 87% (46224/53130) Resolving deltas: 88% (46755/53130) Resolving deltas: 89% (47287/53130) Resolving deltas: 90% (47817/53130) Resolving deltas: 91% (48349/53130) Resolving deltas: 92% (48880/53130) Resolving deltas: 93% (49411/53130) Resolving deltas: 94% (49943/53130) Resolving deltas: 95% (50474/53130) Resolving deltas: 96% (51006/53130) Resolving deltas: 97% (51537/53130) Resolving deltas: 98% (52071/53130) Resolving deltas: 99% (52601/53130) Resolving deltas: 100% (53130/53130) Resolving deltas: 100% (53130/53130), done.
  9. 8.83 s Fetching commit 8a197b8cad2f920e58f5fdc82a046a3afcd7e1fd for raised_energy_cff_wip ...
  10. 8.83 s $ /nix/store/bcnisk3ydfgv26v2gw3zlky24g00yww2-git-2.54.0/bin/git fetch origin 8a197b8cad2f920e58f5fdc82a046a3afcd7e1fd
  11. 9.25 s From https://github.com/alphal00p/gammaloop
  12. 9.25 s * branch 8a197b8cad2f920e58f5fdc82a046a3afcd7e1fd -> FETCH_HEAD
  13. 9.26 s $ /nix/store/9ypz3flqsrl5xl495mm8h645gadjsxi1-coreutils-9.11/bin/timeout --kill-after=15s 7200s /nix/store/bcnisk3ydfgv26v2gw3zlky24g00yww2-git-2.54.0/bin/git -c advice.detachedHead=false checkout 8a197b8cad2f920e58f5fdc82a046a3afcd7e1fd
  14. 9.48 s HEAD is now at 8a197b8ca preserve separate UV Taylor denominator topologies
  15. 9.48 s $ /nix/store/9ypz3flqsrl5xl495mm8h645gadjsxi1-coreutils-9.11/bin/timeout --kill-after=15s 7200s /nix/store/23zk8sgzamrbmj1fday15szf7f2279s8-nix-2.34.7/bin/nix --extra-experimental-features nix-command --extra-experimental-features flakes --log-format internal-json run .#packages.x86_64-linux.nix-ci-check-gammaloop-nextest-core --print-build-logs
  16. 14.71 s
  17. 14.75 s Downloading cached gammaloop-nextest-binaries-core-gammaloop-api from https://cache.nix-ci.com
  18. 14.75 s Downloading cached gammaloop-nextest-binaries-core-gammaloop-tracing-filter from https://cache.nix-ci.com
  19. 14.75 s Downloading cached gammaloop-nextest-binaries-core-gammaloop-tracing-filter-macros from https://cache.nix-ci.com
  20. 14.75 s Downloading cached gammaloop-nextest-binaries-core-gammalooprs from https://cache.nix-ci.com
  21. 14.75 s Downloading cached gammaloop-nextest-binaries-core-three-dimensional-reps from https://cache.nix-ci.com
  22. 14.81 s Downloaded cached gammaloop-nextest-binaries-core-gammaloop-tracing-filter-macros (1.7 MiB) in 63ms
  23. 14.81 s Progress: 0 of 1 built, 1 of 7 downloaded from cache (4 downloading)
  24. 14.99 s Downloaded cached gammaloop-nextest-binaries-core-gammaloop-tracing-filter (8.1 MiB) in 243ms
  25. 14.99 s Progress: 0 of 1 built, 2 of 7 downloaded from cache (3 downloading)
  26. 14.99 s Downloaded cached gammaloop-nextest-binaries-core-three-dimensional-reps (8.9 MiB) in 247ms
  27. 14.99 s Progress: 0 of 1 built, 3 of 7 downloaded from cache (2 downloading)
  28. 15.97 s Downloaded cached gammaloop-nextest-binaries-core-gammalooprs (85.9 MiB) in 1.2s
  29. 15.97 s Progress: 0 of 1 built, 4 of 7 downloaded from cache (1 downloading)
  30. 16.16 s Downloaded cached gammaloop-nextest-binaries-core-gammaloop-api (118.7 MiB) in 1.4s
  31. 16.16 s Progress: 0 of 1 built, 5 of 7 downloaded from cache
  32. 16.16 s Downloading cached gammaloop-nextest-binaries-core from https://cache.nix-ci.com
  33. 16.16 s Downloaded cached gammaloop-nextest-binaries-core (2032 B) in 3ms
  34. 16.16 s Progress: 0 of 1 built, 6 of 7 downloaded from cache
  35. 16.16 s Downloading cached nix-ci-check-gammaloop-nextest-core from https://cache.nix-ci.com
  36. 16.17 s Downloaded cached nix-ci-check-gammaloop-nextest-core (1016 B) in 2ms
  37. 16.17 s Progress: 0 of 1 built, 7 of 7 downloaded from cache
  38. 21.31 s evaluating derivation 'g copying '/nix/store/qv5p evaluating derivation 'g copying '/nix/store/qv5p evaluating derivation 'g copying '/nix/store/qv5p evaluating derivation 'g copying '/nix/store/qv5p evaluating derivation 'g copying '/nix/store/qv5p evaluating derivation 'g copying '/nix/store/qv5p evaluating derivation 'g copying '/nix/store/qv5p evaluating derivation 'g copying '/nix/store/qv5p evaluating derivation 'g querying gammaloop-nexte querying info about miss querying gammaloop-nexte [0/1 built, 0.0 KiB DL] [1/0/1 built, 0.0 KiB DLgammaloop-nextest-core> Extracting 4 binaries (including 1 non-test binary), 1 build script output directory, and 2 linked paths to /build/nextest-archive-zsrXEg
  39. 22.03 s gammaloop-nextest-core> Extracted 20 files to /build/nextest-archive-zsrXEg in 0.72s
  40. 22.04 s gammaloop-nextest-core> ------------
  41. 22.04 s gammaloop-nextest-core> Nextest run ID feef071c-54bb-423e-ac02-6efc3d53feb3 with nextest profile: ci_gammaloop
  42. 22.04 s gammaloop-nextest-core> Starting 377 tests across 3 binaries
  43. 23.36 s gammaloop-nextest-core> ------------
  44. 23.36 s gammaloop-nextest-core> Summary [ 1.316s] 377 tests run: 377 passed, 0 skipped
  45. 23.48 s gammaloop-nextest-core>
  46. 23.48 s gammaloop-nextest-core> ========== nextest test summary ==========
  47. 23.48 s gammaloop-nextest-core> report: target/nextest/ci_gammaloop/junit.xml
  48. 23.48 s gammaloop-nextest-core> tests: 377, failures: 0, errors: 0
  49. 23.48 s gammaloop-nextest-core> No failing testcases found.
  50. 23.48 s gammaloop-nextest-core> =========================================
  51. 23.50 s gammaloop-nextest-core> Extracting 1 binary and 1 linked path to /build/nextest-archive-xYJLcI
  52. 23.57 s gammaloop-nextest-core> Extracted 7 files to /build/nextest-archive-xYJLcI in 0.07s
  53. 23.58 s gammaloop-nextest-core> ------------
  54. 23.58 s gammaloop-nextest-core> Nextest run ID 785dbc3d-151a-4e42-bd03-8131e5fb6b11 with nextest profile: ci_gammaloop
  55. 23.58 s gammaloop-nextest-core> Starting 19 tests across 1 binary
  56. 23.59 s gammaloop-nextest-core> ------------
  57. 23.59 s gammaloop-nextest-core> Summary [ 0.012s] 19 tests run: 19 passed, 0 skipped
  58. 23.63 s gammaloop-nextest-core>
  59. 23.63 s gammaloop-nextest-core> ========== nextest test summary ==========
  60. 23.63 s gammaloop-nextest-core> report: target/nextest/ci_gammaloop/junit.xml
  61. 23.63 s gammaloop-nextest-core> tests: 19, failures: 0, errors: 0
  62. 23.63 s gammaloop-nextest-core> No failing testcases found.
  63. 23.63 s gammaloop-nextest-core> =========================================
  64. 23.64 s gammaloop-nextest-core> Extracting 1 binary to /build/nextest-archive-EGag36
  65. 23.67 s gammaloop-nextest-core> Extracted 4 files to /build/nextest-archive-EGag36 in 0.03s
  66. 23.68 s gammaloop-nextest-core> ------------
  67. 23.68 s gammaloop-nextest-core> Nextest run ID 582f4ed7-065b-4ec8-bc0b-3c1a001b2d75 with nextest profile: ci_gammaloop
  68. 23.68 s gammaloop-nextest-core> Starting 0 tests across 1 binary
  69. 23.68 s gammaloop-nextest-core> ------------
  70. 23.68 s gammaloop-nextest-core> Summary [ 0.000s] 0 tests run: 0 passed, 0 skipped
  71. 23.71 s gammaloop-nextest-core>
  72. 23.71 s gammaloop-nextest-core> ========== nextest test summary ==========
  73. 23.71 s gammaloop-nextest-core> report: target/nextest/ci_gammaloop/junit.xml
  74. 23.71 s gammaloop-nextest-core> tests: 0, failures: 0, errors: 0
  75. 23.71 s gammaloop-nextest-core> No failing testcases found.
  76. 23.71 s gammaloop-nextest-core> =========================================
  77. 23.72 s gammaloop-nextest-core> Extracting 4 binaries, 1 build script output directory, and 2 linked paths to /build/nextest-archive-OM5q93
  78. 24.21 s gammaloop-nextest-core> Extracted 18 files to /build/nextest-archive-OM5q93 in 0.49s
  79. 24.22 s gammaloop-nextest-core> ------------
  80. 24.22 s gammaloop-nextest-core> Nextest run ID c2d0d83b-b1d2-44d0-ae88-375b8da65a4f with nextest profile: ci_gammaloop
  81. 24.22 s gammaloop-nextest-core> Starting 645 tests across 4 binaries (59 tests skipped, including 58 tests via profile.ci_gammaloop.default-filter)
  82. 25.77 s gammaloop-nextest-core> FAIL [ 0.196s] (553/645) gammalooprs uv::approx::local_4d::tests::dod_one_triangle_keeps_separate_denominator_topologies
  83. 25.77 s gammaloop-nextest-core> stdout ---
  84. 25.77 s gammaloop-nextest-core>
  85. 25.77 s gammaloop-nextest-core> running 1 test
  86. 25.77 s gammaloop-nextest-core> test uv::approx::local_4d::tests::dod_one_triangle_keeps_separate_denominator_topologies ... FAILED
  87. 25.77 s gammaloop-nextest-core>
  88. 25.77 s gammaloop-nextest-core> failures:
  89. 25.77 s gammaloop-nextest-core>
  90. 25.77 s gammaloop-nextest-core> failures:
  91. 25.77 s gammaloop-nextest-core> uv::approx::local_4d::tests::dod_one_triangle_keeps_separate_denominator_topologies
  92. 25.77 s gammaloop-nextest-core>
  93. 25.77 s gammaloop-nextest-core> test result: FAILED. 0 passed; 1 failed; 0 ignored; 0 measured; 695 filtered out; finished in 0.14s
  94. 25.77 s gammaloop-nextest-core>
  95. 25.77 s gammaloop-nextest-core> stderr ---
  96. 25.77 s gammaloop-nextest-core> The application panicked (crashed).
  97. 25.77 s gammaloop-nextest-core> Message: assertion `left == right` failed
  98. 25.77 s gammaloop-nextest-core> left: [[1, 1, 1], [1, 1, 1], [1, 1, 2], [2, 1, 1]]
  99. 25.77 s gammaloop-nextest-core> right: [[1, 1, 1], [1, 1, 2], [2, 1, 1]]
  100. 25.77 s gammaloop-nextest-core> Location: crates/gammalooprs/src/uv/approx/local_4d.rs:1992
  101. 25.77 s gammaloop-nextest-core>
  102. 25.77 s gammaloop-nextest-core> ━━━━━━━━━━━━━━━━━━━━━━━━━━━━━━━━━━ BACKTRACE ━━━━━━━━━━━━━━━━━━━━━━━━━━━━━━━━━━━
  103. 25.77 s gammaloop-nextest-core> 1: <color_eyre[51793ea62743adbd]::config::PanicHook>::panic_report<unknown>
  104. 25.77 s gammaloop-nextest-core> at <unknown source file>:<unknown line>
  105. 25.77 s gammaloop-nextest-core> 2: <color_eyre[51793ea62743adbd]::config::PanicHook>::into_panic_hook::{closure#0}<unknown>
  106. 25.77 s gammaloop-nextest-core> at <unknown source file>:<unknown line>
  107. 25.77 s gammaloop-nextest-core> 3: std[bcb96dfbba0ab899]::panicking::panic_with_hook<unknown>
  108. 25.77 s gammaloop-nextest-core> at <unknown source file>:<unknown line>
  109. 25.77 s gammaloop-nextest-core> 4: std[bcb96dfbba0ab899]::panicking::panic_handler::{closure#0}<unknown>
  110. 25.77 s gammaloop-nextest-core> at <unknown source file>:<unknown line>
  111. 25.77 s gammaloop-nextest-core> 5: std[bcb96dfbba0ab899]::sys::backtrace::__rust_end_short_backtrace::<std[bcb96dfbba0ab899]::panicking::panic_handler::{closure#0}, !><unknown>
  112. 25.77 s gammaloop-nextest-core> at <unknown source file>:<unknown line>
  113. 25.77 s gammaloop-nextest-core> 6: __rustc[6c289b9f9c454d21]::rust_begin_unwind<unknown>
  114. 25.77 s gammaloop-nextest-core> at <unknown source file>:<unknown line>
  115. 25.77 s gammaloop-nextest-core> 7: core[940e698046960fd5]::panicking::panic_fmt<unknown>
  116. 25.77 s gammaloop-nextest-core> at <unknown source file>:<unknown line>
  117. 25.77 s gammaloop-nextest-core> 8: core[940e698046960fd5]::panicking::assert_failed_inner<unknown>
  118. 25.77 s gammaloop-nextest-core> at <unknown source file>:<unknown line>
  119. 25.77 s gammaloop-nextest-core> 9: core[940e698046960fd5]::panicking::assert_failed::<alloc[2ea6bcb46fca0c42]::vec::Vec<[usize; 3usize]>, alloc[2ea6bcb46fca0c42]::vec::Vec<[usize; 3usize]>><unknown>
  120. 25.77 s gammaloop-nextest-core> at <unknown source file>:<unknown line>
  121. 25.77 s gammaloop-nextest-core> 10: gammalooprs[8af0a922d9a4c82d]::uv::approx::local_4d::tests::dod_one_triangle_keeps_separate_denominator_topologies<unknown>
  122. 25.77 s gammaloop-nextest-core> at <unknown source file>:<unknown line>
  123. 25.77 s gammaloop-nextest-core> 11: <gammalooprs[8af0a922d9a4c82d]::uv::approx::local_4d::tests::dod_one_triangle_keeps_separate_denominator_topologies::{closure#0} as core[940e698046960fd5]::ops::function::FnOnce<()>>::call_once<unknown>
  124. 25.77 s gammaloop-nextest-core> at <unknown source file>:<unknown line>
  125. 25.77 s gammaloop-nextest-core> 12: test[75d6903177b1d7e9]::__rust_begin_short_backtrace::<core[940e698046960fd5]::result::Result<(), alloc[2ea6bcb46fca0c42]::string::String>, fn() -> core[940e698046960fd5]::result::Result<(), alloc[2ea6bcb46fca0c42]::string::String>><unknown>
  126. 25.77 s gammaloop-nextest-core> at <unknown source file>:<unknown line>
  127. 25.77 s gammaloop-nextest-core> 13: test[75d6903177b1d7e9]::run_test::{closure#0}<unknown>
  128. 25.77 s gammaloop-nextest-core> at <unknown source file>:<unknown line>
  129. 25.77 s gammaloop-nextest-core> 14: std[bcb96dfbba0ab899]::sys::backtrace::__rust_begin_short_backtrace::<test[75d6903177b1d7e9]::run_test::{closure#1}, ()><unknown>
  130. 25.77 s gammaloop-nextest-core> at <unknown source file>:<unknown line>
  131. 25.77 s gammaloop-nextest-core> 15: <std[bcb96dfbba0ab899]::thread::lifecycle::spawn_unchecked<test[75d6903177b1d7e9]::run_test::{closure#1}, ()>::{closure#1} as core[940e698046960fd5]::ops::function::FnOnce<()>>::call_once::{shim:vtable#0}<unknown>
  132. 25.77 s gammaloop-nextest-core> at <unknown source file>:<unknown line>
  133. 25.77 s gammaloop-nextest-core> 16: <std[bcb96dfbba0ab899]::sys::thread::unix::Thread>::new::thread_start<unknown>
  134. 25.77 s gammaloop-nextest-core> at <unknown source file>:<unknown line>
  135. 25.77 s gammaloop-nextest-core> 17: start_thread<unknown>
  136. 25.77 s gammaloop-nextest-core> at <unknown source file>:<unknown line>
  137. 25.77 s gammaloop-nextest-core> 18: __clone3<unknown>
  138. 25.77 s gammaloop-nextest-core> at <unknown source file>:<unknown line>
  139. 25.77 s gammaloop-nextest-core>
  140. 25.77 s gammaloop-nextest-core> Run with COLORBT_SHOW_HIDDEN=1 environment variable to disable frame filtering.
  141. 25.77 s gammaloop-nextest-core> Run with RUST_BACKTRACE=full to include source snippets.
  142. 25.77 s gammaloop-nextest-core>
  143. 26.37 s gammaloop-nextest-core> FAIL [ 0.598s] (577/645) gammalooprs uv::approx::tests::factorized_owned_dot_child_cff_matches_direct_3d_for_uncut_self_energy
  144. 26.37 s gammaloop-nextest-core> stdout ---
  145. 26.37 s gammaloop-nextest-core>
  146. 26.37 s gammaloop-nextest-core> running 1 test
  147. 26.37 s gammaloop-nextest-core> test uv::approx::tests::factorized_owned_dot_child_cff_matches_direct_3d_for_uncut_self_energy ... FAILED
  148. 26.37 s gammaloop-nextest-core>
  149. 26.37 s gammaloop-nextest-core> failures:
  150. 26.37 s gammaloop-nextest-core>
  151. 26.37 s gammaloop-nextest-core> failures:
  152. 26.37 s gammaloop-nextest-core> uv::approx::tests::factorized_owned_dot_child_cff_matches_direct_3d_for_uncut_self_energy
  153. 26.37 s gammaloop-nextest-core>
  154. 26.37 s gammaloop-nextest-core> test result: FAILED. 0 passed; 1 failed; 0 ignored; 0 measured; 695 filtered out; finished in 0.57s
  155. 26.37 s gammaloop-nextest-core>
  156. 26.37 s gammaloop-nextest-core> stderr ---
  157. 26.37 s gammaloop-nextest-core> The application panicked (crashed).
  158. 26.37 s gammaloop-nextest-core> Message: assertion `left == right` failed
  159. 26.37 s gammaloop-nextest-core> left: [[1, 1, 2], [1, 2], [2, 2, 1], [2, 1], [2, 1], [2, 2, 1], [2, 2, 2, 1], [2, 2, 1]]
  160. 26.37 s gammaloop-nextest-core> right: [[1, 1, 2, 2, 2]]
  161. 26.37 s gammaloop-nextest-core> Location: crates/gammalooprs/src/uv/approx/mod.rs:1471
  162. 26.37 s gammaloop-nextest-core>
  163. 26.37 s gammaloop-nextest-core> ━━━━━━━━━━━━━━━━━━━━━━━━━━━━━━━━━━ BACKTRACE ━━━━━━━━━━━━━━━━━━━━━━━━━━━━━━━━━━━
  164. 26.37 s gammaloop-nextest-core> 1: <color_eyre[51793ea62743adbd]::config::PanicHook>::panic_report<unknown>
  165. 26.37 s gammaloop-nextest-core> at <unknown source file>:<unknown line>
  166. 26.37 s gammaloop-nextest-core> 2: <color_eyre[51793ea62743adbd]::config::PanicHook>::into_panic_hook::{closure#0}<unknown>
  167. 26.37 s gammaloop-nextest-core> at <unknown source file>:<unknown line>
  168. 26.37 s gammaloop-nextest-core> 3: std[bcb96dfbba0ab899]::panicking::panic_with_hook<unknown>
  169. 26.37 s gammaloop-nextest-core> at <unknown source file>:<unknown line>
  170. 26.37 s gammaloop-nextest-core> 4: std[bcb96dfbba0ab899]::panicking::panic_handler::{closure#0}<unknown>
  171. 26.37 s gammaloop-nextest-core> at <unknown source file>:<unknown line>
  172. 26.37 s gammaloop-nextest-core> 5: std[bcb96dfbba0ab899]::sys::backtrace::__rust_end_short_backtrace::<std[bcb96dfbba0ab899]::panicking::panic_handler::{closure#0}, !><unknown>
  173. 26.37 s gammaloop-nextest-core> at <unknown source file>:<unknown line>
  174. 26.37 s gammaloop-nextest-core> 6: __rustc[6c289b9f9c454d21]::rust_begin_unwind<unknown>
  175. 26.37 s gammaloop-nextest-core> at <unknown source file>:<unknown line>
  176. 26.37 s gammaloop-nextest-core> 7: core[940e698046960fd5]::panicking::panic_fmt<unknown>
  177. 26.37 s gammaloop-nextest-core> at <unknown source file>:<unknown line>
  178. 26.37 s gammaloop-nextest-core> 8: core[940e698046960fd5]::panicking::assert_failed_inner<unknown>
  179. 26.37 s gammaloop-nextest-core> at <unknown source file>:<unknown line>
  180. 26.37 s gammaloop-nextest-core> 9: core[940e698046960fd5]::panicking::assert_failed::<alloc[2ea6bcb46fca0c42]::vec::Vec<alloc[2ea6bcb46fca0c42]::vec::Vec<usize>>, alloc[2ea6bcb46fca0c42]::vec::Vec<alloc[2ea6bcb46fca0c42]::vec::Vec<usize>>><unknown>
  181. 26.37 s gammaloop-nextest-core> at <unknown source file>:<unknown line>
  182. 26.37 s gammaloop-nextest-core> 10: gammalooprs[8af0a922d9a4c82d]::uv::approx::tests::factorized_owned_dot_child_cff_matches_direct_3d_for_uncut_self_energy<unknown>
  183. 26.37 s gammaloop-nextest-core> at <unknown source file>:<unknown line>
  184. 26.37 s gammaloop-nextest-core> 11: <gammalooprs[8af0a922d9a4c82d]::uv::approx::tests::factorized_owned_dot_child_cff_matches_direct_3d_for_uncut_self_energy::{closure#0} as core[940e698046960fd5]::ops::function::FnOnce<()>>::call_once<unknown>
  185. 26.37 s gammaloop-nextest-core> at <unknown source file>:<unknown line>
  186. 26.37 s gammaloop-nextest-core> 12: test[75d6903177b1d7e9]::__rust_begin_short_backtrace::<core[940e698046960fd5]::result::Result<(), alloc[2ea6bcb46fca0c42]::string::String>, fn() -> core[940e698046960fd5]::result::Result<(), alloc[2ea6bcb46fca0c42]::string::String>><unknown>
  187. 26.37 s gammaloop-nextest-core> at <unknown source file>:<unknown line>
  188. 26.37 s gammaloop-nextest-core> 13: test[75d6903177b1d7e9]::run_test::{closure#0}<unknown>
  189. 26.37 s gammaloop-nextest-core> at <unknown source file>:<unknown line>
  190. 26.37 s gammaloop-nextest-core> 14: std[bcb96dfbba0ab899]::sys::backtrace::__rust_begin_short_backtrace::<test[75d6903177b1d7e9]::run_test::{closure#1}, ()><unknown>
  191. 26.37 s gammaloop-nextest-core> at <unknown source file>:<unknown line>
  192. 26.37 s gammaloop-nextest-core> 15: <std[bcb96dfbba0ab899]::thread::lifecycle::spawn_unchecked<test[75d6903177b1d7e9]::run_test::{closure#1}, ()>::{closure#1} as core[940e698046960fd5]::ops::function::FnOnce<()>>::call_once::{shim:vtable#0}<unknown>
  193. 26.37 s gammaloop-nextest-core> at <unknown source file>:<unknown line>
  194. 26.37 s gammaloop-nextest-core> 16: <std[bcb96dfbba0ab899]::sys::thread::unix::Thread>::new::thread_start<unknown>
  195. 26.37 s gammaloop-nextest-core> at <unknown source file>:<unknown line>
  196. 26.37 s gammaloop-nextest-core> 17: start_thread<unknown>
  197. 26.37 s gammaloop-nextest-core> at <unknown source file>:<unknown line>
  198. 26.37 s gammaloop-nextest-core> 18: __clone3<unknown>
  199. 26.37 s gammaloop-nextest-core> at <unknown source file>:<unknown line>
  200. 26.37 s gammaloop-nextest-core>
  201. 26.37 s gammaloop-nextest-core> Run with COLORBT_SHOW_HIDDEN=1 environment variable to disable frame filtering.
  202. 26.37 s gammaloop-nextest-core> Run with RUST_BACKTRACE=full to include source snippets.
  203. 26.37 s gammaloop-nextest-core>
  204. 39.37 s gammaloop-nextest-core> ------------
  205. 39.37 s gammaloop-nextest-core> Summary [ 15.149s] 645 tests run: 643 passed, 2 failed, 59 skipped
  206. 39.37 s gammaloop-nextest-core> FAIL [ 0.196s] (553/645) gammalooprs uv::approx::local_4d::tests::dod_one_triangle_keeps_separate_denominator_topologies
  207. 39.37 s gammaloop-nextest-core> stdout ---
  208. 39.37 s gammaloop-nextest-core>
  209. 39.37 s gammaloop-nextest-core> running 1 test
  210. 39.37 s gammaloop-nextest-core> test uv::approx::local_4d::tests::dod_one_triangle_keeps_separate_denominator_topologies ... FAILED
  211. 39.37 s gammaloop-nextest-core>
  212. 39.37 s gammaloop-nextest-core> failures:
  213. 39.37 s gammaloop-nextest-core>
  214. 39.37 s gammaloop-nextest-core> failures:
  215. 39.37 s gammaloop-nextest-core> uv::approx::local_4d::tests::dod_one_triangle_keeps_separate_denominator_topologies
  216. 39.37 s gammaloop-nextest-core>
  217. 39.37 s gammaloop-nextest-core> test result: FAILED. 0 passed; 1 failed; 0 ignored; 0 measured; 695 filtered out; finished in 0.14s
  218. 39.37 s gammaloop-nextest-core>
  219. 39.37 s gammaloop-nextest-core> stderr ---
  220. 39.37 s gammaloop-nextest-core> The application panicked (crashed).
  221. 39.37 s gammaloop-nextest-core> Message: assertion `left == right` failed
  222. 39.37 s gammaloop-nextest-core> left: [[1, 1, 1], [1, 1, 1], [1, 1, 2], [2, 1, 1]]
  223. 39.37 s gammaloop-nextest-core> right: [[1, 1, 1], [1, 1, 2], [2, 1, 1]]
  224. 39.37 s gammaloop-nextest-core> Location: crates/gammalooprs/src/uv/approx/local_4d.rs:1992
  225. 39.37 s gammaloop-nextest-core>
  226. 39.37 s gammaloop-nextest-core> ━━━━━━━━━━━━━━━━━━━━━━━━━━━━━━━━━━ BACKTRACE ━━━━━━━━━━━━━━━━━━━━━━━━━━━━━━━━━━━
  227. 39.37 s gammaloop-nextest-core> 1: <color_eyre[51793ea62743adbd]::config::PanicHook>::panic_report<unknown>
  228. 39.37 s gammaloop-nextest-core> at <unknown source file>:<unknown line>
  229. 39.37 s gammaloop-nextest-core> 2: <color_eyre[51793ea62743adbd]::config::PanicHook>::into_panic_hook::{closure#0}<unknown>
  230. 39.37 s gammaloop-nextest-core> at <unknown source file>:<unknown line>
  231. 39.37 s gammaloop-nextest-core> 3: std[bcb96dfbba0ab899]::panicking::panic_with_hook<unknown>
  232. 39.37 s gammaloop-nextest-core> at <unknown source file>:<unknown line>
  233. 39.37 s gammaloop-nextest-core> 4: std[bcb96dfbba0ab899]::panicking::panic_handler::{closure#0}<unknown>
  234. 39.37 s gammaloop-nextest-core> at <unknown source file>:<unknown line>
  235. 39.37 s gammaloop-nextest-core> 5: std[bcb96dfbba0ab899]::sys::backtrace::__rust_end_short_backtrace::<std[bcb96dfbba0ab899]::panicking::panic_handler::{closure#0}, !><unknown>
  236. 39.37 s gammaloop-nextest-core> at <unknown source file>:<unknown line>
  237. 39.37 s gammaloop-nextest-core> 6: __rustc[6c289b9f9c454d21]::rust_begin_unwind<unknown>
  238. 39.37 s gammaloop-nextest-core> at <unknown source file>:<unknown line>
  239. 39.37 s gammaloop-nextest-core> 7: core[940e698046960fd5]::panicking::panic_fmt<unknown>
  240. 39.37 s gammaloop-nextest-core> at <unknown source file>:<unknown line>
  241. 39.37 s gammaloop-nextest-core> 8: core[940e698046960fd5]::panicking::assert_failed_inner<unknown>
  242. 39.37 s gammaloop-nextest-core> at <unknown source file>:<unknown line>
  243. 39.37 s gammaloop-nextest-core> 9: core[940e698046960fd5]::panicking::assert_failed::<alloc[2ea6bcb46fca0c42]::vec::Vec<[usize; 3usize]>, alloc[2ea6bcb46fca0c42]::vec::Vec<[usize; 3usize]>><unknown>
  244. 39.37 s gammaloop-nextest-core> at <unknown source file>:<unknown line>
  245. 39.37 s gammaloop-nextest-core> 10: gammalooprs[8af0a922d9a4c82d]::uv::approx::local_4d::tests::dod_one_triangle_keeps_separate_denominator_topologies<unknown>
  246. 39.37 s gammaloop-nextest-core> at <unknown source file>:<unknown line>
  247. 39.37 s gammaloop-nextest-core> 11: <gammalooprs[8af0a922d9a4c82d]::uv::approx::local_4d::tests::dod_one_triangle_keeps_separate_denominator_topologies::{closure#0} as core[940e698046960fd5]::ops::function::FnOnce<()>>::call_once<unknown>
  248. 39.37 s gammaloop-nextest-core> at <unknown source file>:<unknown line>
  249. 39.37 s gammaloop-nextest-core> 12: test[75d6903177b1d7e9]::__rust_begin_short_backtrace::<core[940e698046960fd5]::result::Result<(), alloc[2ea6bcb46fca0c42]::string::String>, fn() -> core[940e698046960fd5]::result::Result<(), alloc[2ea6bcb46fca0c42]::string::String>><unknown>
  250. 39.37 s gammaloop-nextest-core> at <unknown source file>:<unknown line>
  251. 39.37 s gammaloop-nextest-core> 13: test[75d6903177b1d7e9]::run_test::{closure#0}<unknown>
  252. 39.37 s gammaloop-nextest-core> at <unknown source file>:<unknown line>
  253. 39.37 s gammaloop-nextest-core> 14: std[bcb96dfbba0ab899]::sys::backtrace::__rust_begin_short_backtrace::<test[75d6903177b1d7e9]::run_test::{closure#1}, ()><unknown>
  254. 39.37 s gammaloop-nextest-core> at <unknown source file>:<unknown line>
  255. 39.37 s gammaloop-nextest-core> 15: <std[bcb96dfbba0ab899]::thread::lifecycle::spawn_unchecked<test[75d6903177b1d7e9]::run_test::{closure#1}, ()>::{closure#1} as core[940e698046960fd5]::ops::function::FnOnce<()>>::call_once::{shim:vtable#0}<unknown>
  256. 39.37 s gammaloop-nextest-core> at <unknown source file>:<unknown line>
  257. 39.37 s gammaloop-nextest-core> 16: <std[bcb96dfbba0ab899]::sys::thread::unix::Thread>::new::thread_start<unknown>
  258. 39.37 s gammaloop-nextest-core> at <unknown source file>:<unknown line>
  259. 39.37 s gammaloop-nextest-core> 17: start_thread<unknown>
  260. 39.37 s gammaloop-nextest-core> at <unknown source file>:<unknown line>
  261. 39.37 s gammaloop-nextest-core> 18: __clone3<unknown>
  262. 39.37 s gammaloop-nextest-core> at <unknown source file>:<unknown line>
  263. 39.37 s gammaloop-nextest-core>
  264. 39.37 s gammaloop-nextest-core> Run with COLORBT_SHOW_HIDDEN=1 environment variable to disable frame filtering.
  265. 39.37 s gammaloop-nextest-core> Run with RUST_BACKTRACE=full to include source snippets.
  266. 39.37 s gammaloop-nextest-core>
  267. 39.37 s gammaloop-nextest-core> FAIL [ 0.598s] (577/645) gammalooprs uv::approx::tests::factorized_owned_dot_child_cff_matches_direct_3d_for_uncut_self_energy
  268. 39.37 s gammaloop-nextest-core> stdout ---
  269. 39.37 s gammaloop-nextest-core>
  270. 39.37 s gammaloop-nextest-core> running 1 test
  271. 39.38 s gammaloop-nextest-core> test uv::approx::tests::factorized_owned_dot_child_cff_matches_direct_3d_for_uncut_self_energy ... FAILED
  272. 39.38 s gammaloop-nextest-core>
  273. 39.38 s gammaloop-nextest-core> failures:
  274. 39.38 s gammaloop-nextest-core>
  275. 39.38 s gammaloop-nextest-core> failures:
  276. 39.38 s gammaloop-nextest-core> uv::approx::tests::factorized_owned_dot_child_cff_matches_direct_3d_for_uncut_self_energy
  277. 39.38 s gammaloop-nextest-core>
  278. 39.38 s gammaloop-nextest-core> test result: FAILED. 0 passed; 1 failed; 0 ignored; 0 measured; 695 filtered out; finished in 0.57s
  279. 39.38 s gammaloop-nextest-core>
  280. 39.38 s gammaloop-nextest-core> stderr ---
  281. 39.38 s gammaloop-nextest-core> The application panicked (crashed).
  282. 39.38 s gammaloop-nextest-core> Message: assertion `left == right` failed
  283. 39.38 s gammaloop-nextest-core> left: [[1, 1, 2], [1, 2], [2, 2, 1], [2, 1], [2, 1], [2, 2, 1], [2, 2, 2, 1], [2, 2, 1]]
  284. 39.38 s gammaloop-nextest-core> right: [[1, 1, 2, 2, 2]]
  285. 39.38 s gammaloop-nextest-core> Location: crates/gammalooprs/src/uv/approx/mod.rs:1471
  286. 39.38 s gammaloop-nextest-core>
  287. 39.38 s gammaloop-nextest-core> ━━━━━━━━━━━━━━━━━━━━━━━━━━━━━━━━━━ BACKTRACE ━━━━━━━━━━━━━━━━━━━━━━━━━━━━━━━━━━━
  288. 39.38 s gammaloop-nextest-core> 1: <color_eyre[51793ea62743adbd]::config::PanicHook>::panic_report<unknown>
  289. 39.38 s gammaloop-nextest-core> at <unknown source file>:<unknown line>
  290. 39.38 s gammaloop-nextest-core> 2: <color_eyre[51793ea62743adbd]::config::PanicHook>::into_panic_hook::{closure#0}<unknown>
  291. 39.38 s gammaloop-nextest-core> at <unknown source file>:<unknown line>
  292. 39.38 s gammaloop-nextest-core> 3: std[bcb96dfbba0ab899]::panicking::panic_with_hook<unknown>
  293. 39.38 s gammaloop-nextest-core> at <unknown source file>:<unknown line>
  294. 39.38 s gammaloop-nextest-core> 4: std[bcb96dfbba0ab899]::panicking::panic_handler::{closure#0}<unknown>
  295. 39.38 s gammaloop-nextest-core> at <unknown source file>:<unknown line>
  296. 39.38 s gammaloop-nextest-core> 5: std[bcb96dfbba0ab899]::sys::backtrace::__rust_end_short_backtrace::<std[bcb96dfbba0ab899]::panicking::panic_handler::{closure#0}, !><unknown>
  297. 39.38 s gammaloop-nextest-core> at <unknown source file>:<unknown line>
  298. 39.38 s gammaloop-nextest-core> 6: __rustc[6c289b9f9c454d21]::rust_begin_unwind<unknown>
  299. 39.38 s gammaloop-nextest-core> at <unknown source file>:<unknown line>
  300. 39.38 s gammaloop-nextest-core> 7: core[940e698046960fd5]::panicking::panic_fmt<unknown>
  301. 39.38 s gammaloop-nextest-core> at <unknown source file>:<unknown line>
  302. 39.38 s gammaloop-nextest-core> 8: core[940e698046960fd5]::panicking::assert_failed_inner<unknown>
  303. 39.38 s gammaloop-nextest-core> at <unknown source file>:<unknown line>
  304. 39.38 s gammaloop-nextest-core> 9: core[940e698046960fd5]::panicking::assert_failed::<alloc[2ea6bcb46fca0c42]::vec::Vec<alloc[2ea6bcb46fca0c42]::vec::Vec<usize>>, alloc[2ea6bcb46fca0c42]::vec::Vec<alloc[2ea6bcb46fca0c42]::vec::Vec<usize>>><unknown>
  305. 39.38 s gammaloop-nextest-core> at <unknown source file>:<unknown line>
  306. 39.38 s gammaloop-nextest-core> 10: gammalooprs[8af0a922d9a4c82d]::uv::approx::tests::factorized_owned_dot_child_cff_matches_direct_3d_for_uncut_self_energy<unknown>
  307. 39.38 s gammaloop-nextest-core> at <unknown source file>:<unknown line>
  308. 39.38 s gammaloop-nextest-core> 11: <gammalooprs[8af0a922d9a4c82d]::uv::approx::tests::factorized_owned_dot_child_cff_matches_direct_3d_for_uncut_self_energy::{closure#0} as core[940e698046960fd5]::ops::function::FnOnce<()>>::call_once<unknown>
  309. 39.38 s gammaloop-nextest-core> at <unknown source file>:<unknown line>
  310. 39.38 s gammaloop-nextest-core> 12: test[75d6903177b1d7e9]::__rust_begin_short_backtrace::<core[940e698046960fd5]::result::Result<(), alloc[2ea6bcb46fca0c42]::string::String>, fn() -> core[940e698046960fd5]::result::Result<(), alloc[2ea6bcb46fca0c42]::string::String>><unknown>
  311. 39.38 s gammaloop-nextest-core> at <unknown source file>:<unknown line>
  312. 39.38 s gammaloop-nextest-core> 13: test[75d6903177b1d7e9]::run_test::{closure#0}<unknown>
  313. 39.38 s gammaloop-nextest-core> at <unknown source file>:<unknown line>
  314. 39.38 s gammaloop-nextest-core> 14: std[bcb96dfbba0ab899]::sys::backtrace::__rust_begin_short_backtrace::<test[75d6903177b1d7e9]::run_test::{closure#1}, ()><unknown>
  315. 39.38 s gammaloop-nextest-core> at <unknown source file>:<unknown line>
  316. 39.38 s gammaloop-nextest-core> 15: <std[bcb96dfbba0ab899]::thread::lifecycle::spawn_unchecked<test[75d6903177b1d7e9]::run_test::{closure#1}, ()>::{closure#1} as core[940e698046960fd5]::ops::function::FnOnce<()>>::call_once::{shim:vtable#0}<unknown>
  317. 39.38 s gammaloop-nextest-core> at <unknown source file>:<unknown line>
  318. 39.38 s gammaloop-nextest-core> 16: <std[bcb96dfbba0ab899]::sys::thread::unix::Thread>::new::thread_start<unknown>
  319. 39.38 s gammaloop-nextest-core> at <unknown source file>:<unknown line>
  320. 39.38 s gammaloop-nextest-core> 17: start_thread<unknown>
  321. 39.38 s gammaloop-nextest-core> at <unknown source file>:<unknown line>
  322. 39.38 s gammaloop-nextest-core> 18: __clone3<unknown>
  323. 39.38 s gammaloop-nextest-core> at <unknown source file>:<unknown line>
  324. 39.38 s gammaloop-nextest-core>
  325. 39.38 s gammaloop-nextest-core> Run with COLORBT_SHOW_HIDDEN=1 environment variable to disable frame filtering.
  326. 39.38 s gammaloop-nextest-core> Run with RUST_BACKTRACE=full to include source snippets.
  327. 39.38 s gammaloop-nextest-core>
  328. 39.48 s gammaloop-nextest-core> error: test run failed
  329. 39.54 s gammaloop-nextest-core>
  330. 39.54 s gammaloop-nextest-core> ========== nextest test summary ==========
  331. 39.54 s gammaloop-nextest-core> report: target/nextest/ci_gammaloop/junit.xml
  332. 39.54 s gammaloop-nextest-core> tests: 645, failures: 2, errors: 0
  333. 39.54 s gammaloop-nextest-core>
  334. 39.54 s gammaloop-nextest-core> 1. gammalooprs::uv::approx::local_4d::tests::dod_one_triangle_keeps_separate_denominator_topologies
  335. 39.54 s gammaloop-nextest-core> failure: test failure with exit code 101
  336. 39.54 s gammaloop-nextest-core> system-out
  337. 39.54 s gammaloop-nextest-core> running 1 test
  338. 39.54 s gammaloop-nextest-core> test uv::approx::local_4d::tests::dod_one_triangle_keeps_separate_denominator_topologies ... FAILED
  339. 39.54 s gammaloop-nextest-core>
  340. 39.54 s gammaloop-nextest-core> failures:
  341. 39.54 s gammaloop-nextest-core>
  342. 39.54 s gammaloop-nextest-core> failures:
  343. 39.54 s gammaloop-nextest-core> uv::approx::local_4d::tests::dod_one_triangle_keeps_separate_denominator_topologies
  344. 39.54 s gammaloop-nextest-core>
  345. 39.54 s gammaloop-nextest-core> test result: FAILED. 0 passed; 1 failed; 0 ignored; 0 measured; 695 filtered out; finished in 0.14s
  346. 39.54 s gammaloop-nextest-core> system-err
  347. 39.54 s gammaloop-nextest-core> The application panicked (crashed).
  348. 39.54 s gammaloop-nextest-core> Message: assertion `left == right` failed
  349. 39.54 s gammaloop-nextest-core> left: [[1, 1, 1], [1, 1, 1], [1, 1, 2], [2, 1, 1]]
  350. 39.54 s gammaloop-nextest-core> right: [[1, 1, 1], [1, 1, 2], [2, 1, 1]]
  351. 39.54 s gammaloop-nextest-core> Location: crates/gammalooprs/src/uv/approx/local_4d.rs:1992
  352. 39.54 s gammaloop-nextest-core>
  353. 39.54 s gammaloop-nextest-core> ━━━━━━━━━━━━━━━━━━━━━━━━━━━━━━━━━━ BACKTRACE ━━━━━━━━━━━━━━━━━━━━━━━━━━━━━━━━━━━
  354. 39.54 s gammaloop-nextest-core> 1: <color_eyre[51793ea62743adbd]::config::PanicHook>::panic_report<unknown>
  355. 39.54 s gammaloop-nextest-core> at <unknown source file>:<unknown line>
  356. 39.54 s gammaloop-nextest-core> 2: <color_eyre[51793ea62743adbd]::config::PanicHook>::into_panic_hook::{closure#0}<unknown>
  357. 39.54 s gammaloop-nextest-core> at <unknown source file>:<unknown line>
  358. 39.54 s gammaloop-nextest-core> 3: std[bcb96dfbba0ab899]::panicking::panic_with_hook<unknown>
  359. 39.54 s gammaloop-nextest-core> at <unknown source file>:<unknown line>
  360. 39.54 s gammaloop-nextest-core> 4: std[bcb96dfbba0ab899]::panicking::panic_handler::{closure#0}<unknown>
  361. 39.54 s gammaloop-nextest-core> at <unknown source file>:<unknown line>
  362. 39.54 s gammaloop-nextest-core> 5: std[bcb96dfbba0ab899]::sys::backtrace::__rust_end_short_backtrace::<std[bcb96dfbba0ab899]::panicking::panic_handler::{closure#0}, !><unknown>
  363. 39.54 s gammaloop-nextest-core> at <unknown source file>:<unknown line>
  364. 39.54 s gammaloop-nextest-core> 6: __rustc[6c289b9f9c454d21]::rust_begin_unwind<unknown>
  365. 39.54 s gammaloop-nextest-core> at <unknown source file>:<unknown line>
  366. 39.54 s gammaloop-nextest-core> 7: core[940e698046960fd5]::panicking::panic_fmt<unknown>
  367. 39.54 s gammaloop-nextest-core> at <unknown source file>:<unknown line>
  368. 39.54 s gammaloop-nextest-core> 8: core[940e698046960fd5]::panicking::assert_failed_inner<unknown>
  369. 39.54 s gammaloop-nextest-core> at <unknown source file>:<unknown line>
  370. 39.54 s gammaloop-nextest-core> 9: core[940e698046960fd5]::panicking::assert_failed::<alloc[2ea6bcb46fca0c42]::vec::Vec<[usize; 3usize]>, alloc[2ea6bcb46fca0c42]::vec::Vec<[usize; 3usize]>><unknown>
  371. 39.54 s gammaloop-nextest-core> at <unknown source file>:<unknown line>
  372. 39.54 s gammaloop-nextest-core> 10: gammalooprs[8af0a922d9a4c82d]::uv::approx::local_4d::tests::dod_one_triangle_keeps_separate_denominator_topologies<unknown>
  373. 39.54 s gammaloop-nextest-core> at <unknown source file>:<unknown line>
  374. 39.54 s gammaloop-nextest-core> 11: <gammalooprs[8af0a922d9a4c82d]::uv::approx::local_4d::tests::dod_one_triangle_keeps_separate_denominator_topologies::{closure#0} as core[940e698046960fd5]::ops::function::FnOnce<()>>::call_once<unknown>
  375. 39.54 s gammaloop-nextest-core> at <unknown source file>:<unknown line>
  376. 39.54 s gammaloop-nextest-core> 12: test[75d6903177b1d7e9]::__rust_begin_short_backtrace::<core[940e698046960fd5]::result::Result<(), alloc[2ea6bcb46fca0c42]::string::String>, fn() -> core[940e698046960fd5]::result::Result<(), alloc[2ea6bcb46fca0c42]::string::String>><unknown>
  377. 39.54 s gammaloop-nextest-core> at <unknown source file>:<unknown line>
  378. 39.54 s gammaloop-nextest-core> 13: test[75d6903177b1d7e9]::run_test::{closure#0}<unknown>
  379. 39.54 s gammaloop-nextest-core> at <unknown source file>:<unknown line>
  380. 39.54 s gammaloop-nextest-core> 14: std[bcb96dfbba0ab899]::sys::backtrace::__rust_begin_short_backtrace::<test[75d6903177b1d7e9]::run_test::{closure#1}, ()><unknown>
  381. 39.54 s gammaloop-nextest-core> at <unknown source file>:<unknown line>
  382. 39.54 s gammaloop-nextest-core> 15: <std[bcb96dfbba0ab899]::thread::lifecycle::spawn_unchecked<test[75d6903177b1d7e9]::run_test::{closure#1}, ()>::{closure#1} as core[940e698046960fd5]::ops::function::FnOnce<()>>::call_once::{shim:vtable#0}<unknown>
  383. 39.54 s gammaloop-nextest-core> at <unknown source file>:<unknown line>
  384. 39.54 s gammaloop-nextest-core> 16: <std[bcb96dfbba0ab899]::sys::thread::unix::Thread>::new::thread_start<unknown>
  385. 39.54 s gammaloop-nextest-core> at <unknown source file>:<unknown line>
  386. 39.54 s gammaloop-nextest-core> 17: start_thread<unknown>
  387. 39.54 s gammaloop-nextest-core> at <unknown source file>:<unknown line>
  388. 39.54 s gammaloop-nextest-core> 18: __clone3<unknown>
  389. 39.54 s gammaloop-nextest-core> at <unknown source file>:<unknown line>
  390. 39.54 s gammaloop-nextest-core>
  391. 39.54 s gammaloop-nextest-core> Run with COLORBT_SHOW_HIDDEN=1 environment variable to disable frame filtering.
  392. 39.54 s gammaloop-nextest-core> Run with RUST_BACKTRACE=full to include source snippets.
  393. 39.54 s gammaloop-nextest-core>
  394. 39.54 s gammaloop-nextest-core> 2. gammalooprs::uv::approx::tests::factorized_owned_dot_child_cff_matches_direct_3d_for_uncut_self_energy
  395. 39.54 s gammaloop-nextest-core> failure: test failure with exit code 101
  396. 39.54 s gammaloop-nextest-core> system-out
  397. 39.54 s gammaloop-nextest-core> running 1 test
  398. 39.54 s gammaloop-nextest-core> test uv::approx::tests::factorized_owned_dot_child_cff_matches_direct_3d_for_uncut_self_energy ... FAILED
  399. 39.54 s gammaloop-nextest-core>
  400. 39.54 s gammaloop-nextest-core> failures:
  401. 39.54 s gammaloop-nextest-core>
  402. 39.54 s gammaloop-nextest-core> failures:
  403. 39.54 s gammaloop-nextest-core> uv::approx::tests::factorized_owned_dot_child_cff_matches_direct_3d_for_uncut_self_energy
  404. 39.54 s gammaloop-nextest-core>
  405. 39.54 s gammaloop-nextest-core> test result: FAILED. 0 passed; 1 failed; 0 ignored; 0 measured; 695 filtered out; finished in 0.57s
  406. 39.54 s gammaloop-nextest-core> system-err
  407. 39.54 s gammaloop-nextest-core> The application panicked (crashed).
  408. 39.54 s gammaloop-nextest-core> Message: assertion `left == right` failed
  409. 39.54 s gammaloop-nextest-core> left: [[1, 1, 2], [1, 2], [2, 2, 1], [2, 1], [2, 1], [2, 2, 1], [2, 2, 2, 1], [2, 2, 1]]
  410. 39.54 s gammaloop-nextest-core> right: [[1, 1, 2, 2, 2]]
  411. 39.54 s gammaloop-nextest-core> Location: crates/gammalooprs/src/uv/approx/mod.rs:1471
  412. 39.54 s gammaloop-nextest-core>
  413. 39.54 s gammaloop-nextest-core> ━━━━━━━━━━━━━━━━━━━━━━━━━━━━━━━━━━ BACKTRACE ━━━━━━━━━━━━━━━━━━━━━━━━━━━━━━━━━━━
  414. 39.54 s gammaloop-nextest-core> 1: <color_eyre[51793ea62743adbd]::config::PanicHook>::panic_report<unknown>
  415. 39.54 s gammaloop-nextest-core> at <unknown source file>:<unknown line>
  416. 39.54 s gammaloop-nextest-core> 2: <color_eyre[51793ea62743adbd]::config::PanicHook>::into_panic_hook::{closure#0}<unknown>
  417. 39.54 s gammaloop-nextest-core> at <unknown source file>:<unknown line>
  418. 39.54 s gammaloop-nextest-core> 3: std[bcb96dfbba0ab899]::panicking::panic_with_hook<unknown>
  419. 39.54 s gammaloop-nextest-core> at <unknown source file>:<unknown line>
  420. 39.54 s gammaloop-nextest-core> 4: std[bcb96dfbba0ab899]::panicking::panic_handler::{closure#0}<unknown>
  421. 39.54 s gammaloop-nextest-core> at <unknown source file>:<unknown line>
  422. 39.54 s gammaloop-nextest-core> 5: std[bcb96dfbba0ab899]::sys::backtrace::__rust_end_short_backtrace::<std[bcb96dfbba0ab899]::panicking::panic_handler::{closure#0}, !><unknown>
  423. 39.54 s gammaloop-nextest-core> at <unknown source file>:<unknown line>
  424. 39.54 s gammaloop-nextest-core> 6: __rustc[6c289b9f9c454d21]::rust_begin_unwind<unknown>
  425. 39.54 s gammaloop-nextest-core> at <unknown source file>:<unknown line>
  426. 39.54 s gammaloop-nextest-core> 7: core[940e698046960fd5]::panicking::panic_fmt<unknown>
  427. 39.54 s gammaloop-nextest-core> at <unknown source file>:<unknown line>
  428. 39.54 s gammaloop-nextest-core> 8: core[940e698046960fd5]::panicking::assert_failed_inner<unknown>
  429. 39.54 s gammaloop-nextest-core> at <unknown source file>:<unknown line>
  430. 39.54 s gammaloop-nextest-core> 9: core[940e698046960fd5]::panicking::assert_failed::<alloc[2ea6bcb46fca0c42]::vec::Vec<alloc[2ea6bcb46fca0c42]::vec::Vec<usize>>, alloc[2ea6bcb46fca0c42]::vec::Vec<alloc[2ea6bcb46fca0c42]::vec::Vec<usize>>><unknown>
  431. 39.54 s gammaloop-nextest-core> at <unknown source file>:<unknown line>
  432. 39.54 s gammaloop-nextest-core> 10: gammalooprs[8af0a922d9a4c82d]::uv::approx::tests::factorized_owned_dot_child_cff_matches_direct_3d_for_uncut_self_energy<unknown>
  433. 39.54 s gammaloop-nextest-core> at <unknown source file>:<unknown line>
  434. 39.54 s gammaloop-nextest-core> 11: <gammalooprs[8af0a922d9a4c82d]::uv::approx::tests::factorized_owned_dot_child_cff_matches_direct_3d_for_uncut_self_energy::{closure#0} as core[940e698046960fd5]::ops::function::FnOnce<()>>::call_once<unknown>
  435. 39.54 s gammaloop-nextest-core> at <unknown source file>:<unknown line>
  436. 39.54 s gammaloop-nextest-core> 12: test[75d6903177b1d7e9]::__rust_begin_short_backtrace::<core[940e698046960fd5]::result::Result<(), alloc[2ea6bcb46fca0c42]::string::String>, fn() -> core[940e698046960fd5]::result::Result<(), alloc[2ea6bcb46fca0c42]::string::String>><unknown>
  437. 39.54 s gammaloop-nextest-core> at <unknown source file>:<unknown line>
  438. 39.54 s gammaloop-nextest-core> 13: test[75d6903177b1d7e9]::run_test::{closure#0}<unknown>
  439. 39.54 s gammaloop-nextest-core> at <unknown source file>:<unknown line>
  440. 39.54 s gammaloop-nextest-core> 14: std[bcb96dfbba0ab899]::sys::backtrace::__rust_begin_short_backtrace::<test[75d6903177b1d7e9]::run_test::{closure#1}, ()><unknown>
  441. 39.54 s gammaloop-nextest-core> at <unknown source file>:<unknown line>
  442. 39.54 s gammaloop-nextest-core> 15: <std[bcb96dfbba0ab899]::thread::lifecycle::spawn_unchecked<test[75d6903177b1d7e9]::run_test::{closure#1}, ()>::{closure#1} as core[940e698046960fd5]::ops::function::FnOnce<()>>::call_once::{shim:vtable#0}<unknown>
  443. 39.54 s gammaloop-nextest-core> at <unknown source file>:<unknown line>
  444. 39.54 s gammaloop-nextest-core> 16: <std[bcb96dfbba0ab899]::sys::thread::unix::Thread>::new::thread_start<unknown>
  445. 39.54 s gammaloop-nextest-core> at <unknown source file>:<unknown line>
  446. 39.54 s gammaloop-nextest-core> 17: start_thread<unknown>
  447. 39.54 s gammaloop-nextest-core> at <unknown source file>:<unknown line>
  448. 39.54 s gammaloop-nextest-core> 18: __clone3<unknown>
  449. 39.54 s gammaloop-nextest-core> at <unknown source file>:<unknown line>
  450. 39.54 s gammaloop-nextest-core>
  451. 39.54 s gammaloop-nextest-core> Run with COLORBT_SHOW_HIDDEN=1 environment variable to disable frame filtering.
  452. 39.54 s gammaloop-nextest-core> Run with RUST_BACKTRACE=full to include source snippets.
  453. 39.54 s gammaloop-nextest-core> =========================================
  454. 39.57 s gammaloop-nextest-core> Extracting 1 binary, 1 build script output directory, and 1 linked path to /build/nextest-archive-cZSeo1
  455. 39.70 s gammaloop-nextest-core> Extracted 7 files to /build/nextest-archive-cZSeo1 in 0.13s
  456. 39.71 s gammaloop-nextest-core> ------------
  457. 39.71 s gammaloop-nextest-core> Nextest run ID cd98eea8-2e75-443a-bbbb-e8133c835950 with nextest profile: ci_gammaloop
  458. 39.71 s gammaloop-nextest-core> Starting 119 tests across 1 binary
  459. 41.81 s gammaloop-nextest-core> ------------
  460. 41.81 s gammaloop-nextest-core> Summary [ 2.095s] 119 tests run: 119 passed, 0 skipped
  461. 41.88 s gammaloop-nextest-core>
  462. 41.88 s gammaloop-nextest-core> ========== nextest test summary ==========
  463. 41.88 s gammaloop-nextest-core> report: target/nextest/ci_gammaloop/junit.xml
  464. 41.88 s gammaloop-nextest-core> tests: 119, failures: 0, errors: 0
  465. 41.88 s gammaloop-nextest-core> No failing testcases found.
  466. 41.88 s gammaloop-nextest-core> =========================================
  467. 41.98 s [0 built (1 failed), 0.0error: Cannot build '/nix/store/bcc3gg1akl605y0c3km3gjg8nsqsjzv8-gammaloop-nextest-core.drv'.
  468. 41.98 s Reason: builder failed with exit code 100.
  469. 41.98 s Output paths:
  470. 41.98 s /nix/store/i7lvgxhj7vpsi0jgq7jfdhgg9f5m1qi3-gammaloop-nextest-core
  471. 41.98 s Last 429 log lines:
  472. 41.98 s > Extracting 4 binaries (including 1 non-test binary), 1 build script output directory, and 2 linked paths to /build/nextest-archive-zsrXEg
  473. 41.98 s > Extracted 20 files to /build/nextest-archive-zsrXEg in 0.72s
  474. 41.98 s > ------------
  475. 41.98 s > Nextest run ID feef071c-54bb-423e-ac02-6efc3d53feb3 with nextest profile: ci_gammaloop
  476. 41.98 s > Starting 377 tests across 3 binaries
  477. 41.98 s > ------------
  478. 41.98 s > Summary [ 1.316s] 377 tests run: 377 passed, 0 skipped
  479. 41.98 s >
  480. 41.98 s > ========== nextest test summary ==========
  481. 41.98 s > report: target/nextest/ci_gammaloop/junit.xml
  482. 41.98 s > tests: 377, failures: 0, errors: 0
  483. 41.98 s > No failing testcases found.
  484. 41.98 s > =========================================
  485. 41.98 s > Extracting 1 binary and 1 linked path to /build/nextest-archive-xYJLcI
  486. 41.98 s > Extracted 7 files to /build/nextest-archive-xYJLcI in 0.07s
  487. 41.98 s > ------------
  488. 41.98 s > Nextest run ID 785dbc3d-151a-4e42-bd03-8131e5fb6b11 with nextest profile: ci_gammaloop
  489. 41.98 s > Starting 19 tests across 1 binary
  490. 41.98 s > ------------
  491. 41.98 s > Summary [ 0.012s] 19 tests run: 19 passed, 0 skipped
  492. 41.98 s >
  493. 41.98 s > ========== nextest test summary ==========
  494. 41.98 s > report: target/nextest/ci_gammaloop/junit.xml
  495. 41.98 s > tests: 19, failures: 0, errors: 0
  496. 41.98 s > No failing testcases found.
  497. 41.98 s > =========================================
  498. 41.98 s > Extracting 1 binary to /build/nextest-archive-EGag36
  499. 41.98 s > Extracted 4 files to /build/nextest-archive-EGag36 in 0.03s
  500. 41.98 s > ------------
  501. 41.98 s > Nextest run ID 582f4ed7-065b-4ec8-bc0b-3c1a001b2d75 with nextest profile: ci_gammaloop
  502. 41.98 s > Starting 0 tests across 1 binary
  503. 41.98 s > ------------
  504. 41.98 s > Summary [ 0.000s] 0 tests run: 0 passed, 0 skipped
  505. 41.98 s >
  506. 41.98 s > ========== nextest test summary ==========
  507. 41.98 s > report: target/nextest/ci_gammaloop/junit.xml
  508. 41.98 s > tests: 0, failures: 0, errors: 0
  509. 41.98 s > No failing testcases found.
  510. 41.98 s > =========================================
  511. 41.98 s > Extracting 4 binaries, 1 build script output directory, and 2 linked paths to /build/nextest-archive-OM5q93
  512. 41.98 s > Extracted 18 files to /build/nextest-archive-OM5q93 in 0.49s
  513. 41.98 s > ------------
  514. 41.98 s > Nextest run ID c2d0d83b-b1d2-44d0-ae88-375b8da65a4f with nextest profile: ci_gammaloop
  515. 41.98 s > Starting 645 tests across 4 binaries (59 tests skipped, including 58 tests via profile.ci_gammaloop.default-filter)
  516. 41.98 s > FAIL [ 0.196s] (553/645) gammalooprs uv::approx::local_4d::tests::dod_one_triangle_keeps_separate_denominator_topologies
  517. 41.98 s > stdout ---
  518. 41.98 s >
  519. 41.98 s > running 1 test
  520. 41.98 s > test uv::approx::local_4d::tests::dod_one_triangle_keeps_separate_denominator_topologies ... FAILED
  521. 41.98 s >
  522. 41.98 s > failures:
  523. 41.98 s >
  524. 41.98 s > failures:
  525. 41.98 s > uv::approx::local_4d::tests::dod_one_triangle_keeps_separate_denominator_topologies
  526. 41.98 s >
  527. 41.98 s > test result: FAILED. 0 passed; 1 failed; 0 ignored; 0 measured; 695 filtered out; finished in 0.14s
  528. 41.98 s >
  529. 41.98 s > stderr ---
  530. 41.98 s > The application panicked (crashed).
  531. 41.98 s > Message: assertion `left == right` failed
  532. 41.98 s > left: [[1, 1, 1], [1, 1, 1], [1, 1, 2], [2, 1, 1]]
  533. 41.98 s > right: [[1, 1, 1], [1, 1, 2], [2, 1, 1]]
  534. 41.98 s > Location: crates/gammalooprs/src/uv/approx/local_4d.rs:1992
  535. 41.98 s >
  536. 41.98 s > ━━━━━━━━━━━━━━━━━━━━━━━━━━━━━━━━━━ BACKTRACE ━━━━━━━━━━━━━━━━━━━━━━━━━━━━━━━━━━━
  537. 41.98 s > 1: <color_eyre[51793ea62743adbd]::config::PanicHook>::panic_report<unknown>
  538. 41.98 s > at <unknown source file>:<unknown line>
  539. 41.98 s > 2: <color_eyre[51793ea62743adbd]::config::PanicHook>::into_panic_hook::{closure#0}<unknown>
  540. 41.98 s > at <unknown source file>:<unknown line>
  541. 41.98 s > 3: std[bcb96dfbba0ab899]::panicking::panic_with_hook<unknown>
  542. 41.98 s > at <unknown source file>:<unknown line>
  543. 41.98 s > 4: std[bcb96dfbba0ab899]::panicking::panic_handler::{closure#0}<unknown>
  544. 41.98 s > at <unknown source file>:<unknown line>
  545. 41.98 s > 5: std[bcb96dfbba0ab899]::sys::backtrace::__rust_end_short_backtrace::<std[bcb96dfbba0ab899]::panicking::panic_handler::{closure#0}, !><unknown>
  546. 41.98 s > at <unknown source file>:<unknown line>
  547. 41.98 s > 6: __rustc[6c289b9f9c454d21]::rust_begin_unwind<unknown>
  548. 41.98 s > at <unknown source file>:<unknown line>
  549. 41.98 s > 7: core[940e698046960fd5]::panicking::panic_fmt<unknown>
  550. 41.98 s > at <unknown source file>:<unknown line>
  551. 41.98 s > 8: core[940e698046960fd5]::panicking::assert_failed_inner<unknown>
  552. 41.98 s > at <unknown source file>:<unknown line>
  553. 41.98 s > 9: core[940e698046960fd5]::panicking::assert_failed::<alloc[2ea6bcb46fca0c42]::vec::Vec<[usize; 3usize]>, alloc[2ea6bcb46fca0c42]::vec::Vec<[usize; 3usize]>><unknown>
  554. 41.98 s > at <unknown source file>:<unknown line>
  555. 41.98 s > 10: gammalooprs[8af0a922d9a4c82d]::uv::approx::local_4d::tests::dod_one_triangle_keeps_separate_denominator_topologies<unknown>
  556. 41.98 s > at <unknown source file>:<unknown line>
  557. 41.98 s > 11: <gammalooprs[8af0a922d9a4c82d]::uv::approx::local_4d::tests::dod_one_triangle_keeps_separate_denominator_topologies::{closure#0} as core[940e698046960fd5]::ops::function::FnOnce<()>>::call_once<unknown>
  558. 41.98 s > at <unknown source file>:<unknown line>
  559. 41.98 s > 12: test[75d6903177b1d7e9]::__rust_begin_short_backtrace::<core[940e698046960fd5]::result::Result<(), alloc[2ea6bcb46fca0c42]::string::String>, fn() -> core[940e698046960fd5]::result::Result<(), alloc[2ea6bcb46fca0c42]::string::String>><unknown>
  560. 41.98 s > at <unknown source file>:<unknown line>
  561. 41.98 s > 13: test[75d6903177b1d7e9]::run_test::{closure#0}<unknown>
  562. 41.98 s > at <unknown source file>:<unknown line>
  563. 41.98 s > 14: std[bcb96dfbba0ab899]::sys::backtrace::__rust_begin_short_backtrace::<test[75d6903177b1d7e9]::run_test::{closure#1}, ()><unknown>
  564. 41.98 s > at <unknown source file>:<unknown line>
  565. 41.98 s > 15: <std[bcb96dfbba0ab899]::thread::lifecycle::spawn_unchecked<test[75d6903177b1d7e9]::run_test::{closure#1}, ()>::{closure#1} as core[940e698046960fd5]::ops::function::FnOnce<()>>::call_once::{shim:vtable#0}<unknown>
  566. 41.98 s > at <unknown source file>:<unknown line>
  567. 41.98 s > 16: <std[bcb96dfbba0ab899]::sys::thread::unix::Thread>::new::thread_start<unknown>
  568. 41.98 s > at <unknown source file>:<unknown line>
  569. 41.98 s > 17: start_thread<unknown>
  570. 41.98 s > at <unknown source file>:<unknown line>
  571. 41.98 s > 18: __clone3<unknown>
  572. 41.98 s > at <unknown source file>:<unknown line>
  573. 41.98 s >
  574. 41.98 s > Run with COLORBT_SHOW_HIDDEN=1 environment variable to disable frame filtering.
  575. 41.98 s > Run with RUST_BACKTRACE=full to include source snippets.
  576. 41.98 s >
  577. 41.98 s > FAIL [ 0.598s] (577/645) gammalooprs uv::approx::tests::factorized_owned_dot_child_cff_matches_direct_3d_for_uncut_self_energy
  578. 41.98 s > stdout ---
  579. 41.98 s >
  580. 41.98 s > running 1 test
  581. 41.98 s > test uv::approx::tests::factorized_owned_dot_child_cff_matches_direct_3d_for_uncut_self_energy ... FAILED
  582. 41.98 s >
  583. 41.98 s > failures:
  584. 41.98 s >
  585. 41.98 s > failures:
  586. 41.98 s > uv::approx::tests::factorized_owned_dot_child_cff_matches_direct_3d_for_uncut_self_energy
  587. 41.98 s >
  588. 41.98 s > test result: FAILED. 0 passed; 1 failed; 0 ignored; 0 measured; 695 filtered out; finished in 0.57s
  589. 41.98 s >
  590. 41.98 s > stderr ---
  591. 41.98 s > The application panicked (crashed).
  592. 41.98 s > Message: assertion `left == right` failed
  593. 41.98 s > left: [[1, 1, 2], [1, 2], [2, 2, 1], [2, 1], [2, 1], [2, 2, 1], [2, 2, 2, 1], [2, 2, 1]]
  594. 41.98 s > right: [[1, 1, 2, 2, 2]]
  595. 41.98 s > Location: crates/gammalooprs/src/uv/approx/mod.rs:1471
  596. 41.98 s >
  597. 41.98 s > ━━━━━━━━━━━━━━━━━━━━━━━━━━━━━━━━━━ BACKTRACE ━━━━━━━━━━━━━━━━━━━━━━━━━━━━━━━━━━━
  598. 41.98 s > 1: <color_eyre[51793ea62743adbd]::config::PanicHook>::panic_report<unknown>
  599. 41.98 s > at <unknown source file>:<unknown line>
  600. 41.98 s > 2: <color_eyre[51793ea62743adbd]::config::PanicHook>::into_panic_hook::{closure#0}<unknown>
  601. 41.98 s > at <unknown source file>:<unknown line>
  602. 41.98 s > 3: std[bcb96dfbba0ab899]::panicking::panic_with_hook<unknown>
  603. 41.98 s > at <unknown source file>:<unknown line>
  604. 41.98 s > 4: std[bcb96dfbba0ab899]::panicking::panic_handler::{closure#0}<unknown>
  605. 41.98 s > at <unknown source file>:<unknown line>
  606. 41.98 s > 5: std[bcb96dfbba0ab899]::sys::backtrace::__rust_end_short_backtrace::<std[bcb96dfbba0ab899]::panicking::panic_handler::{closure#0}, !><unknown>
  607. 41.98 s > at <unknown source file>:<unknown line>
  608. 41.98 s > 6: __rustc[6c289b9f9c454d21]::rust_begin_unwind<unknown>
  609. 41.98 s > at <unknown source file>:<unknown line>
  610. 41.98 s > 7: core[940e698046960fd5]::panicking::panic_fmt<unknown>
  611. 41.98 s > at <unknown source file>:<unknown line>
  612. 41.98 s > 8: core[940e698046960fd5]::panicking::assert_failed_inner<unknown>
  613. 41.98 s > at <unknown source file>:<unknown line>
  614. 41.98 s > 9: core[940e698046960fd5]::panicking::assert_failed::<alloc[2ea6bcb46fca0c42]::vec::Vec<alloc[2ea6bcb46fca0c42]::vec::Vec<usize>>, alloc[2ea6bcb46fca0c42]::vec::Vec<alloc[2ea6bcb46fca0c42]::vec::Vec<usize>>><unknown>
  615. 41.98 s > at <unknown source file>:<unknown line>
  616. 41.98 s > 10: gammalooprs[8af0a922d9a4c82d]::uv::approx::tests::factorized_owned_dot_child_cff_matches_direct_3d_for_uncut_self_energy<unknown>
  617. 41.98 s > at <unknown source file>:<unknown line>
  618. 41.98 s > 11: <gammalooprs[8af0a922d9a4c82d]::uv::approx::tests::factorized_owned_dot_child_cff_matches_direct_3d_for_uncut_self_energy::{closure#0} as core[940e698046960fd5]::ops::function::FnOnce<()>>::call_once<unknown>
  619. 41.98 s > at <unknown source file>:<unknown line>
  620. 41.98 s > 12: test[75d6903177b1d7e9]::__rust_begin_short_backtrace::<core[940e698046960fd5]::result::Result<(), alloc[2ea6bcb46fca0c42]::string::String>, fn() -> core[940e698046960fd5]::result::Result<(), alloc[2ea6bcb46fca0c42]::string::String>><unknown>
  621. 41.98 s > at <unknown source file>:<unknown line>
  622. 41.98 s > 13: test[75d6903177b1d7e9]::run_test::{closure#0}<unknown>
  623. 41.98 s > at <unknown source file>:<unknown line>
  624. 41.98 s > 14: std[bcb96dfbba0ab899]::sys::backtrace::__rust_begin_short_backtrace::<test[75d6903177b1d7e9]::run_test::{closure#1}, ()><unknown>
  625. 41.98 s > at <unknown source file>:<unknown line>
  626. 41.98 s > 15: <std[bcb96dfbba0ab899]::thread::lifecycle::spawn_unchecked<test[75d6903177b1d7e9]::run_test::{closure#1}, ()>::{closure#1} as core[940e698046960fd5]::ops::function::FnOnce<()>>::call_once::{shim:vtable#0}<unknown>
  627. 41.98 s > at <unknown source file>:<unknown line>
  628. 41.98 s > 16: <std[bcb96dfbba0ab899]::sys::thread::unix::Thread>::new::thread_start<unknown>
  629. 41.98 s > at <unknown source file>:<unknown line>
  630. 41.98 s > 17: start_thread<unknown>
  631. 41.98 s > at <unknown source file>:<unknown line>
  632. 41.98 s > 18: __clone3<unknown>
  633. 41.98 s > at <unknown source file>:<unknown line>
  634. 41.98 s >
  635. 41.98 s > Run with COLORBT_SHOW_HIDDEN=1 environment variable to disable frame filtering.
  636. 41.98 s > Run with RUST_BACKTRACE=full to include source snippets.
  637. 41.98 s >
  638. 41.98 s > ------------
  639. 41.98 s > Summary [ 15.149s] 645 tests run: 643 passed, 2 failed, 59 skipped
  640. 41.98 s > FAIL [ 0.196s] (553/645) gammalooprs uv::approx::local_4d::tests::dod_one_triangle_keeps_separate_denominator_topologies
  641. 41.98 s > stdout ---
  642. 41.98 s >
  643. 41.98 s > running 1 test
  644. 41.98 s > test uv::approx::local_4d::tests::dod_one_triangle_keeps_separate_denominator_topologies ... FAILED
  645. 41.98 s >
  646. 41.98 s > failures:
  647. 41.98 s >
  648. 41.98 s > failures:
  649. 41.98 s > uv::approx::local_4d::tests::dod_one_triangle_keeps_separate_denominator_topologies
  650. 41.98 s >
  651. 41.98 s > test result: FAILED. 0 passed; 1 failed; 0 ignored; 0 measured; 695 filtered out; finished in 0.14s
  652. 41.98 s >
  653. 41.98 s > stderr ---
  654. 41.98 s > The application panicked (crashed).
  655. 41.98 s > Message: assertion `left == right` failed
  656. 41.98 s > left: [[1, 1, 1], [1, 1, 1], [1, 1, 2], [2, 1, 1]]
  657. 41.98 s > right: [[1, 1, 1], [1, 1, 2], [2, 1, 1]]
  658. 41.98 s > Location: crates/gammalooprs/src/uv/approx/local_4d.rs:1992
  659. 41.98 s >
  660. 41.98 s > ━━━━━━━━━━━━━━━━━━━━━━━━━━━━━━━━━━ BACKTRACE ━━━━━━━━━━━━━━━━━━━━━━━━━━━━━━━━━━━
  661. 41.98 s > 1: <color_eyre[51793ea62743adbd]::config::PanicHook>::panic_report<unknown>
  662. 41.98 s > at <unknown source file>:<unknown line>
  663. 41.98 s > 2: <color_eyre[51793ea62743adbd]::config::PanicHook>::into_panic_hook::{closure#0}<unknown>
  664. 41.98 s > at <unknown source file>:<unknown line>
  665. 41.98 s > 3: std[bcb96dfbba0ab899]::panicking::panic_with_hook<unknown>
  666. 41.98 s > at <unknown source file>:<unknown line>
  667. 41.98 s > 4: std[bcb96dfbba0ab899]::panicking::panic_handler::{closure#0}<unknown>
  668. 41.98 s > at <unknown source file>:<unknown line>
  669. 41.98 s > 5: std[bcb96dfbba0ab899]::sys::backtrace::__rust_end_short_backtrace::<std[bcb96dfbba0ab899]::panicking::panic_handler::{closure#0}, !><unknown>
  670. 41.98 s > at <unknown source file>:<unknown line>
  671. 41.98 s > 6: __rustc[6c289b9f9c454d21]::rust_begin_unwind<unknown>
  672. 41.98 s > at <unknown source file>:<unknown line>
  673. 41.98 s > 7: core[940e698046960fd5]::panicking::panic_fmt<unknown>
  674. 41.98 s > at <unknown source file>:<unknown line>
  675. 41.98 s > 8: core[940e698046960fd5]::panicking::assert_failed_inner<unknown>
  676. 41.98 s > at <unknown source file>:<unknown line>
  677. 41.98 s > 9: core[940e698046960fd5]::panicking::assert_failed::<alloc[2ea6bcb46fca0c42]::vec::Vec<[usize; 3usize]>, alloc[2ea6bcb46fca0c42]::vec::Vec<[usize; 3usize]>><unknown>
  678. 41.98 s > at <unknown source file>:<unknown line>
  679. 41.98 s > 10: gammalooprs[8af0a922d9a4c82d]::uv::approx::local_4d::tests::dod_one_triangle_keeps_separate_denominator_topologies<unknown>
  680. 41.98 s > at <unknown source file>:<unknown line>
  681. 41.98 s > 11: <gammalooprs[8af0a922d9a4c82d]::uv::approx::local_4d::tests::dod_one_triangle_keeps_separate_denominator_topologies::{closure#0} as core[940e698046960fd5]::ops::function::FnOnce<()>>::call_once<unknown>
  682. 41.98 s > at <unknown source file>:<unknown line>
  683. 41.98 s > 12: test[75d6903177b1d7e9]::__rust_begin_short_backtrace::<core[940e698046960fd5]::result::Result<(), alloc[2ea6bcb46fca0c42]::string::String>, fn() -> core[940e698046960fd5]::result::Result<(), alloc[2ea6bcb46fca0c42]::string::String>><unknown>
  684. 41.98 s > at <unknown source file>:<unknown line>
  685. 41.98 s > 13: test[75d6903177b1d7e9]::run_test::{closure#0}<unknown>
  686. 41.98 s > at <unknown source file>:<unknown line>
  687. 41.98 s > 14: std[bcb96dfbba0ab899]::sys::backtrace::__rust_begin_short_backtrace::<test[75d6903177b1d7e9]::run_test::{closure#1}, ()><unknown>
  688. 41.98 s > at <unknown source file>:<unknown line>
  689. 41.98 s > 15: <std[bcb96dfbba0ab899]::thread::lifecycle::spawn_unchecked<test[75d6903177b1d7e9]::run_test::{closure#1}, ()>::{closure#1} as core[940e698046960fd5]::ops::function::FnOnce<()>>::call_once::{shim:vtable#0}<unknown>
  690. 41.98 s > at <unknown source file>:<unknown line>
  691. 41.98 s > 16: <std[bcb96dfbba0ab899]::sys::thread::unix::Thread>::new::thread_start<unknown>
  692. 41.98 s > at <unknown source file>:<unknown line>
  693. 41.98 s > 17: start_thread<unknown>
  694. 41.98 s > at <unknown source file>:<unknown line>
  695. 41.98 s > 18: __clone3<unknown>
  696. 41.98 s > at <unknown source file>:<unknown line>
  697. 41.98 s >
  698. 41.98 s > Run with COLORBT_SHOW_HIDDEN=1 environment variable to disable frame filtering.
  699. 41.98 s > Run with RUST_BACKTRACE=full to include source snippets.
  700. 41.98 s >
  701. 41.98 s > FAIL [ 0.598s] (577/645) gammalooprs uv::approx::tests::factorized_owned_dot_child_cff_matches_direct_3d_for_uncut_self_energy
  702. 41.98 s > stdout ---
  703. 41.98 s >
  704. 41.98 s > running 1 test
  705. 41.98 s > test uv::approx::tests::factorized_owned_dot_child_cff_matches_direct_3d_for_uncut_self_energy ... FAILED
  706. 41.98 s >
  707. 41.98 s > failures:
  708. 41.98 s >
  709. 41.98 s > failures:
  710. 41.98 s > uv::approx::tests::factorized_owned_dot_child_cff_matches_direct_3d_for_uncut_self_energy
  711. 41.98 s >
  712. 41.98 s > test result: FAILED. 0 passed; 1 failed; 0 ignored; 0 measured; 695 filtered out; finished in 0.57s
  713. 41.98 s >
  714. 41.98 s > stderr ---
  715. 41.98 s > The application panicked (crashed).
  716. 41.98 s > Message: assertion `left == right` failed
  717. 41.98 s > left: [[1, 1, 2], [1, 2], [2, 2, 1], [2, 1], [2, 1], [2, 2, 1], [2, 2, 2, 1], [2, 2, 1]]
  718. 41.98 s > right: [[1, 1, 2, 2, 2]]
  719. 41.98 s > Location: crates/gammalooprs/src/uv/approx/mod.rs:1471
  720. 41.98 s >
  721. 41.98 s > ━━━━━━━━━━━━━━━━━━━━━━━━━━━━━━━━━━ BACKTRACE ━━━━━━━━━━━━━━━━━━━━━━━━━━━━━━━━━━━
  722. 41.98 s > 1: <color_eyre[51793ea62743adbd]::config::PanicHook>::panic_report<unknown>
  723. 41.98 s > at <unknown source file>:<unknown line>
  724. 41.98 s > 2: <color_eyre[51793ea62743adbd]::config::PanicHook>::into_panic_hook::{closure#0}<unknown>
  725. 41.98 s > at <unknown source file>:<unknown line>
  726. 41.98 s > 3: std[bcb96dfbba0ab899]::panicking::panic_with_hook<unknown>
  727. 41.98 s > at <unknown source file>:<unknown line>
  728. 41.98 s > 4: std[bcb96dfbba0ab899]::panicking::panic_handler::{closure#0}<unknown>
  729. 41.98 s > at <unknown source file>:<unknown line>
  730. 41.98 s > 5: std[bcb96dfbba0ab899]::sys::backtrace::__rust_end_short_backtrace::<std[bcb96dfbba0ab899]::panicking::panic_handler::{closure#0}, !><unknown>
  731. 41.98 s > at <unknown source file>:<unknown line>
  732. 41.98 s > 6: __rustc[6c289b9f9c454d21]::rust_begin_unwind<unknown>
  733. 41.98 s > at <unknown source file>:<unknown line>
  734. 41.98 s > 7: core[940e698046960fd5]::panicking::panic_fmt<unknown>
  735. 41.98 s > at <unknown source file>:<unknown line>
  736. 41.98 s > 8: core[940e698046960fd5]::panicking::assert_failed_inner<unknown>
  737. 41.98 s > at <unknown source file>:<unknown line>
  738. 41.98 s > 9: core[940e698046960fd5]::panicking::assert_failed::<alloc[2ea6bcb46fca0c42]::vec::Vec<alloc[2ea6bcb46fca0c42]::vec::Vec<usize>>, alloc[2ea6bcb46fca0c42]::vec::Vec<alloc[2ea6bcb46fca0c42]::vec::Vec<usize>>><unknown>
  739. 41.98 s > at <unknown source file>:<unknown line>
  740. 41.98 s > 10: gammalooprs[8af0a922d9a4c82d]::uv::approx::tests::factorized_owned_dot_child_cff_matches_direct_3d_for_uncut_self_energy<unknown>
  741. 41.98 s > at <unknown source file>:<unknown line>
  742. 41.98 s > 11: <gammalooprs[8af0a922d9a4c82d]::uv::approx::tests::factorized_owned_dot_child_cff_matches_direct_3d_for_uncut_self_energy::{closure#0} as core[940e698046960fd5]::ops::function::FnOnce<()>>::call_once<unknown>
  743. 41.98 s > at <unknown source file>:<unknown line>
  744. 41.98 s > 12: test[75d6903177b1d7e9]::__rust_begin_short_backtrace::<core[940e698046960fd5]::result::Result<(), alloc[2ea6bcb46fca0c42]::string::String>, fn() -> core[940e698046960fd5]::result::Result<(), alloc[2ea6bcb46fca0c42]::string::String>><unknown>
  745. 41.98 s > at <unknown source file>:<unknown line>
  746. 41.98 s > 13: test[75d6903177b1d7e9]::run_test::{closure#0}<unknown>
  747. 41.98 s > at <unknown source file>:<unknown line>
  748. 41.98 s > 14: std[bcb96dfbba0ab899]::sys::backtrace::__rust_begin_short_backtrace::<test[75d6903177b1d7e9]::run_test::{closure#1}, ()><unknown>
  749. 41.98 s > at <unknown source file>:<unknown line>
  750. 41.98 s > 15: <std[bcb96dfbba0ab899]::thread::lifecycle::spawn_unchecked<test[75d6903177b1d7e9]::run_test::{closure#1}, ()>::{closure#1} as core[940e698046960fd5]::ops::function::FnOnce<()>>::call_once::{shim:vtable#0}<unknown>
  751. 41.98 s > at <unknown source file>:<unknown line>
  752. 41.98 s > 16: <std[bcb96dfbba0ab899]::sys::thread::unix::Thread>::new::thread_start<unknown>
  753. 41.98 s > at <unknown source file>:<unknown line>
  754. 41.98 s > 17: start_thread<unknown>
  755. 41.98 s > at <unknown source file>:<unknown line>
  756. 41.98 s > 18: __clone3<unknown>
  757. 41.98 s > at <unknown source file>:<unknown line>
  758. 41.98 s >
  759. 41.98 s > Run with COLORBT_SHOW_HIDDEN=1 environment variable to disable frame filtering.
  760. 41.98 s > Run with RUST_BACKTRACE=full to include source snippets.
  761. 41.98 s >
  762. 41.98 s > error: test run failed
  763. 41.98 s >
  764. 41.98 s > ========== nextest test summary ==========
  765. 41.98 s > report: target/nextest/ci_gammaloop/junit.xml
  766. 41.98 s > tests: 645, failures: 2, errors: 0
  767. 41.98 s >
  768. 41.98 s > 1. gammalooprs::uv::approx::local_4d::tests::dod_one_triangle_keeps_separate_denominator_topologies
  769. 41.98 s > failure: test failure with exit code 101
  770. 41.98 s > system-out
  771. 41.98 s > running 1 test
  772. 41.98 s > test uv::approx::local_4d::tests::dod_one_triangle_keeps_separate_denominator_topologies ... FAILED
  773. 41.98 s >
  774. 41.98 s > failures:
  775. 41.98 s >
  776. 41.98 s > failures:
  777. 41.98 s > uv::approx::local_4d::tests::dod_one_triangle_keeps_separate_denominator_topologies
  778. 41.98 s >
  779. 41.98 s > test result: FAILED. 0 passed; 1 failed; 0 ignored; 0 measured; 695 filtered out; finished in 0.14s
  780. 41.98 s > system-err
  781. 41.98 s > The application panicked (crashed).
  782. 41.98 s > Message: assertion `left == right` failed
  783. 41.98 s > left: [[1, 1, 1], [1, 1, 1], [1, 1, 2], [2, 1, 1]]
  784. 41.98 s > right: [[1, 1, 1], [1, 1, 2], [2, 1, 1]]
  785. 41.98 s > Location: crates/gammalooprs/src/uv/approx/local_4d.rs:1992
  786. 41.98 s >
  787. 41.98 s > ━━━━━━━━━━━━━━━━━━━━━━━━━━━━━━━━━━ BACKTRACE ━━━━━━━━━━━━━━━━━━━━━━━━━━━━━━━━━━━
  788. 41.98 s > 1: <color_eyre[51793ea62743adbd]::config::PanicHook>::panic_report<unknown>
  789. 41.98 s > at <unknown source file>:<unknown line>
  790. 41.98 s > 2: <color_eyre[51793ea62743adbd]::config::PanicHook>::into_panic_hook::{closure#0}<unknown>
  791. 41.98 s > at <unknown source file>:<unknown line>
  792. 41.98 s > 3: std[bcb96dfbba0ab899]::panicking::panic_with_hook<unknown>
  793. 41.98 s > at <unknown source file>:<unknown line>
  794. 41.98 s > 4: std[bcb96dfbba0ab899]::panicking::panic_handler::{closure#0}<unknown>
  795. 41.98 s > at <unknown source file>:<unknown line>
  796. 41.98 s > 5: std[bcb96dfbba0ab899]::sys::backtrace::__rust_end_short_backtrace::<std[bcb96dfbba0ab899]::panicking::panic_handler::{closure#0}, !><unknown>
  797. 41.98 s > at <unknown source file>:<unknown line>
  798. 41.98 s > 6: __rustc[6c289b9f9c454d21]::rust_begin_unwind<unknown>
  799. 41.98 s > at <unknown source file>:<unknown line>
  800. 41.98 s > 7: core[940e698046960fd5]::panicking::panic_fmt<unknown>
  801. 41.98 s > at <unknown source file>:<unknown line>
  802. 41.98 s > 8: core[940e698046960fd5]::panicking::assert_failed_inner<unknown>
  803. 41.98 s > at <unknown source file>:<unknown line>
  804. 41.98 s > 9: core[940e698046960fd5]::panicking::assert_failed::<alloc[2ea6bcb46fca0c42]::vec::Vec<[usize; 3usize]>, alloc[2ea6bcb46fca0c42]::vec::Vec<[usize; 3usize]>><unknown>
  805. 41.98 s > at <unknown source file>:<unknown line>
  806. 41.98 s > 10: gammalooprs[8af0a922d9a4c82d]::uv::approx::local_4d::tests::dod_one_triangle_keeps_separate_denominator_topologies<unknown>
  807. 41.98 s > at <unknown source file>:<unknown line>
  808. 41.98 s > 11: <gammalooprs[8af0a922d9a4c82d]::uv::approx::local_4d::tests::dod_one_triangle_keeps_separate_denominator_topologies::{closure#0} as core[940e698046960fd5]::ops::function::FnOnce<()>>::call_once<unknown>
  809. 41.98 s > at <unknown source file>:<unknown line>
  810. 41.98 s > 12: test[75d6903177b1d7e9]::__rust_begin_short_backtrace::<core[940e698046960fd5]::result::Result<(), alloc[2ea6bcb46fca0c42]::string::String>, fn() -> core[940e698046960fd5]::result::Result<(), alloc[2ea6bcb46fca0c42]::string::String>><unknown>
  811. 41.98 s > at <unknown source file>:<unknown line>
  812. 41.98 s > 13: test[75d6903177b1d7e9]::run_test::{closure#0}<unknown>
  813. 41.98 s > at <unknown source file>:<unknown line>
  814. 41.98 s > 14: std[bcb96dfbba0ab899]::sys::backtrace::__rust_begin_short_backtrace::<test[75d6903177b1d7e9]::run_test::{closure#1}, ()><unknown>
  815. 41.98 s > at <unknown source file>:<unknown line>
  816. 41.98 s > 15: <std[bcb96dfbba0ab899]::thread::lifecycle::spawn_unchecked<test[75d6903177b1d7e9]::run_test::{closure#1}, ()>::{closure#1} as core[940e698046960fd5]::ops::function::FnOnce<()>>::call_once::{shim:vtable#0}<unknown>
  817. 41.98 s > at <unknown source file>:<unknown line>
  818. 41.98 s > 16: <std[bcb96dfbba0ab899]::sys::thread::unix::Thread>::new::thread_start<unknown>
  819. 41.98 s > at <unknown source file>:<unknown line>
  820. 41.98 s > 17: start_thread<unknown>
  821. 41.98 s > at <unknown source file>:<unknown line>
  822. 41.98 s > 18: __clone3<unknown>
  823. 41.98 s > at <unknown source file>:<unknown line>
  824. 41.98 s >
  825. 41.98 s > Run with COLORBT_SHOW_HIDDEN=1 environment variable to disable frame filtering.
  826. 41.98 s > Run with RUST_BACKTRACE=full to include source snippets.
  827. 41.98 s >
  828. 41.98 s > 2. gammalooprs::uv::approx::tests::factorized_owned_dot_child_cff_matches_direct_3d_for_uncut_self_energy
  829. 41.98 s > failure: test failure with exit code 101
  830. 41.98 s > system-out
  831. 41.98 s > running 1 test
  832. 41.98 s > test uv::approx::tests::factorized_owned_dot_child_cff_matches_direct_3d_for_uncut_self_energy ... FAILED
  833. 41.98 s >
  834. 41.98 s > failures:
  835. 41.98 s >
  836. 41.98 s > failures:
  837. 41.98 s > uv::approx::tests::factorized_owned_dot_child_cff_matches_direct_3d_for_uncut_self_energy
  838. 41.98 s >
  839. 41.98 s > test result: FAILED. 0 passed; 1 failed; 0 ignored; 0 measured; 695 filtered out; finished in 0.57s
  840. 41.98 s > system-err
  841. 41.98 s > The application panicked (crashed).
  842. 41.98 s > Message: assertion `left == right` failed
  843. 41.98 s > left: [[1, 1, 2], [1, 2], [2, 2, 1], [2, 1], [2, 1], [2, 2, 1], [2, 2, 2, 1], [2, 2, 1]]
  844. 41.98 s > right: [[1, 1, 2, 2, 2]]
  845. 41.98 s > Location: crates/gammalooprs/src/uv/approx/mod.rs:1471
  846. 41.98 s >
  847. 41.98 s > ━━━━━━━━━━━━━━━━━━━━━━━━━━━━━━━━━━ BACKTRACE ━━━━━━━━━━━━━━━━━━━━━━━━━━━━━━━━━━━
  848. 41.98 s > 1: <color_eyre[51793ea62743adbd]::config::PanicHook>::panic_report<unknown>
  849. 41.98 s > at <unknown source file>:<unknown line>
  850. 41.98 s > 2: <color_eyre[51793ea62743adbd]::config::PanicHook>::into_panic_hook::{closure#0}<unknown>
  851. 41.98 s > at <unknown source file>:<unknown line>
  852. 41.98 s > 3: std[bcb96dfbba0ab899]::panicking::panic_with_hook<unknown>
  853. 41.98 s > at <unknown source file>:<unknown line>
  854. 41.98 s > 4: std[bcb96dfbba0ab899]::panicking::panic_handler::{closure#0}<unknown>
  855. 41.98 s > at <unknown source file>:<unknown line>
  856. 41.98 s > 5: std[bcb96dfbba0ab899]::sys::backtrace::__rust_end_short_backtrace::<std[bcb96dfbba0ab899]::panicking::panic_handler::{closure#0}, !><unknown>
  857. 41.98 s > at <unknown source file>:<unknown line>
  858. 41.98 s > 6: __rustc[6c289b9f9c454d21]::rust_begin_unwind<unknown>
  859. 41.98 s > at <unknown source file>:<unknown line>
  860. 41.98 s > 7: core[940e698046960fd5]::panicking::panic_fmt<unknown>
  861. 41.98 s > at <unknown source file>:<unknown line>
  862. 41.98 s > 8: core[940e698046960fd5]::panicking::assert_failed_inner<unknown>
  863. 41.98 s > at <unknown source file>:<unknown line>
  864. 41.98 s > 9: core[940e698046960fd5]::panicking::assert_failed::<alloc[2ea6bcb46fca0c42]::vec::Vec<alloc[2ea6bcb46fca0c42]::vec::Vec<usize>>, alloc[2ea6bcb46fca0c42]::vec::Vec<alloc[2ea6bcb46fca0c42]::vec::Vec<usize>>><unknown>
  865. 41.98 s > at <unknown source file>:<unknown line>
  866. 41.98 s > 10: gammalooprs[8af0a922d9a4c82d]::uv::approx::tests::factorized_owned_dot_child_cff_matches_direct_3d_for_uncut_self_energy<unknown>
  867. 41.98 s > at <unknown source file>:<unknown line>
  868. 41.98 s > 11: <gammalooprs[8af0a922d9a4c82d]::uv::approx::tests::factorized_owned_dot_child_cff_matches_direct_3d_for_uncut_self_energy::{closure#0} as core[940e698046960fd5]::ops::function::FnOnce<()>>::call_once<unknown>
  869. 41.98 s > at <unknown source file>:<unknown line>
  870. 41.98 s > 12: test[75d6903177b1d7e9]::__rust_begin_short_backtrace::<core[940e698046960fd5]::result::Result<(), alloc[2ea6bcb46fca0c42]::string::String>, fn() -> core[940e698046960fd5]::result::Result<(), alloc[2ea6bcb46fca0c42]::string::String>><unknown>
  871. 41.98 s > at <unknown source file>:<unknown line>
  872. 41.98 s > 13: test[75d6903177b1d7e9]::run_test::{closure#0}<unknown>
  873. 41.98 s > at <unknown source file>:<unknown line>
  874. 41.98 s > 14: std[bcb96dfbba0ab899]::sys::backtrace::__rust_begin_short_backtrace::<test[75d6903177b1d7e9]::run_test::{closure#1}, ()><unknown>
  875. 41.98 s > at <unknown source file>:<unknown line>
  876. 41.98 s > 15: <std[bcb96dfbba0ab899]::thread::lifecycle::spawn_unchecked<test[75d6903177b1d7e9]::run_test::{closure#1}, ()>::{closure#1} as core[940e698046960fd5]::ops::function::FnOnce<()>>::call_once::{shim:vtable#0}<unknown>
  877. 41.98 s > at <unknown source file>:<unknown line>
  878. 41.98 s > 16: <std[bcb96dfbba0ab899]::sys::thread::unix::Thread>::new::thread_start<unknown>
  879. 41.98 s > at <unknown source file>:<unknown line>
  880. 41.98 s > 17: start_thread<unknown>
  881. 41.98 s > at <unknown source file>:<unknown line>
  882. 41.98 s > 18: __clone3<unknown>
  883. 41.98 s > at <unknown source file>:<unknown line>
  884. 41.98 s >
  885. 41.98 s > Run with COLORBT_SHOW_HIDDEN=1 environment variable to disable frame filtering.
  886. 41.98 s > Run with RUST_BACKTRACE=full to include source snippets.
  887. 41.98 s > =========================================
  888. 41.98 s > Extracting 1 binary, 1 build script output directory, and 1 linked path to /build/nextest-archive-cZSeo1
  889. 41.98 s > Extracted 7 files to /build/nextest-archive-cZSeo1 in 0.13s
  890. 41.98 s > ------------
  891. 41.98 s > Nextest run ID cd98eea8-2e75-443a-bbbb-e8133c835950 with nextest profile: ci_gammaloop
  892. 41.98 s > Starting 119 tests across 1 binary
  893. 41.98 s > ------------
  894. 41.98 s > Summary [ 2.095s] 119 tests run: 119 passed, 0 skipped
  895. 41.98 s >
  896. 41.98 s > ========== nextest test summary ==========
  897. 41.98 s > report: target/nextest/ci_gammaloop/junit.xml
  898. 41.98 s > tests: 119, failures: 0, errors: 0
  899. 41.98 s > No failing testcases found.
  900. 41.98 s > =========================================
  901. 41.98 s For full logs, run:
  902. 41.98 s nix log /nix/store/bcc3gg1akl605y0c3km3gjg8nsqsjzv8-gammaloop-nextest-core.drv
  903. 42.18 s Run failed.