build packages.x86_64-linux.crate-test-binaries-three-dimensional-reps
1.02 s
$ /nix/store/9ypz3flqsrl5xl495mm8h645gadjsxi1-coreutils-9.11/bin/timeout --kill-after=15s 7200s /nix/store/23zk8sgzamrbmj1fday15szf7f2279s8-nix-2.34.7/bin/nix --extra-experimental-features nix-command --extra-experimental-features flakes --log-format internal-json build --no-link --print-out-paths git+https://github.com/alphal00p/gammaloop?ref=raised_energy_cff_wip&rev=c8e7631734f65b7fae00ea28219fb7c871b6ed1e&shallow=1#packages.x86_64-linux.crate-test-binaries-three-dimensional-reps --print-build-logs
1.82 s
1.86 s
Building /nix/store/cv02k8axyaajy2wk22703viwwjkp6c9w-gammaloop-crate-test-binaries-three-dimensional-reps-50150770f831b638-deps-0.1.0.drv
2.00 s
[gammaloop-crate-test-binaries-three-dimensional-reps-50150770f831b638-deps] Phase: unpackPhase
2.00 s
[gammaloop-crate-test-binaries-three-dimensional-reps-50150770f831b638-deps] unpacking source archive /nix/store/cra0nlvfvsi0f5flhy40zq1fjvqjsqqk-source
2.03 s
[gammaloop-crate-test-binaries-three-dimensional-reps-50150770f831b638-deps] source root is source
2.06 s
[gammaloop-crate-test-binaries-three-dimensional-reps-50150770f831b638-deps] Phase: patchPhase
2.22 s
[gammaloop-crate-test-binaries-three-dimensional-reps-50150770f831b638-deps] Executing configureCargoCommonVars
2.23 s
[gammaloop-crate-test-binaries-three-dimensional-reps-50150770f831b638-deps] copying cargo artifacts from /nix/store/2ws3v62qqf2mmz5fp17kchi9n0k8vkxl-gammaloop-crate-test-binaries-three-dimensional-reps-50150770f831b638-inputs/target to target
2.23 s
[gammaloop-crate-test-binaries-three-dimensional-reps-50150770f831b638-deps] will deep copy artifacts (instead of symlinking) as requested
3.49 s
[gammaloop-crate-test-binaries-three-dimensional-reps-50150770f831b638-deps] Phase: updateAutotoolsGnuConfigScriptsPhase
3.54 s
[gammaloop-crate-test-binaries-three-dimensional-reps-50150770f831b638-deps] Phase: configurePhase
3.55 s
[gammaloop-crate-test-binaries-three-dimensional-reps-50150770f831b638-deps] will append /build/source/.cargo-home/config.toml with contents of /nix/store/1sigmg52bb61pfngmk9k8wq5fz9r7bf1-vendor-cargo-deps/config.toml
3.55 s
[gammaloop-crate-test-binaries-three-dimensional-reps-50150770f831b638-deps] default configurePhase, nothing to do
3.56 s
[gammaloop-crate-test-binaries-three-dimensional-reps-50150770f831b638-deps] Phase: buildPhase
3.56 s
[gammaloop-crate-test-binaries-three-dimensional-reps-50150770f831b638-deps] +++ command cargo --version
3.57 s
[gammaloop-crate-test-binaries-three-dimensional-reps-50150770f831b638-deps] cargo 1.97.0 (c980f4866 2026-06-30)
3.57 s
[gammaloop-crate-test-binaries-three-dimensional-reps-50150770f831b638-deps] +++ command cargo test --profile ci-optim --no-run --offline -p three-dimensional-reps --features three-dimensional-reps/serde
4.26 s
[gammaloop-crate-test-binaries-three-dimensional-reps-50150770f831b638-deps] Compiling three-dimensional-reps v0.1.0 (/build/source/crates/three-dimensional-reps)
4.62 s
[gammaloop-crate-test-binaries-three-dimensional-reps-50150770f831b638-deps] error[E0433] : cannot find `eval` in `crate`
4.62 s
[gammaloop-crate-test-binaries-three-dimensional-reps-50150770f831b638-deps] --> crates/three-dimensional-reps/src/generation.rs:6540:28
4.62 s
[gammaloop-crate-test-binaries-three-dimensional-reps-50150770f831b638-deps] |
4.62 s
[gammaloop-crate-test-binaries-three-dimensional-reps-50150770f831b638-deps] 6540 | let input = crate::eval::EvaluationInput {
4.62 s
[gammaloop-crate-test-binaries-three-dimensional-reps-50150770f831b638-deps] | ^^^^ could not find `eval` in the crate root
4.62 s
[gammaloop-crate-test-binaries-three-dimensional-reps-50150770f831b638-deps] |
4.62 s
[gammaloop-crate-test-binaries-three-dimensional-reps-50150770f831b638-deps] note : found an item that was configured out
4.62 s
[gammaloop-crate-test-binaries-three-dimensional-reps-50150770f831b638-deps] --> crates/three-dimensional-reps/src/lib.rs:7:9
4.62 s
[gammaloop-crate-test-binaries-three-dimensional-reps-50150770f831b638-deps] |
4.62 s
[gammaloop-crate-test-binaries-three-dimensional-reps-50150770f831b638-deps] 6 | #[cfg(feature = "eval")]
4.62 s
[gammaloop-crate-test-binaries-three-dimensional-reps-50150770f831b638-deps] | ---------------- the item is gated behind the `eval` feature
4.62 s
[gammaloop-crate-test-binaries-three-dimensional-reps-50150770f831b638-deps] 7 | pub mod eval;
4.62 s
[gammaloop-crate-test-binaries-three-dimensional-reps-50150770f831b638-deps] | ^^^^
4.62 s
[gammaloop-crate-test-binaries-three-dimensional-reps-50150770f831b638-deps]
4.64 s
[gammaloop-crate-test-binaries-three-dimensional-reps-50150770f831b638-deps] error[E0433] : cannot find `eval` in `crate`
4.64 s
[gammaloop-crate-test-binaries-three-dimensional-reps-50150770f831b638-deps] --> crates/three-dimensional-reps/src/generation.rs:6547:30
4.64 s
[gammaloop-crate-test-binaries-three-dimensional-reps-50150770f831b638-deps] |
4.64 s
[gammaloop-crate-test-binaries-three-dimensional-reps-50150770f831b638-deps] 6547 | let contact = crate::eval::evaluate_expression(
4.64 s
[gammaloop-crate-test-binaries-three-dimensional-reps-50150770f831b638-deps] | ^^^^ could not find `eval` in the crate root
4.64 s
[gammaloop-crate-test-binaries-three-dimensional-reps-50150770f831b638-deps] |
4.64 s
[gammaloop-crate-test-binaries-three-dimensional-reps-50150770f831b638-deps] note : found an item that was configured out
4.64 s
[gammaloop-crate-test-binaries-three-dimensional-reps-50150770f831b638-deps] --> crates/three-dimensional-reps/src/lib.rs:7:9
4.64 s
[gammaloop-crate-test-binaries-three-dimensional-reps-50150770f831b638-deps] |
4.64 s
[gammaloop-crate-test-binaries-three-dimensional-reps-50150770f831b638-deps] 6 | #[cfg(feature = "eval")]
4.64 s
[gammaloop-crate-test-binaries-three-dimensional-reps-50150770f831b638-deps] | ---------------- the item is gated behind the `eval` feature
4.64 s
[gammaloop-crate-test-binaries-three-dimensional-reps-50150770f831b638-deps] 7 | pub mod eval;
4.64 s
[gammaloop-crate-test-binaries-three-dimensional-reps-50150770f831b638-deps] | ^^^^
4.64 s
[gammaloop-crate-test-binaries-three-dimensional-reps-50150770f831b638-deps]
4.65 s
[gammaloop-crate-test-binaries-three-dimensional-reps-50150770f831b638-deps] error[E0433] : cannot find `eval` in `crate`
4.65 s
[gammaloop-crate-test-binaries-three-dimensional-reps-50150770f831b638-deps] --> crates/three-dimensional-reps/src/generation.rs:6555:32
4.65 s
[gammaloop-crate-test-binaries-three-dimensional-reps-50150770f831b638-deps] |
4.65 s
[gammaloop-crate-test-binaries-three-dimensional-reps-50150770f831b638-deps] 6555 | let remainder = crate::eval::evaluate_expression(
4.65 s
[gammaloop-crate-test-binaries-three-dimensional-reps-50150770f831b638-deps] | ^^^^ could not find `eval` in the crate root
4.65 s
[gammaloop-crate-test-binaries-three-dimensional-reps-50150770f831b638-deps] |
4.65 s
[gammaloop-crate-test-binaries-three-dimensional-reps-50150770f831b638-deps] note : found an item that was configured out
4.65 s
[gammaloop-crate-test-binaries-three-dimensional-reps-50150770f831b638-deps] --> crates/three-dimensional-reps/src/lib.rs:7:9
4.65 s
[gammaloop-crate-test-binaries-three-dimensional-reps-50150770f831b638-deps] |
4.65 s
[gammaloop-crate-test-binaries-three-dimensional-reps-50150770f831b638-deps] 6 | #[cfg(feature = "eval")]
4.65 s
[gammaloop-crate-test-binaries-three-dimensional-reps-50150770f831b638-deps] | ---------------- the item is gated behind the `eval` feature
4.65 s
[gammaloop-crate-test-binaries-three-dimensional-reps-50150770f831b638-deps] 7 | pub mod eval;
4.65 s
[gammaloop-crate-test-binaries-three-dimensional-reps-50150770f831b638-deps] | ^^^^
4.65 s
[gammaloop-crate-test-binaries-three-dimensional-reps-50150770f831b638-deps]
4.66 s
[gammaloop-crate-test-binaries-three-dimensional-reps-50150770f831b638-deps] error[E0433] : cannot find `eval` in `crate`
4.66 s
[gammaloop-crate-test-binaries-three-dimensional-reps-50150770f831b638-deps] --> crates/three-dimensional-reps/src/generation.rs:6563:28
4.66 s
[gammaloop-crate-test-binaries-three-dimensional-reps-50150770f831b638-deps] |
4.66 s
[gammaloop-crate-test-binaries-three-dimensional-reps-50150770f831b638-deps] 6563 | let total = crate::eval::evaluate_expression(&powered, &expression, numerator, &input)
4.66 s
[gammaloop-crate-test-binaries-three-dimensional-reps-50150770f831b638-deps] | ^^^^ could not find `eval` in the crate root
4.66 s
[gammaloop-crate-test-binaries-three-dimensional-reps-50150770f831b638-deps] |
4.67 s
[gammaloop-crate-test-binaries-three-dimensional-reps-50150770f831b638-deps] note : found an item that was configured out
4.67 s
[gammaloop-crate-test-binaries-three-dimensional-reps-50150770f831b638-deps] --> crates/three-dimensional-reps/src/lib.rs:7:9
4.67 s
[gammaloop-crate-test-binaries-three-dimensional-reps-50150770f831b638-deps] |
4.67 s
[gammaloop-crate-test-binaries-three-dimensional-reps-50150770f831b638-deps] 6 | #[cfg(feature = "eval")]
4.67 s
[gammaloop-crate-test-binaries-three-dimensional-reps-50150770f831b638-deps] | ---------------- the item is gated behind the `eval` feature
4.67 s
[gammaloop-crate-test-binaries-three-dimensional-reps-50150770f831b638-deps] 7 | pub mod eval;
4.67 s
[gammaloop-crate-test-binaries-three-dimensional-reps-50150770f831b638-deps] | ^^^^
4.67 s
[gammaloop-crate-test-binaries-three-dimensional-reps-50150770f831b638-deps]
7.02 s
[gammaloop-crate-test-binaries-three-dimensional-reps-50150770f831b638-deps] For more information about this error, try `rustc --explain E0433`.
7.13 s
[gammaloop-crate-test-binaries-three-dimensional-reps-50150770f831b638-deps] error : could not compile `three-dimensional-reps` (lib test) due to 4 previous errors
7.40 s
Progress: 0 of 2 built (1 failed)
7.40 s
Failed to build gammaloop-crate-test-binaries-three-dimensional-reps-50150770f831b638-deps after 5.5s
7.40 s
error: Cannot build '/nix/store/cv02k8axyaajy2wk22703viwwjkp6c9w-gammaloop-crate-test-binaries-three-dimensional-reps-50150770f831b638-deps-0.1.0.drv '.
7.40 s
Reason: builder failed with exit code 101 .
7.40 s
Output paths:
7.40 s
/nix/store/9c503a8m7ppz249bcgxs70380i2rli5i-gammaloop-crate-test-binaries-three-dimensional-reps-50150770f831b638-deps-0.1.0
7.40 s
Last 74 log lines:
7.40 s
> Running phase: unpackPhase
7.40 s
> unpacking source archive /nix/store/cra0nlvfvsi0f5flhy40zq1fjvqjsqqk-source
7.40 s
> source root is source
7.40 s
> Running phase: patchPhase
7.40 s
> Executing configureCargoCommonVars
7.40 s
> copying cargo artifacts from /nix/store/2ws3v62qqf2mmz5fp17kchi9n0k8vkxl-gammaloop-crate-test-binaries-three-dimensional-reps-50150770f831b638-inputs/target to target
7.40 s
> will deep copy artifacts (instead of symlinking) as requested
7.40 s
> Running phase: updateAutotoolsGnuConfigScriptsPhase
7.40 s
> Running phase: configurePhase
7.40 s
> will append /build/source/.cargo-home/config.toml with contents of /nix/store/1sigmg52bb61pfngmk9k8wq5fz9r7bf1-vendor-cargo-deps/config.toml
7.40 s
> default configurePhase, nothing to do
7.40 s
> Running phase: buildPhase
7.40 s
> +++ command cargo --version
7.40 s
> cargo 1.97.0 (c980f4866 2026-06-30)
7.40 s
> +++ command cargo test --profile ci-optim --no-run --offline -p three-dimensional-reps --features three-dimensional-reps/serde
7.40 s
> Compiling three-dimensional-reps v0.1.0 (/build/source/crates/three-dimensional-reps)
7.40 s
> error[E0433] : cannot find `eval` in `crate`
7.40 s
> --> crates/three-dimensional-reps/src/generation.rs:6540:28
7.40 s
> |
7.40 s
> 6540 | let input = crate::eval::EvaluationInput {
7.40 s
> | ^^^^ could not find `eval` in the crate root
7.40 s
> |
7.40 s
> note : found an item that was configured out
7.40 s
> --> crates/three-dimensional-reps/src/lib.rs:7:9
7.40 s
> |
7.40 s
> 6 | #[cfg(feature = "eval")]
7.40 s
> | ---------------- the item is gated behind the `eval` feature
7.40 s
> 7 | pub mod eval;
7.40 s
> | ^^^^
7.40 s
>
7.40 s
> error[E0433] : cannot find `eval` in `crate`
7.40 s
> --> crates/three-dimensional-reps/src/generation.rs:6547:30
7.40 s
> |
7.40 s
> 6547 | let contact = crate::eval::evaluate_expression(
7.40 s
> | ^^^^ could not find `eval` in the crate root
7.40 s
> |
7.40 s
> note : found an item that was configured out
7.40 s
> --> crates/three-dimensional-reps/src/lib.rs:7:9
7.40 s
> |
7.40 s
> 6 | #[cfg(feature = "eval")]
7.40 s
> | ---------------- the item is gated behind the `eval` feature
7.40 s
> 7 | pub mod eval;
7.40 s
> | ^^^^
7.40 s
>
7.40 s
> error[E0433] : cannot find `eval` in `crate`
7.40 s
> --> crates/three-dimensional-reps/src/generation.rs:6555:32
7.40 s
> |
7.40 s
> 6555 | let remainder = crate::eval::evaluate_expression(
7.40 s
> | ^^^^ could not find `eval` in the crate root
7.40 s
> |
7.40 s
> note : found an item that was configured out
7.40 s
> --> crates/three-dimensional-reps/src/lib.rs:7:9
7.40 s
> |
7.40 s
> 6 | #[cfg(feature = "eval")]
7.40 s
> | ---------------- the item is gated behind the `eval` feature
7.40 s
> 7 | pub mod eval;
7.40 s
> | ^^^^
7.40 s
>
7.40 s
> error[E0433] : cannot find `eval` in `crate`
7.40 s
> --> crates/three-dimensional-reps/src/generation.rs:6563:28
7.40 s
> |
7.40 s
> 6563 | let total = crate::eval::evaluate_expression(&powered, &expression, numerator, &input)
7.40 s
> | ^^^^ could not find `eval` in the crate root
7.40 s
> |
7.40 s
> note : found an item that was configured out
7.40 s
> --> crates/three-dimensional-reps/src/lib.rs:7:9
7.40 s
> |
7.40 s
> 6 | #[cfg(feature = "eval")]
7.40 s
> | ---------------- the item is gated behind the `eval` feature
7.40 s
> 7 | pub mod eval;
7.40 s
> | ^^^^
7.40 s
>
7.40 s
> For more information about this error, try `rustc --explain E0433`.
7.40 s
> error : could not compile `three-dimensional-reps` (lib test) due to 4 previous errors
7.40 s
For full logs, run:
7.40 s
nix log /nix/store/cv02k8axyaajy2wk22703viwwjkp6c9w-gammaloop-crate-test-binaries-three-dimensional-reps-50150770f831b638-deps-0.1.0.drv
7.40 s
error: Cannot build '/nix/store/ckziyrv6v1c0n9hwfs12zk6q6lq2lzvl-nix-ci-artifact-barrier-crate-test-binaries-three-dimensional-reps.drv '.
7.40 s
Reason: 1 dependency failed .
7.40 s
Output paths:
7.40 s
/nix/store/ns880drc47fzrjr4v831krv3v27kphvm-nix-ci-artifact-barrier-crate-test-binaries-three-dimensional-reps
7.40 s
Build failed due to failed dependency
7.46 s
Build failed.