build packages.x86_64-linux.crate-test-binaries-three-dimensional-reps
0.24 s
$ /nix/store/9ypz3flqsrl5xl495mm8h645gadjsxi1-coreutils-9.11/bin/timeout --kill-after=15s 7200s /nix/store/23zk8sgzamrbmj1fday15szf7f2279s8-nix-2.34.7/bin/nix --extra-experimental-features nix-command --extra-experimental-features flakes --log-format internal-json build --no-link --print-out-paths git+https://github.com/alphal00p/gammaloop?ref=raised_energy_cff_wip&rev=c8e7631734f65b7fae00ea28219fb7c871b6ed1e&shallow=1#packages.x86_64-linux.crate-test-binaries-three-dimensional-reps --print-build-logs
3.51 s
4.59 s
Downloading cached gammaloop-ci-test-binary-dependencies-50150770f831b638-Cargo.toml from https://cache.nix-ci.com
4.63 s
Building /nix/store/620cg4lxjsln105525v3nij0sy75ni31-gammaloop-ci-test-binary-dependencies-50150770f831b638-three-dimensional-reps-dev-dependency.toml.drv
4.64 s
Downloaded cached gammaloop-ci-test-binary-dependencies-50150770f831b638-Cargo.toml (584 B) in 43ms
4.67 s
Building /nix/store/jxvw34bgxdnn9bkva90k3g1kdb1h3z69-gammaloop-ci-test-dependencies-50150770f831b638-Cargo.toml.drv
4.86 s
Building /nix/store/h5pxbw6p101nvpfz47d71mgr9cyf81gg-gammaloop-crate-test-dependencies-50150770f831b638-inputs.drv
4.86 s
Progress: 0 of 8 built (3 building), 1 of 1 downloaded from cache
4.88 s
[gammaloop-ci-test-binary-dependencies-50150770f831b638-three-dimensional-reps-dev-dependency.toml:post-build] Uploading to the NixCI cache: /nix/store/nkd9p6h639pp1ya2nb2yngjw7qb80nfg-gammaloop-ci-test-binary-dependencies-50150770f831b638-three-dimensional-reps-dev-dependency.toml
4.95 s
[gammaloop-ci-test-binary-dependencies-50150770f831b638-three-dimensional-reps-dev-dependency.toml:post-build] warning: 'warn-short-path-literals' is deprecated, use 'lint-short-path-literals = ignore' instead
5.08 s
[gammaloop-ci-test-binary-dependencies-50150770f831b638-three-dimensional-reps-dev-dependency.toml:post-build] copying 0 paths...
5.16 s
[gammaloop-ci-test-binary-dependencies-50150770f831b638-three-dimensional-reps-dev-dependency.toml:post-build] warning: 'warn-short-path-literals' is deprecated, use 'lint-short-path-literals = ignore' instead
5.32 s
[gammaloop-ci-test-binary-dependencies-50150770f831b638-three-dimensional-reps-dev-dependency.toml:post-build] copying 0 paths...
5.38 s
Uploaded gammaloop-ci-test-binary-dependencies-50150770f831b638-three-dimensional-reps-dev-dependency.toml in 509ms
5.38 s
Progress: 1 of 9 built (2 building), 1 of 1 downloaded from cache
5.38 s
Built gammaloop-ci-test-binary-dependencies-50150770f831b638-three-dimensional-reps-dev-dependency.toml in 744ms
5.54 s
[gammaloop-ci-test-dependencies-50150770f831b638-Cargo.toml:post-build] Uploading to the NixCI cache: /nix/store/l910djsa81d33bspw74vkisyvzi8c7k4-gammaloop-ci-test-dependencies-50150770f831b638-Cargo.toml
5.62 s
[gammaloop-ci-test-dependencies-50150770f831b638-Cargo.toml:post-build] warning: 'warn-short-path-literals' is deprecated, use 'lint-short-path-literals = ignore' instead
5.76 s
[gammaloop-ci-test-dependencies-50150770f831b638-Cargo.toml:post-build] copying 0 paths...
5.85 s
[gammaloop-ci-test-dependencies-50150770f831b638-Cargo.toml:post-build] warning: 'warn-short-path-literals' is deprecated, use 'lint-short-path-literals = ignore' instead
6.02 s
[gammaloop-ci-test-dependencies-50150770f831b638-Cargo.toml:post-build] copying 0 paths...
6.05 s
Uploaded gammaloop-ci-test-dependencies-50150770f831b638-Cargo.toml in 525ms
6.05 s
Progress: 2 of 10 built (1 building), 1 of 1 downloaded from cache
6.05 s
Built gammaloop-ci-test-dependencies-50150770f831b638-Cargo.toml in 1.3s
11.41 s
[gammaloop-crate-test-dependencies-50150770f831b638-inputs:post-build] Uploading to the NixCI cache: /nix/store/5gj697jm6yvaw1hf5bgq663azg3kafrr-gammaloop-crate-test-dependencies-50150770f831b638-inputs
11.49 s
[gammaloop-crate-test-dependencies-50150770f831b638-inputs:post-build] warning: 'warn-short-path-literals' is deprecated, use 'lint-short-path-literals = ignore' instead
11.54 s
[gammaloop-crate-test-dependencies-50150770f831b638-inputs:post-build] copying 1 paths...
11.54 s
[gammaloop-crate-test-dependencies-50150770f831b638-inputs:post-build] copying path '/nix/store/5gj697jm6yvaw1hf5bgq663azg3kafrr-gammaloop-crate-test-dependencies-50150770f831b638-inputs' to 'https://cache.nix-ci.com'...
62.17 s
[gammaloop-crate-test-dependencies-50150770f831b638-inputs:post-build] warning: 'warn-short-path-literals' is deprecated, use 'lint-short-path-literals = ignore' instead
62.59 s
[gammaloop-crate-test-dependencies-50150770f831b638-inputs:post-build] copying 0 paths...
62.91 s
Uploaded gammaloop-crate-test-dependencies-50150770f831b638-inputs in 51.5s
62.91 s
Progress: 3 of 8 built, 1 of 1 downloaded from cache
62.91 s
Built gammaloop-crate-test-dependencies-50150770f831b638-inputs in 58.0s
63.16 s
Building /nix/store/d91n8zakpbd8vm1p2n97bswpx39i2na1-gammaloop-crate-test-binaries-three-dimensional-reps-50150770f831b638-inputs.drv
70.41 s
[gammaloop-crate-test-binaries-three-dimensional-reps-50150770f831b638-inputs:post-build] Uploading to the NixCI cache: /nix/store/2ws3v62qqf2mmz5fp17kchi9n0k8vkxl-gammaloop-crate-test-binaries-three-dimensional-reps-50150770f831b638-inputs
70.85 s
[gammaloop-crate-test-binaries-three-dimensional-reps-50150770f831b638-inputs:post-build] warning: 'warn-short-path-literals' is deprecated, use 'lint-short-path-literals = ignore' instead
70.93 s
[gammaloop-crate-test-binaries-three-dimensional-reps-50150770f831b638-inputs:post-build] copying 0 paths...
71.73 s
[gammaloop-crate-test-binaries-three-dimensional-reps-50150770f831b638-inputs:post-build] warning: 'warn-short-path-literals' is deprecated, use 'lint-short-path-literals = ignore' instead
72.09 s
[gammaloop-crate-test-binaries-three-dimensional-reps-50150770f831b638-inputs:post-build] copying 0 paths...
72.40 s
Uploaded gammaloop-crate-test-binaries-three-dimensional-reps-50150770f831b638-inputs in 2.1s
72.41 s
Progress: 4 of 7 built, 1 of 1 downloaded from cache
72.41 s
Built gammaloop-crate-test-binaries-three-dimensional-reps-50150770f831b638-inputs in 9.2s
72.53 s
Building /nix/store/cv02k8axyaajy2wk22703viwwjkp6c9w-gammaloop-crate-test-binaries-three-dimensional-reps-50150770f831b638-deps-0.1.0.drv
72.75 s
[gammaloop-crate-test-binaries-three-dimensional-reps-50150770f831b638-deps] Phase: unpackPhase
72.77 s
[gammaloop-crate-test-binaries-three-dimensional-reps-50150770f831b638-deps] unpacking source archive /nix/store/cra0nlvfvsi0f5flhy40zq1fjvqjsqqk-source
72.81 s
[gammaloop-crate-test-binaries-three-dimensional-reps-50150770f831b638-deps] source root is source
72.85 s
[gammaloop-crate-test-binaries-three-dimensional-reps-50150770f831b638-deps] Phase: patchPhase
73.07 s
[gammaloop-crate-test-binaries-three-dimensional-reps-50150770f831b638-deps] Executing configureCargoCommonVars
73.07 s
[gammaloop-crate-test-binaries-three-dimensional-reps-50150770f831b638-deps] copying cargo artifacts from /nix/store/2ws3v62qqf2mmz5fp17kchi9n0k8vkxl-gammaloop-crate-test-binaries-three-dimensional-reps-50150770f831b638-inputs/target to target
73.07 s
[gammaloop-crate-test-binaries-three-dimensional-reps-50150770f831b638-deps] will deep copy artifacts (instead of symlinking) as requested
74.46 s
[gammaloop-crate-test-binaries-three-dimensional-reps-50150770f831b638-deps] Phase: updateAutotoolsGnuConfigScriptsPhase
74.58 s
[gammaloop-crate-test-binaries-three-dimensional-reps-50150770f831b638-deps] Phase: configurePhase
74.67 s
[gammaloop-crate-test-binaries-three-dimensional-reps-50150770f831b638-deps] will append /build/source/.cargo-home/config.toml with contents of /nix/store/1sigmg52bb61pfngmk9k8wq5fz9r7bf1-vendor-cargo-deps/config.toml
74.69 s
[gammaloop-crate-test-binaries-three-dimensional-reps-50150770f831b638-deps] default configurePhase, nothing to do
74.70 s
[gammaloop-crate-test-binaries-three-dimensional-reps-50150770f831b638-deps] Phase: buildPhase
74.74 s
[gammaloop-crate-test-binaries-three-dimensional-reps-50150770f831b638-deps] +++ command cargo --version
74.75 s
[gammaloop-crate-test-binaries-three-dimensional-reps-50150770f831b638-deps] cargo 1.97.0 (c980f4866 2026-06-30)
74.77 s
[gammaloop-crate-test-binaries-three-dimensional-reps-50150770f831b638-deps] +++ command cargo test --profile ci-optim --no-run --offline -p three-dimensional-reps --features three-dimensional-reps/serde
75.83 s
[gammaloop-crate-test-binaries-three-dimensional-reps-50150770f831b638-deps] Compiling three-dimensional-reps v0.1.0 (/build/source/crates/three-dimensional-reps)
76.20 s
[gammaloop-crate-test-binaries-three-dimensional-reps-50150770f831b638-deps] error[E0433] : cannot find `eval` in `crate`
76.20 s
[gammaloop-crate-test-binaries-three-dimensional-reps-50150770f831b638-deps] --> crates/three-dimensional-reps/src/generation.rs:6540:28
76.20 s
[gammaloop-crate-test-binaries-three-dimensional-reps-50150770f831b638-deps] |
76.20 s
[gammaloop-crate-test-binaries-three-dimensional-reps-50150770f831b638-deps] 6540 | let input = crate::eval::EvaluationInput {
76.20 s
[gammaloop-crate-test-binaries-three-dimensional-reps-50150770f831b638-deps] | ^^^^ could not find `eval` in the crate root
76.20 s
[gammaloop-crate-test-binaries-three-dimensional-reps-50150770f831b638-deps] |
76.20 s
[gammaloop-crate-test-binaries-three-dimensional-reps-50150770f831b638-deps] note : found an item that was configured out
76.20 s
[gammaloop-crate-test-binaries-three-dimensional-reps-50150770f831b638-deps] --> crates/three-dimensional-reps/src/lib.rs:7:9
76.20 s
[gammaloop-crate-test-binaries-three-dimensional-reps-50150770f831b638-deps] |
76.20 s
[gammaloop-crate-test-binaries-three-dimensional-reps-50150770f831b638-deps] 6 | #[cfg(feature = "eval")]
76.20 s
[gammaloop-crate-test-binaries-three-dimensional-reps-50150770f831b638-deps] | ---------------- the item is gated behind the `eval` feature
76.20 s
[gammaloop-crate-test-binaries-three-dimensional-reps-50150770f831b638-deps] 7 | pub mod eval;
76.20 s
[gammaloop-crate-test-binaries-three-dimensional-reps-50150770f831b638-deps] | ^^^^
76.20 s
[gammaloop-crate-test-binaries-three-dimensional-reps-50150770f831b638-deps]
76.21 s
[gammaloop-crate-test-binaries-three-dimensional-reps-50150770f831b638-deps] error[E0433] : cannot find `eval` in `crate`
76.21 s
[gammaloop-crate-test-binaries-three-dimensional-reps-50150770f831b638-deps] --> crates/three-dimensional-reps/src/generation.rs:6547:30
76.21 s
[gammaloop-crate-test-binaries-three-dimensional-reps-50150770f831b638-deps] |
76.22 s
[gammaloop-crate-test-binaries-three-dimensional-reps-50150770f831b638-deps] 6547 | let contact = crate::eval::evaluate_expression(
76.22 s
[gammaloop-crate-test-binaries-three-dimensional-reps-50150770f831b638-deps] | ^^^^ could not find `eval` in the crate root
76.22 s
[gammaloop-crate-test-binaries-three-dimensional-reps-50150770f831b638-deps] |
76.22 s
[gammaloop-crate-test-binaries-three-dimensional-reps-50150770f831b638-deps] note : found an item that was configured out
76.22 s
[gammaloop-crate-test-binaries-three-dimensional-reps-50150770f831b638-deps] --> crates/three-dimensional-reps/src/lib.rs:7:9
76.22 s
[gammaloop-crate-test-binaries-three-dimensional-reps-50150770f831b638-deps] |
76.22 s
[gammaloop-crate-test-binaries-three-dimensional-reps-50150770f831b638-deps] 6 | #[cfg(feature = "eval")]
76.22 s
[gammaloop-crate-test-binaries-three-dimensional-reps-50150770f831b638-deps] | ---------------- the item is gated behind the `eval` feature
76.22 s
[gammaloop-crate-test-binaries-three-dimensional-reps-50150770f831b638-deps] 7 | pub mod eval;
76.22 s
[gammaloop-crate-test-binaries-three-dimensional-reps-50150770f831b638-deps] | ^^^^
76.22 s
[gammaloop-crate-test-binaries-three-dimensional-reps-50150770f831b638-deps]
76.23 s
[gammaloop-crate-test-binaries-three-dimensional-reps-50150770f831b638-deps] error[E0433] : cannot find `eval` in `crate`
76.23 s
[gammaloop-crate-test-binaries-three-dimensional-reps-50150770f831b638-deps] --> crates/three-dimensional-reps/src/generation.rs:6555:32
76.23 s
[gammaloop-crate-test-binaries-three-dimensional-reps-50150770f831b638-deps] |
76.23 s
[gammaloop-crate-test-binaries-three-dimensional-reps-50150770f831b638-deps] 6555 | let remainder = crate::eval::evaluate_expression(
76.23 s
[gammaloop-crate-test-binaries-three-dimensional-reps-50150770f831b638-deps] | ^^^^ could not find `eval` in the crate root
76.23 s
[gammaloop-crate-test-binaries-three-dimensional-reps-50150770f831b638-deps] |
76.23 s
[gammaloop-crate-test-binaries-three-dimensional-reps-50150770f831b638-deps] note : found an item that was configured out
76.23 s
[gammaloop-crate-test-binaries-three-dimensional-reps-50150770f831b638-deps] --> crates/three-dimensional-reps/src/lib.rs:7:9
76.23 s
[gammaloop-crate-test-binaries-three-dimensional-reps-50150770f831b638-deps] |
76.23 s
[gammaloop-crate-test-binaries-three-dimensional-reps-50150770f831b638-deps] 6 | #[cfg(feature = "eval")]
76.23 s
[gammaloop-crate-test-binaries-three-dimensional-reps-50150770f831b638-deps] | ---------------- the item is gated behind the `eval` feature
76.23 s
[gammaloop-crate-test-binaries-three-dimensional-reps-50150770f831b638-deps] 7 | pub mod eval;
76.23 s
[gammaloop-crate-test-binaries-three-dimensional-reps-50150770f831b638-deps] | ^^^^
76.23 s
[gammaloop-crate-test-binaries-three-dimensional-reps-50150770f831b638-deps]
76.24 s
[gammaloop-crate-test-binaries-three-dimensional-reps-50150770f831b638-deps] error[E0433] : cannot find `eval` in `crate`
76.24 s
[gammaloop-crate-test-binaries-three-dimensional-reps-50150770f831b638-deps] --> crates/three-dimensional-reps/src/generation.rs:6563:28
76.24 s
[gammaloop-crate-test-binaries-three-dimensional-reps-50150770f831b638-deps] |
76.24 s
[gammaloop-crate-test-binaries-three-dimensional-reps-50150770f831b638-deps] 6563 | let total = crate::eval::evaluate_expression(&powered, &expression, numerator, &input)
76.24 s
[gammaloop-crate-test-binaries-three-dimensional-reps-50150770f831b638-deps] | ^^^^ could not find `eval` in the crate root
76.24 s
[gammaloop-crate-test-binaries-three-dimensional-reps-50150770f831b638-deps] |
76.24 s
[gammaloop-crate-test-binaries-three-dimensional-reps-50150770f831b638-deps] note : found an item that was configured out
76.24 s
[gammaloop-crate-test-binaries-three-dimensional-reps-50150770f831b638-deps] --> crates/three-dimensional-reps/src/lib.rs:7:9
76.24 s
[gammaloop-crate-test-binaries-three-dimensional-reps-50150770f831b638-deps] |
76.24 s
[gammaloop-crate-test-binaries-three-dimensional-reps-50150770f831b638-deps] 6 | #[cfg(feature = "eval")]
76.24 s
[gammaloop-crate-test-binaries-three-dimensional-reps-50150770f831b638-deps] | ---------------- the item is gated behind the `eval` feature
76.24 s
[gammaloop-crate-test-binaries-three-dimensional-reps-50150770f831b638-deps] 7 | pub mod eval;
76.24 s
[gammaloop-crate-test-binaries-three-dimensional-reps-50150770f831b638-deps] | ^^^^
76.24 s
[gammaloop-crate-test-binaries-three-dimensional-reps-50150770f831b638-deps]
78.87 s
[gammaloop-crate-test-binaries-three-dimensional-reps-50150770f831b638-deps] For more information about this error, try `rustc --explain E0433`.
78.90 s
[gammaloop-crate-test-binaries-three-dimensional-reps-50150770f831b638-deps] error : could not compile `three-dimensional-reps` (lib test) due to 4 previous errors
79.47 s
Progress: 4 of 6 built (1 failed), 1 of 1 downloaded from cache
79.47 s
Failed to build gammaloop-crate-test-binaries-three-dimensional-reps-50150770f831b638-deps after 6.9s
79.47 s
error: Cannot build '/nix/store/cv02k8axyaajy2wk22703viwwjkp6c9w-gammaloop-crate-test-binaries-three-dimensional-reps-50150770f831b638-deps-0.1.0.drv '.
79.47 s
Reason: builder failed with exit code 101 .
79.47 s
Output paths:
79.47 s
/nix/store/9c503a8m7ppz249bcgxs70380i2rli5i-gammaloop-crate-test-binaries-three-dimensional-reps-50150770f831b638-deps-0.1.0
79.47 s
Last 74 log lines:
79.47 s
> Running phase: unpackPhase
79.47 s
> unpacking source archive /nix/store/cra0nlvfvsi0f5flhy40zq1fjvqjsqqk-source
79.47 s
> source root is source
79.47 s
> Running phase: patchPhase
79.47 s
> Executing configureCargoCommonVars
79.47 s
> copying cargo artifacts from /nix/store/2ws3v62qqf2mmz5fp17kchi9n0k8vkxl-gammaloop-crate-test-binaries-three-dimensional-reps-50150770f831b638-inputs/target to target
79.47 s
> will deep copy artifacts (instead of symlinking) as requested
79.47 s
> Running phase: updateAutotoolsGnuConfigScriptsPhase
79.47 s
> Running phase: configurePhase
79.47 s
> will append /build/source/.cargo-home/config.toml with contents of /nix/store/1sigmg52bb61pfngmk9k8wq5fz9r7bf1-vendor-cargo-deps/config.toml
79.47 s
> default configurePhase, nothing to do
79.47 s
> Running phase: buildPhase
79.47 s
> +++ command cargo --version
79.47 s
> cargo 1.97.0 (c980f4866 2026-06-30)
79.47 s
> +++ command cargo test --profile ci-optim --no-run --offline -p three-dimensional-reps --features three-dimensional-reps/serde
79.47 s
> Compiling three-dimensional-reps v0.1.0 (/build/source/crates/three-dimensional-reps)
79.47 s
> error[E0433] : cannot find `eval` in `crate`
79.47 s
> --> crates/three-dimensional-reps/src/generation.rs:6540:28
79.47 s
> |
79.47 s
> 6540 | let input = crate::eval::EvaluationInput {
79.47 s
> | ^^^^ could not find `eval` in the crate root
79.47 s
> |
79.47 s
> note : found an item that was configured out
79.47 s
> --> crates/three-dimensional-reps/src/lib.rs:7:9
79.47 s
> |
79.47 s
> 6 | #[cfg(feature = "eval")]
79.47 s
> | ---------------- the item is gated behind the `eval` feature
79.47 s
> 7 | pub mod eval;
79.47 s
> | ^^^^
79.47 s
>
79.47 s
> error[E0433] : cannot find `eval` in `crate`
79.47 s
> --> crates/three-dimensional-reps/src/generation.rs:6547:30
79.47 s
> |
79.47 s
> 6547 | let contact = crate::eval::evaluate_expression(
79.47 s
> | ^^^^ could not find `eval` in the crate root
79.47 s
> |
79.47 s
> note : found an item that was configured out
79.47 s
> --> crates/three-dimensional-reps/src/lib.rs:7:9
79.47 s
> |
79.47 s
> 6 | #[cfg(feature = "eval")]
79.47 s
> | ---------------- the item is gated behind the `eval` feature
79.47 s
> 7 | pub mod eval;
79.47 s
> | ^^^^
79.47 s
>
79.47 s
> error[E0433] : cannot find `eval` in `crate`
79.47 s
> --> crates/three-dimensional-reps/src/generation.rs:6555:32
79.47 s
> |
79.47 s
> 6555 | let remainder = crate::eval::evaluate_expression(
79.47 s
> | ^^^^ could not find `eval` in the crate root
79.47 s
> |
79.47 s
> note : found an item that was configured out
79.47 s
> --> crates/three-dimensional-reps/src/lib.rs:7:9
79.47 s
> |
79.47 s
> 6 | #[cfg(feature = "eval")]
79.47 s
> | ---------------- the item is gated behind the `eval` feature
79.47 s
> 7 | pub mod eval;
79.47 s
> | ^^^^
79.47 s
>
79.47 s
> error[E0433] : cannot find `eval` in `crate`
79.47 s
> --> crates/three-dimensional-reps/src/generation.rs:6563:28
79.47 s
> |
79.47 s
> 6563 | let total = crate::eval::evaluate_expression(&powered, &expression, numerator, &input)
79.47 s
> | ^^^^ could not find `eval` in the crate root
79.47 s
> |
79.47 s
> note : found an item that was configured out
79.47 s
> --> crates/three-dimensional-reps/src/lib.rs:7:9
79.47 s
> |
79.47 s
> 6 | #[cfg(feature = "eval")]
79.47 s
> | ---------------- the item is gated behind the `eval` feature
79.47 s
> 7 | pub mod eval;
79.47 s
> | ^^^^
79.47 s
>
79.47 s
> For more information about this error, try `rustc --explain E0433`.
79.47 s
> error : could not compile `three-dimensional-reps` (lib test) due to 4 previous errors
79.47 s
For full logs, run:
79.47 s
nix log /nix/store/cv02k8axyaajy2wk22703viwwjkp6c9w-gammaloop-crate-test-binaries-three-dimensional-reps-50150770f831b638-deps-0.1.0.drv
79.47 s
error: Cannot build '/nix/store/ckziyrv6v1c0n9hwfs12zk6q6lq2lzvl-nix-ci-artifact-barrier-crate-test-binaries-three-dimensional-reps.drv '.
79.47 s
Reason: 1 dependency failed .
79.47 s
Output paths:
79.47 s
/nix/store/ns880drc47fzrjr4v831krv3v27kphvm-nix-ci-artifact-barrier-crate-test-binaries-three-dimensional-reps
79.50 s
Build failed due to failed dependency
79.63 s
Build failed.