build checks.x86_64-linux.gammaloop-nextest-binaries-core
0.66 s
$ /nix/store/9ypz3flqsrl5xl495mm8h645gadjsxi1-coreutils-9.11/bin/timeout --kill-after=15s 7200s /nix/store/23zk8sgzamrbmj1fday15szf7f2279s8-nix-2.34.7/bin/nix --extra-experimental-features nix-command --extra-experimental-features flakes --log-format internal-json build --no-link --print-out-paths git+https://github.com/alphal00p/gammaloop?ref=raised_energy_cff_wip&rev=c8e7631734f65b7fae00ea28219fb7c871b6ed1e&shallow=1#checks.x86_64-linux.gammaloop-nextest-binaries-core --print-build-logs
7.75 s
8.47 s
Downloading cached gammaloop-ci-test-binary-dependencies-1b17e1ec025c6580-Cargo.toml from https://cache.nix-ci.com
8.51 s
Downloading cached gammaloop-ci-test-binary-dependencies-31e37aec92971227-Cargo.toml from https://cache.nix-ci.com
8.51 s
Downloading cached gammaloop-ci-test-binary-dependencies-f0f952c3f8c3050c-Cargo.toml from https://cache.nix-ci.com
8.51 s
Downloaded cached gammaloop-ci-test-binary-dependencies-1b17e1ec025c6580-Cargo.toml (280 B) in 48ms
8.51 s
Downloaded cached gammaloop-ci-test-binary-dependencies-31e37aec92971227-Cargo.toml (824 B) in 1ms
8.51 s
Downloaded cached gammaloop-ci-test-binary-dependencies-f0f952c3f8c3050c-Cargo.toml (1320 B) in 1ms
8.54 s
Downloading cached gammaloop-crate-test-binaries-gammaloop-tracing-filter-macros-1b17e1ec025c6580-inputs from https://cache.nix-ci.com
8.54 s
Downloading cached gammaloop-crate-test-binaries-gammalooprs-247ff5d63201fb2c-inputs from https://cache.nix-ci.com
8.54 s
Downloading cached gammaloop-crate-test-dependencies-f0f952c3f8c3050c-inputs from https://cache.nix-ci.com
8.60 s
Building /nix/store/hb7vrvwgsdv3zmb4nk4r2bwgj32kasrf-gammaloop-ci-test-binary-dependencies-1b17e1ec025c6580-gammaloop-tracing-filter-macros-dev-dependency.toml.drv
8.62 s
Building /nix/store/d803fdhy5vdmwg1bxnrdbbh443q5b2l1-gammaloop-ci-test-binary-dependencies-247ff5d63201fb2c-gammalooprs-dev-dependency.toml.drv
8.66 s
Building /nix/store/8n7av5d2xzacvwsymvrcwygl7s0wgynb-gammaloop-ci-test-binary-dependencies-31e37aec92971227-gammaloop-tracing-filter-dev-dependency.toml.drv
8.71 s
Building /nix/store/4wx7g7wm0incs1bkkmd6hnsr8bjq7s41-gammaloop-ci-test-binary-dependencies-f0f952c3f8c3050c-gammaloop-api-dev-dependency.toml.drv
8.91 s
Building /nix/store/cv02k8axyaajy2wk22703viwwjkp6c9w-gammaloop-crate-test-binaries-three-dimensional-reps-50150770f831b638-deps-0.1.0.drv
8.91 s
Progress: 0 of 17 built (5 building), 1 of 11 downloaded from cache (5 downloading)
8.91 s
Progress: 0 of 17 built (5 building), 2 of 11 downloaded from cache (4 downloading)
8.91 s
Progress: 0 of 17 built (5 building), 3 of 11 downloaded from cache (3 downloading)
8.95 s
[gammaloop-ci-test-binary-dependencies-1b17e1ec025c6580-gammaloop-tracing-filter-macros-dev-dependency.toml:post-build] Uploading to the NixCI cache: /nix/store/gczxq1jnxb2f6nwcbl5zwmigdpgim7v7-gammaloop-ci-test-binary-dependencies-1b17e1ec025c6580-gammaloop-tracing-filter-macros-dev-dependency.toml
9.04 s
[gammaloop-ci-test-binary-dependencies-1b17e1ec025c6580-gammaloop-tracing-filter-macros-dev-dependency.toml:post-build] warning: 'warn-short-path-literals' is deprecated, use 'lint-short-path-literals = ignore' instead
9.19 s
[gammaloop-ci-test-binary-dependencies-1b17e1ec025c6580-gammaloop-tracing-filter-macros-dev-dependency.toml:post-build] copying 0 paths...
9.31 s
[gammaloop-ci-test-binary-dependencies-1b17e1ec025c6580-gammaloop-tracing-filter-macros-dev-dependency.toml:post-build] warning: 'warn-short-path-literals' is deprecated, use 'lint-short-path-literals = ignore' instead
9.50 s
[gammaloop-ci-test-binary-dependencies-1b17e1ec025c6580-gammaloop-tracing-filter-macros-dev-dependency.toml:post-build] copying 0 paths...
9.52 s
Uploaded gammaloop-ci-test-binary-dependencies-1b17e1ec025c6580-gammaloop-tracing-filter-macros-dev-dependency.toml in 600ms
9.52 s
Progress: 1 of 18 built (4 building), 3 of 11 downloaded from cache (3 downloading)
9.52 s
Built gammaloop-ci-test-binary-dependencies-1b17e1ec025c6580-gammaloop-tracing-filter-macros-dev-dependency.toml in 925ms
9.56 s
[gammaloop-ci-test-binary-dependencies-247ff5d63201fb2c-gammalooprs-dev-dependency.toml:post-build] Uploading to the NixCI cache: /nix/store/fzwgaj7lkfphcc1g09xfmk55hmkxkr0x-gammaloop-ci-test-binary-dependencies-247ff5d63201fb2c-gammalooprs-dev-dependency.toml
9.64 s
[gammaloop-ci-test-binary-dependencies-247ff5d63201fb2c-gammalooprs-dev-dependency.toml:post-build] warning: 'warn-short-path-literals' is deprecated, use 'lint-short-path-literals = ignore' instead
9.78 s
[gammaloop-ci-test-binary-dependencies-247ff5d63201fb2c-gammalooprs-dev-dependency.toml:post-build] copying 0 paths...
9.88 s
[gammaloop-ci-test-binary-dependencies-247ff5d63201fb2c-gammalooprs-dev-dependency.toml:post-build] warning: 'warn-short-path-literals' is deprecated, use 'lint-short-path-literals = ignore' instead
10.05 s
[gammaloop-ci-test-binary-dependencies-247ff5d63201fb2c-gammalooprs-dev-dependency.toml:post-build] copying 0 paths...
10.08 s
Uploaded gammaloop-ci-test-binary-dependencies-247ff5d63201fb2c-gammalooprs-dev-dependency.toml in 548ms
10.08 s
Progress: 2 of 19 built (3 building), 3 of 11 downloaded from cache (3 downloading)
10.08 s
Built gammaloop-ci-test-binary-dependencies-247ff5d63201fb2c-gammalooprs-dev-dependency.toml in 1.4s
10.12 s
[gammaloop-ci-test-binary-dependencies-31e37aec92971227-gammaloop-tracing-filter-dev-dependency.toml:post-build] Uploading to the NixCI cache: /nix/store/a90w47vskdc47wbbm7xrpzbp3hjc6n01-gammaloop-ci-test-binary-dependencies-31e37aec92971227-gammaloop-tracing-filter-dev-dependency.toml
10.20 s
[gammaloop-ci-test-binary-dependencies-31e37aec92971227-gammaloop-tracing-filter-dev-dependency.toml:post-build] warning: 'warn-short-path-literals' is deprecated, use 'lint-short-path-literals = ignore' instead
10.35 s
[gammaloop-ci-test-binary-dependencies-31e37aec92971227-gammaloop-tracing-filter-dev-dependency.toml:post-build] copying 0 paths...
10.45 s
[gammaloop-ci-test-binary-dependencies-31e37aec92971227-gammaloop-tracing-filter-dev-dependency.toml:post-build] warning: 'warn-short-path-literals' is deprecated, use 'lint-short-path-literals = ignore' instead
10.52 s
[gammaloop-ci-test-binary-dependencies-31e37aec92971227-gammaloop-tracing-filter-dev-dependency.toml:post-build] copying 0 paths...
10.54 s
Uploaded gammaloop-ci-test-binary-dependencies-31e37aec92971227-gammaloop-tracing-filter-dev-dependency.toml in 456ms
10.54 s
Progress: 3 of 20 built (2 building), 3 of 11 downloaded from cache (3 downloading)
10.54 s
Built gammaloop-ci-test-binary-dependencies-31e37aec92971227-gammaloop-tracing-filter-dev-dependency.toml in 1.8s
10.59 s
[gammaloop-ci-test-binary-dependencies-f0f952c3f8c3050c-gammaloop-api-dev-dependency.toml:post-build] Uploading to the NixCI cache: /nix/store/8n1xwz3n1glb8aw2nw1zp5k5wfk62wm4-gammaloop-ci-test-binary-dependencies-f0f952c3f8c3050c-gammaloop-api-dev-dependency.toml
10.67 s
[gammaloop-ci-test-binary-dependencies-f0f952c3f8c3050c-gammaloop-api-dev-dependency.toml:post-build] warning: 'warn-short-path-literals' is deprecated, use 'lint-short-path-literals = ignore' instead
10.82 s
[gammaloop-ci-test-binary-dependencies-f0f952c3f8c3050c-gammaloop-api-dev-dependency.toml:post-build] copying 0 paths...
10.93 s
[gammaloop-ci-test-binary-dependencies-f0f952c3f8c3050c-gammaloop-api-dev-dependency.toml:post-build] warning: 'warn-short-path-literals' is deprecated, use 'lint-short-path-literals = ignore' instead
11.11 s
[gammaloop-ci-test-binary-dependencies-f0f952c3f8c3050c-gammaloop-api-dev-dependency.toml:post-build] copying 0 paths...
11.14 s
Uploaded gammaloop-ci-test-binary-dependencies-f0f952c3f8c3050c-gammaloop-api-dev-dependency.toml in 593ms
11.14 s
Progress: 4 of 21 built (1 building), 3 of 11 downloaded from cache (3 downloading)
11.14 s
Built gammaloop-ci-test-binary-dependencies-f0f952c3f8c3050c-gammaloop-api-dev-dependency.toml in 2.4s
11.29 s
Building /nix/store/5szmjlzyk11bszgllnyyjxr0crbfnyr4-gammaloop-nextest-binaries-core-gammaloop-tracing-filter-0.1.0.drv
11.29 s
[gammaloop-crate-test-binaries-three-dimensional-reps-50150770f831b638-deps] Phase: unpackPhase
11.29 s
[gammaloop-crate-test-binaries-three-dimensional-reps-50150770f831b638-deps] unpacking source archive /nix/store/cra0nlvfvsi0f5flhy40zq1fjvqjsqqk-source
11.29 s
[gammaloop-crate-test-binaries-three-dimensional-reps-50150770f831b638-deps] source root is source
11.29 s
[gammaloop-crate-test-binaries-three-dimensional-reps-50150770f831b638-deps] Phase: patchPhase
11.29 s
[gammaloop-crate-test-binaries-three-dimensional-reps-50150770f831b638-deps] Executing configureCargoCommonVars
11.29 s
[gammaloop-crate-test-binaries-three-dimensional-reps-50150770f831b638-deps] copying cargo artifacts from /nix/store/2ws3v62qqf2mmz5fp17kchi9n0k8vkxl-gammaloop-crate-test-binaries-three-dimensional-reps-50150770f831b638-inputs/target to target
11.30 s
[gammaloop-crate-test-binaries-three-dimensional-reps-50150770f831b638-deps] will deep copy artifacts (instead of symlinking) as requested
11.30 s
[gammaloop-crate-test-binaries-three-dimensional-reps-50150770f831b638-deps] Phase: updateAutotoolsGnuConfigScriptsPhase
11.30 s
[gammaloop-crate-test-binaries-three-dimensional-reps-50150770f831b638-deps] Phase: configurePhase
11.30 s
[gammaloop-crate-test-binaries-three-dimensional-reps-50150770f831b638-deps] will append /build/source/.cargo-home/config.toml with contents of /nix/store/1sigmg52bb61pfngmk9k8wq5fz9r7bf1-vendor-cargo-deps/config.toml
11.30 s
[gammaloop-crate-test-binaries-three-dimensional-reps-50150770f831b638-deps] default configurePhase, nothing to do
11.30 s
[gammaloop-crate-test-binaries-three-dimensional-reps-50150770f831b638-deps] Phase: buildPhase
11.30 s
[gammaloop-crate-test-binaries-three-dimensional-reps-50150770f831b638-deps] +++ command cargo --version
11.30 s
[gammaloop-crate-test-binaries-three-dimensional-reps-50150770f831b638-deps] cargo 1.97.0 (c980f4866 2026-06-30)
11.30 s
[gammaloop-crate-test-binaries-three-dimensional-reps-50150770f831b638-deps] +++ command cargo test --profile ci-optim --no-run --offline -p three-dimensional-reps --features three-dimensional-reps/serde
11.30 s
[gammaloop-crate-test-binaries-three-dimensional-reps-50150770f831b638-deps] Compiling three-dimensional-reps v0.1.0 (/build/source/crates/three-dimensional-reps)
11.43 s
[gammaloop-nextest-binaries-core-gammaloop-tracing-filter] Phase: unpackPhase
11.43 s
[gammaloop-nextest-binaries-core-gammaloop-tracing-filter] unpacking source archive /nix/store/793yc59hmqpmq9sqax0g6lp3vvyk2gq8-source
11.46 s
[gammaloop-nextest-binaries-core-gammaloop-tracing-filter] source root is source
11.48 s
[gammaloop-nextest-binaries-core-gammaloop-tracing-filter] Phase: patchPhase
11.53 s
[gammaloop-crate-test-binaries-three-dimensional-reps-50150770f831b638-deps] error[E0433] : cannot find `eval` in `crate`
11.53 s
[gammaloop-crate-test-binaries-three-dimensional-reps-50150770f831b638-deps] --> crates/three-dimensional-reps/src/generation.rs:6540:28
11.53 s
[gammaloop-crate-test-binaries-three-dimensional-reps-50150770f831b638-deps] |
11.53 s
[gammaloop-crate-test-binaries-three-dimensional-reps-50150770f831b638-deps] 6540 | let input = crate::eval::EvaluationInput {
11.53 s
[gammaloop-crate-test-binaries-three-dimensional-reps-50150770f831b638-deps] | ^^^^ could not find `eval` in the crate root
11.53 s
[gammaloop-crate-test-binaries-three-dimensional-reps-50150770f831b638-deps] |
11.53 s
[gammaloop-crate-test-binaries-three-dimensional-reps-50150770f831b638-deps] note : found an item that was configured out
11.53 s
[gammaloop-crate-test-binaries-three-dimensional-reps-50150770f831b638-deps] --> crates/three-dimensional-reps/src/lib.rs:7:9
11.53 s
[gammaloop-crate-test-binaries-three-dimensional-reps-50150770f831b638-deps] |
11.53 s
[gammaloop-crate-test-binaries-three-dimensional-reps-50150770f831b638-deps] 6 | #[cfg(feature = "eval")]
11.53 s
[gammaloop-crate-test-binaries-three-dimensional-reps-50150770f831b638-deps] | ---------------- the item is gated behind the `eval` feature
11.53 s
[gammaloop-crate-test-binaries-three-dimensional-reps-50150770f831b638-deps] 7 | pub mod eval;
11.53 s
[gammaloop-crate-test-binaries-three-dimensional-reps-50150770f831b638-deps] | ^^^^
11.53 s
[gammaloop-crate-test-binaries-three-dimensional-reps-50150770f831b638-deps]
11.54 s
[gammaloop-crate-test-binaries-three-dimensional-reps-50150770f831b638-deps] error[E0433] : cannot find `eval` in `crate`
11.54 s
[gammaloop-crate-test-binaries-three-dimensional-reps-50150770f831b638-deps] --> crates/three-dimensional-reps/src/generation.rs:6547:30
11.54 s
[gammaloop-crate-test-binaries-three-dimensional-reps-50150770f831b638-deps] |
11.54 s
[gammaloop-crate-test-binaries-three-dimensional-reps-50150770f831b638-deps] 6547 | let contact = crate::eval::evaluate_expression(
11.54 s
[gammaloop-crate-test-binaries-three-dimensional-reps-50150770f831b638-deps] | ^^^^ could not find `eval` in the crate root
11.54 s
[gammaloop-crate-test-binaries-three-dimensional-reps-50150770f831b638-deps] |
11.54 s
[gammaloop-crate-test-binaries-three-dimensional-reps-50150770f831b638-deps] note : found an item that was configured out
11.54 s
[gammaloop-crate-test-binaries-three-dimensional-reps-50150770f831b638-deps] --> crates/three-dimensional-reps/src/lib.rs:7:9
11.54 s
[gammaloop-crate-test-binaries-three-dimensional-reps-50150770f831b638-deps] |
11.54 s
[gammaloop-crate-test-binaries-three-dimensional-reps-50150770f831b638-deps] 6 | #[cfg(feature = "eval")]
11.54 s
[gammaloop-crate-test-binaries-three-dimensional-reps-50150770f831b638-deps] | ---------------- the item is gated behind the `eval` feature
11.54 s
[gammaloop-crate-test-binaries-three-dimensional-reps-50150770f831b638-deps] 7 | pub mod eval;
11.54 s
[gammaloop-crate-test-binaries-three-dimensional-reps-50150770f831b638-deps] | ^^^^
11.54 s
[gammaloop-crate-test-binaries-three-dimensional-reps-50150770f831b638-deps]
11.55 s
[gammaloop-crate-test-binaries-three-dimensional-reps-50150770f831b638-deps] error[E0433] : cannot find `eval` in `crate`
11.55 s
[gammaloop-crate-test-binaries-three-dimensional-reps-50150770f831b638-deps] --> crates/three-dimensional-reps/src/generation.rs:6555:32
11.55 s
[gammaloop-crate-test-binaries-three-dimensional-reps-50150770f831b638-deps] |
11.55 s
[gammaloop-crate-test-binaries-three-dimensional-reps-50150770f831b638-deps] 6555 | let remainder = crate::eval::evaluate_expression(
11.55 s
[gammaloop-crate-test-binaries-three-dimensional-reps-50150770f831b638-deps] | ^^^^ could not find `eval` in the crate root
11.55 s
[gammaloop-crate-test-binaries-three-dimensional-reps-50150770f831b638-deps] |
11.55 s
[gammaloop-crate-test-binaries-three-dimensional-reps-50150770f831b638-deps] note : found an item that was configured out
11.55 s
[gammaloop-crate-test-binaries-three-dimensional-reps-50150770f831b638-deps] --> crates/three-dimensional-reps/src/lib.rs:7:9
11.55 s
[gammaloop-crate-test-binaries-three-dimensional-reps-50150770f831b638-deps] |
11.55 s
[gammaloop-crate-test-binaries-three-dimensional-reps-50150770f831b638-deps] 6 | #[cfg(feature = "eval")]
11.55 s
[gammaloop-crate-test-binaries-three-dimensional-reps-50150770f831b638-deps] | ---------------- the item is gated behind the `eval` feature
11.55 s
[gammaloop-crate-test-binaries-three-dimensional-reps-50150770f831b638-deps] 7 | pub mod eval;
11.55 s
[gammaloop-crate-test-binaries-three-dimensional-reps-50150770f831b638-deps] | ^^^^
11.55 s
[gammaloop-crate-test-binaries-three-dimensional-reps-50150770f831b638-deps]
11.56 s
[gammaloop-crate-test-binaries-three-dimensional-reps-50150770f831b638-deps] error[E0433] : cannot find `eval` in `crate`
11.56 s
[gammaloop-crate-test-binaries-three-dimensional-reps-50150770f831b638-deps] --> crates/three-dimensional-reps/src/generation.rs:6563:28
11.56 s
[gammaloop-crate-test-binaries-three-dimensional-reps-50150770f831b638-deps] |
11.57 s
[gammaloop-crate-test-binaries-three-dimensional-reps-50150770f831b638-deps] 6563 | let total = crate::eval::evaluate_expression(&powered, &expression, numerator, &input)
11.57 s
[gammaloop-crate-test-binaries-three-dimensional-reps-50150770f831b638-deps] | ^^^^ could not find `eval` in the crate root
11.57 s
[gammaloop-crate-test-binaries-three-dimensional-reps-50150770f831b638-deps] |
11.57 s
[gammaloop-crate-test-binaries-three-dimensional-reps-50150770f831b638-deps] note : found an item that was configured out
11.57 s
[gammaloop-crate-test-binaries-three-dimensional-reps-50150770f831b638-deps] --> crates/three-dimensional-reps/src/lib.rs:7:9
11.57 s
[gammaloop-crate-test-binaries-three-dimensional-reps-50150770f831b638-deps] |
11.57 s
[gammaloop-crate-test-binaries-three-dimensional-reps-50150770f831b638-deps] 6 | #[cfg(feature = "eval")]
11.57 s
[gammaloop-crate-test-binaries-three-dimensional-reps-50150770f831b638-deps] | ---------------- the item is gated behind the `eval` feature
11.57 s
[gammaloop-crate-test-binaries-three-dimensional-reps-50150770f831b638-deps] 7 | pub mod eval;
11.57 s
[gammaloop-crate-test-binaries-three-dimensional-reps-50150770f831b638-deps] | ^^^^
11.57 s
[gammaloop-crate-test-binaries-three-dimensional-reps-50150770f831b638-deps]
11.65 s
[gammaloop-nextest-binaries-core-gammaloop-tracing-filter] copying cargo artifacts from /nix/store/lgn6wk4i6f2451awf9glwm8laradl4ql-gammaloop-crate-test-binaries-gammaloop-tracing-filter-31e37aec92971227-inputs/target to target
13.58 s
[gammaloop-crate-test-binaries-three-dimensional-reps-50150770f831b638-deps] For more information about this error, try `rustc --explain E0433`.
13.70 s
[gammaloop-crate-test-binaries-three-dimensional-reps-50150770f831b638-deps] error : could not compile `three-dimensional-reps` (lib test) due to 4 previous errors
14.03 s
Progress: 4 of 14 built (1 building, 1 failed), 3 of 11 downloaded from cache (3 downloading)
14.03 s
Failed to build gammaloop-crate-test-binaries-three-dimensional-reps-50150770f831b638-deps after 5.1s
14.03 s
error: Cannot build '/nix/store/cv02k8axyaajy2wk22703viwwjkp6c9w-gammaloop-crate-test-binaries-three-dimensional-reps-50150770f831b638-deps-0.1.0.drv '.
14.03 s
Reason: builder failed with exit code 101 .
14.03 s
Output paths:
14.03 s
/nix/store/9c503a8m7ppz249bcgxs70380i2rli5i-gammaloop-crate-test-binaries-three-dimensional-reps-50150770f831b638-deps-0.1.0
14.03 s
Last 74 log lines:
14.03 s
> Running phase: unpackPhase
14.03 s
> unpacking source archive /nix/store/cra0nlvfvsi0f5flhy40zq1fjvqjsqqk-source
14.03 s
> source root is source
14.03 s
> Running phase: patchPhase
14.03 s
> Executing configureCargoCommonVars
14.03 s
> copying cargo artifacts from /nix/store/2ws3v62qqf2mmz5fp17kchi9n0k8vkxl-gammaloop-crate-test-binaries-three-dimensional-reps-50150770f831b638-inputs/target to target
14.03 s
> will deep copy artifacts (instead of symlinking) as requested
14.03 s
> Running phase: updateAutotoolsGnuConfigScriptsPhase
14.03 s
> Running phase: configurePhase
14.03 s
> will append /build/source/.cargo-home/config.toml with contents of /nix/store/1sigmg52bb61pfngmk9k8wq5fz9r7bf1-vendor-cargo-deps/config.toml
14.03 s
> default configurePhase, nothing to do
14.03 s
> Running phase: buildPhase
14.03 s
> +++ command cargo --version
14.03 s
> cargo 1.97.0 (c980f4866 2026-06-30)
14.03 s
> +++ command cargo test --profile ci-optim --no-run --offline -p three-dimensional-reps --features three-dimensional-reps/serde
14.03 s
> Compiling three-dimensional-reps v0.1.0 (/build/source/crates/three-dimensional-reps)
14.03 s
> error[E0433] : cannot find `eval` in `crate`
14.03 s
> --> crates/three-dimensional-reps/src/generation.rs:6540:28
14.03 s
> |
14.03 s
> 6540 | let input = crate::eval::EvaluationInput {
14.03 s
> | ^^^^ could not find `eval` in the crate root
14.03 s
> |
14.03 s
> note : found an item that was configured out
14.03 s
> --> crates/three-dimensional-reps/src/lib.rs:7:9
14.03 s
> |
14.03 s
> 6 | #[cfg(feature = "eval")]
14.03 s
> | ---------------- the item is gated behind the `eval` feature
14.03 s
> 7 | pub mod eval;
14.03 s
> | ^^^^
14.03 s
>
14.03 s
> error[E0433] : cannot find `eval` in `crate`
14.03 s
> --> crates/three-dimensional-reps/src/generation.rs:6547:30
14.03 s
> |
14.03 s
> 6547 | let contact = crate::eval::evaluate_expression(
14.03 s
> | ^^^^ could not find `eval` in the crate root
14.03 s
> |
14.03 s
> note : found an item that was configured out
14.03 s
> --> crates/three-dimensional-reps/src/lib.rs:7:9
14.03 s
> |
14.03 s
> 6 | #[cfg(feature = "eval")]
14.03 s
> | ---------------- the item is gated behind the `eval` feature
14.03 s
> 7 | pub mod eval;
14.03 s
> | ^^^^
14.03 s
>
14.03 s
> error[E0433] : cannot find `eval` in `crate`
14.03 s
> --> crates/three-dimensional-reps/src/generation.rs:6555:32
14.03 s
> |
14.03 s
> 6555 | let remainder = crate::eval::evaluate_expression(
14.03 s
> | ^^^^ could not find `eval` in the crate root
14.03 s
> |
14.03 s
> note : found an item that was configured out
14.03 s
> --> crates/three-dimensional-reps/src/lib.rs:7:9
14.03 s
> |
14.03 s
> 6 | #[cfg(feature = "eval")]
14.03 s
> | ---------------- the item is gated behind the `eval` feature
14.03 s
> 7 | pub mod eval;
14.03 s
> | ^^^^
14.03 s
>
14.03 s
> error[E0433] : cannot find `eval` in `crate`
14.03 s
> --> crates/three-dimensional-reps/src/generation.rs:6563:28
14.03 s
> |
14.03 s
> 6563 | let total = crate::eval::evaluate_expression(&powered, &expression, numerator, &input)
14.03 s
> | ^^^^ could not find `eval` in the crate root
14.03 s
> |
14.03 s
> note : found an item that was configured out
14.03 s
> --> crates/three-dimensional-reps/src/lib.rs:7:9
14.03 s
> |
14.03 s
> 6 | #[cfg(feature = "eval")]
14.03 s
> | ---------------- the item is gated behind the `eval` feature
14.03 s
> 7 | pub mod eval;
14.03 s
> | ^^^^
14.03 s
>
14.03 s
> For more information about this error, try `rustc --explain E0433`.
14.03 s
> error : could not compile `three-dimensional-reps` (lib test) due to 4 previous errors
14.03 s
For full logs, run:
14.03 s
nix log /nix/store/cv02k8axyaajy2wk22703viwwjkp6c9w-gammaloop-crate-test-binaries-three-dimensional-reps-50150770f831b638-deps-0.1.0.drv
14.03 s
error: Cannot build '/nix/store/fgmak5kmh23mbn43xzk95kn3zadimpn9-gammaloop-nextest-binaries-core-three-dimensional-reps-0.1.0.drv '.
14.03 s
Reason: 1 dependency failed .
14.03 s
Output paths:
14.03 s
/nix/store/fnks8cy77qw57c3cdpvrgi3b74d3viyz-gammaloop-nextest-binaries-core-three-dimensional-reps-0.1.0
14.03 s
error: Build failed due to failed dependency
14.03 s
error: Cannot build '/nix/store/dvrvr81y9mj6kbcyzn2dl1m6r0m0cgfl-gammaloop-nextest-binaries-core.drv '.
14.03 s
Reason: 1 dependency failed .
14.03 s
Output paths:
14.03 s
/nix/store/xajgrvr3xlsx1k91dgcdd3y5ijp67jdi-gammaloop-nextest-binaries-core
22.63 s
Downloaded cached gammaloop-crate-test-binaries-gammaloop-tracing-filter-macros-1b17e1ec025c6580-inputs (1.1 GiB) in 14.0s
29.03 s
Downloaded cached gammaloop-crate-test-binaries-gammalooprs-247ff5d63201fb2c-inputs (2.3 GiB) in 20.4s
31.42 s
Downloaded cached gammaloop-crate-test-dependencies-f0f952c3f8c3050c-inputs (2.3 GiB) in 22.8s
31.60 s
Built gammaloop-nextest-binaries-core-gammaloop-tracing-filter in 20.3s
31.61 s
Build failed due to failed dependency
31.68 s
Build failed.