build checks.x86_64-linux.gammaloop-nextest-binaries-core

Reproduce this run
Retry Run
  1. 0.14 s $ /nix/store/9ypz3flqsrl5xl495mm8h645gadjsxi1-coreutils-9.11/bin/timeout --kill-after=15s 7200s /nix/store/23zk8sgzamrbmj1fday15szf7f2279s8-nix-2.34.7/bin/nix --extra-experimental-features nix-command --extra-experimental-features flakes --log-format internal-json build --no-link --print-out-paths git+https://github.com/alphal00p/gammaloop?ref=raised_energy_cff_wip&rev=c8e7631734f65b7fae00ea28219fb7c871b6ed1e&shallow=1#checks.x86_64-linux.gammaloop-nextest-binaries-core --print-build-logs
  2. 8.03 s
  3. 8.58 s Downloading cached gammaloop-ci-test-binary-dependencies-1b17e1ec025c6580-Cargo.toml from https://cache.nix-ci.com
  4. 8.59 s Downloading cached gammaloop-ci-test-binary-dependencies-31e37aec92971227-Cargo.toml from https://cache.nix-ci.com
  5. 8.60 s Downloaded cached gammaloop-ci-test-binary-dependencies-31e37aec92971227-Cargo.toml (824 B) in 0ms
  6. 8.60 s Downloaded cached gammaloop-ci-test-binary-dependencies-1b17e1ec025c6580-Cargo.toml (280 B) in 11ms
  7. 8.66 s Downloading cached gammaloop-crate-test-binaries-gammaloop-tracing-filter-31e37aec92971227-inputs from https://cache.nix-ci.com
  8. 8.66 s Downloading cached gammaloop-crate-test-binaries-gammaloop-tracing-filter-macros-1b17e1ec025c6580-inputs from https://cache.nix-ci.com
  9. 8.67 s Downloading cached gammaloop-crate-test-dependencies-247ff5d63201fb2c-deps from https://cache.nix-ci.com
  10. 8.73 s Building /nix/store/hb7vrvwgsdv3zmb4nk4r2bwgj32kasrf-gammaloop-ci-test-binary-dependencies-1b17e1ec025c6580-gammaloop-tracing-filter-macros-dev-dependency.toml.drv
  11. 8.77 s Building /nix/store/d803fdhy5vdmwg1bxnrdbbh443q5b2l1-gammaloop-ci-test-binary-dependencies-247ff5d63201fb2c-gammalooprs-dev-dependency.toml.drv
  12. 8.82 s Building /nix/store/8n7av5d2xzacvwsymvrcwygl7s0wgynb-gammaloop-ci-test-binary-dependencies-31e37aec92971227-gammaloop-tracing-filter-dev-dependency.toml.drv
  13. 8.87 s Building /nix/store/4wx7g7wm0incs1bkkmd6hnsr8bjq7s41-gammaloop-ci-test-binary-dependencies-f0f952c3f8c3050c-gammaloop-api-dev-dependency.toml.drv
  14. 9.08 s Building /nix/store/cv02k8axyaajy2wk22703viwwjkp6c9w-gammaloop-crate-test-binaries-three-dimensional-reps-50150770f831b638-deps-0.1.0.drv
  15. 9.08 s Progress: 0 of 17 built (5 building), 1 of 13 downloaded from cache (4 downloading)
  16. 9.08 s Progress: 0 of 17 built (5 building), 2 of 13 downloaded from cache (3 downloading)
  17. 9.12 s [gammaloop-ci-test-binary-dependencies-1b17e1ec025c6580-gammaloop-tracing-filter-macros-dev-dependency.toml:post-build] Uploading to the NixCI cache: /nix/store/gczxq1jnxb2f6nwcbl5zwmigdpgim7v7-gammaloop-ci-test-binary-dependencies-1b17e1ec025c6580-gammaloop-tracing-filter-macros-dev-dependency.toml
  18. 9.20 s [gammaloop-ci-test-binary-dependencies-1b17e1ec025c6580-gammaloop-tracing-filter-macros-dev-dependency.toml:post-build] warning: 'warn-short-path-literals' is deprecated, use 'lint-short-path-literals = ignore' instead
  19. 9.28 s [gammaloop-ci-test-binary-dependencies-1b17e1ec025c6580-gammaloop-tracing-filter-macros-dev-dependency.toml:post-build] copying 0 paths...
  20. 9.41 s [gammaloop-ci-test-binary-dependencies-1b17e1ec025c6580-gammaloop-tracing-filter-macros-dev-dependency.toml:post-build] warning: 'warn-short-path-literals' is deprecated, use 'lint-short-path-literals = ignore' instead
  21. 9.53 s [gammaloop-ci-test-binary-dependencies-1b17e1ec025c6580-gammaloop-tracing-filter-macros-dev-dependency.toml:post-build] copying 0 paths...
  22. 9.57 s Uploaded gammaloop-ci-test-binary-dependencies-1b17e1ec025c6580-gammaloop-tracing-filter-macros-dev-dependency.toml in 483ms
  23. 9.57 s Progress: 1 of 18 built (4 building), 2 of 13 downloaded from cache (3 downloading)
  24. 9.57 s Built gammaloop-ci-test-binary-dependencies-1b17e1ec025c6580-gammaloop-tracing-filter-macros-dev-dependency.toml in 845ms
  25. 9.62 s [gammaloop-ci-test-binary-dependencies-247ff5d63201fb2c-gammalooprs-dev-dependency.toml:post-build] Uploading to the NixCI cache: /nix/store/fzwgaj7lkfphcc1g09xfmk55hmkxkr0x-gammaloop-ci-test-binary-dependencies-247ff5d63201fb2c-gammalooprs-dev-dependency.toml
  26. 9.71 s [gammaloop-ci-test-binary-dependencies-247ff5d63201fb2c-gammalooprs-dev-dependency.toml:post-build] warning: 'warn-short-path-literals' is deprecated, use 'lint-short-path-literals = ignore' instead
  27. 9.79 s [gammaloop-ci-test-binary-dependencies-247ff5d63201fb2c-gammalooprs-dev-dependency.toml:post-build] copying 0 paths...
  28. 9.90 s [gammaloop-ci-test-binary-dependencies-247ff5d63201fb2c-gammalooprs-dev-dependency.toml:post-build] warning: 'warn-short-path-literals' is deprecated, use 'lint-short-path-literals = ignore' instead
  29. 10.02 s [gammaloop-ci-test-binary-dependencies-247ff5d63201fb2c-gammalooprs-dev-dependency.toml:post-build] copying 0 paths...
  30. 10.07 s Uploaded gammaloop-ci-test-binary-dependencies-247ff5d63201fb2c-gammalooprs-dev-dependency.toml in 488ms
  31. 10.07 s Progress: 2 of 19 built (3 building), 2 of 13 downloaded from cache (3 downloading)
  32. 10.07 s Built gammaloop-ci-test-binary-dependencies-247ff5d63201fb2c-gammalooprs-dev-dependency.toml in 1.3s
  33. 10.13 s [gammaloop-ci-test-binary-dependencies-31e37aec92971227-gammaloop-tracing-filter-dev-dependency.toml:post-build] Uploading to the NixCI cache: /nix/store/a90w47vskdc47wbbm7xrpzbp3hjc6n01-gammaloop-ci-test-binary-dependencies-31e37aec92971227-gammaloop-tracing-filter-dev-dependency.toml
  34. 10.21 s [gammaloop-ci-test-binary-dependencies-31e37aec92971227-gammaloop-tracing-filter-dev-dependency.toml:post-build] warning: 'warn-short-path-literals' is deprecated, use 'lint-short-path-literals = ignore' instead
  35. 10.29 s [gammaloop-ci-test-binary-dependencies-31e37aec92971227-gammaloop-tracing-filter-dev-dependency.toml:post-build] copying 0 paths...
  36. 10.41 s [gammaloop-ci-test-binary-dependencies-31e37aec92971227-gammaloop-tracing-filter-dev-dependency.toml:post-build] warning: 'warn-short-path-literals' is deprecated, use 'lint-short-path-literals = ignore' instead
  37. 10.52 s [gammaloop-ci-test-binary-dependencies-31e37aec92971227-gammaloop-tracing-filter-dev-dependency.toml:post-build] copying 0 paths...
  38. 10.56 s Uploaded gammaloop-ci-test-binary-dependencies-31e37aec92971227-gammaloop-tracing-filter-dev-dependency.toml in 479ms
  39. 10.56 s Progress: 3 of 20 built (2 building), 2 of 13 downloaded from cache (3 downloading)
  40. 10.56 s Built gammaloop-ci-test-binary-dependencies-31e37aec92971227-gammaloop-tracing-filter-dev-dependency.toml in 1.7s
  41. 10.60 s [gammaloop-ci-test-binary-dependencies-f0f952c3f8c3050c-gammaloop-api-dev-dependency.toml:post-build] Uploading to the NixCI cache: /nix/store/8n1xwz3n1glb8aw2nw1zp5k5wfk62wm4-gammaloop-ci-test-binary-dependencies-f0f952c3f8c3050c-gammaloop-api-dev-dependency.toml
  42. 10.69 s [gammaloop-ci-test-binary-dependencies-f0f952c3f8c3050c-gammaloop-api-dev-dependency.toml:post-build] warning: 'warn-short-path-literals' is deprecated, use 'lint-short-path-literals = ignore' instead
  43. 10.77 s [gammaloop-ci-test-binary-dependencies-f0f952c3f8c3050c-gammaloop-api-dev-dependency.toml:post-build] copying 0 paths...
  44. 10.92 s [gammaloop-ci-test-binary-dependencies-f0f952c3f8c3050c-gammaloop-api-dev-dependency.toml:post-build] warning: 'warn-short-path-literals' is deprecated, use 'lint-short-path-literals = ignore' instead
  45. 11.02 s [gammaloop-ci-test-binary-dependencies-f0f952c3f8c3050c-gammaloop-api-dev-dependency.toml:post-build] copying 0 paths...
  46. 11.04 s Uploaded gammaloop-ci-test-binary-dependencies-f0f952c3f8c3050c-gammaloop-api-dev-dependency.toml in 474ms
  47. 11.04 s Progress: 4 of 21 built (1 building), 2 of 13 downloaded from cache (3 downloading)
  48. 11.04 s Built gammaloop-ci-test-binary-dependencies-f0f952c3f8c3050c-gammaloop-api-dev-dependency.toml in 2.1s
  49. 11.05 s [gammaloop-crate-test-binaries-three-dimensional-reps-50150770f831b638-deps] Phase: unpackPhase
  50. 11.05 s [gammaloop-crate-test-binaries-three-dimensional-reps-50150770f831b638-deps] unpacking source archive /nix/store/cra0nlvfvsi0f5flhy40zq1fjvqjsqqk-source
  51. 11.05 s [gammaloop-crate-test-binaries-three-dimensional-reps-50150770f831b638-deps] source root is source
  52. 11.05 s [gammaloop-crate-test-binaries-three-dimensional-reps-50150770f831b638-deps] Phase: patchPhase
  53. 11.05 s [gammaloop-crate-test-binaries-three-dimensional-reps-50150770f831b638-deps] Executing configureCargoCommonVars
  54. 11.05 s [gammaloop-crate-test-binaries-three-dimensional-reps-50150770f831b638-deps] copying cargo artifacts from /nix/store/2ws3v62qqf2mmz5fp17kchi9n0k8vkxl-gammaloop-crate-test-binaries-three-dimensional-reps-50150770f831b638-inputs/target to target
  55. 11.05 s [gammaloop-crate-test-binaries-three-dimensional-reps-50150770f831b638-deps] will deep copy artifacts (instead of symlinking) as requested
  56. 11.05 s [gammaloop-crate-test-binaries-three-dimensional-reps-50150770f831b638-deps] Phase: updateAutotoolsGnuConfigScriptsPhase
  57. 11.05 s [gammaloop-crate-test-binaries-three-dimensional-reps-50150770f831b638-deps] Phase: configurePhase
  58. 11.06 s [gammaloop-crate-test-binaries-three-dimensional-reps-50150770f831b638-deps] will append /build/source/.cargo-home/config.toml with contents of /nix/store/1sigmg52bb61pfngmk9k8wq5fz9r7bf1-vendor-cargo-deps/config.toml
  59. 11.06 s [gammaloop-crate-test-binaries-three-dimensional-reps-50150770f831b638-deps] default configurePhase, nothing to do
  60. 11.07 s [gammaloop-crate-test-binaries-three-dimensional-reps-50150770f831b638-deps] Phase: buildPhase
  61. 11.08 s [gammaloop-crate-test-binaries-three-dimensional-reps-50150770f831b638-deps] +++ command cargo --version
  62. 11.08 s [gammaloop-crate-test-binaries-three-dimensional-reps-50150770f831b638-deps] cargo 1.97.0 (c980f4866 2026-06-30)
  63. 11.08 s [gammaloop-crate-test-binaries-three-dimensional-reps-50150770f831b638-deps] +++ command cargo test --profile ci-optim --no-run --offline -p three-dimensional-reps --features three-dimensional-reps/serde
  64. 11.82 s [gammaloop-crate-test-binaries-three-dimensional-reps-50150770f831b638-deps] Compiling three-dimensional-reps v0.1.0 (/build/source/crates/three-dimensional-reps)
  65. 12.14 s [gammaloop-crate-test-binaries-three-dimensional-reps-50150770f831b638-deps] error[E0433]: cannot find `eval` in `crate`
  66. 12.14 s [gammaloop-crate-test-binaries-three-dimensional-reps-50150770f831b638-deps] --> crates/three-dimensional-reps/src/generation.rs:6540:28
  67. 12.14 s [gammaloop-crate-test-binaries-three-dimensional-reps-50150770f831b638-deps] |
  68. 12.14 s [gammaloop-crate-test-binaries-three-dimensional-reps-50150770f831b638-deps] 6540 | let input = crate::eval::EvaluationInput {
  69. 12.15 s [gammaloop-crate-test-binaries-three-dimensional-reps-50150770f831b638-deps] | ^^^^ could not find `eval` in the crate root
  70. 12.15 s [gammaloop-crate-test-binaries-three-dimensional-reps-50150770f831b638-deps] |
  71. 12.15 s [gammaloop-crate-test-binaries-three-dimensional-reps-50150770f831b638-deps] note: found an item that was configured out
  72. 12.15 s [gammaloop-crate-test-binaries-three-dimensional-reps-50150770f831b638-deps] --> crates/three-dimensional-reps/src/lib.rs:7:9
  73. 12.15 s [gammaloop-crate-test-binaries-three-dimensional-reps-50150770f831b638-deps] |
  74. 12.15 s [gammaloop-crate-test-binaries-three-dimensional-reps-50150770f831b638-deps] 6 | #[cfg(feature = "eval")]
  75. 12.15 s [gammaloop-crate-test-binaries-three-dimensional-reps-50150770f831b638-deps] | ---------------- the item is gated behind the `eval` feature
  76. 12.15 s [gammaloop-crate-test-binaries-three-dimensional-reps-50150770f831b638-deps] 7 | pub mod eval;
  77. 12.15 s [gammaloop-crate-test-binaries-three-dimensional-reps-50150770f831b638-deps] | ^^^^
  78. 12.15 s [gammaloop-crate-test-binaries-three-dimensional-reps-50150770f831b638-deps]
  79. 12.16 s Downloaded cached gammaloop-crate-test-dependencies-247ff5d63201fb2c-deps (79.6 MiB) in 3.4s
  80. 12.16 s Progress: 4 of 15 built (1 building), 3 of 13 downloaded from cache (2 downloading)
  81. 12.16 s Downloading cached gammaloop-crate-test-binaries-gammalooprs-247ff5d63201fb2c-inputs from https://cache.nix-ci.com
  82. 12.16 s [gammaloop-crate-test-binaries-three-dimensional-reps-50150770f831b638-deps] error[E0433]: cannot find `eval` in `crate`
  83. 12.16 s [gammaloop-crate-test-binaries-three-dimensional-reps-50150770f831b638-deps] --> crates/three-dimensional-reps/src/generation.rs:6547:30
  84. 12.16 s [gammaloop-crate-test-binaries-three-dimensional-reps-50150770f831b638-deps] |
  85. 12.16 s [gammaloop-crate-test-binaries-three-dimensional-reps-50150770f831b638-deps] 6547 | let contact = crate::eval::evaluate_expression(
  86. 12.16 s [gammaloop-crate-test-binaries-three-dimensional-reps-50150770f831b638-deps] | ^^^^ could not find `eval` in the crate root
  87. 12.16 s [gammaloop-crate-test-binaries-three-dimensional-reps-50150770f831b638-deps] |
  88. 12.16 s [gammaloop-crate-test-binaries-three-dimensional-reps-50150770f831b638-deps] note: found an item that was configured out
  89. 12.16 s [gammaloop-crate-test-binaries-three-dimensional-reps-50150770f831b638-deps] --> crates/three-dimensional-reps/src/lib.rs:7:9
  90. 12.16 s [gammaloop-crate-test-binaries-three-dimensional-reps-50150770f831b638-deps] |
  91. 12.17 s [gammaloop-crate-test-binaries-three-dimensional-reps-50150770f831b638-deps] 6 | #[cfg(feature = "eval")]
  92. 12.17 s [gammaloop-crate-test-binaries-three-dimensional-reps-50150770f831b638-deps] | ---------------- the item is gated behind the `eval` feature
  93. 12.17 s [gammaloop-crate-test-binaries-three-dimensional-reps-50150770f831b638-deps] 7 | pub mod eval;
  94. 12.17 s [gammaloop-crate-test-binaries-three-dimensional-reps-50150770f831b638-deps] | ^^^^
  95. 12.17 s [gammaloop-crate-test-binaries-three-dimensional-reps-50150770f831b638-deps]
  96. 12.17 s Downloading cached gammaloop-crate-test-dependencies-f0f952c3f8c3050c-inputs from https://cache.nix-ci.com
  97. 12.18 s [gammaloop-crate-test-binaries-three-dimensional-reps-50150770f831b638-deps] error[E0433]: cannot find `eval` in `crate`
  98. 12.18 s [gammaloop-crate-test-binaries-three-dimensional-reps-50150770f831b638-deps] --> crates/three-dimensional-reps/src/generation.rs:6555:32
  99. 12.18 s [gammaloop-crate-test-binaries-three-dimensional-reps-50150770f831b638-deps] |
  100. 12.18 s [gammaloop-crate-test-binaries-three-dimensional-reps-50150770f831b638-deps] 6555 | let remainder = crate::eval::evaluate_expression(
  101. 12.18 s [gammaloop-crate-test-binaries-three-dimensional-reps-50150770f831b638-deps] | ^^^^ could not find `eval` in the crate root
  102. 12.18 s [gammaloop-crate-test-binaries-three-dimensional-reps-50150770f831b638-deps] |
  103. 12.18 s [gammaloop-crate-test-binaries-three-dimensional-reps-50150770f831b638-deps] note: found an item that was configured out
  104. 12.18 s [gammaloop-crate-test-binaries-three-dimensional-reps-50150770f831b638-deps] --> crates/three-dimensional-reps/src/lib.rs:7:9
  105. 12.18 s [gammaloop-crate-test-binaries-three-dimensional-reps-50150770f831b638-deps] |
  106. 12.18 s [gammaloop-crate-test-binaries-three-dimensional-reps-50150770f831b638-deps] 6 | #[cfg(feature = "eval")]
  107. 12.18 s [gammaloop-crate-test-binaries-three-dimensional-reps-50150770f831b638-deps] | ---------------- the item is gated behind the `eval` feature
  108. 12.18 s [gammaloop-crate-test-binaries-three-dimensional-reps-50150770f831b638-deps] 7 | pub mod eval;
  109. 12.18 s [gammaloop-crate-test-binaries-three-dimensional-reps-50150770f831b638-deps] | ^^^^
  110. 12.18 s [gammaloop-crate-test-binaries-three-dimensional-reps-50150770f831b638-deps]
  111. 12.19 s [gammaloop-crate-test-binaries-three-dimensional-reps-50150770f831b638-deps] error[E0433]: cannot find `eval` in `crate`
  112. 12.19 s [gammaloop-crate-test-binaries-three-dimensional-reps-50150770f831b638-deps] --> crates/three-dimensional-reps/src/generation.rs:6563:28
  113. 12.19 s [gammaloop-crate-test-binaries-three-dimensional-reps-50150770f831b638-deps] |
  114. 12.19 s [gammaloop-crate-test-binaries-three-dimensional-reps-50150770f831b638-deps] 6563 | let total = crate::eval::evaluate_expression(&powered, &expression, numerator, &input)
  115. 12.19 s [gammaloop-crate-test-binaries-three-dimensional-reps-50150770f831b638-deps] | ^^^^ could not find `eval` in the crate root
  116. 12.19 s [gammaloop-crate-test-binaries-three-dimensional-reps-50150770f831b638-deps] |
  117. 12.19 s [gammaloop-crate-test-binaries-three-dimensional-reps-50150770f831b638-deps] note: found an item that was configured out
  118. 12.19 s [gammaloop-crate-test-binaries-three-dimensional-reps-50150770f831b638-deps] --> crates/three-dimensional-reps/src/lib.rs:7:9
  119. 12.19 s [gammaloop-crate-test-binaries-three-dimensional-reps-50150770f831b638-deps] |
  120. 12.19 s [gammaloop-crate-test-binaries-three-dimensional-reps-50150770f831b638-deps] 6 | #[cfg(feature = "eval")]
  121. 12.19 s [gammaloop-crate-test-binaries-three-dimensional-reps-50150770f831b638-deps] | ---------------- the item is gated behind the `eval` feature
  122. 12.19 s [gammaloop-crate-test-binaries-three-dimensional-reps-50150770f831b638-deps] 7 | pub mod eval;
  123. 12.19 s [gammaloop-crate-test-binaries-three-dimensional-reps-50150770f831b638-deps] | ^^^^
  124. 12.19 s [gammaloop-crate-test-binaries-three-dimensional-reps-50150770f831b638-deps]
  125. 15.18 s [gammaloop-crate-test-binaries-three-dimensional-reps-50150770f831b638-deps] For more information about this error, try `rustc --explain E0433`.
  126. 15.23 s [gammaloop-crate-test-binaries-three-dimensional-reps-50150770f831b638-deps] error: could not compile `three-dimensional-reps` (lib test) due to 4 previous errors
  127. 15.65 s Progress: 4 of 15 built (1 failed), 3 of 13 downloaded from cache (4 downloading)
  128. 15.65 s Failed to build gammaloop-crate-test-binaries-three-dimensional-reps-50150770f831b638-deps after 6.5s
  129. 15.65 s error: Cannot build '/nix/store/cv02k8axyaajy2wk22703viwwjkp6c9w-gammaloop-crate-test-binaries-three-dimensional-reps-50150770f831b638-deps-0.1.0.drv'.
  130. 15.65 s Reason: builder failed with exit code 101.
  131. 15.65 s Output paths:
  132. 15.65 s /nix/store/9c503a8m7ppz249bcgxs70380i2rli5i-gammaloop-crate-test-binaries-three-dimensional-reps-50150770f831b638-deps-0.1.0
  133. 15.65 s Last 74 log lines:
  134. 15.65 s > Running phase: unpackPhase
  135. 15.65 s > unpacking source archive /nix/store/cra0nlvfvsi0f5flhy40zq1fjvqjsqqk-source
  136. 15.65 s > source root is source
  137. 15.65 s > Running phase: patchPhase
  138. 15.65 s > Executing configureCargoCommonVars
  139. 15.65 s > copying cargo artifacts from /nix/store/2ws3v62qqf2mmz5fp17kchi9n0k8vkxl-gammaloop-crate-test-binaries-three-dimensional-reps-50150770f831b638-inputs/target to target
  140. 15.65 s > will deep copy artifacts (instead of symlinking) as requested
  141. 15.65 s > Running phase: updateAutotoolsGnuConfigScriptsPhase
  142. 15.65 s > Running phase: configurePhase
  143. 15.65 s > will append /build/source/.cargo-home/config.toml with contents of /nix/store/1sigmg52bb61pfngmk9k8wq5fz9r7bf1-vendor-cargo-deps/config.toml
  144. 15.65 s > default configurePhase, nothing to do
  145. 15.65 s > Running phase: buildPhase
  146. 15.65 s > +++ command cargo --version
  147. 15.65 s > cargo 1.97.0 (c980f4866 2026-06-30)
  148. 15.65 s > +++ command cargo test --profile ci-optim --no-run --offline -p three-dimensional-reps --features three-dimensional-reps/serde
  149. 15.65 s > Compiling three-dimensional-reps v0.1.0 (/build/source/crates/three-dimensional-reps)
  150. 15.65 s > error[E0433]: cannot find `eval` in `crate`
  151. 15.65 s > --> crates/three-dimensional-reps/src/generation.rs:6540:28
  152. 15.65 s > |
  153. 15.65 s > 6540 | let input = crate::eval::EvaluationInput {
  154. 15.65 s > | ^^^^ could not find `eval` in the crate root
  155. 15.65 s > |
  156. 15.65 s > note: found an item that was configured out
  157. 15.65 s > --> crates/three-dimensional-reps/src/lib.rs:7:9
  158. 15.65 s > |
  159. 15.65 s > 6 | #[cfg(feature = "eval")]
  160. 15.65 s > | ---------------- the item is gated behind the `eval` feature
  161. 15.65 s > 7 | pub mod eval;
  162. 15.65 s > | ^^^^
  163. 15.65 s >
  164. 15.65 s > error[E0433]: cannot find `eval` in `crate`
  165. 15.65 s > --> crates/three-dimensional-reps/src/generation.rs:6547:30
  166. 15.65 s > |
  167. 15.65 s > 6547 | let contact = crate::eval::evaluate_expression(
  168. 15.65 s > | ^^^^ could not find `eval` in the crate root
  169. 15.65 s > |
  170. 15.65 s > note: found an item that was configured out
  171. 15.65 s > --> crates/three-dimensional-reps/src/lib.rs:7:9
  172. 15.65 s > |
  173. 15.65 s > 6 | #[cfg(feature = "eval")]
  174. 15.65 s > | ---------------- the item is gated behind the `eval` feature
  175. 15.65 s > 7 | pub mod eval;
  176. 15.65 s > | ^^^^
  177. 15.65 s >
  178. 15.65 s > error[E0433]: cannot find `eval` in `crate`
  179. 15.65 s > --> crates/three-dimensional-reps/src/generation.rs:6555:32
  180. 15.65 s > |
  181. 15.65 s > 6555 | let remainder = crate::eval::evaluate_expression(
  182. 15.65 s > | ^^^^ could not find `eval` in the crate root
  183. 15.65 s > |
  184. 15.65 s > note: found an item that was configured out
  185. 15.65 s > --> crates/three-dimensional-reps/src/lib.rs:7:9
  186. 15.65 s > |
  187. 15.65 s > 6 | #[cfg(feature = "eval")]
  188. 15.65 s > | ---------------- the item is gated behind the `eval` feature
  189. 15.65 s > 7 | pub mod eval;
  190. 15.65 s > | ^^^^
  191. 15.65 s >
  192. 15.65 s > error[E0433]: cannot find `eval` in `crate`
  193. 15.65 s > --> crates/three-dimensional-reps/src/generation.rs:6563:28
  194. 15.65 s > |
  195. 15.65 s > 6563 | let total = crate::eval::evaluate_expression(&powered, &expression, numerator, &input)
  196. 15.65 s > | ^^^^ could not find `eval` in the crate root
  197. 15.65 s > |
  198. 15.65 s > note: found an item that was configured out
  199. 15.65 s > --> crates/three-dimensional-reps/src/lib.rs:7:9
  200. 15.65 s > |
  201. 15.65 s > 6 | #[cfg(feature = "eval")]
  202. 15.65 s > | ---------------- the item is gated behind the `eval` feature
  203. 15.65 s > 7 | pub mod eval;
  204. 15.65 s > | ^^^^
  205. 15.65 s >
  206. 15.65 s > For more information about this error, try `rustc --explain E0433`.
  207. 15.65 s > error: could not compile `three-dimensional-reps` (lib test) due to 4 previous errors
  208. 15.65 s For full logs, run:
  209. 15.65 s nix log /nix/store/cv02k8axyaajy2wk22703viwwjkp6c9w-gammaloop-crate-test-binaries-three-dimensional-reps-50150770f831b638-deps-0.1.0.drv
  210. 15.65 s error: Cannot build '/nix/store/fgmak5kmh23mbn43xzk95kn3zadimpn9-gammaloop-nextest-binaries-core-three-dimensional-reps-0.1.0.drv'.
  211. 15.65 s Reason: 1 dependency failed.
  212. 15.65 s Output paths:
  213. 15.65 s /nix/store/fnks8cy77qw57c3cdpvrgi3b74d3viyz-gammaloop-nextest-binaries-core-three-dimensional-reps-0.1.0
  214. 15.65 s error: Build failed due to failed dependency
  215. 15.65 s error: Cannot build '/nix/store/dvrvr81y9mj6kbcyzn2dl1m6r0m0cgfl-gammaloop-nextest-binaries-core.drv'.
  216. 15.65 s Reason: 1 dependency failed.
  217. 15.65 s Output paths:
  218. 15.65 s /nix/store/xajgrvr3xlsx1k91dgcdd3y5ijp67jdi-gammaloop-nextest-binaries-core
  219. 19.96 s Downloaded cached gammaloop-crate-test-binaries-gammaloop-tracing-filter-macros-1b17e1ec025c6580-inputs (1.1 GiB) in 11.2s
  220. 25.27 s Downloaded cached gammaloop-crate-test-binaries-gammaloop-tracing-filter-31e37aec92971227-inputs (1.6 GiB) in 16.6s
  221. 33.60 s Downloaded cached gammaloop-crate-test-binaries-gammalooprs-247ff5d63201fb2c-inputs (2.3 GiB) in 21.4s
  222. 34.11 s Downloaded cached gammaloop-crate-test-dependencies-f0f952c3f8c3050c-inputs (2.3 GiB) in 21.9s
  223. 34.12 s Build failed due to failed dependency
  224. 34.17 s Build failed.