1. 0.24 s $ /nix/store/9ypz3flqsrl5xl495mm8h645gadjsxi1-coreutils-9.11/bin/timeout --kill-after=15s 7200s /nix/store/23zk8sgzamrbmj1fday15szf7f2279s8-nix-2.34.7/bin/nix --extra-experimental-features nix-command --extra-experimental-features flakes --log-format internal-json build --no-link --print-out-paths git+https://github.com/alphal00p/gammaloop?ref=raised_energy_cff_wip&rev=c8e7631734f65b7fae00ea28219fb7c871b6ed1e&shallow=1#packages.x86_64-linux.crate-test-binaries-three-dimensional-reps --print-build-logs
  2. 3.51 s
  3. 4.59 s Downloading cached gammaloop-ci-test-binary-dependencies-50150770f831b638-Cargo.toml from https://cache.nix-ci.com
  4. 4.63 s Building /nix/store/620cg4lxjsln105525v3nij0sy75ni31-gammaloop-ci-test-binary-dependencies-50150770f831b638-three-dimensional-reps-dev-dependency.toml.drv
  5. 4.64 s Downloaded cached gammaloop-ci-test-binary-dependencies-50150770f831b638-Cargo.toml (584 B) in 43ms
  6. 4.67 s Building /nix/store/jxvw34bgxdnn9bkva90k3g1kdb1h3z69-gammaloop-ci-test-dependencies-50150770f831b638-Cargo.toml.drv
  7. 4.86 s Building /nix/store/h5pxbw6p101nvpfz47d71mgr9cyf81gg-gammaloop-crate-test-dependencies-50150770f831b638-inputs.drv
  8. 4.86 s Progress: 0 of 8 built (3 building), 1 of 1 downloaded from cache
  9. 4.88 s [gammaloop-ci-test-binary-dependencies-50150770f831b638-three-dimensional-reps-dev-dependency.toml:post-build] Uploading to the NixCI cache: /nix/store/nkd9p6h639pp1ya2nb2yngjw7qb80nfg-gammaloop-ci-test-binary-dependencies-50150770f831b638-three-dimensional-reps-dev-dependency.toml
  10. 4.95 s [gammaloop-ci-test-binary-dependencies-50150770f831b638-three-dimensional-reps-dev-dependency.toml:post-build] warning: 'warn-short-path-literals' is deprecated, use 'lint-short-path-literals = ignore' instead
  11. 5.08 s [gammaloop-ci-test-binary-dependencies-50150770f831b638-three-dimensional-reps-dev-dependency.toml:post-build] copying 0 paths...
  12. 5.16 s [gammaloop-ci-test-binary-dependencies-50150770f831b638-three-dimensional-reps-dev-dependency.toml:post-build] warning: 'warn-short-path-literals' is deprecated, use 'lint-short-path-literals = ignore' instead
  13. 5.32 s [gammaloop-ci-test-binary-dependencies-50150770f831b638-three-dimensional-reps-dev-dependency.toml:post-build] copying 0 paths...
  14. 5.38 s Uploaded gammaloop-ci-test-binary-dependencies-50150770f831b638-three-dimensional-reps-dev-dependency.toml in 509ms
  15. 5.38 s Progress: 1 of 9 built (2 building), 1 of 1 downloaded from cache
  16. 5.38 s Built gammaloop-ci-test-binary-dependencies-50150770f831b638-three-dimensional-reps-dev-dependency.toml in 744ms
  17. 5.54 s [gammaloop-ci-test-dependencies-50150770f831b638-Cargo.toml:post-build] Uploading to the NixCI cache: /nix/store/l910djsa81d33bspw74vkisyvzi8c7k4-gammaloop-ci-test-dependencies-50150770f831b638-Cargo.toml
  18. 5.62 s [gammaloop-ci-test-dependencies-50150770f831b638-Cargo.toml:post-build] warning: 'warn-short-path-literals' is deprecated, use 'lint-short-path-literals = ignore' instead
  19. 5.76 s [gammaloop-ci-test-dependencies-50150770f831b638-Cargo.toml:post-build] copying 0 paths...
  20. 5.85 s [gammaloop-ci-test-dependencies-50150770f831b638-Cargo.toml:post-build] warning: 'warn-short-path-literals' is deprecated, use 'lint-short-path-literals = ignore' instead
  21. 6.02 s [gammaloop-ci-test-dependencies-50150770f831b638-Cargo.toml:post-build] copying 0 paths...
  22. 6.05 s Uploaded gammaloop-ci-test-dependencies-50150770f831b638-Cargo.toml in 525ms
  23. 6.05 s Progress: 2 of 10 built (1 building), 1 of 1 downloaded from cache
  24. 6.05 s Built gammaloop-ci-test-dependencies-50150770f831b638-Cargo.toml in 1.3s
  25. 11.41 s [gammaloop-crate-test-dependencies-50150770f831b638-inputs:post-build] Uploading to the NixCI cache: /nix/store/5gj697jm6yvaw1hf5bgq663azg3kafrr-gammaloop-crate-test-dependencies-50150770f831b638-inputs
  26. 11.49 s [gammaloop-crate-test-dependencies-50150770f831b638-inputs:post-build] warning: 'warn-short-path-literals' is deprecated, use 'lint-short-path-literals = ignore' instead
  27. 11.54 s [gammaloop-crate-test-dependencies-50150770f831b638-inputs:post-build] copying 1 paths...
  28. 11.54 s [gammaloop-crate-test-dependencies-50150770f831b638-inputs:post-build] copying path '/nix/store/5gj697jm6yvaw1hf5bgq663azg3kafrr-gammaloop-crate-test-dependencies-50150770f831b638-inputs' to 'https://cache.nix-ci.com'...
  29. 62.17 s [gammaloop-crate-test-dependencies-50150770f831b638-inputs:post-build] warning: 'warn-short-path-literals' is deprecated, use 'lint-short-path-literals = ignore' instead
  30. 62.59 s [gammaloop-crate-test-dependencies-50150770f831b638-inputs:post-build] copying 0 paths...
  31. 62.91 s Uploaded gammaloop-crate-test-dependencies-50150770f831b638-inputs in 51.5s
  32. 62.91 s Progress: 3 of 8 built, 1 of 1 downloaded from cache
  33. 62.91 s Built gammaloop-crate-test-dependencies-50150770f831b638-inputs in 58.0s
  34. 63.16 s Building /nix/store/d91n8zakpbd8vm1p2n97bswpx39i2na1-gammaloop-crate-test-binaries-three-dimensional-reps-50150770f831b638-inputs.drv
  35. 70.41 s [gammaloop-crate-test-binaries-three-dimensional-reps-50150770f831b638-inputs:post-build] Uploading to the NixCI cache: /nix/store/2ws3v62qqf2mmz5fp17kchi9n0k8vkxl-gammaloop-crate-test-binaries-three-dimensional-reps-50150770f831b638-inputs
  36. 70.85 s [gammaloop-crate-test-binaries-three-dimensional-reps-50150770f831b638-inputs:post-build] warning: 'warn-short-path-literals' is deprecated, use 'lint-short-path-literals = ignore' instead
  37. 70.93 s [gammaloop-crate-test-binaries-three-dimensional-reps-50150770f831b638-inputs:post-build] copying 0 paths...
  38. 71.73 s [gammaloop-crate-test-binaries-three-dimensional-reps-50150770f831b638-inputs:post-build] warning: 'warn-short-path-literals' is deprecated, use 'lint-short-path-literals = ignore' instead
  39. 72.09 s [gammaloop-crate-test-binaries-three-dimensional-reps-50150770f831b638-inputs:post-build] copying 0 paths...
  40. 72.40 s Uploaded gammaloop-crate-test-binaries-three-dimensional-reps-50150770f831b638-inputs in 2.1s
  41. 72.41 s Progress: 4 of 7 built, 1 of 1 downloaded from cache
  42. 72.41 s Built gammaloop-crate-test-binaries-three-dimensional-reps-50150770f831b638-inputs in 9.2s
  43. 72.53 s Building /nix/store/cv02k8axyaajy2wk22703viwwjkp6c9w-gammaloop-crate-test-binaries-three-dimensional-reps-50150770f831b638-deps-0.1.0.drv
  44. 72.75 s [gammaloop-crate-test-binaries-three-dimensional-reps-50150770f831b638-deps] Phase: unpackPhase
  45. 72.77 s [gammaloop-crate-test-binaries-three-dimensional-reps-50150770f831b638-deps] unpacking source archive /nix/store/cra0nlvfvsi0f5flhy40zq1fjvqjsqqk-source
  46. 72.81 s [gammaloop-crate-test-binaries-three-dimensional-reps-50150770f831b638-deps] source root is source
  47. 72.85 s [gammaloop-crate-test-binaries-three-dimensional-reps-50150770f831b638-deps] Phase: patchPhase
  48. 73.07 s [gammaloop-crate-test-binaries-three-dimensional-reps-50150770f831b638-deps] Executing configureCargoCommonVars
  49. 73.07 s [gammaloop-crate-test-binaries-three-dimensional-reps-50150770f831b638-deps] copying cargo artifacts from /nix/store/2ws3v62qqf2mmz5fp17kchi9n0k8vkxl-gammaloop-crate-test-binaries-three-dimensional-reps-50150770f831b638-inputs/target to target
  50. 73.07 s [gammaloop-crate-test-binaries-three-dimensional-reps-50150770f831b638-deps] will deep copy artifacts (instead of symlinking) as requested
  51. 74.46 s [gammaloop-crate-test-binaries-three-dimensional-reps-50150770f831b638-deps] Phase: updateAutotoolsGnuConfigScriptsPhase
  52. 74.58 s [gammaloop-crate-test-binaries-three-dimensional-reps-50150770f831b638-deps] Phase: configurePhase
  53. 74.67 s [gammaloop-crate-test-binaries-three-dimensional-reps-50150770f831b638-deps] will append /build/source/.cargo-home/config.toml with contents of /nix/store/1sigmg52bb61pfngmk9k8wq5fz9r7bf1-vendor-cargo-deps/config.toml
  54. 74.69 s [gammaloop-crate-test-binaries-three-dimensional-reps-50150770f831b638-deps] default configurePhase, nothing to do
  55. 74.70 s [gammaloop-crate-test-binaries-three-dimensional-reps-50150770f831b638-deps] Phase: buildPhase
  56. 74.74 s [gammaloop-crate-test-binaries-three-dimensional-reps-50150770f831b638-deps] +++ command cargo --version
  57. 74.75 s [gammaloop-crate-test-binaries-three-dimensional-reps-50150770f831b638-deps] cargo 1.97.0 (c980f4866 2026-06-30)
  58. 74.77 s [gammaloop-crate-test-binaries-three-dimensional-reps-50150770f831b638-deps] +++ command cargo test --profile ci-optim --no-run --offline -p three-dimensional-reps --features three-dimensional-reps/serde
  59. 75.83 s [gammaloop-crate-test-binaries-three-dimensional-reps-50150770f831b638-deps] Compiling three-dimensional-reps v0.1.0 (/build/source/crates/three-dimensional-reps)
  60. 76.20 s [gammaloop-crate-test-binaries-three-dimensional-reps-50150770f831b638-deps] error[E0433]: cannot find `eval` in `crate`
  61. 76.20 s [gammaloop-crate-test-binaries-three-dimensional-reps-50150770f831b638-deps] --> crates/three-dimensional-reps/src/generation.rs:6540:28
  62. 76.20 s [gammaloop-crate-test-binaries-three-dimensional-reps-50150770f831b638-deps] |
  63. 76.20 s [gammaloop-crate-test-binaries-three-dimensional-reps-50150770f831b638-deps] 6540 | let input = crate::eval::EvaluationInput {
  64. 76.20 s [gammaloop-crate-test-binaries-three-dimensional-reps-50150770f831b638-deps] | ^^^^ could not find `eval` in the crate root
  65. 76.20 s [gammaloop-crate-test-binaries-three-dimensional-reps-50150770f831b638-deps] |
  66. 76.20 s [gammaloop-crate-test-binaries-three-dimensional-reps-50150770f831b638-deps] note: found an item that was configured out
  67. 76.20 s [gammaloop-crate-test-binaries-three-dimensional-reps-50150770f831b638-deps] --> crates/three-dimensional-reps/src/lib.rs:7:9
  68. 76.20 s [gammaloop-crate-test-binaries-three-dimensional-reps-50150770f831b638-deps] |
  69. 76.20 s [gammaloop-crate-test-binaries-three-dimensional-reps-50150770f831b638-deps] 6 | #[cfg(feature = "eval")]
  70. 76.20 s [gammaloop-crate-test-binaries-three-dimensional-reps-50150770f831b638-deps] | ---------------- the item is gated behind the `eval` feature
  71. 76.20 s [gammaloop-crate-test-binaries-three-dimensional-reps-50150770f831b638-deps] 7 | pub mod eval;
  72. 76.20 s [gammaloop-crate-test-binaries-three-dimensional-reps-50150770f831b638-deps] | ^^^^
  73. 76.20 s [gammaloop-crate-test-binaries-three-dimensional-reps-50150770f831b638-deps]
  74. 76.21 s [gammaloop-crate-test-binaries-three-dimensional-reps-50150770f831b638-deps] error[E0433]: cannot find `eval` in `crate`
  75. 76.21 s [gammaloop-crate-test-binaries-three-dimensional-reps-50150770f831b638-deps] --> crates/three-dimensional-reps/src/generation.rs:6547:30
  76. 76.21 s [gammaloop-crate-test-binaries-three-dimensional-reps-50150770f831b638-deps] |
  77. 76.22 s [gammaloop-crate-test-binaries-three-dimensional-reps-50150770f831b638-deps] 6547 | let contact = crate::eval::evaluate_expression(
  78. 76.22 s [gammaloop-crate-test-binaries-three-dimensional-reps-50150770f831b638-deps] | ^^^^ could not find `eval` in the crate root
  79. 76.22 s [gammaloop-crate-test-binaries-three-dimensional-reps-50150770f831b638-deps] |
  80. 76.22 s [gammaloop-crate-test-binaries-three-dimensional-reps-50150770f831b638-deps] note: found an item that was configured out
  81. 76.22 s [gammaloop-crate-test-binaries-three-dimensional-reps-50150770f831b638-deps] --> crates/three-dimensional-reps/src/lib.rs:7:9
  82. 76.22 s [gammaloop-crate-test-binaries-three-dimensional-reps-50150770f831b638-deps] |
  83. 76.22 s [gammaloop-crate-test-binaries-three-dimensional-reps-50150770f831b638-deps] 6 | #[cfg(feature = "eval")]
  84. 76.22 s [gammaloop-crate-test-binaries-three-dimensional-reps-50150770f831b638-deps] | ---------------- the item is gated behind the `eval` feature
  85. 76.22 s [gammaloop-crate-test-binaries-three-dimensional-reps-50150770f831b638-deps] 7 | pub mod eval;
  86. 76.22 s [gammaloop-crate-test-binaries-three-dimensional-reps-50150770f831b638-deps] | ^^^^
  87. 76.22 s [gammaloop-crate-test-binaries-three-dimensional-reps-50150770f831b638-deps]
  88. 76.23 s [gammaloop-crate-test-binaries-three-dimensional-reps-50150770f831b638-deps] error[E0433]: cannot find `eval` in `crate`
  89. 76.23 s [gammaloop-crate-test-binaries-three-dimensional-reps-50150770f831b638-deps] --> crates/three-dimensional-reps/src/generation.rs:6555:32
  90. 76.23 s [gammaloop-crate-test-binaries-three-dimensional-reps-50150770f831b638-deps] |
  91. 76.23 s [gammaloop-crate-test-binaries-three-dimensional-reps-50150770f831b638-deps] 6555 | let remainder = crate::eval::evaluate_expression(
  92. 76.23 s [gammaloop-crate-test-binaries-three-dimensional-reps-50150770f831b638-deps] | ^^^^ could not find `eval` in the crate root
  93. 76.23 s [gammaloop-crate-test-binaries-three-dimensional-reps-50150770f831b638-deps] |
  94. 76.23 s [gammaloop-crate-test-binaries-three-dimensional-reps-50150770f831b638-deps] note: found an item that was configured out
  95. 76.23 s [gammaloop-crate-test-binaries-three-dimensional-reps-50150770f831b638-deps] --> crates/three-dimensional-reps/src/lib.rs:7:9
  96. 76.23 s [gammaloop-crate-test-binaries-three-dimensional-reps-50150770f831b638-deps] |
  97. 76.23 s [gammaloop-crate-test-binaries-three-dimensional-reps-50150770f831b638-deps] 6 | #[cfg(feature = "eval")]
  98. 76.23 s [gammaloop-crate-test-binaries-three-dimensional-reps-50150770f831b638-deps] | ---------------- the item is gated behind the `eval` feature
  99. 76.23 s [gammaloop-crate-test-binaries-three-dimensional-reps-50150770f831b638-deps] 7 | pub mod eval;
  100. 76.23 s [gammaloop-crate-test-binaries-three-dimensional-reps-50150770f831b638-deps] | ^^^^
  101. 76.23 s [gammaloop-crate-test-binaries-three-dimensional-reps-50150770f831b638-deps]
  102. 76.24 s [gammaloop-crate-test-binaries-three-dimensional-reps-50150770f831b638-deps] error[E0433]: cannot find `eval` in `crate`
  103. 76.24 s [gammaloop-crate-test-binaries-three-dimensional-reps-50150770f831b638-deps] --> crates/three-dimensional-reps/src/generation.rs:6563:28
  104. 76.24 s [gammaloop-crate-test-binaries-three-dimensional-reps-50150770f831b638-deps] |
  105. 76.24 s [gammaloop-crate-test-binaries-three-dimensional-reps-50150770f831b638-deps] 6563 | let total = crate::eval::evaluate_expression(&powered, &expression, numerator, &input)
  106. 76.24 s [gammaloop-crate-test-binaries-three-dimensional-reps-50150770f831b638-deps] | ^^^^ could not find `eval` in the crate root
  107. 76.24 s [gammaloop-crate-test-binaries-three-dimensional-reps-50150770f831b638-deps] |
  108. 76.24 s [gammaloop-crate-test-binaries-three-dimensional-reps-50150770f831b638-deps] note: found an item that was configured out
  109. 76.24 s [gammaloop-crate-test-binaries-three-dimensional-reps-50150770f831b638-deps] --> crates/three-dimensional-reps/src/lib.rs:7:9
  110. 76.24 s [gammaloop-crate-test-binaries-three-dimensional-reps-50150770f831b638-deps] |
  111. 76.24 s [gammaloop-crate-test-binaries-three-dimensional-reps-50150770f831b638-deps] 6 | #[cfg(feature = "eval")]
  112. 76.24 s [gammaloop-crate-test-binaries-three-dimensional-reps-50150770f831b638-deps] | ---------------- the item is gated behind the `eval` feature
  113. 76.24 s [gammaloop-crate-test-binaries-three-dimensional-reps-50150770f831b638-deps] 7 | pub mod eval;
  114. 76.24 s [gammaloop-crate-test-binaries-three-dimensional-reps-50150770f831b638-deps] | ^^^^
  115. 76.24 s [gammaloop-crate-test-binaries-three-dimensional-reps-50150770f831b638-deps]
  116. 78.87 s [gammaloop-crate-test-binaries-three-dimensional-reps-50150770f831b638-deps] For more information about this error, try `rustc --explain E0433`.
  117. 78.90 s [gammaloop-crate-test-binaries-three-dimensional-reps-50150770f831b638-deps] error: could not compile `three-dimensional-reps` (lib test) due to 4 previous errors
  118. 79.47 s Progress: 4 of 6 built (1 failed), 1 of 1 downloaded from cache
  119. 79.47 s Failed to build gammaloop-crate-test-binaries-three-dimensional-reps-50150770f831b638-deps after 6.9s
  120. 79.47 s error: Cannot build '/nix/store/cv02k8axyaajy2wk22703viwwjkp6c9w-gammaloop-crate-test-binaries-three-dimensional-reps-50150770f831b638-deps-0.1.0.drv'.
  121. 79.47 s Reason: builder failed with exit code 101.
  122. 79.47 s Output paths:
  123. 79.47 s /nix/store/9c503a8m7ppz249bcgxs70380i2rli5i-gammaloop-crate-test-binaries-three-dimensional-reps-50150770f831b638-deps-0.1.0
  124. 79.47 s Last 74 log lines:
  125. 79.47 s > Running phase: unpackPhase
  126. 79.47 s > unpacking source archive /nix/store/cra0nlvfvsi0f5flhy40zq1fjvqjsqqk-source
  127. 79.47 s > source root is source
  128. 79.47 s > Running phase: patchPhase
  129. 79.47 s > Executing configureCargoCommonVars
  130. 79.47 s > copying cargo artifacts from /nix/store/2ws3v62qqf2mmz5fp17kchi9n0k8vkxl-gammaloop-crate-test-binaries-three-dimensional-reps-50150770f831b638-inputs/target to target
  131. 79.47 s > will deep copy artifacts (instead of symlinking) as requested
  132. 79.47 s > Running phase: updateAutotoolsGnuConfigScriptsPhase
  133. 79.47 s > Running phase: configurePhase
  134. 79.47 s > will append /build/source/.cargo-home/config.toml with contents of /nix/store/1sigmg52bb61pfngmk9k8wq5fz9r7bf1-vendor-cargo-deps/config.toml
  135. 79.47 s > default configurePhase, nothing to do
  136. 79.47 s > Running phase: buildPhase
  137. 79.47 s > +++ command cargo --version
  138. 79.47 s > cargo 1.97.0 (c980f4866 2026-06-30)
  139. 79.47 s > +++ command cargo test --profile ci-optim --no-run --offline -p three-dimensional-reps --features three-dimensional-reps/serde
  140. 79.47 s > Compiling three-dimensional-reps v0.1.0 (/build/source/crates/three-dimensional-reps)
  141. 79.47 s > error[E0433]: cannot find `eval` in `crate`
  142. 79.47 s > --> crates/three-dimensional-reps/src/generation.rs:6540:28
  143. 79.47 s > |
  144. 79.47 s > 6540 | let input = crate::eval::EvaluationInput {
  145. 79.47 s > | ^^^^ could not find `eval` in the crate root
  146. 79.47 s > |
  147. 79.47 s > note: found an item that was configured out
  148. 79.47 s > --> crates/three-dimensional-reps/src/lib.rs:7:9
  149. 79.47 s > |
  150. 79.47 s > 6 | #[cfg(feature = "eval")]
  151. 79.47 s > | ---------------- the item is gated behind the `eval` feature
  152. 79.47 s > 7 | pub mod eval;
  153. 79.47 s > | ^^^^
  154. 79.47 s >
  155. 79.47 s > error[E0433]: cannot find `eval` in `crate`
  156. 79.47 s > --> crates/three-dimensional-reps/src/generation.rs:6547:30
  157. 79.47 s > |
  158. 79.47 s > 6547 | let contact = crate::eval::evaluate_expression(
  159. 79.47 s > | ^^^^ could not find `eval` in the crate root
  160. 79.47 s > |
  161. 79.47 s > note: found an item that was configured out
  162. 79.47 s > --> crates/three-dimensional-reps/src/lib.rs:7:9
  163. 79.47 s > |
  164. 79.47 s > 6 | #[cfg(feature = "eval")]
  165. 79.47 s > | ---------------- the item is gated behind the `eval` feature
  166. 79.47 s > 7 | pub mod eval;
  167. 79.47 s > | ^^^^
  168. 79.47 s >
  169. 79.47 s > error[E0433]: cannot find `eval` in `crate`
  170. 79.47 s > --> crates/three-dimensional-reps/src/generation.rs:6555:32
  171. 79.47 s > |
  172. 79.47 s > 6555 | let remainder = crate::eval::evaluate_expression(
  173. 79.47 s > | ^^^^ could not find `eval` in the crate root
  174. 79.47 s > |
  175. 79.47 s > note: found an item that was configured out
  176. 79.47 s > --> crates/three-dimensional-reps/src/lib.rs:7:9
  177. 79.47 s > |
  178. 79.47 s > 6 | #[cfg(feature = "eval")]
  179. 79.47 s > | ---------------- the item is gated behind the `eval` feature
  180. 79.47 s > 7 | pub mod eval;
  181. 79.47 s > | ^^^^
  182. 79.47 s >
  183. 79.47 s > error[E0433]: cannot find `eval` in `crate`
  184. 79.47 s > --> crates/three-dimensional-reps/src/generation.rs:6563:28
  185. 79.47 s > |
  186. 79.47 s > 6563 | let total = crate::eval::evaluate_expression(&powered, &expression, numerator, &input)
  187. 79.47 s > | ^^^^ could not find `eval` in the crate root
  188. 79.47 s > |
  189. 79.47 s > note: found an item that was configured out
  190. 79.47 s > --> crates/three-dimensional-reps/src/lib.rs:7:9
  191. 79.47 s > |
  192. 79.47 s > 6 | #[cfg(feature = "eval")]
  193. 79.47 s > | ---------------- the item is gated behind the `eval` feature
  194. 79.47 s > 7 | pub mod eval;
  195. 79.47 s > | ^^^^
  196. 79.47 s >
  197. 79.47 s > For more information about this error, try `rustc --explain E0433`.
  198. 79.47 s > error: could not compile `three-dimensional-reps` (lib test) due to 4 previous errors
  199. 79.47 s For full logs, run:
  200. 79.47 s nix log /nix/store/cv02k8axyaajy2wk22703viwwjkp6c9w-gammaloop-crate-test-binaries-three-dimensional-reps-50150770f831b638-deps-0.1.0.drv
  201. 79.47 s error: Cannot build '/nix/store/ckziyrv6v1c0n9hwfs12zk6q6lq2lzvl-nix-ci-artifact-barrier-crate-test-binaries-three-dimensional-reps.drv'.
  202. 79.47 s Reason: 1 dependency failed.
  203. 79.47 s Output paths:
  204. 79.47 s /nix/store/ns880drc47fzrjr4v831krv3v27kphvm-nix-ci-artifact-barrier-crate-test-binaries-three-dimensional-reps
  205. 79.50 s Build failed due to failed dependency
  206. 79.63 s Build failed.