0.00 s
$ /nix/store/9ypz3flqsrl5xl495mm8h645gadjsxi1-coreutils-9.11/bin/timeout --kill-after=15s 7200s /nix/store/23zk8sgzamrbmj1fday15szf7f2279s8-nix-2.34.7/bin/nix --extra-experimental-features nix-command --extra-experimental-features flakes flake clone git+https://github.com/alphal00p/gammaloop --dest /tmp/nix-ci-worker/stable-pwd/repo/
0.06 s
Cloning into '/tmp/nix-ci-worker/stable-pwd/repo'...
0.80 s
remote: Enumerating objects: 78063, done.
0.91 s
remote: Counting objects: 0% (1/13885)
remote: Counting objects: 1% (139/13885)
remote: Counting objects: 2% (278/13885)
remote: Counting objects: 3% (417/13885)
remote: Counting objects: 4% (556/13885)
remote: Counting objects: 5% (695/13885)
remote: Counting objects: 6% (834/13885)
remote: Counting objects: 7% (972/13885)
remote: Counting objects: 8% (1111/13885)
remote: Counting objects: 9% (1250/13885)
remote: Counting objects: 10% (1389/13885)
remote: Counting objects: 11% (1528/13885)
remote: Counting objects: 12% (1667/13885)
remote: Counting objects: 13% (1806/13885)
remote: Counting objects: 14% (1944/13885)
remote: Counting objects: 15% (2083/13885)
remote: Counting objects: 16% (2222/13885)
remote: Counting objects: 17% (2361/13885)
remote: Counting objects: 18% (2500/13885)
remote: Counting objects: 19% (2639/13885)
remote: Counting objects: 20% (2777/13885)
remote: Counting objects: 21% (2916/13885)
remote: Counting objects: 22% (3055/13885)
remote: Counting objects: 23% (3194/13885)
remote: Counting objects: 24% (3333/13885)
remote: Counting objects: 25% (3472/13885)
remote: Counting objects: 26% (3611/13885)
remote: Counting objects: 27% (3749/13885)
remote: Counting objects: 28% (3888/13885)
remote: Counting objects: 29% (4027/13885)
remote: Counting objects: 30% (4166/13885)
remote: Counting objects: 31% (4305/13885)
remote: Counting objects: 32% (4444/13885)
remote: Counting objects: 33% (4583/13885)
remote: Counting objects: 34% (4721/13885)
remote: Counting objects: 35% (4860/13885)
remote: Counting objects: 36% (4999/13885)
remote: Counting objects: 37% (5138/13885)
remote: Counting objects: 38% (5277/13885)
remote: Counting objects: 39% (5416/13885)
remote: Counting objects: 40% (5554/13885)
remote: Counting objects: 41% (5693/13885)
remote: Counting objects: 42% (5832/13885)
remote: Counting objects: 43% (5971/13885)
remote: Counting objects: 44% (6110/13885)
remote: Counting objects: 45% (6249/13885)
remote: Counting objects: 46% (6388/13885)
remote: Counting objects: 47% (6526/13885)
remote: Counting objects: 48% (6665/13885)
remote: Counting objects: 49% (6804/13885)
remote: Counting objects: 50% (6943/13885)
remote: Counting objects: 51% (7082/13885)
remote: Counting objects: 52% (7221/13885)
remote: Counting objects: 53% (7360/13885)
remote: Counting objects: 54% (7498/13885)
remote: Counting objects: 55% (7637/13885)
remote: Counting objects: 56% (7776/13885)
remote: Counting objects: 57% (7915/13885)
remote: Counting objects: 58% (8054/13885)
remote: Counting objects: 59% (8193/13885)
remote: Counting objects: 60% (8331/13885)
remote: Counting objects: 61% (8470/13885)
remote: Counting objects: 62% (8609/13885)
remote: Counting objects: 63% (8748/13885)
remote: Counting objects: 64% (8887/13885)
remote: Counting objects: 65% (9026/13885)
remote: Counting objects: 66% (9165/13885)
remote: Counting objects: 67% (9303/13885)
remote: Counting objects: 68% (9442/13885)
remote: Counting objects: 69% (9581/13885)
remote: Counting objects: 70% (9720/13885)
remote: Counting objects: 71% (9859/13885)
remote: Counting objects: 72% (9998/13885)
remote: Counting objects: 73% (10137/13885)
remote: Counting objects: 74% (10275/13885)
remote: Counting objects: 75% (10414/13885)
remote: Counting objects: 76% (10553/13885)
remote: Counting objects: 77% (10692/13885)
remote: Counting objects: 78% (10831/13885)
remote: Counting objects: 79% (10970/13885)
remote: Counting objects: 80% (11108/13885)
remote: Counting objects: 81% (11247/13885)
remote: Counting objects: 82% (11386/13885)
remote: Counting objects: 83% (11525/13885)
remote: Counting objects: 84% (11664/13885)
remote: Counting objects: 85% (11803/13885)
remote: Counting objects: 86% (11942/13885)
remote: Counting objects: 87% (12080/13885)
remote: Counting objects: 88% (12219/13885)
remote: Counting objects: 89% (12358/13885)
remote: Counting objects: 90% (12497/13885)
remote: Counting objects: 91% (12636/13885)
remote: Counting objects: 92% (12775/13885)
remote: Counting objects: 93% (12914/13885)
remote: Counting objects: 94% (13052/13885)
remote: Counting objects: 95% (13191/13885)
remote: Counting objects: 96% (13330/13885)
remote: Counting objects: 97% (13469/13885)
remote: Counting objects: 98% (13608/13885)
remote: Counting objects: 99% (13747/13885)
remote: Counting objects: 100% (13885/13885)
remote: Counting objects: 100% (13885/13885), done.
3.67 s
remote: Compressing objects: 0% (1/3075)
remote: Compressing objects: 1% (31/3075)
remote: Compressing objects: 2% (62/3075)
remote: Compressing objects: 3% (93/3075)
remote: Compressing objects: 4% (123/3075)
remote: Compressing objects: 5% (154/3075)
remote: Compressing objects: 6% (185/3075)
remote: Compressing objects: 7% (216/3075)
remote: Compressing objects: 8% (246/3075)
remote: Compressing objects: 9% (277/3075)
remote: Compressing objects: 10% (308/3075)
remote: Compressing objects: 11% (339/3075)
remote: Compressing objects: 12% (369/3075)
remote: Compressing objects: 13% (400/3075)
remote: Compressing objects: 14% (431/3075)
remote: Compressing objects: 15% (462/3075)
remote: Compressing objects: 16% (492/3075)
remote: Compressing objects: 17% (523/3075)
remote: Compressing objects: 18% (554/3075)
remote: Compressing objects: 19% (585/3075)
remote: Compressing objects: 20% (615/3075)
remote: Compressing objects: 21% (646/3075)
remote: Compressing objects: 22% (677/3075)
remote: Compressing objects: 23% (708/3075)
remote: Compressing objects: 24% (738/3075)
remote: Compressing objects: 24% (767/3075)
remote: Compressing objects: 25% (769/3075)
remote: Compressing objects: 26% (800/3075)
remote: Compressing objects: 27% (831/3075)
remote: Compressing objects: 28% (861/3075)
remote: Compressing objects: 28% (880/3075)
remote: Compressing objects: 29% (892/3075)
remote: Compressing objects: 30% (923/3075)
remote: Compressing objects: 31% (954/3075)
remote: Compressing objects: 32% (984/3075)
remote: Compressing objects: 33% (1015/3075)
remote: Compressing objects: 34% (1046/3075)
remote: Compressing objects: 35% (1077/3075)
remote: Compressing objects: 36% (1107/3075)
remote: Compressing objects: 37% (1138/3075)
remote: Compressing objects: 38% (1169/3075)
remote: Compressing objects: 39% (1200/3075)
remote: Compressing objects: 40% (1230/3075)
remote: Compressing objects: 41% (1261/3075)
remote: Compressing objects: 42% (1292/3075)
remote: Compressing objects: 43% (1323/3075)
remote: Compressing objects: 44% (1353/3075)
remote: Compressing objects: 45% (1384/3075)
remote: Compressing objects: 46% (1415/3075)
remote: Compressing objects: 47% (1446/3075)
remote: Compressing objects: 48% (1476/3075)
remote: Compressing objects: 49% (1507/3075)
remote: Compressing objects: 50% (1538/3075)
remote: Compressing objects: 51% (1569/3075)
remote: Compressing objects: 52% (1599/3075)
remote: Compressing objects: 53% (1630/3075)
remote: Compressing objects: 54% (1661/3075)
remote: Compressing objects: 55% (1692/3075)
remote: Compressing objects: 56% (1722/3075)
remote: Compressing objects: 57% (1753/3075)
remote: Compressing objects: 58% (1784/3075)
remote: Compressing objects: 59% (1815/3075)
remote: Compressing objects: 60% (1845/3075)
remote: Compressing objects: 61% (1876/3075)
remote: Compressing objects: 62% (1907/3075)
remote: Compressing objects: 63% (1938/3075)
remote: Compressing objects: 64% (1968/3075)
remote: Compressing objects: 65% (1999/3075)
remote: Compressing objects: 66% (2030/3075)
remote: Compressing objects: 67% (2061/3075)
remote: Compressing objects: 68% (2091/3075)
remote: Compressing objects: 69% (2122/3075)
remote: Compressing objects: 70% (2153/3075)
remote: Compressing objects: 71% (2184/3075)
remote: Compressing objects: 72% (2214/3075)
remote: Compressing objects: 73% (2245/3075)
remote: Compressing objects: 74% (2276/3075)
remote: Compressing objects: 75% (2307/3075)
remote: Compressing objects: 76% (2337/3075)
remote: Compressing objects: 77% (2368/3075)
remote: Compressing objects: 78% (2399/3075)
remote: Compressing objects: 79% (2430/3075)
remote: Compressing objects: 80% (2460/3075)
remote: Compressing objects: 81% (2491/3075)
remote: Compressing objects: 82% (2522/3075)
remote: Compressing objects: 83% (2553/3075)
remote: Compressing objects: 84% (2583/3075)
remote: Compressing objects: 85% (2614/3075)
remote: Compressing objects: 86% (2645/3075)
remote: Compressing objects: 87% (2676/3075)
remote: Compressing objects: 88% (2706/3075)
remote: Compressing objects: 89% (2737/3075)
remote: Compressing objects: 90% (2768/3075)
remote: Compressing objects: 91% (2799/3075)
remote: Compressing objects: 92% (2829/3075)
remote: Compressing objects: 93% (2860/3075)
remote: Compressing objects: 94% (2891/3075)
remote: Compressing objects: 95% (2922/3075)
remote: Compressing objects: 96% (2952/3075)
remote: Compressing objects: 97% (2983/3075)
remote: Compressing objects: 98% (3014/3075)
remote: Compressing objects: 99% (3045/3075)
remote: Compressing objects: 100% (3075/3075)
remote: Compressing objects: 100% (3075/3075), done.
7.39 s
Receiving objects: 0% (1/78063)
Receiving objects: 1% (781/78063)
Receiving objects: 2% (1562/78063)
Receiving objects: 3% (2342/78063)
Receiving objects: 4% (3123/78063)
Receiving objects: 5% (3904/78063)
Receiving objects: 6% (4684/78063)
Receiving objects: 7% (5465/78063)
Receiving objects: 8% (6246/78063)
Receiving objects: 9% (7026/78063)
Receiving objects: 10% (7807/78063), 12.40 MiB | 24.79 MiB/s
Receiving objects: 11% (8587/78063), 12.40 MiB | 24.79 MiB/s
Receiving objects: 12% (9368/78063), 12.40 MiB | 24.79 MiB/s
Receiving objects: 13% (10149/78063), 12.40 MiB | 24.79 MiB/s
Receiving objects: 14% (10929/78063), 12.40 MiB | 24.79 MiB/s
Receiving objects: 15% (11710/78063), 12.40 MiB | 24.79 MiB/s
Receiving objects: 16% (12491/78063), 12.40 MiB | 24.79 MiB/s
Receiving objects: 17% (13271/78063), 12.40 MiB | 24.79 MiB/s
Receiving objects: 18% (14052/78063), 12.40 MiB | 24.79 MiB/s
Receiving objects: 19% (14832/78063), 12.40 MiB | 24.79 MiB/s
Receiving objects: 20% (15613/78063), 12.40 MiB | 24.79 MiB/s
Receiving objects: 21% (16394/78063), 12.40 MiB | 24.79 MiB/s
Receiving objects: 22% (17174/78063), 12.40 MiB | 24.79 MiB/s
Receiving objects: 23% (17955/78063), 12.40 MiB | 24.79 MiB/s
Receiving objects: 24% (18736/78063), 12.40 MiB | 24.79 MiB/s
Receiving objects: 25% (19516/78063), 12.40 MiB | 24.79 MiB/s
Receiving objects: 26% (20297/78063), 12.40 MiB | 24.79 MiB/s
Receiving objects: 27% (21078/78063), 12.40 MiB | 24.79 MiB/s
Receiving objects: 28% (21858/78063), 12.40 MiB | 24.79 MiB/s
Receiving objects: 29% (22639/78063), 12.40 MiB | 24.79 MiB/s
Receiving objects: 30% (23419/78063), 12.40 MiB | 24.79 MiB/s
Receiving objects: 31% (24200/78063), 12.40 MiB | 24.79 MiB/s
Receiving objects: 32% (24981/78063), 12.40 MiB | 24.79 MiB/s
Receiving objects: 33% (25761/78063), 12.40 MiB | 24.79 MiB/s
Receiving objects: 34% (26542/78063), 12.40 MiB | 24.79 MiB/s
Receiving objects: 35% (27323/78063), 12.40 MiB | 24.79 MiB/s
Receiving objects: 36% (28103/78063), 12.40 MiB | 24.79 MiB/s
Receiving objects: 37% (28884/78063), 12.40 MiB | 24.79 MiB/s
Receiving objects: 38% (29664/78063), 12.40 MiB | 24.79 MiB/s
Receiving objects: 39% (30445/78063), 12.40 MiB | 24.79 MiB/s
Receiving objects: 40% (31226/78063), 12.40 MiB | 24.79 MiB/s
Receiving objects: 41% (32006/78063), 12.40 MiB | 24.79 MiB/s
Receiving objects: 41% (32753/78063), 30.28 MiB | 30.27 MiB/s
Receiving objects: 42% (32787/78063), 30.28 MiB | 30.27 MiB/s
Receiving objects: 43% (33568/78063), 30.28 MiB | 30.27 MiB/s
Receiving objects: 44% (34348/78063), 30.28 MiB | 30.27 MiB/s
Receiving objects: 45% (35129/78063), 30.28 MiB | 30.27 MiB/s
Receiving objects: 46% (35909/78063), 30.28 MiB | 30.27 MiB/s
Receiving objects: 47% (36690/78063), 30.28 MiB | 30.27 MiB/s
Receiving objects: 48% (37471/78063), 30.28 MiB | 30.27 MiB/s
Receiving objects: 49% (38251/78063), 30.28 MiB | 30.27 MiB/s
Receiving objects: 50% (39032/78063), 30.28 MiB | 30.27 MiB/s
Receiving objects: 51% (39813/78063), 30.28 MiB | 30.27 MiB/s
Receiving objects: 52% (40593/78063), 47.21 MiB | 31.40 MiB/s
Receiving objects: 53% (41374/78063), 47.21 MiB | 31.40 MiB/s
Receiving objects: 54% (42155/78063), 47.21 MiB | 31.40 MiB/s
Receiving objects: 55% (42935/78063), 47.21 MiB | 31.40 MiB/s
Receiving objects: 56% (43716/78063), 47.21 MiB | 31.40 MiB/s
Receiving objects: 57% (44496/78063), 47.21 MiB | 31.40 MiB/s
Receiving objects: 58% (45277/78063), 47.21 MiB | 31.40 MiB/s
Receiving objects: 59% (46058/78063), 47.21 MiB | 31.40 MiB/s
Receiving objects: 60% (46838/78063), 47.21 MiB | 31.40 MiB/s
Receiving objects: 61% (47619/78063), 47.21 MiB | 31.40 MiB/s
Receiving objects: 62% (48400/78063), 47.21 MiB | 31.40 MiB/s
Receiving objects: 62% (48916/78063), 64.20 MiB | 31.72 MiB/s
Receiving objects: 63% (49180/78063), 64.20 MiB | 31.72 MiB/s
Receiving objects: 64% (49961/78063), 64.20 MiB | 31.72 MiB/s
Receiving objects: 65% (50741/78063), 64.20 MiB | 31.72 MiB/s
Receiving objects: 66% (51522/78063), 64.20 MiB | 31.72 MiB/s
Receiving objects: 67% (52303/78063), 64.20 MiB | 31.72 MiB/s
Receiving objects: 68% (53083/78063), 64.20 MiB | 31.72 MiB/s
Receiving objects: 69% (53864/78063), 64.20 MiB | 31.72 MiB/s
Receiving objects: 70% (54645/78063), 64.20 MiB | 31.72 MiB/s
Receiving objects: 71% (55425/78063), 64.20 MiB | 31.72 MiB/s
Receiving objects: 72% (56206/78063), 64.20 MiB | 31.72 MiB/s
Receiving objects: 73% (56986/78063), 64.20 MiB | 31.72 MiB/s
Receiving objects: 74% (57767/78063), 81.79 MiB | 32.27 MiB/s
Receiving objects: 75% (58548/78063), 81.79 MiB | 32.27 MiB/s
Receiving objects: 76% (59328/78063), 81.79 MiB | 32.27 MiB/s
Receiving objects: 77% (60109/78063), 81.79 MiB | 32.27 MiB/s
Receiving objects: 78% (60890/78063), 81.79 MiB | 32.27 MiB/s
Receiving objects: 79% (61670/78063), 81.79 MiB | 32.27 MiB/s
Receiving objects: 80% (62451/78063), 81.79 MiB | 32.27 MiB/s
Receiving objects: 80% (62647/78063), 98.71 MiB | 32.39 MiB/s
Receiving objects: 81% (63232/78063), 98.71 MiB | 32.39 MiB/s
Receiving objects: 82% (64012/78063), 98.71 MiB | 32.39 MiB/s
Receiving objects: 83% (64793/78063), 98.71 MiB | 32.39 MiB/s
Receiving objects: 84% (65573/78063), 98.71 MiB | 32.39 MiB/s
Receiving objects: 85% (66354/78063), 98.71 MiB | 32.39 MiB/s
Receiving objects: 86% (67135/78063), 98.71 MiB | 32.39 MiB/s
Receiving objects: 87% (67915/78063), 98.71 MiB | 32.39 MiB/s
Receiving objects: 88% (68696/78063), 98.71 MiB | 32.39 MiB/s
Receiving objects: 89% (69477/78063), 98.71 MiB | 32.39 MiB/s
Receiving objects: 90% (70257/78063), 98.71 MiB | 32.39 MiB/s
Receiving objects: 91% (71038/78063), 98.71 MiB | 32.39 MiB/s
Receiving objects: 92% (71818/78063), 98.71 MiB | 32.39 MiB/s
Receiving objects: 93% (72599/78063), 98.71 MiB | 32.39 MiB/s
Receiving objects: 94% (73380/78063), 115.71 MiB | 32.62 MiB/s
Receiving objects: 95% (74160/78063), 115.71 MiB | 32.62 MiB/s
Receiving objects: 96% (74941/78063), 115.71 MiB | 32.62 MiB/s
Receiving objects: 97% (75722/78063), 115.71 MiB | 32.62 MiB/s
Receiving objects: 98% (76502/78063), 115.71 MiB | 32.62 MiB/s
Receiving objects: 99% (77283/78063), 115.71 MiB | 32.62 MiB/s
remote: Total 78063 (delta 9791), reused 11665 (delta 8714), pack-reused 64178 (from 2)
7.39 s
Receiving objects: 100% (78063/78063), 115.71 MiB | 32.62 MiB/s
Receiving objects: 100% (78063/78063), 120.77 MiB | 32.67 MiB/s, done.
8.17 s
Resolving deltas: 0% (0/53110)
Resolving deltas: 1% (532/53110)
Resolving deltas: 2% (1063/53110)
Resolving deltas: 3% (1594/53110)
Resolving deltas: 4% (2125/53110)
Resolving deltas: 5% (2656/53110)
Resolving deltas: 6% (3190/53110)
Resolving deltas: 7% (3720/53110)
Resolving deltas: 8% (4249/53110)
Resolving deltas: 9% (4780/53110)
Resolving deltas: 10% (5311/53110)
Resolving deltas: 11% (5844/53110)
Resolving deltas: 12% (6375/53110)
Resolving deltas: 13% (6905/53110)
Resolving deltas: 14% (7436/53110)
Resolving deltas: 15% (7967/53110)
Resolving deltas: 16% (8498/53110)
Resolving deltas: 17% (9029/53110)
Resolving deltas: 18% (9560/53110)
Resolving deltas: 19% (10091/53110)
Resolving deltas: 20% (10622/53110)
Resolving deltas: 21% (11155/53110)
Resolving deltas: 22% (11685/53110)
Resolving deltas: 23% (12216/53110)
Resolving deltas: 24% (12747/53110)
Resolving deltas: 25% (13278/53110)
Resolving deltas: 26% (13810/53110)
Resolving deltas: 27% (14340/53110)
Resolving deltas: 28% (14871/53110)
Resolving deltas: 29% (15402/53110)
Resolving deltas: 30% (15933/53110)
Resolving deltas: 31% (16465/53110)
Resolving deltas: 32% (16996/53110)
Resolving deltas: 33% (17527/53110)
Resolving deltas: 34% (18058/53110)
Resolving deltas: 35% (18589/53110)
Resolving deltas: 36% (19120/53110)
Resolving deltas: 37% (19651/53110)
Resolving deltas: 38% (20182/53110)
Resolving deltas: 39% (20713/53110)
Resolving deltas: 40% (21245/53110)
Resolving deltas: 41% (21776/53110)
Resolving deltas: 42% (22307/53110)
Resolving deltas: 43% (22838/53110)
Resolving deltas: 44% (23369/53110)
Resolving deltas: 45% (23900/53110)
Resolving deltas: 46% (24432/53110)
Resolving deltas: 47% (24962/53110)
Resolving deltas: 48% (25493/53110)
Resolving deltas: 49% (26024/53110)
Resolving deltas: 50% (26555/53110)
Resolving deltas: 51% (27087/53110)
Resolving deltas: 52% (27618/53110)
Resolving deltas: 53% (28149/53110)
Resolving deltas: 54% (28680/53110)
Resolving deltas: 55% (29212/53110)
Resolving deltas: 56% (29742/53110)
Resolving deltas: 57% (30273/53110)
Resolving deltas: 58% (30804/53110)
Resolving deltas: 59% (31335/53110)
Resolving deltas: 60% (31866/53110)
Resolving deltas: 61% (32398/53110)
Resolving deltas: 62% (32929/53110)
Resolving deltas: 63% (33460/53110)
Resolving deltas: 64% (33991/53110)
Resolving deltas: 65% (34522/53110)
Resolving deltas: 66% (35054/53110)
Resolving deltas: 67% (35584/53110)
Resolving deltas: 68% (36115/53110)
Resolving deltas: 69% (36648/53110)
Resolving deltas: 70% (37177/53110)
Resolving deltas: 71% (37709/53110)
Resolving deltas: 72% (38240/53110)
Resolving deltas: 73% (38772/53110)
Resolving deltas: 74% (39302/53110)
Resolving deltas: 75% (39833/53110)
Resolving deltas: 76% (40364/53110)
Resolving deltas: 77% (40895/53110)
Resolving deltas: 78% (41426/53110)
Resolving deltas: 79% (41957/53110)
Resolving deltas: 80% (42489/53110)
Resolving deltas: 81% (43020/53110)
Resolving deltas: 82% (43552/53110)
Resolving deltas: 83% (44082/53110)
Resolving deltas: 84% (44613/53110)
Resolving deltas: 85% (45144/53110)
Resolving deltas: 86% (45677/53110)
Resolving deltas: 87% (46206/53110)
Resolving deltas: 88% (46737/53110)
Resolving deltas: 89% (47268/53110)
Resolving deltas: 90% (47799/53110)
Resolving deltas: 91% (48331/53110)
Resolving deltas: 92% (48862/53110)
Resolving deltas: 93% (49393/53110)
Resolving deltas: 94% (49926/53110)
Resolving deltas: 95% (50455/53110)
Resolving deltas: 96% (50989/53110)
Resolving deltas: 97% (51519/53110)
Resolving deltas: 98% (52048/53110)
Resolving deltas: 99% (52579/53110)
Resolving deltas: 100% (53110/53110)
Resolving deltas: 100% (53110/53110), done.
8.47 s
Fetching commit d3dd17d9365e2ca30d668d40432f3a1d094af28e for raised_energy_cff_wip ...
8.47 s
$ /nix/store/bcnisk3ydfgv26v2gw3zlky24g00yww2-git-2.54.0/bin/git fetch origin d3dd17d9365e2ca30d668d40432f3a1d094af28e
8.96 s
From https://github.com/alphal00p/gammaloop
8.96 s
* branch d3dd17d9365e2ca30d668d40432f3a1d094af28e -> FETCH_HEAD
8.97 s
$ /nix/store/9ypz3flqsrl5xl495mm8h645gadjsxi1-coreutils-9.11/bin/timeout --kill-after=15s 7200s /nix/store/bcnisk3ydfgv26v2gw3zlky24g00yww2-git-2.54.0/bin/git -c advice.detachedHead=false checkout d3dd17d9365e2ca30d668d40432f3a1d094af28e
9.15 s
HEAD is now at d3dd17d93 stream lower-sector CFF component products
9.15 s
$ /nix/store/9ypz3flqsrl5xl495mm8h645gadjsxi1-coreutils-9.11/bin/timeout --kill-after=15s 7200s /nix/store/23zk8sgzamrbmj1fday15szf7f2279s8-nix-2.34.7/bin/nix --extra-experimental-features nix-command --extra-experimental-features flakes --log-format internal-json run .#packages.x86_64-linux.nix-ci-check-gammaloop-nextest-integration --print-build-logs
12.77 s
13.36 s
Downloading cached gammaloop-nextest-binaries-integration-gammaloop-integration-tests from https://cache.nix-ci.com
51.21 s
Downloaded cached gammaloop-nextest-binaries-integration-gammaloop-integration-tests (414.9 MiB) in 37.8s
51.21 s
Progress: 0 of 1 built, 1 of 3 downloaded from cache
51.21 s
Downloading cached gammaloop-nextest-binaries-integration from https://cache.nix-ci.com
51.25 s
Downloaded cached gammaloop-nextest-binaries-integration (528 B) in 43ms
51.25 s
Progress: 0 of 1 built, 2 of 3 downloaded from cache
51.25 s
Downloading cached nix-ci-check-gammaloop-nextest-integration from https://cache.nix-ci.com
51.50 s
Downloaded cached nix-ci-check-gammaloop-nextest-integration (1032 B) in 246ms
51.50 s
Progress: 0 of 1 built, 3 of 3 downloaded from cache
55.82 s
evaluating derivation 'g
copying '/nix/store/jc0j
evaluating derivation 'g
copying '/nix/store/jc0j
evaluating derivation 'g
copying '/nix/store/jc0j
evaluating derivation 'g
copying '/nix/store/jc0j
evaluating derivation 'g
copying '/nix/store/jc0j
evaluating derivation 'g
querying gammaloop-nexte
querying info about miss
querying gammaloop-nexte
[0 /1 built, 0.0 KiB DL]
[1 /0 /1 built, 0.0 KiB DLgammaloop-nextest-integration> Extracting 13 binaries, 1 build script output directory, and 3 linked paths to /build/nextest-archive-930Ufy
57.83 s
gammaloop-nextest-integration> Extracted 30 files to /build/nextest-archive-930Ufy in 2.02s
57.85 s
gammaloop-nextest-integration> ------------
57.85 s
gammaloop-nextest-integration> Nextest run ID 6fb25a9f-db91-4514-9c64-4d5c1962672f with nextest profile: ci_gammaloop
57.85 s
gammaloop-nextest-integration> Starting 152 tests across 13 binaries (208 tests skipped , including 207 tests via profile.ci_gammaloop.default-filter )
389.00 s
gammaloop-nextest-integration> FAIL [ 71.208s] ( 54/152) gammaloop-integration-tests::test_runs aa_aa::important :: aa_aa_local_inspect_backend_consistency
389.00 s
gammaloop-nextest-integration> stdout ---
389.00 s
gammaloop-nextest-integration>
389.00 s
gammaloop-nextest-integration> running 1 test
389.00 s
gammaloop-nextest-integration> test aa_aa::important::aa_aa_local_inspect_backend_consistency has been running for over 60 seconds
389.00 s
gammaloop-nextest-integration> test aa_aa::important::aa_aa_local_inspect_backend_consistency ... FAILED
389.00 s
gammaloop-nextest-integration>
389.00 s
gammaloop-nextest-integration> failures:
389.00 s
gammaloop-nextest-integration>
389.00 s
gammaloop-nextest-integration> failures:
389.00 s
gammaloop-nextest-integration> aa_aa::important::aa_aa_local_inspect_backend_consistency
389.00 s
gammaloop-nextest-integration>
389.00 s
gammaloop-nextest-integration> test result: FAILED. 0 passed; 1 failed; 0 ignored; 0 measured; 258 filtered out; finished in 71.03s
389.00 s
gammaloop-nextest-integration>
389.00 s
gammaloop-nextest-integration> stderr ---
389.00 s
gammaloop-nextest-integration> [2026-09-06 07:01:54.337] @gammaloop_api::se... INFO : Running command import model sm-default.json
389.00 s
gammaloop-nextest-integration> [2026-09-06 07:01:54.337] @import::model INFO : Loading built-in JSON model sm-default
389.00 s
gammaloop-nextest-integration> [2026-09-06 07:01:54.356] @gammalooprs::model INFO : The following 11 external parameters were forced to zero by the restriction card:
389.00 s
gammaloop-nextest-integration> lamWS, AWS, rhoWS, etaWS, ymc, yme, ymm, MC, Me, MM, WTau
389.00 s
gammaloop-nextest-integration> [2026-09-06 07:01:54.356] @gammalooprs::model INFO : The following 34 vertex rules were removed by the restriction card:
389.00 s
gammaloop-nextest-integration> V_82 -> (c~, d, G+) | V_83 -> (t~, d, G+) | V_84 -> (c~, s, G+) | V_85 -> (t~, s, G+) | V_86 -> (u~, b, G+) | V_87 -> (c~, b, G+) | V_90 -> (c~, d, W+) | V_91 -> (t~, d, W+) | V_92 -> (u~, s, W+) | V_94 -> (t~, s, W+) | V_95 -> (u~, b, W+) | V_96 -> (c~, b, W+) | V_101 -> (e+, e-, G0) | V_102 -> (mu+, mu-, G0) | V_104 -> (e+, e-, H) | V_105 -> (mu+, mu-, H) | V_110 -> (ve~, e-, G+) | V_111 -> (vm~, mu-, G+) | V_116 -> (b~, u, G-) | V_117 -> (d~, c, G-) | V_118 -> (s~, c, G-) | V_119 -> (b~, c, G-) | V_120 -> (d~, t, G-) | V_121 -> (s~, t, G-) | V_124 -> (s~, u, W-) | V_125 -> (b~, u, W-) | V_126 -> (d~, c, W-) | V_128 -> (b~, c, W-) | V_129 -> (d~, t, W-) | V_130 -> (s~, t, W-) | V_138 -> (c~, c, G0) | V_140 -> (c~, c, H) | V_145 -> (e+, ve, G-) | V_146 -> (mu+, vm, G-)
389.00 s
gammaloop-nextest-integration> [2026-09-06 07:01:54.356] @gammalooprs::model INFO : The following 36 couplings were removed by the restriction card:
389.00 s
gammaloop-nextest-integration> GC_13, GC_14, GC_16, GC_17, GC_18, GC_19, GC_20, GC_22, GC_23, GC_24, GC_25, GC_26, GC_28, GC_29, GC_42, GC_43, GC_44, GC_46, GC_47, GC_48, GC_84, GC_85, GC_86, GC_87, GC_88, GC_89, GC_90, GC_91, GC_92, GC_93, GC_101, GC_102, GC_103, GC_105, GC_106, GC_107
389.00 s
gammaloop-nextest-integration> [2026-09-06 07:01:54.357] @gammaloop_api::se... INFO : Running command run set_model_parameters
389.00 s
gammaloop-nextest-integration> [2026-09-06 07:01:54.357] @gammaloop_api::se... INFO : Starting command block set_model_parameters
389.00 s
gammaloop-nextest-integration> [2026-09-06 07:01:54.357] @gammaloop_api::se... INFO : Running command set model MT=173.0
389.00 s
gammaloop-nextest-integration> [2026-09-06 07:01:54.360] @gammaloop_api::se... INFO : Running command set model WT=0.0
389.00 s
gammaloop-nextest-integration> [2026-09-06 07:01:54.364] @gammaloop_api::se... INFO : Running command set model ymt=173.0
389.00 s
gammaloop-nextest-integration> [2026-09-06 07:01:54.367] @gammaloop_api::se... INFO : Running command set model aS=0.118
389.00 s
gammaloop-nextest-integration> [2026-09-06 07:01:54.370] @gammaloop_api::se... INFO : Running command set model aEWM1=137.036
389.00 s
gammaloop-nextest-integration> [2026-09-06 07:01:54.373] @gammaloop_api::se... INFO : Running command set model Gf=1.166390e-05
389.00 s
gammaloop-nextest-integration> [2026-09-06 07:01:54.377] @gammaloop_api::se... INFO : Running command set model MZ=91.188
389.00 s
gammaloop-nextest-integration> [2026-09-06 07:01:54.380] @gammaloop_api::se... INFO : Running command set global string '
389.00 s
gammaloop-nextest-integration> [global.generation.compile]
389.00 s
gammaloop-nextest-integration> compilation_mode = "symjit"
389.00 s
gammaloop-nextest-integration> optimization_level = "O0"
389.00 s
gammaloop-nextest-integration> fast_math = false
389.00 s
gammaloop-nextest-integration> [...]
389.00 s
gammaloop-nextest-integration> [2026-09-06 07:01:54.381] @gammaloop_api::se... INFO : Running command import graphs ./examples/cli/aa_aa/1L/aa_aa_1L.dot -p aa_aa_all_helicities -i 1L_ppmm -o
389.00 s
gammaloop-nextest-integration> [2026-09-06 07:01:54.381] @commands::import INFO : Loading graphs from '/build/source/examples/cli/aa_aa/1L/aa_aa_1L.dot'
389.00 s
gammaloop-nextest-integration> [2026-09-06 07:01:54.389] @gammaloop_api::se... INFO : Running command generate existing -p aa_aa_all_helicities
389.00 s
gammaloop-nextest-integration> [2026-09-06 07:02:21.784] @commands::generate INFO :
389.00 s
gammaloop-nextest-integration> Integrand generation summary
389.00 s
gammaloop-nextest-integration> peak RAM 1.09 GiB | cores 1
389.00 s
gammaloop-nextest-integration> ╭───────────┬───────┬─────────┬──────────────┬─────────────┬────────────────┬──────────────╮
389.00 s
gammaloop-nextest-integration> │ integrand │ graph │ # evals │ expr build │ spenso │ symbolica eval │ compile │
389.00 s
gammaloop-nextest-integration> ├───────────┼───────┼─────────┼──────────────┼─────────────┼────────────────┼──────────────┤
389.00 s
gammaloop-nextest-integration> │ 1L_ppmm │ GL0 │ 13 │ 525ms (5.6% ) │ 1.81s (19% ) │ 6.12s (65% ) │ 923ms (9.8% ) │
389.00 s
gammaloop-nextest-integration> │ 1L_ppmm │ GL2 │ 13 │ 490ms (5.6% ) │ 1.57s (18% ) │ 5.81s (66% ) │ 890ms (10% ) │
389.00 s
gammaloop-nextest-integration> │ 1L_ppmm │ GL4 │ 11 │ 503ms (5.5% ) │ 1.79s (19% ) │ 6.06s (66% ) │ 875ms (9.5% ) │
389.00 s
gammaloop-nextest-integration> ├───────────┼───────┼─────────┼──────────────┼─────────────┼────────────────┼──────────────┤
389.00 s
gammaloop-nextest-integration> │ Total │ │ 37 │ 1.52s (5.6% ) │ 5.17s (19% ) │ 18.00s (66% ) │ 2.69s (9.8% ) │
389.00 s
gammaloop-nextest-integration> ╰───────────┴───────┴─────────┴──────────────┴─────────────┴────────────────┴──────────────╯
389.00 s
gammaloop-nextest-integration> [2026-09-06 07:02:22.731] @gammaloop_api::se... INFO : Running command import model sm-default.json
389.00 s
gammaloop-nextest-integration> [2026-09-06 07:02:22.731] @import::model INFO : Loading built-in JSON model sm-default
389.00 s
gammaloop-nextest-integration> [2026-09-06 07:02:22.753] @gammalooprs::model INFO : The following 11 external parameters were forced to zero by the restriction card:
389.00 s
gammaloop-nextest-integration> lamWS, AWS, rhoWS, etaWS, ymc, yme, ymm, MC, Me, MM, WTau
389.00 s
gammaloop-nextest-integration> [2026-09-06 07:02:22.753] @gammalooprs::model INFO : The following 34 vertex rules were removed by the restriction card:
389.00 s
gammaloop-nextest-integration> V_82 -> (c~, d, G+) | V_83 -> (t~, d, G+) | V_84 -> (c~, s, G+) | V_85 -> (t~, s, G+) | V_86 -> (u~, b, G+) | V_87 -> (c~, b, G+) | V_90 -> (c~, d, W+) | V_91 -> (t~, d, W+) | V_92 -> (u~, s, W+) | V_94 -> (t~, s, W+) | V_95 -> (u~, b, W+) | V_96 -> (c~, b, W+) | V_101 -> (e+, e-, G0) | V_102 -> (mu+, mu-, G0) | V_104 -> (e+, e-, H) | V_105 -> (mu+, mu-, H) | V_110 -> (ve~, e-, G+) | V_111 -> (vm~, mu-, G+) | V_116 -> (b~, u, G-) | V_117 -> (d~, c, G-) | V_118 -> (s~, c, G-) | V_119 -> (b~, c, G-) | V_120 -> (d~, t, G-) | V_121 -> (s~, t, G-) | V_124 -> (s~, u, W-) | V_125 -> (b~, u, W-) | V_126 -> (d~, c, W-) | V_128 -> (b~, c, W-) | V_129 -> (d~, t, W-) | V_130 -> (s~, t, W-) | V_138 -> (c~, c, G0) | V_140 -> (c~, c, H) | V_145 -> (e+, ve, G-) | V_146 -> (mu+, vm, G-)
389.00 s
gammaloop-nextest-integration> [2026-09-06 07:02:22.753] @gammalooprs::model INFO : The following 36 couplings were removed by the restriction card:
389.00 s
gammaloop-nextest-integration> GC_13, GC_14, GC_16, GC_17, GC_18, GC_19, GC_20, GC_22, GC_23, GC_24, GC_25, GC_26, GC_28, GC_29, GC_42, GC_43, GC_44, GC_46, GC_47, GC_48, GC_84, GC_85, GC_86, GC_87, GC_88, GC_89, GC_90, GC_91, GC_92, GC_93, GC_101, GC_102, GC_103, GC_105, GC_106, GC_107
389.00 s
gammaloop-nextest-integration> [2026-09-06 07:02:22.754] @gammaloop_api::se... INFO : Running command run set_model_parameters
389.00 s
gammaloop-nextest-integration> [2026-09-06 07:02:22.754] @gammaloop_api::se... INFO : Starting command block set_model_parameters
389.00 s
gammaloop-nextest-integration> [2026-09-06 07:02:22.754] @gammaloop_api::se... INFO : Running command set model MT=173.0
389.00 s
gammaloop-nextest-integration> [2026-09-06 07:02:22.758] @gammaloop_api::se... INFO : Running command set model WT=0.0
389.00 s
gammaloop-nextest-integration> [2026-09-06 07:02:22.762] @gammaloop_api::se... INFO : Running command set model ymt=173.0
389.00 s
gammaloop-nextest-integration> [2026-09-06 07:02:22.766] @gammaloop_api::se... INFO : Running command set model aS=0.118
389.00 s
gammaloop-nextest-integration> [2026-09-06 07:02:22.770] @gammaloop_api::se... INFO : Running command set model aEWM1=137.036
389.00 s
gammaloop-nextest-integration> [2026-09-06 07:02:22.774] @gammaloop_api::se... INFO : Running command set model Gf=1.166390e-05
389.00 s
gammaloop-nextest-integration> [2026-09-06 07:02:22.777] @gammaloop_api::se... INFO : Running command set model MZ=91.188
389.00 s
gammaloop-nextest-integration> [2026-09-06 07:02:22.782] @gammaloop_api::se... INFO : Running command set global string '
389.00 s
gammaloop-nextest-integration> [global.generation.compile]
389.00 s
gammaloop-nextest-integration> compilation_mode = "assembly"
389.00 s
gammaloop-nextest-integration> optimization_level = "O0"
389.00 s
gammaloop-nextest-integration> fast_math = false
389.00 s
gammaloop-nextest-integration> [...]
389.00 s
gammaloop-nextest-integration> [2026-09-06 07:02:22.783] @gammaloop_api::se... INFO : Running command import graphs ./examples/cli/aa_aa/1L/aa_aa_1L.dot -p aa_aa_all_helicities_assembly -i 1L_ppmm -o
389.00 s
gammaloop-nextest-integration> [2026-09-06 07:02:22.783] @commands::import INFO : Loading graphs from '/build/source/examples/cli/aa_aa/1L/aa_aa_1L.dot'
389.00 s
gammaloop-nextest-integration> [2026-09-06 07:02:22.791] @gammaloop_api::se... INFO : Running command generate existing -p aa_aa_all_helicities_assembly
389.00 s
gammaloop-nextest-integration> [2026-09-06 07:02:45.043] @processes::amplitude INFO : Compiling amplitude 1L_ppmm
389.00 s
gammaloop-nextest-integration> [2026-09-06 07:03:04.191] @commands::generate INFO : Removed 34 generated C++ source file(s). Use '--keep-sources ' to keep them.
389.00 s
gammaloop-nextest-integration> [2026-09-06 07:03:04.191] @commands::generate INFO :
389.00 s
gammaloop-nextest-integration> Integrand generation summary
389.00 s
gammaloop-nextest-integration> peak RAM 2.21 GiB | cores 1
389.00 s
gammaloop-nextest-integration> ╭───────────┬───────┬─────────┬──────────────┬──────────────┬────────────────┬──────────────╮
389.00 s
gammaloop-nextest-integration> │ integrand │ graph │ # evals │ expr build │ spenso │ symbolica eval │ compile │
389.00 s
gammaloop-nextest-integration> ├───────────┼───────┼─────────┼──────────────┼──────────────┼────────────────┼──────────────┤
389.00 s
gammaloop-nextest-integration> │ 1L_ppmm │ GL0 │ 13 │ 562ms (4.0% ) │ 1.51s (11% ) │ 5.68s (41% ) │ 6.16s (44% ) │
389.00 s
gammaloop-nextest-integration> │ 1L_ppmm │ GL2 │ 13 │ 593ms (4.2% ) │ 1.37s (9.6% ) │ 5.34s (37% ) │ 6.95s (49% ) │
389.00 s
gammaloop-nextest-integration> │ 1L_ppmm │ GL4 │ 11 │ 581ms (4.4% ) │ 1.35s (10% ) │ 5.23s (40% ) │ 6.03s (46% ) │
389.00 s
gammaloop-nextest-integration> ├───────────┼───────┼─────────┼──────────────┼──────────────┼────────────────┼──────────────┤
389.00 s
gammaloop-nextest-integration> │ Total │ │ 37 │ 1.74s (4.2% ) │ 4.24s (10% ) │ 16.25s (39% ) │ 19.14s (46% ) │
389.00 s
gammaloop-nextest-integration> ╰───────────┴───────┴─────────┴──────────────┴──────────────┴────────────────┴──────────────╯
389.00 s
gammaloop-nextest-integration> [2026-09-06 07:03:04.857] @gammaloop_api::se... INFO : Running command set process -p aa_aa_all_helicities -i 1L_ppmm string '
389.00 s
gammaloop-nextest-integration> [stability]
389.00 s
gammaloop-nextest-integration> check_on_norm = true
389.00 s
gammaloop-nextest-integration> escalate_if_exact_zero = false
389.00 s
gammaloop-nextest-integration> loop_momenta_norm_escalation_factor = -1.0
389.00 s
gammaloop-nextest-integration> [...]
389.00 s
gammaloop-nextest-integration> [2026-09-06 07:03:04.857] @gammaloop_api::se... INFO : Running command set process -p aa_aa_all_helicities_assembly -i 1L_ppmm string '
389.00 s
gammaloop-nextest-integration> [stability]
389.00 s
gammaloop-nextest-integration> check_on_norm = true
389.00 s
gammaloop-nextest-integration> escalate_if_exact_zero = false
389.00 s
gammaloop-nextest-integration> loop_momenta_norm_escalation_factor = -1.0
389.00 s
gammaloop-nextest-integration> [...]
389.00 s
gammaloop-nextest-integration> [2026-09-06 07:03:04.858] @gammaloop_api::se... INFO : Running command set process -p aa_aa_all_helicities -i 1L_mpmm string '
389.00 s
gammaloop-nextest-integration> [stability]
389.00 s
gammaloop-nextest-integration> check_on_norm = true
389.00 s
gammaloop-nextest-integration> escalate_if_exact_zero = false
389.00 s
gammaloop-nextest-integration> loop_momenta_norm_escalation_factor = -1.0
389.00 s
gammaloop-nextest-integration> [...]
389.00 s
gammaloop-nextest-integration> [2026-09-06 07:03:04.859] @gammaloop_api::se... INFO : Running command set process -p aa_aa_all_helicities_assembly -i 1L_mpmm string '
389.00 s
gammaloop-nextest-integration> [stability]
389.00 s
gammaloop-nextest-integration> check_on_norm = true
389.00 s
gammaloop-nextest-integration> escalate_if_exact_zero = false
389.00 s
gammaloop-nextest-integration> loop_momenta_norm_escalation_factor = -1.0
389.00 s
gammaloop-nextest-integration> [...]
389.00 s
gammaloop-nextest-integration> [2026-09-06 07:03:04.859] @gammaloop_api::se... INFO : Running command set process -p aa_aa_all_helicities -i 1L_mmmm string '
389.00 s
gammaloop-nextest-integration> [stability]
389.00 s
gammaloop-nextest-integration> check_on_norm = true
389.00 s
gammaloop-nextest-integration> escalate_if_exact_zero = false
389.00 s
gammaloop-nextest-integration> loop_momenta_norm_escalation_factor = -1.0
389.00 s
gammaloop-nextest-integration> [...]
389.00 s
gammaloop-nextest-integration> [2026-09-06 07:03:04.860] @gammaloop_api::se... INFO : Running command set process -p aa_aa_all_helicities_assembly -i 1L_mmmm string '
389.00 s
gammaloop-nextest-integration> [stability]
389.00 s
gammaloop-nextest-integration> check_on_norm = true
389.00 s
gammaloop-nextest-integration> escalate_if_exact_zero = false
389.00 s
gammaloop-nextest-integration> loop_momenta_norm_escalation_factor = -1.0
389.00 s
gammaloop-nextest-integration> [...]
389.00 s
gammaloop-nextest-integration> [2026-09-06 07:03:04.861] @gammaloop_api::se... INFO : Running command set process -p aa_aa_all_helicities -i 1L_pmmp string '
389.00 s
gammaloop-nextest-integration> [stability]
389.00 s
gammaloop-nextest-integration> check_on_norm = true
389.00 s
gammaloop-nextest-integration> escalate_if_exact_zero = false
389.00 s
gammaloop-nextest-integration> loop_momenta_norm_escalation_factor = -1.0
389.00 s
gammaloop-nextest-integration> [...]
389.00 s
gammaloop-nextest-integration> [2026-09-06 07:03:04.861] @gammaloop_api::se... INFO : Running command set process -p aa_aa_all_helicities_assembly -i 1L_pmmp string '
389.00 s
gammaloop-nextest-integration> [stability]
389.00 s
gammaloop-nextest-integration> check_on_norm = true
389.00 s
gammaloop-nextest-integration> escalate_if_exact_zero = false
389.00 s
gammaloop-nextest-integration> loop_momenta_norm_escalation_factor = -1.0
389.00 s
gammaloop-nextest-integration> [...]
389.00 s
gammaloop-nextest-integration> [2026-09-06 07:03:04.862] @gammaloop_api::se... INFO : Running command set process -p aa_aa_all_helicities -i 1L_pmpm string '
389.00 s
gammaloop-nextest-integration> [stability]
389.00 s
gammaloop-nextest-integration> check_on_norm = true
389.00 s
gammaloop-nextest-integration> escalate_if_exact_zero = false
389.00 s
gammaloop-nextest-integration> loop_momenta_norm_escalation_factor = -1.0
389.00 s
gammaloop-nextest-integration> [...]
389.00 s
gammaloop-nextest-integration> [2026-09-06 07:03:04.863] @gammaloop_api::se... INFO : Running command set process -p aa_aa_all_helicities_assembly -i 1L_pmpm string '
389.00 s
gammaloop-nextest-integration> [stability]
389.00 s
gammaloop-nextest-integration> check_on_norm = true
389.00 s
gammaloop-nextest-integration> escalate_if_exact_zero = false
389.00 s
gammaloop-nextest-integration> loop_momenta_norm_escalation_factor = -1.0
389.00 s
gammaloop-nextest-integration> [...]
389.00 s
gammaloop-nextest-integration> [2026-09-06 07:03:04.867] @process::amplitude INFO : Input is below threshold: 0 existing threshold E-surfaces across 0/1 graph groups
389.00 s
gammaloop-nextest-integration> [2026-09-06 07:03:04.867] @process::amplitude INFO : overlap structure of group 0: [0: []]
389.00 s
gammaloop-nextest-integration> [2026-09-06 07:03:04.868] @integrands::process [{#im_is_nan, #re_is_nan}] WARNING : final process evaluation is nonfinite
389.00 s
gammaloop-nextest-integration> [2026-09-06 07:03:04.868] @commands::inspect INFO :
389.00 s
gammaloop-nextest-integration> Input point in momentum space:
389.00 s
gammaloop-nextest-integration>
389.00 s
gammaloop-nextest-integration> ( 0.1100000000000000, -0.0700000000000000, 0.1900000000000000 )
389.00 s
gammaloop-nextest-integration>
389.00 s
gammaloop-nextest-integration> The evaluation of integrand '1L_ppmm' is:
389.00 s
gammaloop-nextest-integration>
389.00 s
gammaloop-nextest-integration> ( +0.0000000000000000e0, +0.0000000000000000e0 i)
389.00 s
gammaloop-nextest-integration>
389.00 s
gammaloop-nextest-integration> [2026-09-06 07:03:04.871] @process::amplitude INFO : Input is below threshold: 0 existing threshold E-surfaces across 0/1 graph groups
389.00 s
gammaloop-nextest-integration> [2026-09-06 07:03:04.871] @process::amplitude INFO : overlap structure of group 0: [0: []]
389.00 s
gammaloop-nextest-integration> [2026-09-06 07:03:04.871] @commands::inspect INFO :
389.00 s
gammaloop-nextest-integration> Input point in momentum space:
389.00 s
gammaloop-nextest-integration>
389.00 s
gammaloop-nextest-integration> ( 0.1100000000000000, -0.0700000000000000, 0.1900000000000000 )
389.00 s
gammaloop-nextest-integration>
389.00 s
gammaloop-nextest-integration> The evaluation of integrand '1L_ppmm' is:
389.00 s
gammaloop-nextest-integration>
389.00 s
gammaloop-nextest-integration> ( -1.7132462539328486e-28, -8.7105072229446864e-10 i)
389.00 s
gammaloop-nextest-integration>
389.00 s
gammaloop-nextest-integration> The application panicked (crashed).
389.01 s
gammaloop-nextest-integration> Message: kinematics=a, integrand=1L_ppmm, graph_id=0: assembly vs symjit inspect: actual=(-0.00000000000000000000000000017132462539328486+-0.0000000008710507222944686i), expected=(0+0i), tolerance=0.0000000001
389.01 s
gammaloop-nextest-integration> Location: tests/tests/test_runs/utils.rs :466
389.01 s
gammaloop-nextest-integration>
389.01 s
gammaloop-nextest-integration> ━━━━━━━━━━━━━━━━━━━━━━━━━━━━━━━━━━ BACKTRACE ━━━━━━━━━━━━━━━━━━━━━━━━━━━━━━━━━━━
389.01 s
gammaloop-nextest-integration> 1: <color_eyre[51793ea62743adbd]::config::PanicHook>::panic_report <unknown>
389.01 s
gammaloop-nextest-integration> at <unknown source file> :<unknown line>
389.01 s
gammaloop-nextest-integration> 2: <color_eyre[51793ea62743adbd]::config::PanicHook>::into_panic_hook::{closure#0} <unknown>
389.01 s
gammaloop-nextest-integration> at <unknown source file> :<unknown line>
389.01 s
gammaloop-nextest-integration> 3: std[bcb96dfbba0ab899]::panicking::panic_with_hook <unknown>
389.01 s
gammaloop-nextest-integration> at <unknown source file> :<unknown line>
389.01 s
gammaloop-nextest-integration> 4: std[bcb96dfbba0ab899]::panicking::panic_handler::{closure#0} <unknown>
389.01 s
gammaloop-nextest-integration> at <unknown source file> :<unknown line>
389.01 s
gammaloop-nextest-integration> 5: std[bcb96dfbba0ab899]::sys::backtrace::__rust_end_short_backtrace::<std[bcb96dfbba0ab899]::panicking::panic_handler::{closure#0}, !> <unknown>
389.01 s
gammaloop-nextest-integration> at <unknown source file> :<unknown line>
389.01 s
gammaloop-nextest-integration> 6: __rustc[6c289b9f9c454d21]::rust_begin_unwind <unknown>
389.01 s
gammaloop-nextest-integration> at <unknown source file> :<unknown line>
389.01 s
gammaloop-nextest-integration> 7: core[940e698046960fd5]::panicking::panic_fmt <unknown>
389.01 s
gammaloop-nextest-integration> at <unknown source file> :<unknown line>
389.01 s
gammaloop-nextest-integration> 8: <test_runs[66584badfeb6c7be]::aa_aa::important::aa_aa_local_inspect_backend_consistency::{closure#0} as core[940e698046960fd5]::ops::function::FnOnce<()>>::call_once <unknown>
389.01 s
gammaloop-nextest-integration> at <unknown source file> :<unknown line>
389.01 s
gammaloop-nextest-integration> 9: serial_test[cd99724524a2f1c0]::serial_code_lock::local_serial_core_with_return::<(), eyre[cb2fd339c0c40fca]::Report> <unknown>
389.01 s
gammaloop-nextest-integration> at <unknown source file> :<unknown line>
389.01 s
gammaloop-nextest-integration> 10: <test_runs[66584badfeb6c7be]::aa_aa::important::aa_aa_local_inspect_backend_consistency::{closure#0} as core[940e698046960fd5]::ops::function::FnOnce<()>>::call_once <unknown>
389.01 s
gammaloop-nextest-integration> at <unknown source file> :<unknown line>
389.01 s
gammaloop-nextest-integration> 11: test[75d6903177b1d7e9]::__rust_begin_short_backtrace::<core[940e698046960fd5]::result::Result<(), alloc[2ea6bcb46fca0c42]::string::String>, fn() -> core[940e698046960fd5]::result::Result<(), alloc[2ea6bcb46fca0c42]::string::String>> <unknown>
389.01 s
gammaloop-nextest-integration> at <unknown source file> :<unknown line>
389.01 s
gammaloop-nextest-integration> 12: test[75d6903177b1d7e9]::run_test::{closure#0} <unknown>
389.01 s
gammaloop-nextest-integration> at <unknown source file> :<unknown line>
389.01 s
gammaloop-nextest-integration> 13: std[bcb96dfbba0ab899]::sys::backtrace::__rust_begin_short_backtrace::<test[75d6903177b1d7e9]::run_test::{closure#1}, ()> <unknown>
389.01 s
gammaloop-nextest-integration> at <unknown source file> :<unknown line>
389.01 s
gammaloop-nextest-integration> 14: <std[bcb96dfbba0ab899]::thread::lifecycle::spawn_unchecked<test[75d6903177b1d7e9]::run_test::{closure#1}, ()>::{closure#1} as core[940e698046960fd5]::ops::function::FnOnce<()>>::call_once::{shim:vtable#0} <unknown>
389.01 s
gammaloop-nextest-integration> at <unknown source file> :<unknown line>
389.01 s
gammaloop-nextest-integration> 15: <std[bcb96dfbba0ab899]::sys::thread::unix::Thread>::new::thread_start <unknown>
389.01 s
gammaloop-nextest-integration> at <unknown source file> :<unknown line>
389.01 s
gammaloop-nextest-integration> 16: start_thread <unknown>
389.01 s
gammaloop-nextest-integration> at <unknown source file> :<unknown line>
389.01 s
gammaloop-nextest-integration> 17: __clone3 <unknown>
389.01 s
gammaloop-nextest-integration> at <unknown source file> :<unknown line>
389.01 s
gammaloop-nextest-integration>
389.01 s
gammaloop-nextest-integration> Run with COLORBT_SHOW_HIDDEN=1 environment variable to disable frame filtering.
389.01 s
gammaloop-nextest-integration> Run with RUST_BACKTRACE=full to include source snippets.
389.01 s
gammaloop-nextest-integration>
809.02 s
gammaloop-nextest-integration> ------------
809.02 s
gammaloop-nextest-integration> Summary [ 751.167s] 152 tests run: 151 passed , 1 failed , 208 skipped
809.02 s
gammaloop-nextest-integration> FAIL [ 71.208s] ( 54/152) gammaloop-integration-tests::test_runs aa_aa::important :: aa_aa_local_inspect_backend_consistency
809.02 s
gammaloop-nextest-integration> stdout ---
809.02 s
gammaloop-nextest-integration>
809.02 s
gammaloop-nextest-integration> running 1 test
809.02 s
gammaloop-nextest-integration> test aa_aa::important::aa_aa_local_inspect_backend_consistency has been running for over 60 seconds
809.02 s
gammaloop-nextest-integration> test aa_aa::important::aa_aa_local_inspect_backend_consistency ... FAILED
809.02 s
gammaloop-nextest-integration>
809.02 s
gammaloop-nextest-integration> failures:
809.02 s
gammaloop-nextest-integration>
809.02 s
gammaloop-nextest-integration> failures:
809.02 s
gammaloop-nextest-integration> aa_aa::important::aa_aa_local_inspect_backend_consistency
809.02 s
gammaloop-nextest-integration>
809.02 s
gammaloop-nextest-integration> test result: FAILED. 0 passed; 1 failed; 0 ignored; 0 measured; 258 filtered out; finished in 71.03s
809.02 s
gammaloop-nextest-integration>
809.02 s
gammaloop-nextest-integration> stderr ---
809.02 s
gammaloop-nextest-integration> [2026-09-06 07:01:54.337] @gammaloop_api::se... INFO : Running command import model sm-default.json
809.02 s
gammaloop-nextest-integration> [2026-09-06 07:01:54.337] @import::model INFO : Loading built-in JSON model sm-default
809.02 s
gammaloop-nextest-integration> [2026-09-06 07:01:54.356] @gammalooprs::model INFO : The following 11 external parameters were forced to zero by the restriction card:
809.02 s
gammaloop-nextest-integration> lamWS, AWS, rhoWS, etaWS, ymc, yme, ymm, MC, Me, MM, WTau
809.02 s
gammaloop-nextest-integration> [2026-09-06 07:01:54.356] @gammalooprs::model INFO : The following 34 vertex rules were removed by the restriction card:
809.02 s
gammaloop-nextest-integration> V_82 -> (c~, d, G+) | V_83 -> (t~, d, G+) | V_84 -> (c~, s, G+) | V_85 -> (t~, s, G+) | V_86 -> (u~, b, G+) | V_87 -> (c~, b, G+) | V_90 -> (c~, d, W+) | V_91 -> (t~, d, W+) | V_92 -> (u~, s, W+) | V_94 -> (t~, s, W+) | V_95 -> (u~, b, W+) | V_96 -> (c~, b, W+) | V_101 -> (e+, e-, G0) | V_102 -> (mu+, mu-, G0) | V_104 -> (e+, e-, H) | V_105 -> (mu+, mu-, H) | V_110 -> (ve~, e-, G+) | V_111 -> (vm~, mu-, G+) | V_116 -> (b~, u, G-) | V_117 -> (d~, c, G-) | V_118 -> (s~, c, G-) | V_119 -> (b~, c, G-) | V_120 -> (d~, t, G-) | V_121 -> (s~, t, G-) | V_124 -> (s~, u, W-) | V_125 -> (b~, u, W-) | V_126 -> (d~, c, W-) | V_128 -> (b~, c, W-) | V_129 -> (d~, t, W-) | V_130 -> (s~, t, W-) | V_138 -> (c~, c, G0) | V_140 -> (c~, c, H) | V_145 -> (e+, ve, G-) | V_146 -> (mu+, vm, G-)
809.02 s
gammaloop-nextest-integration> [2026-09-06 07:01:54.356] @gammalooprs::model INFO : The following 36 couplings were removed by the restriction card:
809.02 s
gammaloop-nextest-integration> GC_13, GC_14, GC_16, GC_17, GC_18, GC_19, GC_20, GC_22, GC_23, GC_24, GC_25, GC_26, GC_28, GC_29, GC_42, GC_43, GC_44, GC_46, GC_47, GC_48, GC_84, GC_85, GC_86, GC_87, GC_88, GC_89, GC_90, GC_91, GC_92, GC_93, GC_101, GC_102, GC_103, GC_105, GC_106, GC_107
809.02 s
gammaloop-nextest-integration> [2026-09-06 07:01:54.357] @gammaloop_api::se... INFO : Running command run set_model_parameters
809.02 s
gammaloop-nextest-integration> [2026-09-06 07:01:54.357] @gammaloop_api::se... INFO : Starting command block set_model_parameters
809.02 s
gammaloop-nextest-integration> [2026-09-06 07:01:54.357] @gammaloop_api::se... INFO : Running command set model MT=173.0
809.02 s
gammaloop-nextest-integration> [2026-09-06 07:01:54.360] @gammaloop_api::se... INFO : Running command set model WT=0.0
809.02 s
gammaloop-nextest-integration> [2026-09-06 07:01:54.364] @gammaloop_api::se... INFO : Running command set model ymt=173.0
809.02 s
gammaloop-nextest-integration> [2026-09-06 07:01:54.367] @gammaloop_api::se... INFO : Running command set model aS=0.118
809.02 s
gammaloop-nextest-integration> [2026-09-06 07:01:54.370] @gammaloop_api::se... INFO : Running command set model aEWM1=137.036
809.02 s
gammaloop-nextest-integration> [2026-09-06 07:01:54.373] @gammaloop_api::se... INFO : Running command set model Gf=1.166390e-05
809.02 s
gammaloop-nextest-integration> [2026-09-06 07:01:54.377] @gammaloop_api::se... INFO : Running command set model MZ=91.188
809.02 s
gammaloop-nextest-integration> [2026-09-06 07:01:54.380] @gammaloop_api::se... INFO : Running command set global string '
809.02 s
gammaloop-nextest-integration> [global.generation.compile]
809.02 s
gammaloop-nextest-integration> compilation_mode = "symjit"
809.02 s
gammaloop-nextest-integration> optimization_level = "O0"
809.02 s
gammaloop-nextest-integration> fast_math = false
809.02 s
gammaloop-nextest-integration> [...]
809.02 s
gammaloop-nextest-integration> [2026-09-06 07:01:54.381] @gammaloop_api::se... INFO : Running command import graphs ./examples/cli/aa_aa/1L/aa_aa_1L.dot -p aa_aa_all_helicities -i 1L_ppmm -o
809.02 s
gammaloop-nextest-integration> [2026-09-06 07:01:54.381] @commands::import INFO : Loading graphs from '/build/source/examples/cli/aa_aa/1L/aa_aa_1L.dot'
809.02 s
gammaloop-nextest-integration> [2026-09-06 07:01:54.389] @gammaloop_api::se... INFO : Running command generate existing -p aa_aa_all_helicities
809.02 s
gammaloop-nextest-integration> [2026-09-06 07:02:21.784] @commands::generate INFO :
809.02 s
gammaloop-nextest-integration> Integrand generation summary
809.02 s
gammaloop-nextest-integration> peak RAM 1.09 GiB | cores 1
809.02 s
gammaloop-nextest-integration> ╭───────────┬───────┬─────────┬──────────────┬─────────────┬────────────────┬──────────────╮
809.02 s
gammaloop-nextest-integration> │ integrand │ graph │ # evals │ expr build │ spenso │ symbolica eval │ compile │
809.02 s
gammaloop-nextest-integration> ├───────────┼───────┼─────────┼──────────────┼─────────────┼────────────────┼──────────────┤
809.02 s
gammaloop-nextest-integration> │ 1L_ppmm │ GL0 │ 13 │ 525ms (5.6% ) │ 1.81s (19% ) │ 6.12s (65% ) │ 923ms (9.8% ) │
809.02 s
gammaloop-nextest-integration> │ 1L_ppmm │ GL2 │ 13 │ 490ms (5.6% ) │ 1.57s (18% ) │ 5.81s (66% ) │ 890ms (10% ) │
809.02 s
gammaloop-nextest-integration> │ 1L_ppmm │ GL4 │ 11 │ 503ms (5.5% ) │ 1.79s (19% ) │ 6.06s (66% ) │ 875ms (9.5% ) │
809.02 s
gammaloop-nextest-integration> ├───────────┼───────┼─────────┼──────────────┼─────────────┼────────────────┼──────────────┤
809.02 s
gammaloop-nextest-integration> │ Total │ │ 37 │ 1.52s (5.6% ) │ 5.17s (19% ) │ 18.00s (66% ) │ 2.69s (9.8% ) │
809.02 s
gammaloop-nextest-integration> ╰───────────┴───────┴─────────┴──────────────┴─────────────┴────────────────┴──────────────╯
809.02 s
gammaloop-nextest-integration> [2026-09-06 07:02:22.731] @gammaloop_api::se... INFO : Running command import model sm-default.json
809.02 s
gammaloop-nextest-integration> [2026-09-06 07:02:22.731] @import::model INFO : Loading built-in JSON model sm-default
809.02 s
gammaloop-nextest-integration> [2026-09-06 07:02:22.753] @gammalooprs::model INFO : The following 11 external parameters were forced to zero by the restriction card:
809.02 s
gammaloop-nextest-integration> lamWS, AWS, rhoWS, etaWS, ymc, yme, ymm, MC, Me, MM, WTau
809.02 s
gammaloop-nextest-integration> [2026-09-06 07:02:22.753] @gammalooprs::model INFO : The following 34 vertex rules were removed by the restriction card:
809.02 s
gammaloop-nextest-integration> V_82 -> (c~, d, G+) | V_83 -> (t~, d, G+) | V_84 -> (c~, s, G+) | V_85 -> (t~, s, G+) | V_86 -> (u~, b, G+) | V_87 -> (c~, b, G+) | V_90 -> (c~, d, W+) | V_91 -> (t~, d, W+) | V_92 -> (u~, s, W+) | V_94 -> (t~, s, W+) | V_95 -> (u~, b, W+) | V_96 -> (c~, b, W+) | V_101 -> (e+, e-, G0) | V_102 -> (mu+, mu-, G0) | V_104 -> (e+, e-, H) | V_105 -> (mu+, mu-, H) | V_110 -> (ve~, e-, G+) | V_111 -> (vm~, mu-, G+) | V_116 -> (b~, u, G-) | V_117 -> (d~, c, G-) | V_118 -> (s~, c, G-) | V_119 -> (b~, c, G-) | V_120 -> (d~, t, G-) | V_121 -> (s~, t, G-) | V_124 -> (s~, u, W-) | V_125 -> (b~, u, W-) | V_126 -> (d~, c, W-) | V_128 -> (b~, c, W-) | V_129 -> (d~, t, W-) | V_130 -> (s~, t, W-) | V_138 -> (c~, c, G0) | V_140 -> (c~, c, H) | V_145 -> (e+, ve, G-) | V_146 -> (mu+, vm, G-)
809.02 s
gammaloop-nextest-integration> [2026-09-06 07:02:22.753] @gammalooprs::model INFO : The following 36 couplings were removed by the restriction card:
809.02 s
gammaloop-nextest-integration> GC_13, GC_14, GC_16, GC_17, GC_18, GC_19, GC_20, GC_22, GC_23, GC_24, GC_25, GC_26, GC_28, GC_29, GC_42, GC_43, GC_44, GC_46, GC_47, GC_48, GC_84, GC_85, GC_86, GC_87, GC_88, GC_89, GC_90, GC_91, GC_92, GC_93, GC_101, GC_102, GC_103, GC_105, GC_106, GC_107
809.02 s
gammaloop-nextest-integration> [2026-09-06 07:02:22.754] @gammaloop_api::se... INFO : Running command run set_model_parameters
809.02 s
gammaloop-nextest-integration> [2026-09-06 07:02:22.754] @gammaloop_api::se... INFO : Starting command block set_model_parameters
809.02 s
gammaloop-nextest-integration> [2026-09-06 07:02:22.754] @gammaloop_api::se... INFO : Running command set model MT=173.0
809.02 s
gammaloop-nextest-integration> [2026-09-06 07:02:22.758] @gammaloop_api::se... INFO : Running command set model WT=0.0
809.02 s
gammaloop-nextest-integration> [2026-09-06 07:02:22.762] @gammaloop_api::se... INFO : Running command set model ymt=173.0
809.02 s
gammaloop-nextest-integration> [2026-09-06 07:02:22.766] @gammaloop_api::se... INFO : Running command set model aS=0.118
809.02 s
gammaloop-nextest-integration> [2026-09-06 07:02:22.770] @gammaloop_api::se... INFO : Running command set model aEWM1=137.036
809.02 s
gammaloop-nextest-integration> [2026-09-06 07:02:22.774] @gammaloop_api::se... INFO : Running command set model Gf=1.166390e-05
809.02 s
gammaloop-nextest-integration> [2026-09-06 07:02:22.777] @gammaloop_api::se... INFO : Running command set model MZ=91.188
809.02 s
gammaloop-nextest-integration> [2026-09-06 07:02:22.782] @gammaloop_api::se... INFO : Running command set global string '
809.02 s
gammaloop-nextest-integration> [global.generation.compile]
809.02 s
gammaloop-nextest-integration> compilation_mode = "assembly"
809.02 s
gammaloop-nextest-integration> optimization_level = "O0"
809.02 s
gammaloop-nextest-integration> fast_math = false
809.02 s
gammaloop-nextest-integration> [...]
809.02 s
gammaloop-nextest-integration> [2026-09-06 07:02:22.783] @gammaloop_api::se... INFO : Running command import graphs ./examples/cli/aa_aa/1L/aa_aa_1L.dot -p aa_aa_all_helicities_assembly -i 1L_ppmm -o
809.02 s
gammaloop-nextest-integration> [2026-09-06 07:02:22.783] @commands::import INFO : Loading graphs from '/build/source/examples/cli/aa_aa/1L/aa_aa_1L.dot'
809.02 s
gammaloop-nextest-integration> [2026-09-06 07:02:22.791] @gammaloop_api::se... INFO : Running command generate existing -p aa_aa_all_helicities_assembly
809.02 s
gammaloop-nextest-integration> [2026-09-06 07:02:45.043] @processes::amplitude INFO : Compiling amplitude 1L_ppmm
809.02 s
gammaloop-nextest-integration> [2026-09-06 07:03:04.191] @commands::generate INFO : Removed 34 generated C++ source file(s). Use '--keep-sources ' to keep them.
809.02 s
gammaloop-nextest-integration> [2026-09-06 07:03:04.191] @commands::generate INFO :
809.02 s
gammaloop-nextest-integration> Integrand generation summary
809.02 s
gammaloop-nextest-integration> peak RAM 2.21 GiB | cores 1
809.02 s
gammaloop-nextest-integration> ╭───────────┬───────┬─────────┬──────────────┬──────────────┬────────────────┬──────────────╮
809.02 s
gammaloop-nextest-integration> │ integrand │ graph │ # evals │ expr build │ spenso │ symbolica eval │ compile │
809.02 s
gammaloop-nextest-integration> ├───────────┼───────┼─────────┼──────────────┼──────────────┼────────────────┼──────────────┤
809.02 s
gammaloop-nextest-integration> │ 1L_ppmm │ GL0 │ 13 │ 562ms (4.0% ) │ 1.51s (11% ) │ 5.68s (41% ) │ 6.16s (44% ) │
809.02 s
gammaloop-nextest-integration> │ 1L_ppmm │ GL2 │ 13 │ 593ms (4.2% ) │ 1.37s (9.6% ) │ 5.34s (37% ) │ 6.95s (49% ) │
809.02 s
gammaloop-nextest-integration> │ 1L_ppmm │ GL4 │ 11 │ 581ms (4.4% ) │ 1.35s (10% ) │ 5.23s (40% ) │ 6.03s (46% ) │
809.02 s
gammaloop-nextest-integration> ├───────────┼───────┼─────────┼──────────────┼──────────────┼────────────────┼──────────────┤
809.02 s
gammaloop-nextest-integration> │ Total │ │ 37 │ 1.74s (4.2% ) │ 4.24s (10% ) │ 16.25s (39% ) │ 19.14s (46% ) │
809.02 s
gammaloop-nextest-integration> ╰───────────┴───────┴─────────┴──────────────┴──────────────┴────────────────┴──────────────╯
809.02 s
gammaloop-nextest-integration> [2026-09-06 07:03:04.857] @gammaloop_api::se... INFO : Running command set process -p aa_aa_all_helicities -i 1L_ppmm string '
809.02 s
gammaloop-nextest-integration> [stability]
809.02 s
gammaloop-nextest-integration> check_on_norm = true
809.02 s
gammaloop-nextest-integration> escalate_if_exact_zero = false
809.02 s
gammaloop-nextest-integration> loop_momenta_norm_escalation_factor = -1.0
809.02 s
gammaloop-nextest-integration> [...]
809.02 s
gammaloop-nextest-integration> [2026-09-06 07:03:04.857] @gammaloop_api::se... INFO : Running command set process -p aa_aa_all_helicities_assembly -i 1L_ppmm string '
809.02 s
gammaloop-nextest-integration> [stability]
809.02 s
gammaloop-nextest-integration> check_on_norm = true
809.02 s
gammaloop-nextest-integration> escalate_if_exact_zero = false
809.02 s
gammaloop-nextest-integration> loop_momenta_norm_escalation_factor = -1.0
809.02 s
gammaloop-nextest-integration> [...]
809.02 s
gammaloop-nextest-integration> [2026-09-06 07:03:04.858] @gammaloop_api::se... INFO : Running command set process -p aa_aa_all_helicities -i 1L_mpmm string '
809.02 s
gammaloop-nextest-integration> [stability]
809.02 s
gammaloop-nextest-integration> check_on_norm = true
809.02 s
gammaloop-nextest-integration> escalate_if_exact_zero = false
809.02 s
gammaloop-nextest-integration> loop_momenta_norm_escalation_factor = -1.0
809.02 s
gammaloop-nextest-integration> [...]
809.02 s
gammaloop-nextest-integration> [2026-09-06 07:03:04.859] @gammaloop_api::se... INFO : Running command set process -p aa_aa_all_helicities_assembly -i 1L_mpmm string '
809.02 s
gammaloop-nextest-integration> [stability]
809.02 s
gammaloop-nextest-integration> check_on_norm = true
809.02 s
gammaloop-nextest-integration> escalate_if_exact_zero = false
809.02 s
gammaloop-nextest-integration> loop_momenta_norm_escalation_factor = -1.0
809.02 s
gammaloop-nextest-integration> [...]
809.02 s
gammaloop-nextest-integration> [2026-09-06 07:03:04.859] @gammaloop_api::se... INFO : Running command set process -p aa_aa_all_helicities -i 1L_mmmm string '
809.02 s
gammaloop-nextest-integration> [stability]
809.02 s
gammaloop-nextest-integration> check_on_norm = true
809.02 s
gammaloop-nextest-integration> escalate_if_exact_zero = false
809.02 s
gammaloop-nextest-integration> loop_momenta_norm_escalation_factor = -1.0
809.02 s
gammaloop-nextest-integration> [...]
809.02 s
gammaloop-nextest-integration> [2026-09-06 07:03:04.860] @gammaloop_api::se... INFO : Running command set process -p aa_aa_all_helicities_assembly -i 1L_mmmm string '
809.02 s
gammaloop-nextest-integration> [stability]
809.02 s
gammaloop-nextest-integration> check_on_norm = true
809.02 s
gammaloop-nextest-integration> escalate_if_exact_zero = false
809.02 s
gammaloop-nextest-integration> loop_momenta_norm_escalation_factor = -1.0
809.02 s
gammaloop-nextest-integration> [...]
809.02 s
gammaloop-nextest-integration> [2026-09-06 07:03:04.861] @gammaloop_api::se... INFO : Running command set process -p aa_aa_all_helicities -i 1L_pmmp string '
809.02 s
gammaloop-nextest-integration> [stability]
809.02 s
gammaloop-nextest-integration> check_on_norm = true
809.02 s
gammaloop-nextest-integration> escalate_if_exact_zero = false
809.02 s
gammaloop-nextest-integration> loop_momenta_norm_escalation_factor = -1.0
809.02 s
gammaloop-nextest-integration> [...]
809.02 s
gammaloop-nextest-integration> [2026-09-06 07:03:04.861] @gammaloop_api::se... INFO : Running command set process -p aa_aa_all_helicities_assembly -i 1L_pmmp string '
809.02 s
gammaloop-nextest-integration> [stability]
809.02 s
gammaloop-nextest-integration> check_on_norm = true
809.02 s
gammaloop-nextest-integration> escalate_if_exact_zero = false
809.02 s
gammaloop-nextest-integration> loop_momenta_norm_escalation_factor = -1.0
809.02 s
gammaloop-nextest-integration> [...]
809.02 s
gammaloop-nextest-integration> [2026-09-06 07:03:04.862] @gammaloop_api::se... INFO : Running command set process -p aa_aa_all_helicities -i 1L_pmpm string '
809.02 s
gammaloop-nextest-integration> [stability]
809.02 s
gammaloop-nextest-integration> check_on_norm = true
809.02 s
gammaloop-nextest-integration> escalate_if_exact_zero = false
809.02 s
gammaloop-nextest-integration> loop_momenta_norm_escalation_factor = -1.0
809.02 s
gammaloop-nextest-integration> [...]
809.02 s
gammaloop-nextest-integration> [2026-09-06 07:03:04.863] @gammaloop_api::se... INFO : Running command set process -p aa_aa_all_helicities_assembly -i 1L_pmpm string '
809.02 s
gammaloop-nextest-integration> [stability]
809.02 s
gammaloop-nextest-integration> check_on_norm = true
809.02 s
gammaloop-nextest-integration> escalate_if_exact_zero = false
809.02 s
gammaloop-nextest-integration> loop_momenta_norm_escalation_factor = -1.0
809.02 s
gammaloop-nextest-integration> [...]
809.02 s
gammaloop-nextest-integration> [2026-09-06 07:03:04.867] @process::amplitude INFO : Input is below threshold: 0 existing threshold E-surfaces across 0/1 graph groups
809.02 s
gammaloop-nextest-integration> [2026-09-06 07:03:04.867] @process::amplitude INFO : overlap structure of group 0: [0: []]
809.02 s
gammaloop-nextest-integration> [2026-09-06 07:03:04.868] @integrands::process [{#im_is_nan, #re_is_nan}] WARNING : final process evaluation is nonfinite
809.02 s
gammaloop-nextest-integration> [2026-09-06 07:03:04.868] @commands::inspect INFO :
809.02 s
gammaloop-nextest-integration> Input point in momentum space:
809.02 s
gammaloop-nextest-integration>
809.02 s
gammaloop-nextest-integration> ( 0.1100000000000000, -0.0700000000000000, 0.1900000000000000 )
809.02 s
gammaloop-nextest-integration>
809.02 s
gammaloop-nextest-integration> The evaluation of integrand '1L_ppmm' is:
809.02 s
gammaloop-nextest-integration>
809.02 s
gammaloop-nextest-integration> ( +0.0000000000000000e0, +0.0000000000000000e0 i)
809.02 s
gammaloop-nextest-integration>
809.02 s
gammaloop-nextest-integration> [2026-09-06 07:03:04.871] @process::amplitude INFO : Input is below threshold: 0 existing threshold E-surfaces across 0/1 graph groups
809.02 s
gammaloop-nextest-integration> [2026-09-06 07:03:04.871] @process::amplitude INFO : overlap structure of group 0: [0: []]
809.02 s
gammaloop-nextest-integration> [2026-09-06 07:03:04.871] @commands::inspect INFO :
809.02 s
gammaloop-nextest-integration> Input point in momentum space:
809.02 s
gammaloop-nextest-integration>
809.02 s
gammaloop-nextest-integration> ( 0.1100000000000000, -0.0700000000000000, 0.1900000000000000 )
809.02 s
gammaloop-nextest-integration>
809.02 s
gammaloop-nextest-integration> The evaluation of integrand '1L_ppmm' is:
809.02 s
gammaloop-nextest-integration>
809.02 s
gammaloop-nextest-integration> ( -1.7132462539328486e-28, -8.7105072229446864e-10 i)
809.02 s
gammaloop-nextest-integration>
809.02 s
gammaloop-nextest-integration> The application panicked (crashed).
809.02 s
gammaloop-nextest-integration> Message: kinematics=a, integrand=1L_ppmm, graph_id=0: assembly vs symjit inspect: actual=(-0.00000000000000000000000000017132462539328486+-0.0000000008710507222944686i), expected=(0+0i), tolerance=0.0000000001
809.02 s
gammaloop-nextest-integration> Location: tests/tests/test_runs/utils.rs :466
809.02 s
gammaloop-nextest-integration>
809.02 s
gammaloop-nextest-integration> ━━━━━━━━━━━━━━━━━━━━━━━━━━━━━━━━━━ BACKTRACE ━━━━━━━━━━━━━━━━━━━━━━━━━━━━━━━━━━━
809.02 s
gammaloop-nextest-integration> 1: <color_eyre[51793ea62743adbd]::config::PanicHook>::panic_report <unknown>
809.02 s
gammaloop-nextest-integration> at <unknown source file> :<unknown line>
809.02 s
gammaloop-nextest-integration> 2: <color_eyre[51793ea62743adbd]::config::PanicHook>::into_panic_hook::{closure#0} <unknown>
809.02 s
gammaloop-nextest-integration> at <unknown source file> :<unknown line>
809.02 s
gammaloop-nextest-integration> 3: std[bcb96dfbba0ab899]::panicking::panic_with_hook <unknown>
809.02 s
gammaloop-nextest-integration> at <unknown source file> :<unknown line>
809.02 s
gammaloop-nextest-integration> 4: std[bcb96dfbba0ab899]::panicking::panic_handler::{closure#0} <unknown>
809.02 s
gammaloop-nextest-integration> at <unknown source file> :<unknown line>
809.02 s
gammaloop-nextest-integration> 5: std[bcb96dfbba0ab899]::sys::backtrace::__rust_end_short_backtrace::<std[bcb96dfbba0ab899]::panicking::panic_handler::{closure#0}, !> <unknown>
809.02 s
gammaloop-nextest-integration> at <unknown source file> :<unknown line>
809.02 s
gammaloop-nextest-integration> 6: __rustc[6c289b9f9c454d21]::rust_begin_unwind <unknown>
809.02 s
gammaloop-nextest-integration> at <unknown source file> :<unknown line>
809.02 s
gammaloop-nextest-integration> 7: core[940e698046960fd5]::panicking::panic_fmt <unknown>
809.02 s
gammaloop-nextest-integration> at <unknown source file> :<unknown line>
809.02 s
gammaloop-nextest-integration> 8: <test_runs[66584badfeb6c7be]::aa_aa::important::aa_aa_local_inspect_backend_consistency::{closure#0} as core[940e698046960fd5]::ops::function::FnOnce<()>>::call_once <unknown>
809.02 s
gammaloop-nextest-integration> at <unknown source file> :<unknown line>
809.02 s
gammaloop-nextest-integration> 9: serial_test[cd99724524a2f1c0]::serial_code_lock::local_serial_core_with_return::<(), eyre[cb2fd339c0c40fca]::Report> <unknown>
809.02 s
gammaloop-nextest-integration> at <unknown source file> :<unknown line>
809.02 s
gammaloop-nextest-integration> 10: <test_runs[66584badfeb6c7be]::aa_aa::important::aa_aa_local_inspect_backend_consistency::{closure#0} as core[940e698046960fd5]::ops::function::FnOnce<()>>::call_once <unknown>
809.02 s
gammaloop-nextest-integration> at <unknown source file> :<unknown line>
809.02 s
gammaloop-nextest-integration> 11: test[75d6903177b1d7e9]::__rust_begin_short_backtrace::<core[940e698046960fd5]::result::Result<(), alloc[2ea6bcb46fca0c42]::string::String>, fn() -> core[940e698046960fd5]::result::Result<(), alloc[2ea6bcb46fca0c42]::string::String>> <unknown>
809.02 s
gammaloop-nextest-integration> at <unknown source file> :<unknown line>
809.02 s
gammaloop-nextest-integration> 12: test[75d6903177b1d7e9]::run_test::{closure#0} <unknown>
809.02 s
gammaloop-nextest-integration> at <unknown source file> :<unknown line>
809.02 s
gammaloop-nextest-integration> 13: std[bcb96dfbba0ab899]::sys::backtrace::__rust_begin_short_backtrace::<test[75d6903177b1d7e9]::run_test::{closure#1}, ()> <unknown>
809.02 s
gammaloop-nextest-integration> at <unknown source file> :<unknown line>
809.02 s
gammaloop-nextest-integration> 14: <std[bcb96dfbba0ab899]::thread::lifecycle::spawn_unchecked<test[75d6903177b1d7e9]::run_test::{closure#1}, ()>::{closure#1} as core[940e698046960fd5]::ops::function::FnOnce<()>>::call_once::{shim:vtable#0} <unknown>
809.02 s
gammaloop-nextest-integration> at <unknown source file> :<unknown line>
809.02 s
gammaloop-nextest-integration> 15: <std[bcb96dfbba0ab899]::sys::thread::unix::Thread>::new::thread_start <unknown>
809.02 s
gammaloop-nextest-integration> at <unknown source file> :<unknown line>
809.02 s
gammaloop-nextest-integration> 16: start_thread <unknown>
809.02 s
gammaloop-nextest-integration> at <unknown source file> :<unknown line>
809.02 s
gammaloop-nextest-integration> 17: __clone3 <unknown>
809.02 s
gammaloop-nextest-integration> at <unknown source file> :<unknown line>
809.02 s
gammaloop-nextest-integration>
809.02 s
gammaloop-nextest-integration> Run with COLORBT_SHOW_HIDDEN=1 environment variable to disable frame filtering.
809.02 s
gammaloop-nextest-integration> Run with RUST_BACKTRACE=full to include source snippets.
809.02 s
gammaloop-nextest-integration>
809.10 s
gammaloop-nextest-integration> error : test run failed
809.12 s
gammaloop-nextest-integration>
809.12 s
gammaloop-nextest-integration> ========== nextest test summary ==========
809.12 s
gammaloop-nextest-integration> report: target/nextest/ci_gammaloop/junit.xml
809.12 s
gammaloop-nextest-integration> tests: 152, failures: 1, errors: 0
809.12 s
gammaloop-nextest-integration>
809.12 s
gammaloop-nextest-integration> 1. gammaloop-integration-tests::test_runs::aa_aa::important::aa_aa_local_inspect_backend_consistency
809.12 s
gammaloop-nextest-integration> failure: test failure with exit code 101
809.12 s
gammaloop-nextest-integration> system-out
809.12 s
gammaloop-nextest-integration> running 1 test
809.12 s
gammaloop-nextest-integration> test aa_aa::important::aa_aa_local_inspect_backend_consistency has been running for over 60 seconds
809.12 s
gammaloop-nextest-integration> test aa_aa::important::aa_aa_local_inspect_backend_consistency ... FAILED
809.12 s
gammaloop-nextest-integration>
809.12 s
gammaloop-nextest-integration> failures:
809.12 s
gammaloop-nextest-integration>
809.12 s
gammaloop-nextest-integration> failures:
809.12 s
gammaloop-nextest-integration> aa_aa::important::aa_aa_local_inspect_backend_consistency
809.12 s
gammaloop-nextest-integration>
809.12 s
gammaloop-nextest-integration> test result: FAILED. 0 passed; 1 failed; 0 ignored; 0 measured; 258 filtered out; finished in 71.03s
809.12 s
gammaloop-nextest-integration> system-err
809.12 s
gammaloop-nextest-integration> [2026-09-06 07:01:54.337] @gammaloop_api::se... INFO : Running command import model sm-default.json
809.12 s
gammaloop-nextest-integration> [2026-09-06 07:01:54.337] @import::model INFO : Loading built-in JSON model sm-default
809.12 s
gammaloop-nextest-integration> [2026-09-06 07:01:54.356] @gammalooprs::model INFO : The following 11 external parameters were forced to zero by the restriction card:
809.12 s
gammaloop-nextest-integration> lamWS, AWS, rhoWS, etaWS, ymc, yme, ymm, MC, Me, MM, WTau
809.12 s
gammaloop-nextest-integration> [2026-09-06 07:01:54.356] @gammalooprs::model INFO : The following 34 vertex rules were removed by the restriction card:
809.12 s
gammaloop-nextest-integration> V_82 -> (c~, d, G+) | V_83 -> (t~, d, G+) | V_84 -> (c~, s, G+) | V_85 -> (t~, s, G+) | V_86 -> (u~, b, G+) | V_87 -> (c~, b, G+) | V_90 -> (c~, d, W+) | V_91 -> (t~, d, W+) | V_92 -> (u~, s, W+) | V_94 -> (t~, s, W+) | V_95 -> (u~, b, W+) | V_96 -> (c~, b, W+) | V_101 -> (e+, e-, G0) | V_102 -> (mu+, mu-, G0) | V_104 -> (e+, e-, H) | V_105 -> (mu+, mu-, H) | V_110 -> (ve~, e-, G+) | V_111 -> (vm~, mu-, G+) | V_116 -> (b~, u, G-) | V_117 -> (d~, c, G-) | V_118 -> (s~, c, G-) | V_119 -> (b~, c, G-) | V_120 -> (d~, t, G-) | V_121 -> (s~, t, G-) | V_124 -> (s~, u, W-) | V_125 -> (b~, u, W-) | V_126 -> (d~, c, W-) | V_128 -> (b~, c, W-) | V_129 -> (d~, t, W-) | V_130 -> (s~, t, W-) | V_138 -> (c~, c, G0) | V_140 -> (c~, c, H) | V_145 -> (e+, ve, G-) | V_146 -> (mu+, vm, G-)
809.12 s
gammaloop-nextest-integration> [2026-09-06 07:01:54.356] @gammalooprs::model INFO : The following 36 couplings were removed by the restriction card:
809.12 s
gammaloop-nextest-integration> GC_13, GC_14, GC_16, GC_17, GC_18, GC_19, GC_20, GC_22, GC_23, GC_24, GC_25, GC_26, GC_28, GC_29, GC_42, GC_43, GC_44, GC_46, GC_47, GC_48, GC_84, GC_85, GC_86, GC_87, GC_88, GC_89, GC_90, GC_91, GC_92, GC_93, GC_101, GC_102, GC_103, GC_105, GC_106, GC_107
809.12 s
gammaloop-nextest-integration> [2026-09-06 07:01:54.357] @gammaloop_api::se... INFO : Running command run set_model_parameters
809.12 s
gammaloop-nextest-integration> [2026-09-06 07:01:54.357] @gammaloop_api::se... INFO : Starting command block set_model_parameters
809.12 s
gammaloop-nextest-integration> [2026-09-06 07:01:54.357] @gammaloop_api::se... INFO : Running command set model MT=173.0
809.12 s
gammaloop-nextest-integration> [2026-09-06 07:01:54.360] @gammaloop_api::se... INFO : Running command set model WT=0.0
809.12 s
gammaloop-nextest-integration> [2026-09-06 07:01:54.364] @gammaloop_api::se... INFO : Running command set model ymt=173.0
809.12 s
gammaloop-nextest-integration> [2026-09-06 07:01:54.367] @gammaloop_api::se... INFO : Running command set model aS=0.118
809.12 s
gammaloop-nextest-integration> [2026-09-06 07:01:54.370] @gammaloop_api::se... INFO : Running command set model aEWM1=137.036
809.12 s
gammaloop-nextest-integration> [2026-09-06 07:01:54.373] @gammaloop_api::se... INFO : Running command set model Gf=1.166390e-05
809.12 s
gammaloop-nextest-integration> [2026-09-06 07:01:54.377] @gammaloop_api::se... INFO : Running command set model MZ=91.188
809.12 s
gammaloop-nextest-integration> [2026-09-06 07:01:54.380] @gammaloop_api::se... INFO : Running command set global string '
809.12 s
gammaloop-nextest-integration> [global.generation.compile]
809.12 s
gammaloop-nextest-integration> compilation_mode = "symjit"
809.12 s
gammaloop-nextest-integration> optimization_level = "O0"
809.12 s
gammaloop-nextest-integration> fast_math = false
809.12 s
gammaloop-nextest-integration> [...]
809.12 s
gammaloop-nextest-integration> [2026-09-06 07:01:54.381] @gammaloop_api::se... INFO : Running command import graphs ./examples/cli/aa_aa/1L/aa_aa_1L.dot -p aa_aa_all_helicities -i 1L_ppmm -o
809.12 s
gammaloop-nextest-integration> [2026-09-06 07:01:54.381] @commands::import INFO : Loading graphs from '/build/source/examples/cli/aa_aa/1L/aa_aa_1L.dot'
809.12 s
gammaloop-nextest-integration> [2026-09-06 07:01:54.389] @gammaloop_api::se... INFO : Running command generate existing -p aa_aa_all_helicities
809.12 s
gammaloop-nextest-integration> [2026-09-06 07:02:21.784] @commands::generate INFO :
809.12 s
gammaloop-nextest-integration> Integrand generation summary
809.12 s
gammaloop-nextest-integration> peak RAM 1.09 GiB | cores 1
809.12 s
gammaloop-nextest-integration> ╭───────────┬───────┬─────────┬──────────────┬─────────────┬────────────────┬──────────────╮
809.12 s
gammaloop-nextest-integration> │ integrand │ graph │ # evals │ expr build │ spenso │ symbolica eval │ compile │
809.12 s
gammaloop-nextest-integration> ├───────────┼───────┼─────────┼──────────────┼─────────────┼────────────────┼──────────────┤
809.12 s
gammaloop-nextest-integration> │ 1L_ppmm │ GL0 │ 13 │ 525ms (5.6%) │ 1.81s (19%) │ 6.12s (65%) │ 923ms (9.8%) │
809.12 s
gammaloop-nextest-integration> │ 1L_ppmm │ GL2 │ 13 │ 490ms (5.6%) │ 1.57s (18%) │ 5.81s (66%) │ 890ms (10%) │
809.12 s
gammaloop-nextest-integration> │ 1L_ppmm │ GL4 │ 11 │ 503ms (5.5%) │ 1.79s (19%) │ 6.06s (66%) │ 875ms (9.5%) │
809.12 s
gammaloop-nextest-integration> ├───────────┼───────┼─────────┼──────────────┼─────────────┼────────────────┼──────────────┤
809.12 s
gammaloop-nextest-integration> │ Total │ │ 37 │ 1.52s (5.6%) │ 5.17s (19%) │ 18.00s (66%) │ 2.69s (9.8%) │
809.12 s
gammaloop-nextest-integration> ╰───────────┴───────┴─────────┴──────────────┴─────────────┴────────────────┴──────────────╯
809.12 s
gammaloop-nextest-integration> [2026-09-06 07:02:22.731] @gammaloop_api::se... INFO : Running command import model sm-default.json
809.12 s
gammaloop-nextest-integration> [2026-09-06 07:02:22.731] @import::model INFO : Loading built-in JSON model sm-default
809.12 s
gammaloop-nextest-integration> [2026-09-06 07:02:22.753] @gammalooprs::model INFO : The following 11 external parameters were forced to zero by the restriction card:
809.12 s
gammaloop-nextest-integration> lamWS, AWS, rhoWS, etaWS, ymc, yme, ymm, MC, Me, MM, WTau
809.12 s
gammaloop-nextest-integration> [2026-09-06 07:02:22.753] @gammalooprs::model INFO : The following 34 vertex rules were removed by the restriction card:
809.12 s
gammaloop-nextest-integration> V_82 -> (c~, d, G+) | V_83 -> (t~, d, G+) | V_84 -> (c~, s, G+) | V_85 -> (t~, s, G+) | V_86 -> (u~, b, G+) | V_87 -> (c~, b, G+) | V_90 -> (c~, d, W+) | V_91 -> (t~, d, W+) | V_92 -> (u~, s, W+) | V_94 -> (t~, s, W+) | V_95 -> (u~, b, W+) | V_96 -> (c~, b, W+) | V_101 -> (e+, e-, G0) | V_102 -> (mu+, mu-, G0) | V_104 -> (e+, e-, H) | V_105 -> (mu+, mu-, H) | V_110 -> (ve~, e-, G+) | V_111 -> (vm~, mu-, G+) | V_116 -> (b~, u, G-) | V_117 -> (d~, c, G-) | V_118 -> (s~, c, G-) | V_119 -> (b~, c, G-) | V_120 -> (d~, t, G-) | V_121 -> (s~, t, G-) | V_124 -> (s~, u, W-) | V_125 -> (b~, u, W-) | V_126 -> (d~, c, W-) | V_128 -> (b~, c, W-) | V_129 -> (d~, t, W-) | V_130 -> (s~, t, W-) | V_138 -> (c~, c, G0) | V_140 -> (c~, c, H) | V_145 -> (e+, ve, G-) | V_146 -> (mu+, vm, G-)
809.12 s
gammaloop-nextest-integration> [2026-09-06 07:02:22.753] @gammalooprs::model INFO : The following 36 couplings were removed by the restriction card:
809.12 s
gammaloop-nextest-integration> GC_13, GC_14, GC_16, GC_17, GC_18, GC_19, GC_20, GC_22, GC_23, GC_24, GC_25, GC_26, GC_28, GC_29, GC_42, GC_43, GC_44, GC_46, GC_47, GC_48, GC_84, GC_85, GC_86, GC_87, GC_88, GC_89, GC_90, GC_91, GC_92, GC_93, GC_101, GC_102, GC_103, GC_105, GC_106, GC_107
809.12 s
gammaloop-nextest-integration> [2026-09-06 07:02:22.754] @gammaloop_api::se... INFO : Running command run set_model_parameters
809.12 s
gammaloop-nextest-integration> [2026-09-06 07:02:22.754] @gammaloop_api::se... INFO : Starting command block set_model_parameters
809.12 s
gammaloop-nextest-integration> [2026-09-06 07:02:22.754] @gammaloop_api::se... INFO : Running command set model MT=173.0
809.12 s
gammaloop-nextest-integration> [2026-09-06 07:02:22.758] @gammaloop_api::se... INFO : Running command set model WT=0.0
809.12 s
gammaloop-nextest-integration> [2026-09-06 07:02:22.762] @gammaloop_api::se... INFO : Running command set model ymt=173.0
809.12 s
gammaloop-nextest-integration> [2026-09-06 07:02:22.766] @gammaloop_api::se... INFO : Running command set model aS=0.118
809.12 s
gammaloop-nextest-integration> [2026-09-06 07:02:22.770] @gammaloop_api::se... INFO : Running command set model aEWM1=137.036
809.12 s
gammaloop-nextest-integration> [2026-09-06 07:02:22.774] @gammaloop_api::se... INFO : Running command set model Gf=1.166390e-05
809.12 s
gammaloop-nextest-integration> [2026-09-06 07:02:22.777] @gammaloop_api::se... INFO : Running command set model MZ=91.188
809.12 s
gammaloop-nextest-integration> [2026-09-06 07:02:22.782] @gammaloop_api::se... INFO : Running command set global string '
809.12 s
gammaloop-nextest-integration> [global.generation.compile]
809.12 s
gammaloop-nextest-integration> compilation_mode = "assembly"
809.12 s
gammaloop-nextest-integration> optimization_level = "O0"
809.12 s
gammaloop-nextest-integration> fast_math = false
809.12 s
gammaloop-nextest-integration> [...]
809.12 s
gammaloop-nextest-integration> [2026-09-06 07:02:22.783] @gammaloop_api::se... INFO : Running command import graphs ./examples/cli/aa_aa/1L/aa_aa_1L.dot -p aa_aa_all_helicities_assembly -i 1L_ppmm -o
809.12 s
gammaloop-nextest-integration> [2026-09-06 07:02:22.783] @commands::import INFO : Loading graphs from '/build/source/examples/cli/aa_aa/1L/aa_aa_1L.dot'
809.12 s
gammaloop-nextest-integration> [2026-09-06 07:02:22.791] @gammaloop_api::se... INFO : Running command generate existing -p aa_aa_all_helicities_assembly
809.12 s
gammaloop-nextest-integration> [2026-09-06 07:02:45.043] @processes::amplitude INFO : Compiling amplitude 1L_ppmm
809.12 s
gammaloop-nextest-integration> [2026-09-06 07:03:04.191] @commands::generate INFO : Removed 34 generated C++ source file(s). Use '--keep-sources' to keep them.
809.12 s
gammaloop-nextest-integration> [2026-09-06 07:03:04.191] @commands::generate INFO :
809.12 s
gammaloop-nextest-integration> Integrand generation summary
809.12 s
gammaloop-nextest-integration> peak RAM 2.21 GiB | cores 1
809.12 s
gammaloop-nextest-integration> ╭───────────┬───────┬─────────┬──────────────┬──────────────┬────────────────┬──────────────╮
809.12 s
gammaloop-nextest-integration> │ integrand │ graph │ # evals │ expr build │ spenso │ symbolica eval │ compile │
809.12 s
gammaloop-nextest-integration> ├───────────┼───────┼─────────┼──────────────┼──────────────┼────────────────┼──────────────┤
809.12 s
gammaloop-nextest-integration> │ 1L_ppmm │ GL0 │ 13 │ 562ms (4.0%) │ 1.51s (11%) │ 5.68s (41%) │ 6.16s (44%) │
809.12 s
gammaloop-nextest-integration> │ 1L_ppmm │ GL2 │ 13 │ 593ms (4.2%) │ 1.37s (9.6%) │ 5.34s (37%) │ 6.95s (49%) │
809.13 s
gammaloop-nextest-integration> │ 1L_ppmm │ GL4 │ 11 │ 581ms (4.4%) │ 1.35s (10%) │ 5.23s (40%) │ 6.03s (46%) │
809.13 s
gammaloop-nextest-integration> ├───────────┼───────┼─────────┼──────────────┼──────────────┼────────────────┼──────────────┤
809.13 s
gammaloop-nextest-integration> │ Total │ │ 37 │ 1.74s (4.2%) │ 4.24s (10%) │ 16.25s (39%) │ 19.14s (46%) │
809.13 s
gammaloop-nextest-integration> ╰───────────┴───────┴─────────┴──────────────┴──────────────┴────────────────┴──────────────╯
809.13 s
gammaloop-nextest-integration> [2026-09-06 07:03:04.857] @gammaloop_api::se... INFO : Running command set process -p aa_aa_all_helicities -i 1L_ppmm string '
809.13 s
gammaloop-nextest-integration> [stability]
809.13 s
gammaloop-nextest-integration> check_on_norm = true
809.13 s
gammaloop-nextest-integration> escalate_if_exact_zero = false
809.13 s
gammaloop-nextest-integration> loop_momenta_norm_escalation_factor = -1.0
809.13 s
gammaloop-nextest-integration> [...]
809.13 s
gammaloop-nextest-integration> [2026-09-06 07:03:04.857] @gammaloop_api::se... INFO : Running command set process -p aa_aa_all_helicities_assembly -i 1L_ppmm string '
809.13 s
gammaloop-nextest-integration> [stability]
809.13 s
gammaloop-nextest-integration> check_on_norm = true
809.13 s
gammaloop-nextest-integration> escalate_if_exact_zero = false
809.13 s
gammaloop-nextest-integration> loop_momenta_norm_escalation_factor = -1.0
809.13 s
gammaloop-nextest-integration> [...]
809.13 s
gammaloop-nextest-integration> [2026-09-06 07:03:04.858] @gammaloop_api::se... INFO : Running command set process -p aa_aa_all_helicities -i 1L_mpmm string '
809.13 s
gammaloop-nextest-integration> [stability]
809.13 s
gammaloop-nextest-integration> check_on_norm = true
809.13 s
gammaloop-nextest-integration> escalate_if_exact_zero = false
809.13 s
gammaloop-nextest-integration> loop_momenta_norm_escalation_factor = -1.0
809.13 s
gammaloop-nextest-integration> [...]
809.13 s
gammaloop-nextest-integration> [2026-09-06 07:03:04.859] @gammaloop_api::se... INFO : Running command set process -p aa_aa_all_helicities_assembly -i 1L_mpmm string '
809.13 s
gammaloop-nextest-integration> [stability]
809.13 s
gammaloop-nextest-integration> check_on_norm = true
809.13 s
gammaloop-nextest-integration> escalate_if_exact_zero = false
809.13 s
gammaloop-nextest-integration> loop_momenta_norm_escalation_factor = -1.0
809.13 s
gammaloop-nextest-integration> [...]
809.13 s
gammaloop-nextest-integration> [2026-09-06 07:03:04.859] @gammaloop_api::se... INFO : Running command set process -p aa_aa_all_helicities -i 1L_mmmm string '
809.13 s
gammaloop-nextest-integration> [stability]
809.13 s
gammaloop-nextest-integration> check_on_norm = true
809.13 s
gammaloop-nextest-integration> escalate_if_exact_zero = false
809.13 s
gammaloop-nextest-integration> loop_momenta_norm_escalation_factor = -1.0
809.13 s
gammaloop-nextest-integration> [...]
809.13 s
gammaloop-nextest-integration> [2026-09-06 07:03:04.860] @gammaloop_api::se... INFO : Running command set process -p aa_aa_all_helicities_assembly -i 1L_mmmm string '
809.13 s
gammaloop-nextest-integration> [stability]
809.13 s
gammaloop-nextest-integration> check_on_norm = true
809.13 s
gammaloop-nextest-integration> escalate_if_exact_zero = false
809.13 s
gammaloop-nextest-integration> loop_momenta_norm_escalation_factor = -1.0
809.13 s
gammaloop-nextest-integration> [...]
809.13 s
gammaloop-nextest-integration> [2026-09-06 07:03:04.861] @gammaloop_api::se... INFO : Running command set process -p aa_aa_all_helicities -i 1L_pmmp string '
809.13 s
gammaloop-nextest-integration> [stability]
809.13 s
gammaloop-nextest-integration> check_on_norm = true
809.13 s
gammaloop-nextest-integration> escalate_if_exact_zero = false
809.13 s
gammaloop-nextest-integration> loop_momenta_norm_escalation_factor = -1.0
809.13 s
gammaloop-nextest-integration> ... omitted 84 more lines; see full nextest output above
809.13 s
gammaloop-nextest-integration> =========================================
809.23 s
error: Cannot build '/nix/store/3qpyi4i089mjhqx61pnq05lcl2pfrw3d-gammaloop-nextest-integration.drv '.
809.23 s
Reason: builder failed with exit code 100 .
809.23 s
Output paths:
809.23 s
/nix/store/qyb58cjmy2g43lf39wd171npb5v3mmpa-gammaloop-nextest-integration
809.23 s
Last 586 log lines:
809.23 s
> Extracting 13 binaries, 1 build script output directory, and 3 linked paths to /build/nextest-archive-930Ufy
809.23 s
> Extracted 30 files to /build/nextest-archive-930Ufy in 2.02s
809.23 s
> ------------
809.23 s
> Nextest run ID 6fb25a9f-db91-4514-9c64-4d5c1962672f with nextest profile: ci_gammaloop
809.23 s
> Starting 152 tests across 13 binaries (208 tests skipped , including 207 tests via profile.ci_gammaloop.default-filter )
809.23 s
> FAIL [ 71.208s] ( 54/152) gammaloop-integration-tests::test_runs aa_aa::important :: aa_aa_local_inspect_backend_consistency
809.23 s
> stdout ---
809.23 s
>
809.23 s
> running 1 test
809.23 s
> test aa_aa::important::aa_aa_local_inspect_backend_consistency has been running for over 60 seconds
809.23 s
> test aa_aa::important::aa_aa_local_inspect_backend_consistency ... FAILED
809.23 s
>
809.23 s
> failures:
809.23 s
>
809.23 s
> failures:
809.23 s
> aa_aa::important::aa_aa_local_inspect_backend_consistency
809.23 s
>
809.23 s
> test result: FAILED. 0 passed; 1 failed; 0 ignored; 0 measured; 258 filtered out; finished in 71.03s
809.23 s
>
809.23 s
> stderr ---
809.23 s
> [2026-09-06 07:01:54.337] @gammaloop_api::se... INFO : Running command import model sm-default.json
809.23 s
> [2026-09-06 07:01:54.337] @import::model INFO : Loading built-in JSON model sm-default
809.23 s
> [2026-09-06 07:01:54.356] @gammalooprs::model INFO : The following 11 external parameters were forced to zero by the restriction card:
809.23 s
> lamWS, AWS, rhoWS, etaWS, ymc, yme, ymm, MC, Me, MM, WTau
809.23 s
> [2026-09-06 07:01:54.356] @gammalooprs::model INFO : The following 34 vertex rules were removed by the restriction card:
809.23 s
> V_82 -> (c~, d, G+) | V_83 -> (t~, d, G+) | V_84 -> (c~, s, G+) | V_85 -> (t~, s, G+) | V_86 -> (u~, b, G+) | V_87 -> (c~, b, G+) | V_90 -> (c~, d, W+) | V_91 -> (t~, d, W+) | V_92 -> (u~, s, W+) | V_94 -> (t~, s, W+) | V_95 -> (u~, b, W+) | V_96 -> (c~, b, W+) | V_101 -> (e+, e-, G0) | V_102 -> (mu+, mu-, G0) | V_104 -> (e+, e-, H) | V_105 -> (mu+, mu-, H) | V_110 -> (ve~, e-, G+) | V_111 -> (vm~, mu-, G+) | V_116 -> (b~, u, G-) | V_117 -> (d~, c, G-) | V_118 -> (s~, c, G-) | V_119 -> (b~, c, G-) | V_120 -> (d~, t, G-) | V_121 -> (s~, t, G-) | V_124 -> (s~, u, W-) | V_125 -> (b~, u, W-) | V_126 -> (d~, c, W-) | V_128 -> (b~, c, W-) | V_129 -> (d~, t, W-) | V_130 -> (s~, t, W-) | V_138 -> (c~, c, G0) | V_140 -> (c~, c, H) | V_145 -> (e+, ve, G-) | V_146 -> (mu+, vm, G-)
809.23 s
> [2026-09-06 07:01:54.356] @gammalooprs::model INFO : The following 36 couplings were removed by the restriction card:
809.23 s
> GC_13, GC_14, GC_16, GC_17, GC_18, GC_19, GC_20, GC_22, GC_23, GC_24, GC_25, GC_26, GC_28, GC_29, GC_42, GC_43, GC_44, GC_46, GC_47, GC_48, GC_84, GC_85, GC_86, GC_87, GC_88, GC_89, GC_90, GC_91, GC_92, GC_93, GC_101, GC_102, GC_103, GC_105, GC_106, GC_107
809.23 s
> [2026-09-06 07:01:54.357] @gammaloop_api::se... INFO : Running command run set_model_parameters
809.23 s
> [2026-09-06 07:01:54.357] @gammaloop_api::se... INFO : Starting command block set_model_parameters
809.23 s
> [2026-09-06 07:01:54.357] @gammaloop_api::se... INFO : Running command set model MT=173.0
809.23 s
> [2026-09-06 07:01:54.360] @gammaloop_api::se... INFO : Running command set model WT=0.0
809.23 s
> [2026-09-06 07:01:54.364] @gammaloop_api::se... INFO : Running command set model ymt=173.0
809.23 s
> [2026-09-06 07:01:54.367] @gammaloop_api::se... INFO : Running command set model aS=0.118
809.23 s
> [2026-09-06 07:01:54.370] @gammaloop_api::se... INFO : Running command set model aEWM1=137.036
809.23 s
> [2026-09-06 07:01:54.373] @gammaloop_api::se... INFO : Running command set model Gf=1.166390e-05
809.23 s
> [2026-09-06 07:01:54.377] @gammaloop_api::se... INFO : Running command set model MZ=91.188
809.23 s
> [2026-09-06 07:01:54.380] @gammaloop_api::se... INFO : Running command set global string '
809.23 s
> [global.generation.compile]
809.23 s
> compilation_mode = "symjit"
809.23 s
> optimization_level = "O0"
809.23 s
> fast_math = false
809.23 s
> [...]
809.23 s
> [2026-09-06 07:01:54.381] @gammaloop_api::se... INFO : Running command import graphs ./examples/cli/aa_aa/1L/aa_aa_1L.dot -p aa_aa_all_helicities -i 1L_ppmm -o
809.23 s
> [2026-09-06 07:01:54.381] @commands::import INFO : Loading graphs from '/build/source/examples/cli/aa_aa/1L/aa_aa_1L.dot'
809.23 s
> [2026-09-06 07:01:54.389] @gammaloop_api::se... INFO : Running command generate existing -p aa_aa_all_helicities
809.23 s
> [2026-09-06 07:02:21.784] @commands::generate INFO :
809.23 s
> Integrand generation summary
809.23 s
> peak RAM 1.09 GiB | cores 1
809.23 s
> ╭───────────┬───────┬─────────┬──────────────┬─────────────┬────────────────┬──────────────╮
809.23 s
> │ integrand │ graph │ # evals │ expr build │ spenso │ symbolica eval │ compile │
809.23 s
> ├───────────┼───────┼─────────┼──────────────┼─────────────┼────────────────┼──────────────┤
809.23 s
> │ 1L_ppmm │ GL0 │ 13 │ 525ms (5.6% ) │ 1.81s (19% ) │ 6.12s (65% ) │ 923ms (9.8% ) │
809.23 s
> │ 1L_ppmm │ GL2 │ 13 │ 490ms (5.6% ) │ 1.57s (18% ) │ 5.81s (66% ) │ 890ms (10% ) │
809.23 s
> │ 1L_ppmm │ GL4 │ 11 │ 503ms (5.5% ) │ 1.79s (19% ) │ 6.06s (66% ) │ 875ms (9.5% ) │
809.23 s
> ├───────────┼───────┼─────────┼──────────────┼─────────────┼────────────────┼──────────────┤
809.23 s
> │ Total │ │ 37 │ 1.52s (5.6% ) │ 5.17s (19% ) │ 18.00s (66% ) │ 2.69s (9.8% ) │
809.23 s
> ╰───────────┴───────┴─────────┴──────────────┴─────────────┴────────────────┴──────────────╯
809.23 s
> [2026-09-06 07:02:22.731] @gammaloop_api::se... INFO : Running command import model sm-default.json
809.23 s
> [2026-09-06 07:02:22.731] @import::model INFO : Loading built-in JSON model sm-default
809.23 s
> [2026-09-06 07:02:22.753] @gammalooprs::model INFO : The following 11 external parameters were forced to zero by the restriction card:
809.23 s
> lamWS, AWS, rhoWS, etaWS, ymc, yme, ymm, MC, Me, MM, WTau
809.23 s
> [2026-09-06 07:02:22.753] @gammalooprs::model INFO : The following 34 vertex rules were removed by the restriction card:
809.23 s
> V_82 -> (c~, d, G+) | V_83 -> (t~, d, G+) | V_84 -> (c~, s, G+) | V_85 -> (t~, s, G+) | V_86 -> (u~, b, G+) | V_87 -> (c~, b, G+) | V_90 -> (c~, d, W+) | V_91 -> (t~, d, W+) | V_92 -> (u~, s, W+) | V_94 -> (t~, s, W+) | V_95 -> (u~, b, W+) | V_96 -> (c~, b, W+) | V_101 -> (e+, e-, G0) | V_102 -> (mu+, mu-, G0) | V_104 -> (e+, e-, H) | V_105 -> (mu+, mu-, H) | V_110 -> (ve~, e-, G+) | V_111 -> (vm~, mu-, G+) | V_116 -> (b~, u, G-) | V_117 -> (d~, c, G-) | V_118 -> (s~, c, G-) | V_119 -> (b~, c, G-) | V_120 -> (d~, t, G-) | V_121 -> (s~, t, G-) | V_124 -> (s~, u, W-) | V_125 -> (b~, u, W-) | V_126 -> (d~, c, W-) | V_128 -> (b~, c, W-) | V_129 -> (d~, t, W-) | V_130 -> (s~, t, W-) | V_138 -> (c~, c, G0) | V_140 -> (c~, c, H) | V_145 -> (e+, ve, G-) | V_146 -> (mu+, vm, G-)
809.23 s
> [2026-09-06 07:02:22.753] @gammalooprs::model INFO : The following 36 couplings were removed by the restriction card:
809.23 s
> GC_13, GC_14, GC_16, GC_17, GC_18, GC_19, GC_20, GC_22, GC_23, GC_24, GC_25, GC_26, GC_28, GC_29, GC_42, GC_43, GC_44, GC_46, GC_47, GC_48, GC_84, GC_85, GC_86, GC_87, GC_88, GC_89, GC_90, GC_91, GC_92, GC_93, GC_101, GC_102, GC_103, GC_105, GC_106, GC_107
809.23 s
> [2026-09-06 07:02:22.754] @gammaloop_api::se... INFO : Running command run set_model_parameters
809.23 s
> [2026-09-06 07:02:22.754] @gammaloop_api::se... INFO : Starting command block set_model_parameters
809.23 s
> [2026-09-06 07:02:22.754] @gammaloop_api::se... INFO : Running command set model MT=173.0
809.23 s
> [2026-09-06 07:02:22.758] @gammaloop_api::se... INFO : Running command set model WT=0.0
809.23 s
> [2026-09-06 07:02:22.762] @gammaloop_api::se... INFO : Running command set model ymt=173.0
809.23 s
> [2026-09-06 07:02:22.766] @gammaloop_api::se... INFO : Running command set model aS=0.118
809.23 s
> [2026-09-06 07:02:22.770] @gammaloop_api::se... INFO : Running command set model aEWM1=137.036
809.23 s
> [2026-09-06 07:02:22.774] @gammaloop_api::se... INFO : Running command set model Gf=1.166390e-05
809.23 s
> [2026-09-06 07:02:22.777] @gammaloop_api::se... INFO : Running command set model MZ=91.188
809.23 s
> [2026-09-06 07:02:22.782] @gammaloop_api::se... INFO : Running command set global string '
809.23 s
> [global.generation.compile]
809.23 s
> compilation_mode = "assembly"
809.23 s
> optimization_level = "O0"
809.23 s
> fast_math = false
809.23 s
> [...]
809.23 s
> [2026-09-06 07:02:22.783] @gammaloop_api::se... INFO : Running command import graphs ./examples/cli/aa_aa/1L/aa_aa_1L.dot -p aa_aa_all_helicities_assembly -i 1L_ppmm -o
809.23 s
> [2026-09-06 07:02:22.783] @commands::import INFO : Loading graphs from '/build/source/examples/cli/aa_aa/1L/aa_aa_1L.dot'
809.23 s
> [2026-09-06 07:02:22.791] @gammaloop_api::se... INFO : Running command generate existing -p aa_aa_all_helicities_assembly
809.23 s
> [2026-09-06 07:02:45.043] @processes::amplitude INFO : Compiling amplitude 1L_ppmm
809.23 s
> [2026-09-06 07:03:04.191] @commands::generate INFO : Removed 34 generated C++ source file(s). Use '--keep-sources ' to keep them.
809.23 s
> [2026-09-06 07:03:04.191] @commands::generate INFO :
809.23 s
> Integrand generation summary
809.23 s
> peak RAM 2.21 GiB | cores 1
809.23 s
> ╭───────────┬───────┬─────────┬──────────────┬──────────────┬────────────────┬──────────────╮
809.23 s
> │ integrand │ graph │ # evals │ expr build │ spenso │ symbolica eval │ compile │
809.23 s
> ├───────────┼───────┼─────────┼──────────────┼──────────────┼────────────────┼──────────────┤
809.23 s
> │ 1L_ppmm │ GL0 │ 13 │ 562ms (4.0% ) │ 1.51s (11% ) │ 5.68s (41% ) │ 6.16s (44% ) │
809.23 s
> │ 1L_ppmm │ GL2 │ 13 │ 593ms (4.2% ) │ 1.37s (9.6% ) │ 5.34s (37% ) │ 6.95s (49% ) │
809.23 s
> │ 1L_ppmm │ GL4 │ 11 │ 581ms (4.4% ) │ 1.35s (10% ) │ 5.23s (40% ) │ 6.03s (46% ) │
809.23 s
> ├───────────┼───────┼─────────┼──────────────┼──────────────┼────────────────┼──────────────┤
809.23 s
> │ Total │ │ 37 │ 1.74s (4.2% ) │ 4.24s (10% ) │ 16.25s (39% ) │ 19.14s (46% ) │
809.23 s
> ╰───────────┴───────┴─────────┴──────────────┴──────────────┴────────────────┴──────────────╯
809.23 s
> [2026-09-06 07:03:04.857] @gammaloop_api::se... INFO : Running command set process -p aa_aa_all_helicities -i 1L_ppmm string '
809.23 s
> [stability]
809.23 s
> check_on_norm = true
809.23 s
> escalate_if_exact_zero = false
809.23 s
> loop_momenta_norm_escalation_factor = -1.0
809.23 s
> [...]
809.23 s
> [2026-09-06 07:03:04.857] @gammaloop_api::se... INFO : Running command set process -p aa_aa_all_helicities_assembly -i 1L_ppmm string '
809.23 s
> [stability]
809.23 s
> check_on_norm = true
809.23 s
> escalate_if_exact_zero = false
809.23 s
> loop_momenta_norm_escalation_factor = -1.0
809.23 s
> [...]
809.23 s
> [2026-09-06 07:03:04.858] @gammaloop_api::se... INFO : Running command set process -p aa_aa_all_helicities -i 1L_mpmm string '
809.23 s
> [stability]
809.23 s
> check_on_norm = true
809.23 s
> escalate_if_exact_zero = false
809.23 s
> loop_momenta_norm_escalation_factor = -1.0
809.23 s
> [...]
809.23 s
> [2026-09-06 07:03:04.859] @gammaloop_api::se... INFO : Running command set process -p aa_aa_all_helicities_assembly -i 1L_mpmm string '
809.23 s
> [stability]
809.23 s
> check_on_norm = true
809.23 s
> escalate_if_exact_zero = false
809.23 s
> loop_momenta_norm_escalation_factor = -1.0
809.23 s
> [...]
809.23 s
> [2026-09-06 07:03:04.859] @gammaloop_api::se... INFO : Running command set process -p aa_aa_all_helicities -i 1L_mmmm string '
809.23 s
> [stability]
809.23 s
> check_on_norm = true
809.23 s
> escalate_if_exact_zero = false
809.23 s
> loop_momenta_norm_escalation_factor = -1.0
809.23 s
> [...]
809.23 s
> [2026-09-06 07:03:04.860] @gammaloop_api::se... INFO : Running command set process -p aa_aa_all_helicities_assembly -i 1L_mmmm string '
809.23 s
> [stability]
809.23 s
> check_on_norm = true
809.23 s
> escalate_if_exact_zero = false
809.23 s
> loop_momenta_norm_escalation_factor = -1.0
809.23 s
> [...]
809.23 s
> [2026-09-06 07:03:04.861] @gammaloop_api::se... INFO : Running command set process -p aa_aa_all_helicities -i 1L_pmmp string '
809.23 s
> [stability]
809.23 s
> check_on_norm = true
809.23 s
> escalate_if_exact_zero = false
809.23 s
> loop_momenta_norm_escalation_factor = -1.0
809.23 s
> [...]
809.23 s
> [2026-09-06 07:03:04.861] @gammaloop_api::se... INFO : Running command set process -p aa_aa_all_helicities_assembly -i 1L_pmmp string '
809.23 s
> [stability]
809.23 s
> check_on_norm = true
809.23 s
> escalate_if_exact_zero = false
809.23 s
> loop_momenta_norm_escalation_factor = -1.0
809.23 s
> [...]
809.23 s
> [2026-09-06 07:03:04.862] @gammaloop_api::se... INFO : Running command set process -p aa_aa_all_helicities -i 1L_pmpm string '
809.23 s
> [stability]
809.23 s
> check_on_norm = true
809.23 s
> escalate_if_exact_zero = false
809.23 s
> loop_momenta_norm_escalation_factor = -1.0
809.23 s
> [...]
809.23 s
> [2026-09-06 07:03:04.863] @gammaloop_api::se... INFO : Running command set process -p aa_aa_all_helicities_assembly -i 1L_pmpm string '
809.23 s
> [stability]
809.23 s
> check_on_norm = true
809.23 s
> escalate_if_exact_zero = false
809.23 s
> loop_momenta_norm_escalation_factor = -1.0
809.23 s
> [...]
809.23 s
> [2026-09-06 07:03:04.867] @process::amplitude INFO : Input is below threshold: 0 existing threshold E-surfaces across 0/1 graph groups
809.23 s
> [2026-09-06 07:03:04.867] @process::amplitude INFO : overlap structure of group 0: [0: []]
809.23 s
> [2026-09-06 07:03:04.868] @integrands::process [{#im_is_nan, #re_is_nan}] WARNING : final process evaluation is nonfinite
809.23 s
> [2026-09-06 07:03:04.868] @commands::inspect INFO :
809.23 s
> Input point in momentum space:
809.23 s
>
809.23 s
> ( 0.1100000000000000, -0.0700000000000000, 0.1900000000000000 )
809.23 s
>
809.23 s
> The evaluation of integrand '1L_ppmm' is:
809.23 s
>
809.23 s
> ( +0.0000000000000000e0, +0.0000000000000000e0 i)
809.23 s
>
809.23 s
> [2026-09-06 07:03:04.871] @process::amplitude INFO : Input is below threshold: 0 existing threshold E-surfaces across 0/1 graph groups
809.23 s
> [2026-09-06 07:03:04.871] @process::amplitude INFO : overlap structure of group 0: [0: []]
809.23 s
> [2026-09-06 07:03:04.871] @commands::inspect INFO :
809.23 s
> Input point in momentum space:
809.23 s
>
809.23 s
> ( 0.1100000000000000, -0.0700000000000000, 0.1900000000000000 )
809.23 s
>
809.23 s
> The evaluation of integrand '1L_ppmm' is:
809.23 s
>
809.23 s
> ( -1.7132462539328486e-28, -8.7105072229446864e-10 i)
809.23 s
>
809.23 s
> The application panicked (crashed).
809.23 s
> Message: kinematics=a, integrand=1L_ppmm, graph_id=0: assembly vs symjit inspect: actual=(-0.00000000000000000000000000017132462539328486+-0.0000000008710507222944686i), expected=(0+0i), tolerance=0.0000000001
809.23 s
> Location: tests/tests/test_runs/utils.rs :466
809.23 s
>
809.23 s
> ━━━━━━━━━━━━━━━━━━━━━━━━━━━━━━━━━━ BACKTRACE ━━━━━━━━━━━━━━━━━━━━━━━━━━━━━━━━━━━
809.23 s
> 1: <color_eyre[51793ea62743adbd]::config::PanicHook>::panic_report <unknown>
809.23 s
> at <unknown source file> :<unknown line>
809.23 s
> 2: <color_eyre[51793ea62743adbd]::config::PanicHook>::into_panic_hook::{closure#0} <unknown>
809.23 s
> at <unknown source file> :<unknown line>
809.23 s
> 3: std[bcb96dfbba0ab899]::panicking::panic_with_hook <unknown>
809.23 s
> at <unknown source file> :<unknown line>
809.23 s
> 4: std[bcb96dfbba0ab899]::panicking::panic_handler::{closure#0} <unknown>
809.23 s
> at <unknown source file> :<unknown line>
809.23 s
> 5: std[bcb96dfbba0ab899]::sys::backtrace::__rust_end_short_backtrace::<std[bcb96dfbba0ab899]::panicking::panic_handler::{closure#0}, !> <unknown>
809.23 s
> at <unknown source file> :<unknown line>
809.23 s
> 6: __rustc[6c289b9f9c454d21]::rust_begin_unwind <unknown>
809.23 s
> at <unknown source file> :<unknown line>
809.23 s
> 7: core[940e698046960fd5]::panicking::panic_fmt <unknown>
809.23 s
> at <unknown source file> :<unknown line>
809.23 s
> 8: <test_runs[66584badfeb6c7be]::aa_aa::important::aa_aa_local_inspect_backend_consistency::{closure#0} as core[940e698046960fd5]::ops::function::FnOnce<()>>::call_once <unknown>
809.23 s
> at <unknown source file> :<unknown line>
809.23 s
> 9: serial_test[cd99724524a2f1c0]::serial_code_lock::local_serial_core_with_return::<(), eyre[cb2fd339c0c40fca]::Report> <unknown>
809.23 s
> at <unknown source file> :<unknown line>
809.23 s
> 10: <test_runs[66584badfeb6c7be]::aa_aa::important::aa_aa_local_inspect_backend_consistency::{closure#0} as core[940e698046960fd5]::ops::function::FnOnce<()>>::call_once <unknown>
809.23 s
> at <unknown source file> :<unknown line>
809.23 s
> 11: test[75d6903177b1d7e9]::__rust_begin_short_backtrace::<core[940e698046960fd5]::result::Result<(), alloc[2ea6bcb46fca0c42]::string::String>, fn() -> core[940e698046960fd5]::result::Result<(), alloc[2ea6bcb46fca0c42]::string::String>> <unknown>
809.23 s
> at <unknown source file> :<unknown line>
809.23 s
> 12: test[75d6903177b1d7e9]::run_test::{closure#0} <unknown>
809.23 s
> at <unknown source file> :<unknown line>
809.23 s
> 13: std[bcb96dfbba0ab899]::sys::backtrace::__rust_begin_short_backtrace::<test[75d6903177b1d7e9]::run_test::{closure#1}, ()> <unknown>
809.23 s
> at <unknown source file> :<unknown line>
809.23 s
> 14: <std[bcb96dfbba0ab899]::thread::lifecycle::spawn_unchecked<test[75d6903177b1d7e9]::run_test::{closure#1}, ()>::{closure#1} as core[940e698046960fd5]::ops::function::FnOnce<()>>::call_once::{shim:vtable#0} <unknown>
809.23 s
> at <unknown source file> :<unknown line>
809.23 s
> 15: <std[bcb96dfbba0ab899]::sys::thread::unix::Thread>::new::thread_start <unknown>
809.23 s
> at <unknown source file> :<unknown line>
809.23 s
> 16: start_thread <unknown>
809.23 s
> at <unknown source file> :<unknown line>
809.23 s
> 17: __clone3 <unknown>
809.23 s
> at <unknown source file> :<unknown line>
809.23 s
>
809.23 s
> Run with COLORBT_SHOW_HIDDEN=1 environment variable to disable frame filtering.
809.23 s
> Run with RUST_BACKTRACE=full to include source snippets.
809.23 s
>
809.23 s
> ------------
809.23 s
> Summary [ 751.167s] 152 tests run: 151 passed , 1 failed , 208 skipped
809.23 s
> FAIL [ 71.208s] ( 54/152) gammaloop-integration-tests::test_runs aa_aa::important :: aa_aa_local_inspect_backend_consistency
809.23 s
> stdout ---
809.23 s
>
809.23 s
> running 1 test
809.23 s
> test aa_aa::important::aa_aa_local_inspect_backend_consistency has been running for over 60 seconds
809.23 s
> test aa_aa::important::aa_aa_local_inspect_backend_consistency ... FAILED
809.23 s
>
809.23 s
> failures:
809.23 s
>
809.23 s
> failures:
809.23 s
> aa_aa::important::aa_aa_local_inspect_backend_consistency
809.23 s
>
809.23 s
> test result: FAILED. 0 passed; 1 failed; 0 ignored; 0 measured; 258 filtered out; finished in 71.03s
809.23 s
>
809.23 s
> stderr ---
809.23 s
> [2026-09-06 07:01:54.337] @gammaloop_api::se... INFO : Running command import model sm-default.json
809.23 s
> [2026-09-06 07:01:54.337] @import::model INFO : Loading built-in JSON model sm-default
809.23 s
> [2026-09-06 07:01:54.356] @gammalooprs::model INFO : The following 11 external parameters were forced to zero by the restriction card:
809.23 s
> lamWS, AWS, rhoWS, etaWS, ymc, yme, ymm, MC, Me, MM, WTau
809.23 s
> [2026-09-06 07:01:54.356] @gammalooprs::model INFO : The following 34 vertex rules were removed by the restriction card:
809.23 s
> V_82 -> (c~, d, G+) | V_83 -> (t~, d, G+) | V_84 -> (c~, s, G+) | V_85 -> (t~, s, G+) | V_86 -> (u~, b, G+) | V_87 -> (c~, b, G+) | V_90 -> (c~, d, W+) | V_91 -> (t~, d, W+) | V_92 -> (u~, s, W+) | V_94 -> (t~, s, W+) | V_95 -> (u~, b, W+) | V_96 -> (c~, b, W+) | V_101 -> (e+, e-, G0) | V_102 -> (mu+, mu-, G0) | V_104 -> (e+, e-, H) | V_105 -> (mu+, mu-, H) | V_110 -> (ve~, e-, G+) | V_111 -> (vm~, mu-, G+) | V_116 -> (b~, u, G-) | V_117 -> (d~, c, G-) | V_118 -> (s~, c, G-) | V_119 -> (b~, c, G-) | V_120 -> (d~, t, G-) | V_121 -> (s~, t, G-) | V_124 -> (s~, u, W-) | V_125 -> (b~, u, W-) | V_126 -> (d~, c, W-) | V_128 -> (b~, c, W-) | V_129 -> (d~, t, W-) | V_130 -> (s~, t, W-) | V_138 -> (c~, c, G0) | V_140 -> (c~, c, H) | V_145 -> (e+, ve, G-) | V_146 -> (mu+, vm, G-)
809.23 s
> [2026-09-06 07:01:54.356] @gammalooprs::model INFO : The following 36 couplings were removed by the restriction card:
809.23 s
> GC_13, GC_14, GC_16, GC_17, GC_18, GC_19, GC_20, GC_22, GC_23, GC_24, GC_25, GC_26, GC_28, GC_29, GC_42, GC_43, GC_44, GC_46, GC_47, GC_48, GC_84, GC_85, GC_86, GC_87, GC_88, GC_89, GC_90, GC_91, GC_92, GC_93, GC_101, GC_102, GC_103, GC_105, GC_106, GC_107
809.23 s
> [2026-09-06 07:01:54.357] @gammaloop_api::se... INFO : Running command run set_model_parameters
809.23 s
> [2026-09-06 07:01:54.357] @gammaloop_api::se... INFO : Starting command block set_model_parameters
809.23 s
> [2026-09-06 07:01:54.357] @gammaloop_api::se... INFO : Running command set model MT=173.0
809.23 s
> [2026-09-06 07:01:54.360] @gammaloop_api::se... INFO : Running command set model WT=0.0
809.23 s
> [2026-09-06 07:01:54.364] @gammaloop_api::se... INFO : Running command set model ymt=173.0
809.23 s
> [2026-09-06 07:01:54.367] @gammaloop_api::se... INFO : Running command set model aS=0.118
809.23 s
> [2026-09-06 07:01:54.370] @gammaloop_api::se... INFO : Running command set model aEWM1=137.036
809.23 s
> [2026-09-06 07:01:54.373] @gammaloop_api::se... INFO : Running command set model Gf=1.166390e-05
809.23 s
> [2026-09-06 07:01:54.377] @gammaloop_api::se... INFO : Running command set model MZ=91.188
809.23 s
> [2026-09-06 07:01:54.380] @gammaloop_api::se... INFO : Running command set global string '
809.23 s
> [global.generation.compile]
809.23 s
> compilation_mode = "symjit"
809.23 s
> optimization_level = "O0"
809.23 s
> fast_math = false
809.23 s
> [...]
809.23 s
> [2026-09-06 07:01:54.381] @gammaloop_api::se... INFO : Running command import graphs ./examples/cli/aa_aa/1L/aa_aa_1L.dot -p aa_aa_all_helicities -i 1L_ppmm -o
809.23 s
> [2026-09-06 07:01:54.381] @commands::import INFO : Loading graphs from '/build/source/examples/cli/aa_aa/1L/aa_aa_1L.dot'
809.23 s
> [2026-09-06 07:01:54.389] @gammaloop_api::se... INFO : Running command generate existing -p aa_aa_all_helicities
809.23 s
> [2026-09-06 07:02:21.784] @commands::generate INFO :
809.23 s
> Integrand generation summary
809.23 s
> peak RAM 1.09 GiB | cores 1
809.23 s
> ╭───────────┬───────┬─────────┬──────────────┬─────────────┬────────────────┬──────────────╮
809.23 s
> │ integrand │ graph │ # evals │ expr build │ spenso │ symbolica eval │ compile │
809.23 s
> ├───────────┼───────┼─────────┼──────────────┼─────────────┼────────────────┼──────────────┤
809.23 s
> │ 1L_ppmm │ GL0 │ 13 │ 525ms (5.6% ) │ 1.81s (19% ) │ 6.12s (65% ) │ 923ms (9.8% ) │
809.23 s
> │ 1L_ppmm │ GL2 │ 13 │ 490ms (5.6% ) │ 1.57s (18% ) │ 5.81s (66% ) │ 890ms (10% ) │
809.23 s
> │ 1L_ppmm │ GL4 │ 11 │ 503ms (5.5% ) │ 1.79s (19% ) │ 6.06s (66% ) │ 875ms (9.5% ) │
809.23 s
> ├───────────┼───────┼─────────┼──────────────┼─────────────┼────────────────┼──────────────┤
809.23 s
> │ Total │ │ 37 │ 1.52s (5.6% ) │ 5.17s (19% ) │ 18.00s (66% ) │ 2.69s (9.8% ) │
809.23 s
> ╰───────────┴───────┴─────────┴──────────────┴─────────────┴────────────────┴──────────────╯
809.23 s
> [2026-09-06 07:02:22.731] @gammaloop_api::se... INFO : Running command import model sm-default.json
809.23 s
> [2026-09-06 07:02:22.731] @import::model INFO : Loading built-in JSON model sm-default
809.23 s
> [2026-09-06 07:02:22.753] @gammalooprs::model INFO : The following 11 external parameters were forced to zero by the restriction card:
809.23 s
> lamWS, AWS, rhoWS, etaWS, ymc, yme, ymm, MC, Me, MM, WTau
809.23 s
> [2026-09-06 07:02:22.753] @gammalooprs::model INFO : The following 34 vertex rules were removed by the restriction card:
809.23 s
> V_82 -> (c~, d, G+) | V_83 -> (t~, d, G+) | V_84 -> (c~, s, G+) | V_85 -> (t~, s, G+) | V_86 -> (u~, b, G+) | V_87 -> (c~, b, G+) | V_90 -> (c~, d, W+) | V_91 -> (t~, d, W+) | V_92 -> (u~, s, W+) | V_94 -> (t~, s, W+) | V_95 -> (u~, b, W+) | V_96 -> (c~, b, W+) | V_101 -> (e+, e-, G0) | V_102 -> (mu+, mu-, G0) | V_104 -> (e+, e-, H) | V_105 -> (mu+, mu-, H) | V_110 -> (ve~, e-, G+) | V_111 -> (vm~, mu-, G+) | V_116 -> (b~, u, G-) | V_117 -> (d~, c, G-) | V_118 -> (s~, c, G-) | V_119 -> (b~, c, G-) | V_120 -> (d~, t, G-) | V_121 -> (s~, t, G-) | V_124 -> (s~, u, W-) | V_125 -> (b~, u, W-) | V_126 -> (d~, c, W-) | V_128 -> (b~, c, W-) | V_129 -> (d~, t, W-) | V_130 -> (s~, t, W-) | V_138 -> (c~, c, G0) | V_140 -> (c~, c, H) | V_145 -> (e+, ve, G-) | V_146 -> (mu+, vm, G-)
809.23 s
> [2026-09-06 07:02:22.753] @gammalooprs::model INFO : The following 36 couplings were removed by the restriction card:
809.23 s
> GC_13, GC_14, GC_16, GC_17, GC_18, GC_19, GC_20, GC_22, GC_23, GC_24, GC_25, GC_26, GC_28, GC_29, GC_42, GC_43, GC_44, GC_46, GC_47, GC_48, GC_84, GC_85, GC_86, GC_87, GC_88, GC_89, GC_90, GC_91, GC_92, GC_93, GC_101, GC_102, GC_103, GC_105, GC_106, GC_107
809.23 s
> [2026-09-06 07:02:22.754] @gammaloop_api::se... INFO : Running command run set_model_parameters
809.23 s
> [2026-09-06 07:02:22.754] @gammaloop_api::se... INFO : Starting command block set_model_parameters
809.23 s
> [2026-09-06 07:02:22.754] @gammaloop_api::se... INFO : Running command set model MT=173.0
809.23 s
> [2026-09-06 07:02:22.758] @gammaloop_api::se... INFO : Running command set model WT=0.0
809.23 s
> [2026-09-06 07:02:22.762] @gammaloop_api::se... INFO : Running command set model ymt=173.0
809.23 s
> [2026-09-06 07:02:22.766] @gammaloop_api::se... INFO : Running command set model aS=0.118
809.23 s
> [2026-09-06 07:02:22.770] @gammaloop_api::se... INFO : Running command set model aEWM1=137.036
809.23 s
> [2026-09-06 07:02:22.774] @gammaloop_api::se... INFO : Running command set model Gf=1.166390e-05
809.23 s
> [2026-09-06 07:02:22.777] @gammaloop_api::se... INFO : Running command set model MZ=91.188
809.23 s
> [2026-09-06 07:02:22.782] @gammaloop_api::se... INFO : Running command set global string '
809.23 s
> [global.generation.compile]
809.23 s
> compilation_mode = "assembly"
809.23 s
> optimization_level = "O0"
809.23 s
> fast_math = false
809.23 s
> [...]
809.23 s
> [2026-09-06 07:02:22.783] @gammaloop_api::se... INFO : Running command import graphs ./examples/cli/aa_aa/1L/aa_aa_1L.dot -p aa_aa_all_helicities_assembly -i 1L_ppmm -o
809.23 s
> [2026-09-06 07:02:22.783] @commands::import INFO : Loading graphs from '/build/source/examples/cli/aa_aa/1L/aa_aa_1L.dot'
809.23 s
> [2026-09-06 07:02:22.791] @gammaloop_api::se... INFO : Running command generate existing -p aa_aa_all_helicities_assembly
809.23 s
> [2026-09-06 07:02:45.043] @processes::amplitude INFO : Compiling amplitude 1L_ppmm
809.23 s
> [2026-09-06 07:03:04.191] @commands::generate INFO : Removed 34 generated C++ source file(s). Use '--keep-sources ' to keep them.
809.23 s
> [2026-09-06 07:03:04.191] @commands::generate INFO :
809.23 s
> Integrand generation summary
809.23 s
> peak RAM 2.21 GiB | cores 1
809.23 s
> ╭───────────┬───────┬─────────┬──────────────┬──────────────┬────────────────┬──────────────╮
809.23 s
> │ integrand │ graph │ # evals │ expr build │ spenso │ symbolica eval │ compile │
809.23 s
> ├───────────┼───────┼─────────┼──────────────┼──────────────┼────────────────┼──────────────┤
809.23 s
> │ 1L_ppmm │ GL0 │ 13 │ 562ms (4.0% ) │ 1.51s (11% ) │ 5.68s (41% ) │ 6.16s (44% ) │
809.23 s
> │ 1L_ppmm │ GL2 │ 13 │ 593ms (4.2% ) │ 1.37s (9.6% ) │ 5.34s (37% ) │ 6.95s (49% ) │
809.23 s
> │ 1L_ppmm │ GL4 │ 11 │ 581ms (4.4% ) │ 1.35s (10% ) │ 5.23s (40% ) │ 6.03s (46% ) │
809.23 s
> ├───────────┼───────┼─────────┼──────────────┼──────────────┼────────────────┼──────────────┤
809.23 s
> │ Total │ │ 37 │ 1.74s (4.2% ) │ 4.24s (10% ) │ 16.25s (39% ) │ 19.14s (46% ) │
809.23 s
> ╰───────────┴───────┴─────────┴──────────────┴──────────────┴────────────────┴──────────────╯
809.23 s
> [2026-09-06 07:03:04.857] @gammaloop_api::se... INFO : Running command set process -p aa_aa_all_helicities -i 1L_ppmm string '
809.23 s
> [stability]
809.23 s
> check_on_norm = true
809.23 s
> escalate_if_exact_zero = false
809.23 s
> loop_momenta_norm_escalation_factor = -1.0
809.23 s
> [...]
809.23 s
> [2026-09-06 07:03:04.857] @gammaloop_api::se... INFO : Running command set process -p aa_aa_all_helicities_assembly -i 1L_ppmm string '
809.23 s
> [stability]
809.23 s
> check_on_norm = true
809.23 s
> escalate_if_exact_zero = false
809.23 s
> loop_momenta_norm_escalation_factor = -1.0
809.23 s
> [...]
809.23 s
> [2026-09-06 07:03:04.858] @gammaloop_api::se... INFO : Running command set process -p aa_aa_all_helicities -i 1L_mpmm string '
809.23 s
> [stability]
809.23 s
> check_on_norm = true
809.23 s
> escalate_if_exact_zero = false
809.23 s
> loop_momenta_norm_escalation_factor = -1.0
809.23 s
> [...]
809.23 s
> [2026-09-06 07:03:04.859] @gammaloop_api::se... INFO : Running command set process -p aa_aa_all_helicities_assembly -i 1L_mpmm string '
809.23 s
> [stability]
809.23 s
> check_on_norm = true
809.23 s
> escalate_if_exact_zero = false
809.23 s
> loop_momenta_norm_escalation_factor = -1.0
809.23 s
> [...]
809.23 s
> [2026-09-06 07:03:04.859] @gammaloop_api::se... INFO : Running command set process -p aa_aa_all_helicities -i 1L_mmmm string '
809.23 s
> [stability]
809.23 s
> check_on_norm = true
809.23 s
> escalate_if_exact_zero = false
809.23 s
> loop_momenta_norm_escalation_factor = -1.0
809.23 s
> [...]
809.23 s
> [2026-09-06 07:03:04.860] @gammaloop_api::se... INFO : Running command set process -p aa_aa_all_helicities_assembly -i 1L_mmmm string '
809.23 s
> [stability]
809.23 s
> check_on_norm = true
809.23 s
> escalate_if_exact_zero = false
809.23 s
> loop_momenta_norm_escalation_factor = -1.0
809.23 s
> [...]
809.23 s
> [2026-09-06 07:03:04.861] @gammaloop_api::se... INFO : Running command set process -p aa_aa_all_helicities -i 1L_pmmp string '
809.23 s
> [stability]
809.23 s
> check_on_norm = true
809.23 s
> escalate_if_exact_zero = false
809.23 s
> loop_momenta_norm_escalation_factor = -1.0
809.23 s
> [...]
809.23 s
> [2026-09-06 07:03:04.861] @gammaloop_api::se... INFO : Running command set process -p aa_aa_all_helicities_assembly -i 1L_pmmp string '
809.23 s
> [stability]
809.23 s
> check_on_norm = true
809.23 s
> escalate_if_exact_zero = false
809.23 s
> loop_momenta_norm_escalation_factor = -1.0
809.23 s
> [...]
809.23 s
> [2026-09-06 07:03:04.862] @gammaloop_api::se... INFO : Running command set process -p aa_aa_all_helicities -i 1L_pmpm string '
809.23 s
> [stability]
809.23 s
> check_on_norm = true
809.23 s
> escalate_if_exact_zero = false
809.23 s
> loop_momenta_norm_escalation_factor = -1.0
809.23 s
> [...]
809.23 s
> [2026-09-06 07:03:04.863] @gammaloop_api::se... INFO : Running command set process -p aa_aa_all_helicities_assembly -i 1L_pmpm string '
809.23 s
> [stability]
809.23 s
> check_on_norm = true
809.23 s
> escalate_if_exact_zero = false
809.23 s
> loop_momenta_norm_escalation_factor = -1.0
809.23 s
> [...]
809.23 s
> [2026-09-06 07:03:04.867] @process::amplitude INFO : Input is below threshold: 0 existing threshold E-surfaces across 0/1 graph groups
809.23 s
> [2026-09-06 07:03:04.867] @process::amplitude INFO : overlap structure of group 0: [0: []]
809.23 s
> [2026-09-06 07:03:04.868] @integrands::process [{#im_is_nan, #re_is_nan}] WARNING : final process evaluation is nonfinite
809.23 s
> [2026-09-06 07:03:04.868] @commands::inspect INFO :
809.23 s
> Input point in momentum space:
809.23 s
>
809.23 s
> ( 0.1100000000000000, -0.0700000000000000, 0.1900000000000000 )
809.23 s
>
809.23 s
> The evaluation of integrand '1L_ppmm' is:
809.23 s
>
809.23 s
> ( +0.0000000000000000e0, +0.0000000000000000e0 i)
809.23 s
>
809.23 s
> [2026-09-06 07:03:04.871] @process::amplitude INFO : Input is below threshold: 0 existing threshold E-surfaces across 0/1 graph groups
809.23 s
> [2026-09-06 07:03:04.871] @process::amplitude INFO : overlap structure of group 0: [0: []]
809.23 s
> [2026-09-06 07:03:04.871] @commands::inspect INFO :
809.23 s
> Input point in momentum space:
809.23 s
>
809.23 s
> ( 0.1100000000000000, -0.0700000000000000, 0.1900000000000000 )
809.23 s
>
809.23 s
> The evaluation of integrand '1L_ppmm' is:
809.23 s
>
809.23 s
> ( -1.7132462539328486e-28, -8.7105072229446864e-10 i)
809.23 s
>
809.23 s
> The application panicked (crashed).
809.23 s
> Message: kinematics=a, integrand=1L_ppmm, graph_id=0: assembly vs symjit inspect: actual=(-0.00000000000000000000000000017132462539328486+-0.0000000008710507222944686i), expected=(0+0i), tolerance=0.0000000001
809.23 s
> Location: tests/tests/test_runs/utils.rs :466
809.23 s
>
809.23 s
> ━━━━━━━━━━━━━━━━━━━━━━━━━━━━━━━━━━ BACKTRACE ━━━━━━━━━━━━━━━━━━━━━━━━━━━━━━━━━━━
809.23 s
> 1: <color_eyre[51793ea62743adbd]::config::PanicHook>::panic_report <unknown>
809.23 s
> at <unknown source file> :<unknown line>
809.23 s
> 2: <color_eyre[51793ea62743adbd]::config::PanicHook>::into_panic_hook::{closure#0} <unknown>
809.23 s
> at <unknown source file> :<unknown line>
809.23 s
> 3: std[bcb96dfbba0ab899]::panicking::panic_with_hook <unknown>
809.23 s
> at <unknown source file> :<unknown line>
809.23 s
> 4: std[bcb96dfbba0ab899]::panicking::panic_handler::{closure#0} <unknown>
809.23 s
> at <unknown source file> :<unknown line>
809.23 s
> 5: std[bcb96dfbba0ab899]::sys::backtrace::__rust_end_short_backtrace::<std[bcb96dfbba0ab899]::panicking::panic_handler::{closure#0}, !> <unknown>
809.23 s
> at <unknown source file> :<unknown line>
809.23 s
> 6: __rustc[6c289b9f9c454d21]::rust_begin_unwind <unknown>
809.23 s
> at <unknown source file> :<unknown line>
809.23 s
> 7: core[940e698046960fd5]::panicking::panic_fmt <unknown>
809.23 s
> at <unknown source file> :<unknown line>
809.23 s
> 8: <test_runs[66584badfeb6c7be]::aa_aa::important::aa_aa_local_inspect_backend_consistency::{closure#0} as core[940e698046960fd5]::ops::function::FnOnce<()>>::call_once <unknown>
809.23 s
> at <unknown source file> :<unknown line>
809.23 s
> 9: serial_test[cd99724524a2f1c0]::serial_code_lock::local_serial_core_with_return::<(), eyre[cb2fd339c0c40fca]::Report> <unknown>
809.23 s
> at <unknown source file> :<unknown line>
809.23 s
> 10: <test_runs[66584badfeb6c7be]::aa_aa::important::aa_aa_local_inspect_backend_consistency::{closure#0} as core[940e698046960fd5]::ops::function::FnOnce<()>>::call_once <unknown>
809.23 s
> at <unknown source file> :<unknown line>
809.23 s
> 11: test[75d6903177b1d7e9]::__rust_begin_short_backtrace::<core[940e698046960fd5]::result::Result<(), alloc[2ea6bcb46fca0c42]::string::String>, fn() -> core[940e698046960fd5]::result::Result<(), alloc[2ea6bcb46fca0c42]::string::String>> <unknown>
809.23 s
> at <unknown source file> :<unknown line>
809.23 s
> 12: test[75d6903177b1d7e9]::run_test::{closure#0} <unknown>
809.23 s
> at <unknown source file> :<unknown line>
809.23 s
> 13: std[bcb96dfbba0ab899]::sys::backtrace::__rust_begin_short_backtrace::<test[75d6903177b1d7e9]::run_test::{closure#1}, ()> <unknown>
809.23 s
> at <unknown source file> :<unknown line>
809.23 s
> 14: <std[bcb96dfbba0ab899]::thread::lifecycle::spawn_unchecked<test[75d6903177b1d7e9]::run_test::{closure#1}, ()>::{closure#1} as core[940e698046960fd5]::ops::function::FnOnce<()>>::call_once::{shim:vtable#0} <unknown>
809.23 s
> at <unknown source file> :<unknown line>
809.23 s
> 15: <std[bcb96dfbba0ab899]::sys::thread::unix::Thread>::new::thread_start <unknown>
809.23 s
> at <unknown source file> :<unknown line>
809.23 s
> 16: start_thread <unknown>
809.23 s
> at <unknown source file> :<unknown line>
809.23 s
> 17: __clone3 <unknown>
809.23 s
> at <unknown source file> :<unknown line>
809.23 s
>
809.23 s
> Run with COLORBT_SHOW_HIDDEN=1 environment variable to disable frame filtering.
809.23 s
> Run with RUST_BACKTRACE=full to include source snippets.
809.23 s
>
809.23 s
> error : test run failed
809.23 s
>
809.23 s
> ========== nextest test summary ==========
809.23 s
> report: target/nextest/ci_gammaloop/junit.xml
809.23 s
> tests: 152, failures: 1, errors: 0
809.23 s
>
809.23 s
> 1. gammaloop-integration-tests::test_runs::aa_aa::important::aa_aa_local_inspect_backend_consistency
809.23 s
> failure: test failure with exit code 101
809.23 s
> system-out
809.23 s
> running 1 test
809.23 s
> test aa_aa::important::aa_aa_local_inspect_backend_consistency has been running for over 60 seconds
809.23 s
> test aa_aa::important::aa_aa_local_inspect_backend_consistency ... FAILED
809.23 s
>
809.23 s
> failures:
809.23 s
>
809.23 s
> failures:
809.23 s
> aa_aa::important::aa_aa_local_inspect_backend_consistency
809.23 s
>
809.23 s
> test result: FAILED. 0 passed; 1 failed; 0 ignored; 0 measured; 258 filtered out; finished in 71.03s
809.23 s
> system-err
809.23 s
> [2026-09-06 07:01:54.337] @gammaloop_api::se... INFO : Running command import model sm-default.json
809.23 s
> [2026-09-06 07:01:54.337] @import::model INFO : Loading built-in JSON model sm-default
809.23 s
> [2026-09-06 07:01:54.356] @gammalooprs::model INFO : The following 11 external parameters were forced to zero by the restriction card:
809.23 s
> lamWS, AWS, rhoWS, etaWS, ymc, yme, ymm, MC, Me, MM, WTau
809.23 s
> [2026-09-06 07:01:54.356] @gammalooprs::model INFO : The following 34 vertex rules were removed by the restriction card:
809.23 s
> V_82 -> (c~, d, G+) | V_83 -> (t~, d, G+) | V_84 -> (c~, s, G+) | V_85 -> (t~, s, G+) | V_86 -> (u~, b, G+) | V_87 -> (c~, b, G+) | V_90 -> (c~, d, W+) | V_91 -> (t~, d, W+) | V_92 -> (u~, s, W+) | V_94 -> (t~, s, W+) | V_95 -> (u~, b, W+) | V_96 -> (c~, b, W+) | V_101 -> (e+, e-, G0) | V_102 -> (mu+, mu-, G0) | V_104 -> (e+, e-, H) | V_105 -> (mu+, mu-, H) | V_110 -> (ve~, e-, G+) | V_111 -> (vm~, mu-, G+) | V_116 -> (b~, u, G-) | V_117 -> (d~, c, G-) | V_118 -> (s~, c, G-) | V_119 -> (b~, c, G-) | V_120 -> (d~, t, G-) | V_121 -> (s~, t, G-) | V_124 -> (s~, u, W-) | V_125 -> (b~, u, W-) | V_126 -> (d~, c, W-) | V_128 -> (b~, c, W-) | V_129 -> (d~, t, W-) | V_130 -> (s~, t, W-) | V_138 -> (c~, c, G0) | V_140 -> (c~, c, H) | V_145 -> (e+, ve, G-) | V_146 -> (mu+, vm, G-)
809.23 s
> [2026-09-06 07:01:54.356] @gammalooprs::model INFO : The following 36 couplings were removed by the restriction card:
809.23 s
> GC_13, GC_14, GC_16, GC_17, GC_18, GC_19, GC_20, GC_22, GC_23, GC_24, GC_25, GC_26, GC_28, GC_29, GC_42, GC_43, GC_44, GC_46, GC_47, GC_48, GC_84, GC_85, GC_86, GC_87, GC_88, GC_89, GC_90, GC_91, GC_92, GC_93, GC_101, GC_102, GC_103, GC_105, GC_106, GC_107
809.23 s
> [2026-09-06 07:01:54.357] @gammaloop_api::se... INFO : Running command run set_model_parameters
809.23 s
> [2026-09-06 07:01:54.357] @gammaloop_api::se... INFO : Starting command block set_model_parameters
809.23 s
> [2026-09-06 07:01:54.357] @gammaloop_api::se... INFO : Running command set model MT=173.0
809.23 s
> [2026-09-06 07:01:54.360] @gammaloop_api::se... INFO : Running command set model WT=0.0
809.23 s
> [2026-09-06 07:01:54.364] @gammaloop_api::se... INFO : Running command set model ymt=173.0
809.23 s
> [2026-09-06 07:01:54.367] @gammaloop_api::se... INFO : Running command set model aS=0.118
809.23 s
> [2026-09-06 07:01:54.370] @gammaloop_api::se... INFO : Running command set model aEWM1=137.036
809.23 s
> [2026-09-06 07:01:54.373] @gammaloop_api::se... INFO : Running command set model Gf=1.166390e-05
809.23 s
> [2026-09-06 07:01:54.377] @gammaloop_api::se... INFO : Running command set model MZ=91.188
809.23 s
> [2026-09-06 07:01:54.380] @gammaloop_api::se... INFO : Running command set global string '
809.23 s
> [global.generation.compile]
809.23 s
> compilation_mode = "symjit"
809.23 s
> optimization_level = "O0"
809.23 s
> fast_math = false
809.23 s
> [...]
809.23 s
> [2026-09-06 07:01:54.381] @gammaloop_api::se... INFO : Running command import graphs ./examples/cli/aa_aa/1L/aa_aa_1L.dot -p aa_aa_all_helicities -i 1L_ppmm -o
809.23 s
> [2026-09-06 07:01:54.381] @commands::import INFO : Loading graphs from '/build/source/examples/cli/aa_aa/1L/aa_aa_1L.dot'
809.23 s
> [2026-09-06 07:01:54.389] @gammaloop_api::se... INFO : Running command generate existing -p aa_aa_all_helicities
809.23 s
> [2026-09-06 07:02:21.784] @commands::generate INFO :
809.23 s
> Integrand generation summary
809.23 s
> peak RAM 1.09 GiB | cores 1
809.23 s
> ╭───────────┬───────┬─────────┬──────────────┬─────────────┬────────────────┬──────────────╮
809.23 s
> │ integrand │ graph │ # evals │ expr build │ spenso │ symbolica eval │ compile │
809.23 s
> ├───────────┼───────┼─────────┼──────────────┼─────────────┼────────────────┼──────────────┤
809.23 s
> │ 1L_ppmm │ GL0 │ 13 │ 525ms (5.6%) │ 1.81s (19%) │ 6.12s (65%) │ 923ms (9.8%) │
809.23 s
> │ 1L_ppmm │ GL2 │ 13 │ 490ms (5.6%) │ 1.57s (18%) │ 5.81s (66%) │ 890ms (10%) │
809.23 s
> │ 1L_ppmm │ GL4 │ 11 │ 503ms (5.5%) │ 1.79s (19%) │ 6.06s (66%) │ 875ms (9.5%) │
809.23 s
> ├───────────┼───────┼─────────┼──────────────┼─────────────┼────────────────┼──────────────┤
809.23 s
> │ Total │ │ 37 │ 1.52s (5.6%) │ 5.17s (19%) │ 18.00s (66%) │ 2.69s (9.8%) │
809.23 s
> ╰───────────┴───────┴─────────┴──────────────┴─────────────┴────────────────┴──────────────╯
809.23 s
> [2026-09-06 07:02:22.731] @gammaloop_api::se... INFO : Running command import model sm-default.json
809.23 s
> [2026-09-06 07:02:22.731] @import::model INFO : Loading built-in JSON model sm-default
809.23 s
> [2026-09-06 07:02:22.753] @gammalooprs::model INFO : The following 11 external parameters were forced to zero by the restriction card:
809.23 s
> lamWS, AWS, rhoWS, etaWS, ymc, yme, ymm, MC, Me, MM, WTau
809.23 s
> [2026-09-06 07:02:22.753] @gammalooprs::model INFO : The following 34 vertex rules were removed by the restriction card:
809.23 s
> V_82 -> (c~, d, G+) | V_83 -> (t~, d, G+) | V_84 -> (c~, s, G+) | V_85 -> (t~, s, G+) | V_86 -> (u~, b, G+) | V_87 -> (c~, b, G+) | V_90 -> (c~, d, W+) | V_91 -> (t~, d, W+) | V_92 -> (u~, s, W+) | V_94 -> (t~, s, W+) | V_95 -> (u~, b, W+) | V_96 -> (c~, b, W+) | V_101 -> (e+, e-, G0) | V_102 -> (mu+, mu-, G0) | V_104 -> (e+, e-, H) | V_105 -> (mu+, mu-, H) | V_110 -> (ve~, e-, G+) | V_111 -> (vm~, mu-, G+) | V_116 -> (b~, u, G-) | V_117 -> (d~, c, G-) | V_118 -> (s~, c, G-) | V_119 -> (b~, c, G-) | V_120 -> (d~, t, G-) | V_121 -> (s~, t, G-) | V_124 -> (s~, u, W-) | V_125 -> (b~, u, W-) | V_126 -> (d~, c, W-) | V_128 -> (b~, c, W-) | V_129 -> (d~, t, W-) | V_130 -> (s~, t, W-) | V_138 -> (c~, c, G0) | V_140 -> (c~, c, H) | V_145 -> (e+, ve, G-) | V_146 -> (mu+, vm, G-)
809.23 s
> [2026-09-06 07:02:22.753] @gammalooprs::model INFO : The following 36 couplings were removed by the restriction card:
809.23 s
> GC_13, GC_14, GC_16, GC_17, GC_18, GC_19, GC_20, GC_22, GC_23, GC_24, GC_25, GC_26, GC_28, GC_29, GC_42, GC_43, GC_44, GC_46, GC_47, GC_48, GC_84, GC_85, GC_86, GC_87, GC_88, GC_89, GC_90, GC_91, GC_92, GC_93, GC_101, GC_102, GC_103, GC_105, GC_106, GC_107
809.23 s
> [2026-09-06 07:02:22.754] @gammaloop_api::se... INFO : Running command run set_model_parameters
809.23 s
> [2026-09-06 07:02:22.754] @gammaloop_api::se... INFO : Starting command block set_model_parameters
809.23 s
> [2026-09-06 07:02:22.754] @gammaloop_api::se... INFO : Running command set model MT=173.0
809.23 s
> [2026-09-06 07:02:22.758] @gammaloop_api::se... INFO : Running command set model WT=0.0
809.23 s
> [2026-09-06 07:02:22.762] @gammaloop_api::se... INFO : Running command set model ymt=173.0
809.23 s
> [2026-09-06 07:02:22.766] @gammaloop_api::se... INFO : Running command set model aS=0.118
809.23 s
> [2026-09-06 07:02:22.770] @gammaloop_api::se... INFO : Running command set model aEWM1=137.036
809.23 s
> [2026-09-06 07:02:22.774] @gammaloop_api::se... INFO : Running command set model Gf=1.166390e-05
809.23 s
> [2026-09-06 07:02:22.777] @gammaloop_api::se... INFO : Running command set model MZ=91.188
809.23 s
> [2026-09-06 07:02:22.782] @gammaloop_api::se... INFO : Running command set global string '
809.23 s
> [global.generation.compile]
809.23 s
> compilation_mode = "assembly"
809.23 s
> optimization_level = "O0"
809.23 s
> fast_math = false
809.23 s
> [...]
809.23 s
> [2026-09-06 07:02:22.783] @gammaloop_api::se... INFO : Running command import graphs ./examples/cli/aa_aa/1L/aa_aa_1L.dot -p aa_aa_all_helicities_assembly -i 1L_ppmm -o
809.23 s
> [2026-09-06 07:02:22.783] @commands::import INFO : Loading graphs from '/build/source/examples/cli/aa_aa/1L/aa_aa_1L.dot'
809.23 s
> [2026-09-06 07:02:22.791] @gammaloop_api::se... INFO : Running command generate existing -p aa_aa_all_helicities_assembly
809.23 s
> [2026-09-06 07:02:45.043] @processes::amplitude INFO : Compiling amplitude 1L_ppmm
809.23 s
> [2026-09-06 07:03:04.191] @commands::generate INFO : Removed 34 generated C++ source file(s). Use '--keep-sources' to keep them.
809.23 s
> [2026-09-06 07:03:04.191] @commands::generate INFO :
809.23 s
> Integrand generation summary
809.23 s
> peak RAM 2.21 GiB | cores 1
809.23 s
> ╭───────────┬───────┬─────────┬──────────────┬──────────────┬────────────────┬──────────────╮
809.23 s
> │ integrand │ graph │ # evals │ expr build │ spenso │ symbolica eval │ compile │
809.23 s
> ├───────────┼───────┼─────────┼──────────────┼──────────────┼────────────────┼──────────────┤
809.23 s
> │ 1L_ppmm │ GL0 │ 13 │ 562ms (4.0%) │ 1.51s (11%) │ 5.68s (41%) │ 6.16s (44%) │
809.23 s
> │ 1L_ppmm │ GL2 │ 13 │ 593ms (4.2%) │ 1.37s (9.6%) │ 5.34s (37%) │ 6.95s (49%) │
809.23 s
> │ 1L_ppmm │ GL4 │ 11 │ 581ms (4.4%) │ 1.35s (10%) │ 5.23s (40%) │ 6.03s (46%) │
809.23 s
> ├───────────┼───────┼─────────┼──────────────┼──────────────┼────────────────┼──────────────┤
809.23 s
> │ Total │ │ 37 │ 1.74s (4.2%) │ 4.24s (10%) │ 16.25s (39%) │ 19.14s (46%) │
809.23 s
> ╰───────────┴───────┴─────────┴──────────────┴──────────────┴────────────────┴──────────────╯
809.23 s
> [2026-09-06 07:03:04.857] @gammaloop_api::se... INFO : Running command set process -p aa_aa_all_helicities -i 1L_ppmm string '
809.23 s
> [stability]
809.23 s
> check_on_norm = true
809.23 s
> escalate_if_exact_zero = false
809.23 s
> loop_momenta_norm_escalation_factor = -1.0
809.23 s
> [...]
809.23 s
> [2026-09-06 07:03:04.857] @gammaloop_api::se... INFO : Running command set process -p aa_aa_all_helicities_assembly -i 1L_ppmm string '
809.23 s
> [stability]
809.23 s
> check_on_norm = true
809.23 s
> escalate_if_exact_zero = false
809.23 s
> loop_momenta_norm_escalation_factor = -1.0
809.23 s
> [...]
809.23 s
> [2026-09-06 07:03:04.858] @gammaloop_api::se... INFO : Running command set process -p aa_aa_all_helicities -i 1L_mpmm string '
809.23 s
> [stability]
809.23 s
> check_on_norm = true
809.23 s
> escalate_if_exact_zero = false
809.23 s
> loop_momenta_norm_escalation_factor = -1.0
809.23 s
> [...]
809.23 s
> [2026-09-06 07:03:04.859] @gammaloop_api::se... INFO : Running command set process -p aa_aa_all_helicities_assembly -i 1L_mpmm string '
809.23 s
> [stability]
809.23 s
> check_on_norm = true
809.23 s
> escalate_if_exact_zero = false
809.23 s
> loop_momenta_norm_escalation_factor = -1.0
809.23 s
> [...]
809.23 s
> [2026-09-06 07:03:04.859] @gammaloop_api::se... INFO : Running command set process -p aa_aa_all_helicities -i 1L_mmmm string '
809.23 s
> [stability]
809.23 s
> check_on_norm = true
809.23 s
> escalate_if_exact_zero = false
809.23 s
> loop_momenta_norm_escalation_factor = -1.0
809.23 s
> [...]
809.23 s
> [2026-09-06 07:03:04.860] @gammaloop_api::se... INFO : Running command set process -p aa_aa_all_helicities_assembly -i 1L_mmmm string '
809.23 s
> [stability]
809.23 s
> check_on_norm = true
809.23 s
> escalate_if_exact_zero = false
809.23 s
> loop_momenta_norm_escalation_factor = -1.0
809.23 s
> [...]
809.23 s
> [2026-09-06 07:03:04.861] @gammaloop_api::se... INFO : Running command set process -p aa_aa_all_helicities -i 1L_pmmp string '
809.23 s
> [stability]
809.23 s
> check_on_norm = true
809.23 s
> escalate_if_exact_zero = false
809.23 s
> loop_momenta_norm_escalation_factor = -1.0
809.23 s
> ... omitted 84 more lines; see full nextest output above
809.23 s
> =========================================
809.23 s
For full logs, run:
809.23 s
nix log /nix/store/3qpyi4i089mjhqx61pnq05lcl2pfrw3d-gammaloop-nextest-integration.drv
809.36 s
[0 built (1 failed ), 0.0 Run failed.