test packages.x86_64-linux.nix-ci-check-gammaloop-nextest-integration

Reproduce this run
Retry Run
  1. 0.00 s $ /nix/store/9ypz3flqsrl5xl495mm8h645gadjsxi1-coreutils-9.11/bin/timeout --kill-after=15s 7200s /nix/store/23zk8sgzamrbmj1fday15szf7f2279s8-nix-2.34.7/bin/nix --extra-experimental-features nix-command --extra-experimental-features flakes flake clone git+https://github.com/alphal00p/gammaloop --dest /tmp/nix-ci-worker/stable-pwd/repo/
  2. 0.06 s Cloning into '/tmp/nix-ci-worker/stable-pwd/repo'...
  3. 0.80 s remote: Enumerating objects: 78063, done.
  4. 0.91 s remote: Counting objects: 0% (1/13885) remote: Counting objects: 1% (139/13885) remote: Counting objects: 2% (278/13885) remote: Counting objects: 3% (417/13885) remote: Counting objects: 4% (556/13885) remote: Counting objects: 5% (695/13885) remote: Counting objects: 6% (834/13885) remote: Counting objects: 7% (972/13885) remote: Counting objects: 8% (1111/13885) remote: Counting objects: 9% (1250/13885) remote: Counting objects: 10% (1389/13885) remote: Counting objects: 11% (1528/13885) remote: Counting objects: 12% (1667/13885) remote: Counting objects: 13% (1806/13885) remote: Counting objects: 14% (1944/13885) remote: Counting objects: 15% (2083/13885) remote: Counting objects: 16% (2222/13885) remote: Counting objects: 17% (2361/13885) remote: Counting objects: 18% (2500/13885) remote: Counting objects: 19% (2639/13885) remote: Counting objects: 20% (2777/13885) remote: Counting objects: 21% (2916/13885) remote: Counting objects: 22% (3055/13885) remote: Counting objects: 23% (3194/13885) remote: Counting objects: 24% (3333/13885) remote: Counting objects: 25% (3472/13885) remote: Counting objects: 26% (3611/13885) remote: Counting objects: 27% (3749/13885) remote: Counting objects: 28% (3888/13885) remote: Counting objects: 29% (4027/13885) remote: Counting objects: 30% (4166/13885) remote: Counting objects: 31% (4305/13885) remote: Counting objects: 32% (4444/13885) remote: Counting objects: 33% (4583/13885) remote: Counting objects: 34% (4721/13885) remote: Counting objects: 35% (4860/13885) remote: Counting objects: 36% (4999/13885) remote: Counting objects: 37% (5138/13885) remote: Counting objects: 38% (5277/13885) remote: Counting objects: 39% (5416/13885) remote: Counting objects: 40% (5554/13885) remote: Counting objects: 41% (5693/13885) remote: Counting objects: 42% (5832/13885) remote: Counting objects: 43% (5971/13885) remote: Counting objects: 44% (6110/13885) remote: Counting objects: 45% (6249/13885) remote: Counting objects: 46% (6388/13885) remote: Counting objects: 47% (6526/13885) remote: Counting objects: 48% (6665/13885) remote: Counting objects: 49% (6804/13885) remote: Counting objects: 50% (6943/13885) remote: Counting objects: 51% (7082/13885) remote: Counting objects: 52% (7221/13885) remote: Counting objects: 53% (7360/13885) remote: Counting objects: 54% (7498/13885) remote: Counting objects: 55% (7637/13885) remote: Counting objects: 56% (7776/13885) remote: Counting objects: 57% (7915/13885) remote: Counting objects: 58% (8054/13885) remote: Counting objects: 59% (8193/13885) remote: Counting objects: 60% (8331/13885) remote: Counting objects: 61% (8470/13885) remote: Counting objects: 62% (8609/13885) remote: Counting objects: 63% (8748/13885) remote: Counting objects: 64% (8887/13885) remote: Counting objects: 65% (9026/13885) remote: Counting objects: 66% (9165/13885) remote: Counting objects: 67% (9303/13885) remote: Counting objects: 68% (9442/13885) remote: Counting objects: 69% (9581/13885) remote: Counting objects: 70% (9720/13885) remote: Counting objects: 71% (9859/13885) remote: Counting objects: 72% (9998/13885) remote: Counting objects: 73% (10137/13885) remote: Counting objects: 74% (10275/13885) remote: Counting objects: 75% (10414/13885) remote: Counting objects: 76% (10553/13885) remote: Counting objects: 77% (10692/13885) remote: Counting objects: 78% (10831/13885) remote: Counting objects: 79% (10970/13885) remote: Counting objects: 80% (11108/13885) remote: Counting objects: 81% (11247/13885) remote: Counting objects: 82% (11386/13885) remote: Counting objects: 83% (11525/13885) remote: Counting objects: 84% (11664/13885) remote: Counting objects: 85% (11803/13885) remote: Counting objects: 86% (11942/13885) remote: Counting objects: 87% (12080/13885) remote: Counting objects: 88% (12219/13885) remote: Counting objects: 89% (12358/13885) remote: Counting objects: 90% (12497/13885) remote: Counting objects: 91% (12636/13885) remote: Counting objects: 92% (12775/13885) remote: Counting objects: 93% (12914/13885) remote: Counting objects: 94% (13052/13885) remote: Counting objects: 95% (13191/13885) remote: Counting objects: 96% (13330/13885) remote: Counting objects: 97% (13469/13885) remote: Counting objects: 98% (13608/13885) remote: Counting objects: 99% (13747/13885) remote: Counting objects: 100% (13885/13885) remote: Counting objects: 100% (13885/13885), done.
  5. 3.67 s remote: Compressing objects: 0% (1/3075) remote: Compressing objects: 1% (31/3075) remote: Compressing objects: 2% (62/3075) remote: Compressing objects: 3% (93/3075) remote: Compressing objects: 4% (123/3075) remote: Compressing objects: 5% (154/3075) remote: Compressing objects: 6% (185/3075) remote: Compressing objects: 7% (216/3075) remote: Compressing objects: 8% (246/3075) remote: Compressing objects: 9% (277/3075) remote: Compressing objects: 10% (308/3075) remote: Compressing objects: 11% (339/3075) remote: Compressing objects: 12% (369/3075) remote: Compressing objects: 13% (400/3075) remote: Compressing objects: 14% (431/3075) remote: Compressing objects: 15% (462/3075) remote: Compressing objects: 16% (492/3075) remote: Compressing objects: 17% (523/3075) remote: Compressing objects: 18% (554/3075) remote: Compressing objects: 19% (585/3075) remote: Compressing objects: 20% (615/3075) remote: Compressing objects: 21% (646/3075) remote: Compressing objects: 22% (677/3075) remote: Compressing objects: 23% (708/3075) remote: Compressing objects: 24% (738/3075) remote: Compressing objects: 24% (767/3075) remote: Compressing objects: 25% (769/3075) remote: Compressing objects: 26% (800/3075) remote: Compressing objects: 27% (831/3075) remote: Compressing objects: 28% (861/3075) remote: Compressing objects: 28% (880/3075) remote: Compressing objects: 29% (892/3075) remote: Compressing objects: 30% (923/3075) remote: Compressing objects: 31% (954/3075) remote: Compressing objects: 32% (984/3075) remote: Compressing objects: 33% (1015/3075) remote: Compressing objects: 34% (1046/3075) remote: Compressing objects: 35% (1077/3075) remote: Compressing objects: 36% (1107/3075) remote: Compressing objects: 37% (1138/3075) remote: Compressing objects: 38% (1169/3075) remote: Compressing objects: 39% (1200/3075) remote: Compressing objects: 40% (1230/3075) remote: Compressing objects: 41% (1261/3075) remote: Compressing objects: 42% (1292/3075) remote: Compressing objects: 43% (1323/3075) remote: Compressing objects: 44% (1353/3075) remote: Compressing objects: 45% (1384/3075) remote: Compressing objects: 46% (1415/3075) remote: Compressing objects: 47% (1446/3075) remote: Compressing objects: 48% (1476/3075) remote: Compressing objects: 49% (1507/3075) remote: Compressing objects: 50% (1538/3075) remote: Compressing objects: 51% (1569/3075) remote: Compressing objects: 52% (1599/3075) remote: Compressing objects: 53% (1630/3075) remote: Compressing objects: 54% (1661/3075) remote: Compressing objects: 55% (1692/3075) remote: Compressing objects: 56% (1722/3075) remote: Compressing objects: 57% (1753/3075) remote: Compressing objects: 58% (1784/3075) remote: Compressing objects: 59% (1815/3075) remote: Compressing objects: 60% (1845/3075) remote: Compressing objects: 61% (1876/3075) remote: Compressing objects: 62% (1907/3075) remote: Compressing objects: 63% (1938/3075) remote: Compressing objects: 64% (1968/3075) remote: Compressing objects: 65% (1999/3075) remote: Compressing objects: 66% (2030/3075) remote: Compressing objects: 67% (2061/3075) remote: Compressing objects: 68% (2091/3075) remote: Compressing objects: 69% (2122/3075) remote: Compressing objects: 70% (2153/3075) remote: Compressing objects: 71% (2184/3075) remote: Compressing objects: 72% (2214/3075) remote: Compressing objects: 73% (2245/3075) remote: Compressing objects: 74% (2276/3075) remote: Compressing objects: 75% (2307/3075) remote: Compressing objects: 76% (2337/3075) remote: Compressing objects: 77% (2368/3075) remote: Compressing objects: 78% (2399/3075) remote: Compressing objects: 79% (2430/3075) remote: Compressing objects: 80% (2460/3075) remote: Compressing objects: 81% (2491/3075) remote: Compressing objects: 82% (2522/3075) remote: Compressing objects: 83% (2553/3075) remote: Compressing objects: 84% (2583/3075) remote: Compressing objects: 85% (2614/3075) remote: Compressing objects: 86% (2645/3075) remote: Compressing objects: 87% (2676/3075) remote: Compressing objects: 88% (2706/3075) remote: Compressing objects: 89% (2737/3075) remote: Compressing objects: 90% (2768/3075) remote: Compressing objects: 91% (2799/3075) remote: Compressing objects: 92% (2829/3075) remote: Compressing objects: 93% (2860/3075) remote: Compressing objects: 94% (2891/3075) remote: Compressing objects: 95% (2922/3075) remote: Compressing objects: 96% (2952/3075) remote: Compressing objects: 97% (2983/3075) remote: Compressing objects: 98% (3014/3075) remote: Compressing objects: 99% (3045/3075) remote: Compressing objects: 100% (3075/3075) remote: Compressing objects: 100% (3075/3075), done.
  6. 7.39 s Receiving objects: 0% (1/78063) Receiving objects: 1% (781/78063) Receiving objects: 2% (1562/78063) Receiving objects: 3% (2342/78063) Receiving objects: 4% (3123/78063) Receiving objects: 5% (3904/78063) Receiving objects: 6% (4684/78063) Receiving objects: 7% (5465/78063) Receiving objects: 8% (6246/78063) Receiving objects: 9% (7026/78063) Receiving objects: 10% (7807/78063), 12.40 MiB | 24.79 MiB/s Receiving objects: 11% (8587/78063), 12.40 MiB | 24.79 MiB/s Receiving objects: 12% (9368/78063), 12.40 MiB | 24.79 MiB/s Receiving objects: 13% (10149/78063), 12.40 MiB | 24.79 MiB/s Receiving objects: 14% (10929/78063), 12.40 MiB | 24.79 MiB/s Receiving objects: 15% (11710/78063), 12.40 MiB | 24.79 MiB/s Receiving objects: 16% (12491/78063), 12.40 MiB | 24.79 MiB/s Receiving objects: 17% (13271/78063), 12.40 MiB | 24.79 MiB/s Receiving objects: 18% (14052/78063), 12.40 MiB | 24.79 MiB/s Receiving objects: 19% (14832/78063), 12.40 MiB | 24.79 MiB/s Receiving objects: 20% (15613/78063), 12.40 MiB | 24.79 MiB/s Receiving objects: 21% (16394/78063), 12.40 MiB | 24.79 MiB/s Receiving objects: 22% (17174/78063), 12.40 MiB | 24.79 MiB/s Receiving objects: 23% (17955/78063), 12.40 MiB | 24.79 MiB/s Receiving objects: 24% (18736/78063), 12.40 MiB | 24.79 MiB/s Receiving objects: 25% (19516/78063), 12.40 MiB | 24.79 MiB/s Receiving objects: 26% (20297/78063), 12.40 MiB | 24.79 MiB/s Receiving objects: 27% (21078/78063), 12.40 MiB | 24.79 MiB/s Receiving objects: 28% (21858/78063), 12.40 MiB | 24.79 MiB/s Receiving objects: 29% (22639/78063), 12.40 MiB | 24.79 MiB/s Receiving objects: 30% (23419/78063), 12.40 MiB | 24.79 MiB/s Receiving objects: 31% (24200/78063), 12.40 MiB | 24.79 MiB/s Receiving objects: 32% (24981/78063), 12.40 MiB | 24.79 MiB/s Receiving objects: 33% (25761/78063), 12.40 MiB | 24.79 MiB/s Receiving objects: 34% (26542/78063), 12.40 MiB | 24.79 MiB/s Receiving objects: 35% (27323/78063), 12.40 MiB | 24.79 MiB/s Receiving objects: 36% (28103/78063), 12.40 MiB | 24.79 MiB/s Receiving objects: 37% (28884/78063), 12.40 MiB | 24.79 MiB/s Receiving objects: 38% (29664/78063), 12.40 MiB | 24.79 MiB/s Receiving objects: 39% (30445/78063), 12.40 MiB | 24.79 MiB/s Receiving objects: 40% (31226/78063), 12.40 MiB | 24.79 MiB/s Receiving objects: 41% (32006/78063), 12.40 MiB | 24.79 MiB/s Receiving objects: 41% (32753/78063), 30.28 MiB | 30.27 MiB/s Receiving objects: 42% (32787/78063), 30.28 MiB | 30.27 MiB/s Receiving objects: 43% (33568/78063), 30.28 MiB | 30.27 MiB/s Receiving objects: 44% (34348/78063), 30.28 MiB | 30.27 MiB/s Receiving objects: 45% (35129/78063), 30.28 MiB | 30.27 MiB/s Receiving objects: 46% (35909/78063), 30.28 MiB | 30.27 MiB/s Receiving objects: 47% (36690/78063), 30.28 MiB | 30.27 MiB/s Receiving objects: 48% (37471/78063), 30.28 MiB | 30.27 MiB/s Receiving objects: 49% (38251/78063), 30.28 MiB | 30.27 MiB/s Receiving objects: 50% (39032/78063), 30.28 MiB | 30.27 MiB/s Receiving objects: 51% (39813/78063), 30.28 MiB | 30.27 MiB/s Receiving objects: 52% (40593/78063), 47.21 MiB | 31.40 MiB/s Receiving objects: 53% (41374/78063), 47.21 MiB | 31.40 MiB/s Receiving objects: 54% (42155/78063), 47.21 MiB | 31.40 MiB/s Receiving objects: 55% (42935/78063), 47.21 MiB | 31.40 MiB/s Receiving objects: 56% (43716/78063), 47.21 MiB | 31.40 MiB/s Receiving objects: 57% (44496/78063), 47.21 MiB | 31.40 MiB/s Receiving objects: 58% (45277/78063), 47.21 MiB | 31.40 MiB/s Receiving objects: 59% (46058/78063), 47.21 MiB | 31.40 MiB/s Receiving objects: 60% (46838/78063), 47.21 MiB | 31.40 MiB/s Receiving objects: 61% (47619/78063), 47.21 MiB | 31.40 MiB/s Receiving objects: 62% (48400/78063), 47.21 MiB | 31.40 MiB/s Receiving objects: 62% (48916/78063), 64.20 MiB | 31.72 MiB/s Receiving objects: 63% (49180/78063), 64.20 MiB | 31.72 MiB/s Receiving objects: 64% (49961/78063), 64.20 MiB | 31.72 MiB/s Receiving objects: 65% (50741/78063), 64.20 MiB | 31.72 MiB/s Receiving objects: 66% (51522/78063), 64.20 MiB | 31.72 MiB/s Receiving objects: 67% (52303/78063), 64.20 MiB | 31.72 MiB/s Receiving objects: 68% (53083/78063), 64.20 MiB | 31.72 MiB/s Receiving objects: 69% (53864/78063), 64.20 MiB | 31.72 MiB/s Receiving objects: 70% (54645/78063), 64.20 MiB | 31.72 MiB/s Receiving objects: 71% (55425/78063), 64.20 MiB | 31.72 MiB/s Receiving objects: 72% (56206/78063), 64.20 MiB | 31.72 MiB/s Receiving objects: 73% (56986/78063), 64.20 MiB | 31.72 MiB/s Receiving objects: 74% (57767/78063), 81.79 MiB | 32.27 MiB/s Receiving objects: 75% (58548/78063), 81.79 MiB | 32.27 MiB/s Receiving objects: 76% (59328/78063), 81.79 MiB | 32.27 MiB/s Receiving objects: 77% (60109/78063), 81.79 MiB | 32.27 MiB/s Receiving objects: 78% (60890/78063), 81.79 MiB | 32.27 MiB/s Receiving objects: 79% (61670/78063), 81.79 MiB | 32.27 MiB/s Receiving objects: 80% (62451/78063), 81.79 MiB | 32.27 MiB/s Receiving objects: 80% (62647/78063), 98.71 MiB | 32.39 MiB/s Receiving objects: 81% (63232/78063), 98.71 MiB | 32.39 MiB/s Receiving objects: 82% (64012/78063), 98.71 MiB | 32.39 MiB/s Receiving objects: 83% (64793/78063), 98.71 MiB | 32.39 MiB/s Receiving objects: 84% (65573/78063), 98.71 MiB | 32.39 MiB/s Receiving objects: 85% (66354/78063), 98.71 MiB | 32.39 MiB/s Receiving objects: 86% (67135/78063), 98.71 MiB | 32.39 MiB/s Receiving objects: 87% (67915/78063), 98.71 MiB | 32.39 MiB/s Receiving objects: 88% (68696/78063), 98.71 MiB | 32.39 MiB/s Receiving objects: 89% (69477/78063), 98.71 MiB | 32.39 MiB/s Receiving objects: 90% (70257/78063), 98.71 MiB | 32.39 MiB/s Receiving objects: 91% (71038/78063), 98.71 MiB | 32.39 MiB/s Receiving objects: 92% (71818/78063), 98.71 MiB | 32.39 MiB/s Receiving objects: 93% (72599/78063), 98.71 MiB | 32.39 MiB/s Receiving objects: 94% (73380/78063), 115.71 MiB | 32.62 MiB/s Receiving objects: 95% (74160/78063), 115.71 MiB | 32.62 MiB/s Receiving objects: 96% (74941/78063), 115.71 MiB | 32.62 MiB/s Receiving objects: 97% (75722/78063), 115.71 MiB | 32.62 MiB/s Receiving objects: 98% (76502/78063), 115.71 MiB | 32.62 MiB/s Receiving objects: 99% (77283/78063), 115.71 MiB | 32.62 MiB/s remote: Total 78063 (delta 9791), reused 11665 (delta 8714), pack-reused 64178 (from 2)
  7. 7.39 s Receiving objects: 100% (78063/78063), 115.71 MiB | 32.62 MiB/s Receiving objects: 100% (78063/78063), 120.77 MiB | 32.67 MiB/s, done.
  8. 8.17 s Resolving deltas: 0% (0/53110) Resolving deltas: 1% (532/53110) Resolving deltas: 2% (1063/53110) Resolving deltas: 3% (1594/53110) Resolving deltas: 4% (2125/53110) Resolving deltas: 5% (2656/53110) Resolving deltas: 6% (3190/53110) Resolving deltas: 7% (3720/53110) Resolving deltas: 8% (4249/53110) Resolving deltas: 9% (4780/53110) Resolving deltas: 10% (5311/53110) Resolving deltas: 11% (5844/53110) Resolving deltas: 12% (6375/53110) Resolving deltas: 13% (6905/53110) Resolving deltas: 14% (7436/53110) Resolving deltas: 15% (7967/53110) Resolving deltas: 16% (8498/53110) Resolving deltas: 17% (9029/53110) Resolving deltas: 18% (9560/53110) Resolving deltas: 19% (10091/53110) Resolving deltas: 20% (10622/53110) Resolving deltas: 21% (11155/53110) Resolving deltas: 22% (11685/53110) Resolving deltas: 23% (12216/53110) Resolving deltas: 24% (12747/53110) Resolving deltas: 25% (13278/53110) Resolving deltas: 26% (13810/53110) Resolving deltas: 27% (14340/53110) Resolving deltas: 28% (14871/53110) Resolving deltas: 29% (15402/53110) Resolving deltas: 30% (15933/53110) Resolving deltas: 31% (16465/53110) Resolving deltas: 32% (16996/53110) Resolving deltas: 33% (17527/53110) Resolving deltas: 34% (18058/53110) Resolving deltas: 35% (18589/53110) Resolving deltas: 36% (19120/53110) Resolving deltas: 37% (19651/53110) Resolving deltas: 38% (20182/53110) Resolving deltas: 39% (20713/53110) Resolving deltas: 40% (21245/53110) Resolving deltas: 41% (21776/53110) Resolving deltas: 42% (22307/53110) Resolving deltas: 43% (22838/53110) Resolving deltas: 44% (23369/53110) Resolving deltas: 45% (23900/53110) Resolving deltas: 46% (24432/53110) Resolving deltas: 47% (24962/53110) Resolving deltas: 48% (25493/53110) Resolving deltas: 49% (26024/53110) Resolving deltas: 50% (26555/53110) Resolving deltas: 51% (27087/53110) Resolving deltas: 52% (27618/53110) Resolving deltas: 53% (28149/53110) Resolving deltas: 54% (28680/53110) Resolving deltas: 55% (29212/53110) Resolving deltas: 56% (29742/53110) Resolving deltas: 57% (30273/53110) Resolving deltas: 58% (30804/53110) Resolving deltas: 59% (31335/53110) Resolving deltas: 60% (31866/53110) Resolving deltas: 61% (32398/53110) Resolving deltas: 62% (32929/53110) Resolving deltas: 63% (33460/53110) Resolving deltas: 64% (33991/53110) Resolving deltas: 65% (34522/53110) Resolving deltas: 66% (35054/53110) Resolving deltas: 67% (35584/53110) Resolving deltas: 68% (36115/53110) Resolving deltas: 69% (36648/53110) Resolving deltas: 70% (37177/53110) Resolving deltas: 71% (37709/53110) Resolving deltas: 72% (38240/53110) Resolving deltas: 73% (38772/53110) Resolving deltas: 74% (39302/53110) Resolving deltas: 75% (39833/53110) Resolving deltas: 76% (40364/53110) Resolving deltas: 77% (40895/53110) Resolving deltas: 78% (41426/53110) Resolving deltas: 79% (41957/53110) Resolving deltas: 80% (42489/53110) Resolving deltas: 81% (43020/53110) Resolving deltas: 82% (43552/53110) Resolving deltas: 83% (44082/53110) Resolving deltas: 84% (44613/53110) Resolving deltas: 85% (45144/53110) Resolving deltas: 86% (45677/53110) Resolving deltas: 87% (46206/53110) Resolving deltas: 88% (46737/53110) Resolving deltas: 89% (47268/53110) Resolving deltas: 90% (47799/53110) Resolving deltas: 91% (48331/53110) Resolving deltas: 92% (48862/53110) Resolving deltas: 93% (49393/53110) Resolving deltas: 94% (49926/53110) Resolving deltas: 95% (50455/53110) Resolving deltas: 96% (50989/53110) Resolving deltas: 97% (51519/53110) Resolving deltas: 98% (52048/53110) Resolving deltas: 99% (52579/53110) Resolving deltas: 100% (53110/53110) Resolving deltas: 100% (53110/53110), done.
  9. 8.47 s Fetching commit d3dd17d9365e2ca30d668d40432f3a1d094af28e for raised_energy_cff_wip ...
  10. 8.47 s $ /nix/store/bcnisk3ydfgv26v2gw3zlky24g00yww2-git-2.54.0/bin/git fetch origin d3dd17d9365e2ca30d668d40432f3a1d094af28e
  11. 8.96 s From https://github.com/alphal00p/gammaloop
  12. 8.96 s * branch d3dd17d9365e2ca30d668d40432f3a1d094af28e -> FETCH_HEAD
  13. 8.97 s $ /nix/store/9ypz3flqsrl5xl495mm8h645gadjsxi1-coreutils-9.11/bin/timeout --kill-after=15s 7200s /nix/store/bcnisk3ydfgv26v2gw3zlky24g00yww2-git-2.54.0/bin/git -c advice.detachedHead=false checkout d3dd17d9365e2ca30d668d40432f3a1d094af28e
  14. 9.15 s HEAD is now at d3dd17d93 stream lower-sector CFF component products
  15. 9.15 s $ /nix/store/9ypz3flqsrl5xl495mm8h645gadjsxi1-coreutils-9.11/bin/timeout --kill-after=15s 7200s /nix/store/23zk8sgzamrbmj1fday15szf7f2279s8-nix-2.34.7/bin/nix --extra-experimental-features nix-command --extra-experimental-features flakes --log-format internal-json run .#packages.x86_64-linux.nix-ci-check-gammaloop-nextest-integration --print-build-logs
  16. 12.77 s
  17. 13.36 s Downloading cached gammaloop-nextest-binaries-integration-gammaloop-integration-tests from https://cache.nix-ci.com
  18. 51.21 s Downloaded cached gammaloop-nextest-binaries-integration-gammaloop-integration-tests (414.9 MiB) in 37.8s
  19. 51.21 s Progress: 0 of 1 built, 1 of 3 downloaded from cache
  20. 51.21 s Downloading cached gammaloop-nextest-binaries-integration from https://cache.nix-ci.com
  21. 51.25 s Downloaded cached gammaloop-nextest-binaries-integration (528 B) in 43ms
  22. 51.25 s Progress: 0 of 1 built, 2 of 3 downloaded from cache
  23. 51.25 s Downloading cached nix-ci-check-gammaloop-nextest-integration from https://cache.nix-ci.com
  24. 51.50 s Downloaded cached nix-ci-check-gammaloop-nextest-integration (1032 B) in 246ms
  25. 51.50 s Progress: 0 of 1 built, 3 of 3 downloaded from cache
  26. 55.82 s evaluating derivation 'g copying '/nix/store/jc0j evaluating derivation 'g copying '/nix/store/jc0j evaluating derivation 'g copying '/nix/store/jc0j evaluating derivation 'g copying '/nix/store/jc0j evaluating derivation 'g copying '/nix/store/jc0j evaluating derivation 'g querying gammaloop-nexte querying info about miss querying gammaloop-nexte [0/1 built, 0.0 KiB DL] [1/0/1 built, 0.0 KiB DLgammaloop-nextest-integration> Extracting 13 binaries, 1 build script output directory, and 3 linked paths to /build/nextest-archive-930Ufy
  27. 57.83 s gammaloop-nextest-integration> Extracted 30 files to /build/nextest-archive-930Ufy in 2.02s
  28. 57.85 s gammaloop-nextest-integration> ------------
  29. 57.85 s gammaloop-nextest-integration> Nextest run ID 6fb25a9f-db91-4514-9c64-4d5c1962672f with nextest profile: ci_gammaloop
  30. 57.85 s gammaloop-nextest-integration> Starting 152 tests across 13 binaries (208 tests skipped, including 207 tests via profile.ci_gammaloop.default-filter)
  31. 389.00 s gammaloop-nextest-integration> FAIL [ 71.208s] ( 54/152) gammaloop-integration-tests::test_runs aa_aa::important::aa_aa_local_inspect_backend_consistency
  32. 389.00 s gammaloop-nextest-integration> stdout ---
  33. 389.00 s gammaloop-nextest-integration>
  34. 389.00 s gammaloop-nextest-integration> running 1 test
  35. 389.00 s gammaloop-nextest-integration> test aa_aa::important::aa_aa_local_inspect_backend_consistency has been running for over 60 seconds
  36. 389.00 s gammaloop-nextest-integration> test aa_aa::important::aa_aa_local_inspect_backend_consistency ... FAILED
  37. 389.00 s gammaloop-nextest-integration>
  38. 389.00 s gammaloop-nextest-integration> failures:
  39. 389.00 s gammaloop-nextest-integration>
  40. 389.00 s gammaloop-nextest-integration> failures:
  41. 389.00 s gammaloop-nextest-integration> aa_aa::important::aa_aa_local_inspect_backend_consistency
  42. 389.00 s gammaloop-nextest-integration>
  43. 389.00 s gammaloop-nextest-integration> test result: FAILED. 0 passed; 1 failed; 0 ignored; 0 measured; 258 filtered out; finished in 71.03s
  44. 389.00 s gammaloop-nextest-integration>
  45. 389.00 s gammaloop-nextest-integration> stderr ---
  46. 389.00 s gammaloop-nextest-integration> [2026-09-06 07:01:54.337] @gammaloop_api::se... INFO : Running command import model sm-default.json
  47. 389.00 s gammaloop-nextest-integration> [2026-09-06 07:01:54.337] @import::model INFO : Loading built-in JSON model sm-default
  48. 389.00 s gammaloop-nextest-integration> [2026-09-06 07:01:54.356] @gammalooprs::model INFO : The following 11 external parameters were forced to zero by the restriction card:
  49. 389.00 s gammaloop-nextest-integration> lamWS, AWS, rhoWS, etaWS, ymc, yme, ymm, MC, Me, MM, WTau
  50. 389.00 s gammaloop-nextest-integration> [2026-09-06 07:01:54.356] @gammalooprs::model INFO : The following 34 vertex rules were removed by the restriction card:
  51. 389.00 s gammaloop-nextest-integration> V_82 -> (c~, d, G+) | V_83 -> (t~, d, G+) | V_84 -> (c~, s, G+) | V_85 -> (t~, s, G+) | V_86 -> (u~, b, G+) | V_87 -> (c~, b, G+) | V_90 -> (c~, d, W+) | V_91 -> (t~, d, W+) | V_92 -> (u~, s, W+) | V_94 -> (t~, s, W+) | V_95 -> (u~, b, W+) | V_96 -> (c~, b, W+) | V_101 -> (e+, e-, G0) | V_102 -> (mu+, mu-, G0) | V_104 -> (e+, e-, H) | V_105 -> (mu+, mu-, H) | V_110 -> (ve~, e-, G+) | V_111 -> (vm~, mu-, G+) | V_116 -> (b~, u, G-) | V_117 -> (d~, c, G-) | V_118 -> (s~, c, G-) | V_119 -> (b~, c, G-) | V_120 -> (d~, t, G-) | V_121 -> (s~, t, G-) | V_124 -> (s~, u, W-) | V_125 -> (b~, u, W-) | V_126 -> (d~, c, W-) | V_128 -> (b~, c, W-) | V_129 -> (d~, t, W-) | V_130 -> (s~, t, W-) | V_138 -> (c~, c, G0) | V_140 -> (c~, c, H) | V_145 -> (e+, ve, G-) | V_146 -> (mu+, vm, G-)
  52. 389.00 s gammaloop-nextest-integration> [2026-09-06 07:01:54.356] @gammalooprs::model INFO : The following 36 couplings were removed by the restriction card:
  53. 389.00 s gammaloop-nextest-integration> GC_13, GC_14, GC_16, GC_17, GC_18, GC_19, GC_20, GC_22, GC_23, GC_24, GC_25, GC_26, GC_28, GC_29, GC_42, GC_43, GC_44, GC_46, GC_47, GC_48, GC_84, GC_85, GC_86, GC_87, GC_88, GC_89, GC_90, GC_91, GC_92, GC_93, GC_101, GC_102, GC_103, GC_105, GC_106, GC_107
  54. 389.00 s gammaloop-nextest-integration> [2026-09-06 07:01:54.357] @gammaloop_api::se... INFO : Running command run set_model_parameters
  55. 389.00 s gammaloop-nextest-integration> [2026-09-06 07:01:54.357] @gammaloop_api::se... INFO : Starting command block set_model_parameters
  56. 389.00 s gammaloop-nextest-integration> [2026-09-06 07:01:54.357] @gammaloop_api::se... INFO : Running command set model MT=173.0
  57. 389.00 s gammaloop-nextest-integration> [2026-09-06 07:01:54.360] @gammaloop_api::se... INFO : Running command set model WT=0.0
  58. 389.00 s gammaloop-nextest-integration> [2026-09-06 07:01:54.364] @gammaloop_api::se... INFO : Running command set model ymt=173.0
  59. 389.00 s gammaloop-nextest-integration> [2026-09-06 07:01:54.367] @gammaloop_api::se... INFO : Running command set model aS=0.118
  60. 389.00 s gammaloop-nextest-integration> [2026-09-06 07:01:54.370] @gammaloop_api::se... INFO : Running command set model aEWM1=137.036
  61. 389.00 s gammaloop-nextest-integration> [2026-09-06 07:01:54.373] @gammaloop_api::se... INFO : Running command set model Gf=1.166390e-05
  62. 389.00 s gammaloop-nextest-integration> [2026-09-06 07:01:54.377] @gammaloop_api::se... INFO : Running command set model MZ=91.188
  63. 389.00 s gammaloop-nextest-integration> [2026-09-06 07:01:54.380] @gammaloop_api::se... INFO : Running command set global string '
  64. 389.00 s gammaloop-nextest-integration> [global.generation.compile]
  65. 389.00 s gammaloop-nextest-integration> compilation_mode = "symjit"
  66. 389.00 s gammaloop-nextest-integration> optimization_level = "O0"
  67. 389.00 s gammaloop-nextest-integration> fast_math = false
  68. 389.00 s gammaloop-nextest-integration> [...]
  69. 389.00 s gammaloop-nextest-integration> [2026-09-06 07:01:54.381] @gammaloop_api::se... INFO : Running command import graphs ./examples/cli/aa_aa/1L/aa_aa_1L.dot -p aa_aa_all_helicities -i 1L_ppmm -o
  70. 389.00 s gammaloop-nextest-integration> [2026-09-06 07:01:54.381] @commands::import INFO : Loading graphs from '/build/source/examples/cli/aa_aa/1L/aa_aa_1L.dot'
  71. 389.00 s gammaloop-nextest-integration> [2026-09-06 07:01:54.389] @gammaloop_api::se... INFO : Running command generate existing -p aa_aa_all_helicities
  72. 389.00 s gammaloop-nextest-integration> [2026-09-06 07:02:21.784] @commands::generate INFO :
  73. 389.00 s gammaloop-nextest-integration> Integrand generation summary
  74. 389.00 s gammaloop-nextest-integration> peak RAM 1.09 GiB | cores 1
  75. 389.00 s gammaloop-nextest-integration> ╭───────────┬───────┬─────────┬──────────────┬─────────────┬────────────────┬──────────────╮
  76. 389.00 s gammaloop-nextest-integration> │ integrand │ graph │ # evals │ expr build │ spenso │ symbolica eval │ compile │
  77. 389.00 s gammaloop-nextest-integration> ├───────────┼───────┼─────────┼──────────────┼─────────────┼────────────────┼──────────────┤
  78. 389.00 s gammaloop-nextest-integration> │ 1L_ppmm │ GL0 │ 13 │ 525ms (5.6%) │ 1.81s (19%) │ 6.12s (65%) │ 923ms (9.8%) │
  79. 389.00 s gammaloop-nextest-integration> │ 1L_ppmm │ GL2 │ 13 │ 490ms (5.6%) │ 1.57s (18%) │ 5.81s (66%) │ 890ms (10%) │
  80. 389.00 s gammaloop-nextest-integration> │ 1L_ppmm │ GL4 │ 11 │ 503ms (5.5%) │ 1.79s (19%) │ 6.06s (66%) │ 875ms (9.5%) │
  81. 389.00 s gammaloop-nextest-integration> ├───────────┼───────┼─────────┼──────────────┼─────────────┼────────────────┼──────────────┤
  82. 389.00 s gammaloop-nextest-integration> │ Total │ │ 37 │ 1.52s (5.6%) │ 5.17s (19%) │ 18.00s (66%) │ 2.69s (9.8%) │
  83. 389.00 s gammaloop-nextest-integration> ╰───────────┴───────┴─────────┴──────────────┴─────────────┴────────────────┴──────────────╯
  84. 389.00 s gammaloop-nextest-integration> [2026-09-06 07:02:22.731] @gammaloop_api::se... INFO : Running command import model sm-default.json
  85. 389.00 s gammaloop-nextest-integration> [2026-09-06 07:02:22.731] @import::model INFO : Loading built-in JSON model sm-default
  86. 389.00 s gammaloop-nextest-integration> [2026-09-06 07:02:22.753] @gammalooprs::model INFO : The following 11 external parameters were forced to zero by the restriction card:
  87. 389.00 s gammaloop-nextest-integration> lamWS, AWS, rhoWS, etaWS, ymc, yme, ymm, MC, Me, MM, WTau
  88. 389.00 s gammaloop-nextest-integration> [2026-09-06 07:02:22.753] @gammalooprs::model INFO : The following 34 vertex rules were removed by the restriction card:
  89. 389.00 s gammaloop-nextest-integration> V_82 -> (c~, d, G+) | V_83 -> (t~, d, G+) | V_84 -> (c~, s, G+) | V_85 -> (t~, s, G+) | V_86 -> (u~, b, G+) | V_87 -> (c~, b, G+) | V_90 -> (c~, d, W+) | V_91 -> (t~, d, W+) | V_92 -> (u~, s, W+) | V_94 -> (t~, s, W+) | V_95 -> (u~, b, W+) | V_96 -> (c~, b, W+) | V_101 -> (e+, e-, G0) | V_102 -> (mu+, mu-, G0) | V_104 -> (e+, e-, H) | V_105 -> (mu+, mu-, H) | V_110 -> (ve~, e-, G+) | V_111 -> (vm~, mu-, G+) | V_116 -> (b~, u, G-) | V_117 -> (d~, c, G-) | V_118 -> (s~, c, G-) | V_119 -> (b~, c, G-) | V_120 -> (d~, t, G-) | V_121 -> (s~, t, G-) | V_124 -> (s~, u, W-) | V_125 -> (b~, u, W-) | V_126 -> (d~, c, W-) | V_128 -> (b~, c, W-) | V_129 -> (d~, t, W-) | V_130 -> (s~, t, W-) | V_138 -> (c~, c, G0) | V_140 -> (c~, c, H) | V_145 -> (e+, ve, G-) | V_146 -> (mu+, vm, G-)
  90. 389.00 s gammaloop-nextest-integration> [2026-09-06 07:02:22.753] @gammalooprs::model INFO : The following 36 couplings were removed by the restriction card:
  91. 389.00 s gammaloop-nextest-integration> GC_13, GC_14, GC_16, GC_17, GC_18, GC_19, GC_20, GC_22, GC_23, GC_24, GC_25, GC_26, GC_28, GC_29, GC_42, GC_43, GC_44, GC_46, GC_47, GC_48, GC_84, GC_85, GC_86, GC_87, GC_88, GC_89, GC_90, GC_91, GC_92, GC_93, GC_101, GC_102, GC_103, GC_105, GC_106, GC_107
  92. 389.00 s gammaloop-nextest-integration> [2026-09-06 07:02:22.754] @gammaloop_api::se... INFO : Running command run set_model_parameters
  93. 389.00 s gammaloop-nextest-integration> [2026-09-06 07:02:22.754] @gammaloop_api::se... INFO : Starting command block set_model_parameters
  94. 389.00 s gammaloop-nextest-integration> [2026-09-06 07:02:22.754] @gammaloop_api::se... INFO : Running command set model MT=173.0
  95. 389.00 s gammaloop-nextest-integration> [2026-09-06 07:02:22.758] @gammaloop_api::se... INFO : Running command set model WT=0.0
  96. 389.00 s gammaloop-nextest-integration> [2026-09-06 07:02:22.762] @gammaloop_api::se... INFO : Running command set model ymt=173.0
  97. 389.00 s gammaloop-nextest-integration> [2026-09-06 07:02:22.766] @gammaloop_api::se... INFO : Running command set model aS=0.118
  98. 389.00 s gammaloop-nextest-integration> [2026-09-06 07:02:22.770] @gammaloop_api::se... INFO : Running command set model aEWM1=137.036
  99. 389.00 s gammaloop-nextest-integration> [2026-09-06 07:02:22.774] @gammaloop_api::se... INFO : Running command set model Gf=1.166390e-05
  100. 389.00 s gammaloop-nextest-integration> [2026-09-06 07:02:22.777] @gammaloop_api::se... INFO : Running command set model MZ=91.188
  101. 389.00 s gammaloop-nextest-integration> [2026-09-06 07:02:22.782] @gammaloop_api::se... INFO : Running command set global string '
  102. 389.00 s gammaloop-nextest-integration> [global.generation.compile]
  103. 389.00 s gammaloop-nextest-integration> compilation_mode = "assembly"
  104. 389.00 s gammaloop-nextest-integration> optimization_level = "O0"
  105. 389.00 s gammaloop-nextest-integration> fast_math = false
  106. 389.00 s gammaloop-nextest-integration> [...]
  107. 389.00 s gammaloop-nextest-integration> [2026-09-06 07:02:22.783] @gammaloop_api::se... INFO : Running command import graphs ./examples/cli/aa_aa/1L/aa_aa_1L.dot -p aa_aa_all_helicities_assembly -i 1L_ppmm -o
  108. 389.00 s gammaloop-nextest-integration> [2026-09-06 07:02:22.783] @commands::import INFO : Loading graphs from '/build/source/examples/cli/aa_aa/1L/aa_aa_1L.dot'
  109. 389.00 s gammaloop-nextest-integration> [2026-09-06 07:02:22.791] @gammaloop_api::se... INFO : Running command generate existing -p aa_aa_all_helicities_assembly
  110. 389.00 s gammaloop-nextest-integration> [2026-09-06 07:02:45.043] @processes::amplitude INFO : Compiling amplitude 1L_ppmm
  111. 389.00 s gammaloop-nextest-integration> [2026-09-06 07:03:04.191] @commands::generate INFO : Removed 34 generated C++ source file(s). Use '--keep-sources' to keep them.
  112. 389.00 s gammaloop-nextest-integration> [2026-09-06 07:03:04.191] @commands::generate INFO :
  113. 389.00 s gammaloop-nextest-integration> Integrand generation summary
  114. 389.00 s gammaloop-nextest-integration> peak RAM 2.21 GiB | cores 1
  115. 389.00 s gammaloop-nextest-integration> ╭───────────┬───────┬─────────┬──────────────┬──────────────┬────────────────┬──────────────╮
  116. 389.00 s gammaloop-nextest-integration> │ integrand │ graph │ # evals │ expr build │ spenso │ symbolica eval │ compile │
  117. 389.00 s gammaloop-nextest-integration> ├───────────┼───────┼─────────┼──────────────┼──────────────┼────────────────┼──────────────┤
  118. 389.00 s gammaloop-nextest-integration> │ 1L_ppmm │ GL0 │ 13 │ 562ms (4.0%) │ 1.51s (11%) │ 5.68s (41%) │ 6.16s (44%) │
  119. 389.00 s gammaloop-nextest-integration> │ 1L_ppmm │ GL2 │ 13 │ 593ms (4.2%) │ 1.37s (9.6%) │ 5.34s (37%) │ 6.95s (49%) │
  120. 389.00 s gammaloop-nextest-integration> │ 1L_ppmm │ GL4 │ 11 │ 581ms (4.4%) │ 1.35s (10%) │ 5.23s (40%) │ 6.03s (46%) │
  121. 389.00 s gammaloop-nextest-integration> ├───────────┼───────┼─────────┼──────────────┼──────────────┼────────────────┼──────────────┤
  122. 389.00 s gammaloop-nextest-integration> │ Total │ │ 37 │ 1.74s (4.2%) │ 4.24s (10%) │ 16.25s (39%) │ 19.14s (46%) │
  123. 389.00 s gammaloop-nextest-integration> ╰───────────┴───────┴─────────┴──────────────┴──────────────┴────────────────┴──────────────╯
  124. 389.00 s gammaloop-nextest-integration> [2026-09-06 07:03:04.857] @gammaloop_api::se... INFO : Running command set process -p aa_aa_all_helicities -i 1L_ppmm string '
  125. 389.00 s gammaloop-nextest-integration> [stability]
  126. 389.00 s gammaloop-nextest-integration> check_on_norm = true
  127. 389.00 s gammaloop-nextest-integration> escalate_if_exact_zero = false
  128. 389.00 s gammaloop-nextest-integration> loop_momenta_norm_escalation_factor = -1.0
  129. 389.00 s gammaloop-nextest-integration> [...]
  130. 389.00 s gammaloop-nextest-integration> [2026-09-06 07:03:04.857] @gammaloop_api::se... INFO : Running command set process -p aa_aa_all_helicities_assembly -i 1L_ppmm string '
  131. 389.00 s gammaloop-nextest-integration> [stability]
  132. 389.00 s gammaloop-nextest-integration> check_on_norm = true
  133. 389.00 s gammaloop-nextest-integration> escalate_if_exact_zero = false
  134. 389.00 s gammaloop-nextest-integration> loop_momenta_norm_escalation_factor = -1.0
  135. 389.00 s gammaloop-nextest-integration> [...]
  136. 389.00 s gammaloop-nextest-integration> [2026-09-06 07:03:04.858] @gammaloop_api::se... INFO : Running command set process -p aa_aa_all_helicities -i 1L_mpmm string '
  137. 389.00 s gammaloop-nextest-integration> [stability]
  138. 389.00 s gammaloop-nextest-integration> check_on_norm = true
  139. 389.00 s gammaloop-nextest-integration> escalate_if_exact_zero = false
  140. 389.00 s gammaloop-nextest-integration> loop_momenta_norm_escalation_factor = -1.0
  141. 389.00 s gammaloop-nextest-integration> [...]
  142. 389.00 s gammaloop-nextest-integration> [2026-09-06 07:03:04.859] @gammaloop_api::se... INFO : Running command set process -p aa_aa_all_helicities_assembly -i 1L_mpmm string '
  143. 389.00 s gammaloop-nextest-integration> [stability]
  144. 389.00 s gammaloop-nextest-integration> check_on_norm = true
  145. 389.00 s gammaloop-nextest-integration> escalate_if_exact_zero = false
  146. 389.00 s gammaloop-nextest-integration> loop_momenta_norm_escalation_factor = -1.0
  147. 389.00 s gammaloop-nextest-integration> [...]
  148. 389.00 s gammaloop-nextest-integration> [2026-09-06 07:03:04.859] @gammaloop_api::se... INFO : Running command set process -p aa_aa_all_helicities -i 1L_mmmm string '
  149. 389.00 s gammaloop-nextest-integration> [stability]
  150. 389.00 s gammaloop-nextest-integration> check_on_norm = true
  151. 389.00 s gammaloop-nextest-integration> escalate_if_exact_zero = false
  152. 389.00 s gammaloop-nextest-integration> loop_momenta_norm_escalation_factor = -1.0
  153. 389.00 s gammaloop-nextest-integration> [...]
  154. 389.00 s gammaloop-nextest-integration> [2026-09-06 07:03:04.860] @gammaloop_api::se... INFO : Running command set process -p aa_aa_all_helicities_assembly -i 1L_mmmm string '
  155. 389.00 s gammaloop-nextest-integration> [stability]
  156. 389.00 s gammaloop-nextest-integration> check_on_norm = true
  157. 389.00 s gammaloop-nextest-integration> escalate_if_exact_zero = false
  158. 389.00 s gammaloop-nextest-integration> loop_momenta_norm_escalation_factor = -1.0
  159. 389.00 s gammaloop-nextest-integration> [...]
  160. 389.00 s gammaloop-nextest-integration> [2026-09-06 07:03:04.861] @gammaloop_api::se... INFO : Running command set process -p aa_aa_all_helicities -i 1L_pmmp string '
  161. 389.00 s gammaloop-nextest-integration> [stability]
  162. 389.00 s gammaloop-nextest-integration> check_on_norm = true
  163. 389.00 s gammaloop-nextest-integration> escalate_if_exact_zero = false
  164. 389.00 s gammaloop-nextest-integration> loop_momenta_norm_escalation_factor = -1.0
  165. 389.00 s gammaloop-nextest-integration> [...]
  166. 389.00 s gammaloop-nextest-integration> [2026-09-06 07:03:04.861] @gammaloop_api::se... INFO : Running command set process -p aa_aa_all_helicities_assembly -i 1L_pmmp string '
  167. 389.00 s gammaloop-nextest-integration> [stability]
  168. 389.00 s gammaloop-nextest-integration> check_on_norm = true
  169. 389.00 s gammaloop-nextest-integration> escalate_if_exact_zero = false
  170. 389.00 s gammaloop-nextest-integration> loop_momenta_norm_escalation_factor = -1.0
  171. 389.00 s gammaloop-nextest-integration> [...]
  172. 389.00 s gammaloop-nextest-integration> [2026-09-06 07:03:04.862] @gammaloop_api::se... INFO : Running command set process -p aa_aa_all_helicities -i 1L_pmpm string '
  173. 389.00 s gammaloop-nextest-integration> [stability]
  174. 389.00 s gammaloop-nextest-integration> check_on_norm = true
  175. 389.00 s gammaloop-nextest-integration> escalate_if_exact_zero = false
  176. 389.00 s gammaloop-nextest-integration> loop_momenta_norm_escalation_factor = -1.0
  177. 389.00 s gammaloop-nextest-integration> [...]
  178. 389.00 s gammaloop-nextest-integration> [2026-09-06 07:03:04.863] @gammaloop_api::se... INFO : Running command set process -p aa_aa_all_helicities_assembly -i 1L_pmpm string '
  179. 389.00 s gammaloop-nextest-integration> [stability]
  180. 389.00 s gammaloop-nextest-integration> check_on_norm = true
  181. 389.00 s gammaloop-nextest-integration> escalate_if_exact_zero = false
  182. 389.00 s gammaloop-nextest-integration> loop_momenta_norm_escalation_factor = -1.0
  183. 389.00 s gammaloop-nextest-integration> [...]
  184. 389.00 s gammaloop-nextest-integration> [2026-09-06 07:03:04.867] @process::amplitude INFO : Input is below threshold: 0 existing threshold E-surfaces across 0/1 graph groups
  185. 389.00 s gammaloop-nextest-integration> [2026-09-06 07:03:04.867] @process::amplitude INFO : overlap structure of group 0: [0: []]
  186. 389.00 s gammaloop-nextest-integration> [2026-09-06 07:03:04.868] @integrands::process [{#im_is_nan, #re_is_nan}] WARNING : final process evaluation is nonfinite
  187. 389.00 s gammaloop-nextest-integration> [2026-09-06 07:03:04.868] @commands::inspect INFO :
  188. 389.00 s gammaloop-nextest-integration> Input point in momentum space:
  189. 389.00 s gammaloop-nextest-integration>
  190. 389.00 s gammaloop-nextest-integration> ( 0.1100000000000000, -0.0700000000000000, 0.1900000000000000 )
  191. 389.00 s gammaloop-nextest-integration>
  192. 389.00 s gammaloop-nextest-integration> The evaluation of integrand '1L_ppmm' is:
  193. 389.00 s gammaloop-nextest-integration>
  194. 389.00 s gammaloop-nextest-integration> ( +0.0000000000000000e0, +0.0000000000000000e0 i)
  195. 389.00 s gammaloop-nextest-integration>
  196. 389.00 s gammaloop-nextest-integration> [2026-09-06 07:03:04.871] @process::amplitude INFO : Input is below threshold: 0 existing threshold E-surfaces across 0/1 graph groups
  197. 389.00 s gammaloop-nextest-integration> [2026-09-06 07:03:04.871] @process::amplitude INFO : overlap structure of group 0: [0: []]
  198. 389.00 s gammaloop-nextest-integration> [2026-09-06 07:03:04.871] @commands::inspect INFO :
  199. 389.00 s gammaloop-nextest-integration> Input point in momentum space:
  200. 389.00 s gammaloop-nextest-integration>
  201. 389.00 s gammaloop-nextest-integration> ( 0.1100000000000000, -0.0700000000000000, 0.1900000000000000 )
  202. 389.00 s gammaloop-nextest-integration>
  203. 389.00 s gammaloop-nextest-integration> The evaluation of integrand '1L_ppmm' is:
  204. 389.00 s gammaloop-nextest-integration>
  205. 389.00 s gammaloop-nextest-integration> ( -1.7132462539328486e-28, -8.7105072229446864e-10 i)
  206. 389.00 s gammaloop-nextest-integration>
  207. 389.00 s gammaloop-nextest-integration> The application panicked (crashed).
  208. 389.01 s gammaloop-nextest-integration> Message: kinematics=a, integrand=1L_ppmm, graph_id=0: assembly vs symjit inspect: actual=(-0.00000000000000000000000000017132462539328486+-0.0000000008710507222944686i), expected=(0+0i), tolerance=0.0000000001
  209. 389.01 s gammaloop-nextest-integration> Location: tests/tests/test_runs/utils.rs:466
  210. 389.01 s gammaloop-nextest-integration>
  211. 389.01 s gammaloop-nextest-integration> ━━━━━━━━━━━━━━━━━━━━━━━━━━━━━━━━━━ BACKTRACE ━━━━━━━━━━━━━━━━━━━━━━━━━━━━━━━━━━━
  212. 389.01 s gammaloop-nextest-integration> 1: <color_eyre[51793ea62743adbd]::config::PanicHook>::panic_report<unknown>
  213. 389.01 s gammaloop-nextest-integration> at <unknown source file>:<unknown line>
  214. 389.01 s gammaloop-nextest-integration> 2: <color_eyre[51793ea62743adbd]::config::PanicHook>::into_panic_hook::{closure#0}<unknown>
  215. 389.01 s gammaloop-nextest-integration> at <unknown source file>:<unknown line>
  216. 389.01 s gammaloop-nextest-integration> 3: std[bcb96dfbba0ab899]::panicking::panic_with_hook<unknown>
  217. 389.01 s gammaloop-nextest-integration> at <unknown source file>:<unknown line>
  218. 389.01 s gammaloop-nextest-integration> 4: std[bcb96dfbba0ab899]::panicking::panic_handler::{closure#0}<unknown>
  219. 389.01 s gammaloop-nextest-integration> at <unknown source file>:<unknown line>
  220. 389.01 s gammaloop-nextest-integration> 5: std[bcb96dfbba0ab899]::sys::backtrace::__rust_end_short_backtrace::<std[bcb96dfbba0ab899]::panicking::panic_handler::{closure#0}, !><unknown>
  221. 389.01 s gammaloop-nextest-integration> at <unknown source file>:<unknown line>
  222. 389.01 s gammaloop-nextest-integration> 6: __rustc[6c289b9f9c454d21]::rust_begin_unwind<unknown>
  223. 389.01 s gammaloop-nextest-integration> at <unknown source file>:<unknown line>
  224. 389.01 s gammaloop-nextest-integration> 7: core[940e698046960fd5]::panicking::panic_fmt<unknown>
  225. 389.01 s gammaloop-nextest-integration> at <unknown source file>:<unknown line>
  226. 389.01 s gammaloop-nextest-integration> 8: <test_runs[66584badfeb6c7be]::aa_aa::important::aa_aa_local_inspect_backend_consistency::{closure#0} as core[940e698046960fd5]::ops::function::FnOnce<()>>::call_once<unknown>
  227. 389.01 s gammaloop-nextest-integration> at <unknown source file>:<unknown line>
  228. 389.01 s gammaloop-nextest-integration> 9: serial_test[cd99724524a2f1c0]::serial_code_lock::local_serial_core_with_return::<(), eyre[cb2fd339c0c40fca]::Report><unknown>
  229. 389.01 s gammaloop-nextest-integration> at <unknown source file>:<unknown line>
  230. 389.01 s gammaloop-nextest-integration> 10: <test_runs[66584badfeb6c7be]::aa_aa::important::aa_aa_local_inspect_backend_consistency::{closure#0} as core[940e698046960fd5]::ops::function::FnOnce<()>>::call_once<unknown>
  231. 389.01 s gammaloop-nextest-integration> at <unknown source file>:<unknown line>
  232. 389.01 s gammaloop-nextest-integration> 11: test[75d6903177b1d7e9]::__rust_begin_short_backtrace::<core[940e698046960fd5]::result::Result<(), alloc[2ea6bcb46fca0c42]::string::String>, fn() -> core[940e698046960fd5]::result::Result<(), alloc[2ea6bcb46fca0c42]::string::String>><unknown>
  233. 389.01 s gammaloop-nextest-integration> at <unknown source file>:<unknown line>
  234. 389.01 s gammaloop-nextest-integration> 12: test[75d6903177b1d7e9]::run_test::{closure#0}<unknown>
  235. 389.01 s gammaloop-nextest-integration> at <unknown source file>:<unknown line>
  236. 389.01 s gammaloop-nextest-integration> 13: std[bcb96dfbba0ab899]::sys::backtrace::__rust_begin_short_backtrace::<test[75d6903177b1d7e9]::run_test::{closure#1}, ()><unknown>
  237. 389.01 s gammaloop-nextest-integration> at <unknown source file>:<unknown line>
  238. 389.01 s gammaloop-nextest-integration> 14: <std[bcb96dfbba0ab899]::thread::lifecycle::spawn_unchecked<test[75d6903177b1d7e9]::run_test::{closure#1}, ()>::{closure#1} as core[940e698046960fd5]::ops::function::FnOnce<()>>::call_once::{shim:vtable#0}<unknown>
  239. 389.01 s gammaloop-nextest-integration> at <unknown source file>:<unknown line>
  240. 389.01 s gammaloop-nextest-integration> 15: <std[bcb96dfbba0ab899]::sys::thread::unix::Thread>::new::thread_start<unknown>
  241. 389.01 s gammaloop-nextest-integration> at <unknown source file>:<unknown line>
  242. 389.01 s gammaloop-nextest-integration> 16: start_thread<unknown>
  243. 389.01 s gammaloop-nextest-integration> at <unknown source file>:<unknown line>
  244. 389.01 s gammaloop-nextest-integration> 17: __clone3<unknown>
  245. 389.01 s gammaloop-nextest-integration> at <unknown source file>:<unknown line>
  246. 389.01 s gammaloop-nextest-integration>
  247. 389.01 s gammaloop-nextest-integration> Run with COLORBT_SHOW_HIDDEN=1 environment variable to disable frame filtering.
  248. 389.01 s gammaloop-nextest-integration> Run with RUST_BACKTRACE=full to include source snippets.
  249. 389.01 s gammaloop-nextest-integration>
  250. 809.02 s gammaloop-nextest-integration> ------------
  251. 809.02 s gammaloop-nextest-integration> Summary [ 751.167s] 152 tests run: 151 passed, 1 failed, 208 skipped
  252. 809.02 s gammaloop-nextest-integration> FAIL [ 71.208s] ( 54/152) gammaloop-integration-tests::test_runs aa_aa::important::aa_aa_local_inspect_backend_consistency
  253. 809.02 s gammaloop-nextest-integration> stdout ---
  254. 809.02 s gammaloop-nextest-integration>
  255. 809.02 s gammaloop-nextest-integration> running 1 test
  256. 809.02 s gammaloop-nextest-integration> test aa_aa::important::aa_aa_local_inspect_backend_consistency has been running for over 60 seconds
  257. 809.02 s gammaloop-nextest-integration> test aa_aa::important::aa_aa_local_inspect_backend_consistency ... FAILED
  258. 809.02 s gammaloop-nextest-integration>
  259. 809.02 s gammaloop-nextest-integration> failures:
  260. 809.02 s gammaloop-nextest-integration>
  261. 809.02 s gammaloop-nextest-integration> failures:
  262. 809.02 s gammaloop-nextest-integration> aa_aa::important::aa_aa_local_inspect_backend_consistency
  263. 809.02 s gammaloop-nextest-integration>
  264. 809.02 s gammaloop-nextest-integration> test result: FAILED. 0 passed; 1 failed; 0 ignored; 0 measured; 258 filtered out; finished in 71.03s
  265. 809.02 s gammaloop-nextest-integration>
  266. 809.02 s gammaloop-nextest-integration> stderr ---
  267. 809.02 s gammaloop-nextest-integration> [2026-09-06 07:01:54.337] @gammaloop_api::se... INFO : Running command import model sm-default.json
  268. 809.02 s gammaloop-nextest-integration> [2026-09-06 07:01:54.337] @import::model INFO : Loading built-in JSON model sm-default
  269. 809.02 s gammaloop-nextest-integration> [2026-09-06 07:01:54.356] @gammalooprs::model INFO : The following 11 external parameters were forced to zero by the restriction card:
  270. 809.02 s gammaloop-nextest-integration> lamWS, AWS, rhoWS, etaWS, ymc, yme, ymm, MC, Me, MM, WTau
  271. 809.02 s gammaloop-nextest-integration> [2026-09-06 07:01:54.356] @gammalooprs::model INFO : The following 34 vertex rules were removed by the restriction card:
  272. 809.02 s gammaloop-nextest-integration> V_82 -> (c~, d, G+) | V_83 -> (t~, d, G+) | V_84 -> (c~, s, G+) | V_85 -> (t~, s, G+) | V_86 -> (u~, b, G+) | V_87 -> (c~, b, G+) | V_90 -> (c~, d, W+) | V_91 -> (t~, d, W+) | V_92 -> (u~, s, W+) | V_94 -> (t~, s, W+) | V_95 -> (u~, b, W+) | V_96 -> (c~, b, W+) | V_101 -> (e+, e-, G0) | V_102 -> (mu+, mu-, G0) | V_104 -> (e+, e-, H) | V_105 -> (mu+, mu-, H) | V_110 -> (ve~, e-, G+) | V_111 -> (vm~, mu-, G+) | V_116 -> (b~, u, G-) | V_117 -> (d~, c, G-) | V_118 -> (s~, c, G-) | V_119 -> (b~, c, G-) | V_120 -> (d~, t, G-) | V_121 -> (s~, t, G-) | V_124 -> (s~, u, W-) | V_125 -> (b~, u, W-) | V_126 -> (d~, c, W-) | V_128 -> (b~, c, W-) | V_129 -> (d~, t, W-) | V_130 -> (s~, t, W-) | V_138 -> (c~, c, G0) | V_140 -> (c~, c, H) | V_145 -> (e+, ve, G-) | V_146 -> (mu+, vm, G-)
  273. 809.02 s gammaloop-nextest-integration> [2026-09-06 07:01:54.356] @gammalooprs::model INFO : The following 36 couplings were removed by the restriction card:
  274. 809.02 s gammaloop-nextest-integration> GC_13, GC_14, GC_16, GC_17, GC_18, GC_19, GC_20, GC_22, GC_23, GC_24, GC_25, GC_26, GC_28, GC_29, GC_42, GC_43, GC_44, GC_46, GC_47, GC_48, GC_84, GC_85, GC_86, GC_87, GC_88, GC_89, GC_90, GC_91, GC_92, GC_93, GC_101, GC_102, GC_103, GC_105, GC_106, GC_107
  275. 809.02 s gammaloop-nextest-integration> [2026-09-06 07:01:54.357] @gammaloop_api::se... INFO : Running command run set_model_parameters
  276. 809.02 s gammaloop-nextest-integration> [2026-09-06 07:01:54.357] @gammaloop_api::se... INFO : Starting command block set_model_parameters
  277. 809.02 s gammaloop-nextest-integration> [2026-09-06 07:01:54.357] @gammaloop_api::se... INFO : Running command set model MT=173.0
  278. 809.02 s gammaloop-nextest-integration> [2026-09-06 07:01:54.360] @gammaloop_api::se... INFO : Running command set model WT=0.0
  279. 809.02 s gammaloop-nextest-integration> [2026-09-06 07:01:54.364] @gammaloop_api::se... INFO : Running command set model ymt=173.0
  280. 809.02 s gammaloop-nextest-integration> [2026-09-06 07:01:54.367] @gammaloop_api::se... INFO : Running command set model aS=0.118
  281. 809.02 s gammaloop-nextest-integration> [2026-09-06 07:01:54.370] @gammaloop_api::se... INFO : Running command set model aEWM1=137.036
  282. 809.02 s gammaloop-nextest-integration> [2026-09-06 07:01:54.373] @gammaloop_api::se... INFO : Running command set model Gf=1.166390e-05
  283. 809.02 s gammaloop-nextest-integration> [2026-09-06 07:01:54.377] @gammaloop_api::se... INFO : Running command set model MZ=91.188
  284. 809.02 s gammaloop-nextest-integration> [2026-09-06 07:01:54.380] @gammaloop_api::se... INFO : Running command set global string '
  285. 809.02 s gammaloop-nextest-integration> [global.generation.compile]
  286. 809.02 s gammaloop-nextest-integration> compilation_mode = "symjit"
  287. 809.02 s gammaloop-nextest-integration> optimization_level = "O0"
  288. 809.02 s gammaloop-nextest-integration> fast_math = false
  289. 809.02 s gammaloop-nextest-integration> [...]
  290. 809.02 s gammaloop-nextest-integration> [2026-09-06 07:01:54.381] @gammaloop_api::se... INFO : Running command import graphs ./examples/cli/aa_aa/1L/aa_aa_1L.dot -p aa_aa_all_helicities -i 1L_ppmm -o
  291. 809.02 s gammaloop-nextest-integration> [2026-09-06 07:01:54.381] @commands::import INFO : Loading graphs from '/build/source/examples/cli/aa_aa/1L/aa_aa_1L.dot'
  292. 809.02 s gammaloop-nextest-integration> [2026-09-06 07:01:54.389] @gammaloop_api::se... INFO : Running command generate existing -p aa_aa_all_helicities
  293. 809.02 s gammaloop-nextest-integration> [2026-09-06 07:02:21.784] @commands::generate INFO :
  294. 809.02 s gammaloop-nextest-integration> Integrand generation summary
  295. 809.02 s gammaloop-nextest-integration> peak RAM 1.09 GiB | cores 1
  296. 809.02 s gammaloop-nextest-integration> ╭───────────┬───────┬─────────┬──────────────┬─────────────┬────────────────┬──────────────╮
  297. 809.02 s gammaloop-nextest-integration> │ integrand │ graph │ # evals │ expr build │ spenso │ symbolica eval │ compile │
  298. 809.02 s gammaloop-nextest-integration> ├───────────┼───────┼─────────┼──────────────┼─────────────┼────────────────┼──────────────┤
  299. 809.02 s gammaloop-nextest-integration> │ 1L_ppmm │ GL0 │ 13 │ 525ms (5.6%) │ 1.81s (19%) │ 6.12s (65%) │ 923ms (9.8%) │
  300. 809.02 s gammaloop-nextest-integration> │ 1L_ppmm │ GL2 │ 13 │ 490ms (5.6%) │ 1.57s (18%) │ 5.81s (66%) │ 890ms (10%) │
  301. 809.02 s gammaloop-nextest-integration> │ 1L_ppmm │ GL4 │ 11 │ 503ms (5.5%) │ 1.79s (19%) │ 6.06s (66%) │ 875ms (9.5%) │
  302. 809.02 s gammaloop-nextest-integration> ├───────────┼───────┼─────────┼──────────────┼─────────────┼────────────────┼──────────────┤
  303. 809.02 s gammaloop-nextest-integration> │ Total │ │ 37 │ 1.52s (5.6%) │ 5.17s (19%) │ 18.00s (66%) │ 2.69s (9.8%) │
  304. 809.02 s gammaloop-nextest-integration> ╰───────────┴───────┴─────────┴──────────────┴─────────────┴────────────────┴──────────────╯
  305. 809.02 s gammaloop-nextest-integration> [2026-09-06 07:02:22.731] @gammaloop_api::se... INFO : Running command import model sm-default.json
  306. 809.02 s gammaloop-nextest-integration> [2026-09-06 07:02:22.731] @import::model INFO : Loading built-in JSON model sm-default
  307. 809.02 s gammaloop-nextest-integration> [2026-09-06 07:02:22.753] @gammalooprs::model INFO : The following 11 external parameters were forced to zero by the restriction card:
  308. 809.02 s gammaloop-nextest-integration> lamWS, AWS, rhoWS, etaWS, ymc, yme, ymm, MC, Me, MM, WTau
  309. 809.02 s gammaloop-nextest-integration> [2026-09-06 07:02:22.753] @gammalooprs::model INFO : The following 34 vertex rules were removed by the restriction card:
  310. 809.02 s gammaloop-nextest-integration> V_82 -> (c~, d, G+) | V_83 -> (t~, d, G+) | V_84 -> (c~, s, G+) | V_85 -> (t~, s, G+) | V_86 -> (u~, b, G+) | V_87 -> (c~, b, G+) | V_90 -> (c~, d, W+) | V_91 -> (t~, d, W+) | V_92 -> (u~, s, W+) | V_94 -> (t~, s, W+) | V_95 -> (u~, b, W+) | V_96 -> (c~, b, W+) | V_101 -> (e+, e-, G0) | V_102 -> (mu+, mu-, G0) | V_104 -> (e+, e-, H) | V_105 -> (mu+, mu-, H) | V_110 -> (ve~, e-, G+) | V_111 -> (vm~, mu-, G+) | V_116 -> (b~, u, G-) | V_117 -> (d~, c, G-) | V_118 -> (s~, c, G-) | V_119 -> (b~, c, G-) | V_120 -> (d~, t, G-) | V_121 -> (s~, t, G-) | V_124 -> (s~, u, W-) | V_125 -> (b~, u, W-) | V_126 -> (d~, c, W-) | V_128 -> (b~, c, W-) | V_129 -> (d~, t, W-) | V_130 -> (s~, t, W-) | V_138 -> (c~, c, G0) | V_140 -> (c~, c, H) | V_145 -> (e+, ve, G-) | V_146 -> (mu+, vm, G-)
  311. 809.02 s gammaloop-nextest-integration> [2026-09-06 07:02:22.753] @gammalooprs::model INFO : The following 36 couplings were removed by the restriction card:
  312. 809.02 s gammaloop-nextest-integration> GC_13, GC_14, GC_16, GC_17, GC_18, GC_19, GC_20, GC_22, GC_23, GC_24, GC_25, GC_26, GC_28, GC_29, GC_42, GC_43, GC_44, GC_46, GC_47, GC_48, GC_84, GC_85, GC_86, GC_87, GC_88, GC_89, GC_90, GC_91, GC_92, GC_93, GC_101, GC_102, GC_103, GC_105, GC_106, GC_107
  313. 809.02 s gammaloop-nextest-integration> [2026-09-06 07:02:22.754] @gammaloop_api::se... INFO : Running command run set_model_parameters
  314. 809.02 s gammaloop-nextest-integration> [2026-09-06 07:02:22.754] @gammaloop_api::se... INFO : Starting command block set_model_parameters
  315. 809.02 s gammaloop-nextest-integration> [2026-09-06 07:02:22.754] @gammaloop_api::se... INFO : Running command set model MT=173.0
  316. 809.02 s gammaloop-nextest-integration> [2026-09-06 07:02:22.758] @gammaloop_api::se... INFO : Running command set model WT=0.0
  317. 809.02 s gammaloop-nextest-integration> [2026-09-06 07:02:22.762] @gammaloop_api::se... INFO : Running command set model ymt=173.0
  318. 809.02 s gammaloop-nextest-integration> [2026-09-06 07:02:22.766] @gammaloop_api::se... INFO : Running command set model aS=0.118
  319. 809.02 s gammaloop-nextest-integration> [2026-09-06 07:02:22.770] @gammaloop_api::se... INFO : Running command set model aEWM1=137.036
  320. 809.02 s gammaloop-nextest-integration> [2026-09-06 07:02:22.774] @gammaloop_api::se... INFO : Running command set model Gf=1.166390e-05
  321. 809.02 s gammaloop-nextest-integration> [2026-09-06 07:02:22.777] @gammaloop_api::se... INFO : Running command set model MZ=91.188
  322. 809.02 s gammaloop-nextest-integration> [2026-09-06 07:02:22.782] @gammaloop_api::se... INFO : Running command set global string '
  323. 809.02 s gammaloop-nextest-integration> [global.generation.compile]
  324. 809.02 s gammaloop-nextest-integration> compilation_mode = "assembly"
  325. 809.02 s gammaloop-nextest-integration> optimization_level = "O0"
  326. 809.02 s gammaloop-nextest-integration> fast_math = false
  327. 809.02 s gammaloop-nextest-integration> [...]
  328. 809.02 s gammaloop-nextest-integration> [2026-09-06 07:02:22.783] @gammaloop_api::se... INFO : Running command import graphs ./examples/cli/aa_aa/1L/aa_aa_1L.dot -p aa_aa_all_helicities_assembly -i 1L_ppmm -o
  329. 809.02 s gammaloop-nextest-integration> [2026-09-06 07:02:22.783] @commands::import INFO : Loading graphs from '/build/source/examples/cli/aa_aa/1L/aa_aa_1L.dot'
  330. 809.02 s gammaloop-nextest-integration> [2026-09-06 07:02:22.791] @gammaloop_api::se... INFO : Running command generate existing -p aa_aa_all_helicities_assembly
  331. 809.02 s gammaloop-nextest-integration> [2026-09-06 07:02:45.043] @processes::amplitude INFO : Compiling amplitude 1L_ppmm
  332. 809.02 s gammaloop-nextest-integration> [2026-09-06 07:03:04.191] @commands::generate INFO : Removed 34 generated C++ source file(s). Use '--keep-sources' to keep them.
  333. 809.02 s gammaloop-nextest-integration> [2026-09-06 07:03:04.191] @commands::generate INFO :
  334. 809.02 s gammaloop-nextest-integration> Integrand generation summary
  335. 809.02 s gammaloop-nextest-integration> peak RAM 2.21 GiB | cores 1
  336. 809.02 s gammaloop-nextest-integration> ╭───────────┬───────┬─────────┬──────────────┬──────────────┬────────────────┬──────────────╮
  337. 809.02 s gammaloop-nextest-integration> │ integrand │ graph │ # evals │ expr build │ spenso │ symbolica eval │ compile │
  338. 809.02 s gammaloop-nextest-integration> ├───────────┼───────┼─────────┼──────────────┼──────────────┼────────────────┼──────────────┤
  339. 809.02 s gammaloop-nextest-integration> │ 1L_ppmm │ GL0 │ 13 │ 562ms (4.0%) │ 1.51s (11%) │ 5.68s (41%) │ 6.16s (44%) │
  340. 809.02 s gammaloop-nextest-integration> │ 1L_ppmm │ GL2 │ 13 │ 593ms (4.2%) │ 1.37s (9.6%) │ 5.34s (37%) │ 6.95s (49%) │
  341. 809.02 s gammaloop-nextest-integration> │ 1L_ppmm │ GL4 │ 11 │ 581ms (4.4%) │ 1.35s (10%) │ 5.23s (40%) │ 6.03s (46%) │
  342. 809.02 s gammaloop-nextest-integration> ├───────────┼───────┼─────────┼──────────────┼──────────────┼────────────────┼──────────────┤
  343. 809.02 s gammaloop-nextest-integration> │ Total │ │ 37 │ 1.74s (4.2%) │ 4.24s (10%) │ 16.25s (39%) │ 19.14s (46%) │
  344. 809.02 s gammaloop-nextest-integration> ╰───────────┴───────┴─────────┴──────────────┴──────────────┴────────────────┴──────────────╯
  345. 809.02 s gammaloop-nextest-integration> [2026-09-06 07:03:04.857] @gammaloop_api::se... INFO : Running command set process -p aa_aa_all_helicities -i 1L_ppmm string '
  346. 809.02 s gammaloop-nextest-integration> [stability]
  347. 809.02 s gammaloop-nextest-integration> check_on_norm = true
  348. 809.02 s gammaloop-nextest-integration> escalate_if_exact_zero = false
  349. 809.02 s gammaloop-nextest-integration> loop_momenta_norm_escalation_factor = -1.0
  350. 809.02 s gammaloop-nextest-integration> [...]
  351. 809.02 s gammaloop-nextest-integration> [2026-09-06 07:03:04.857] @gammaloop_api::se... INFO : Running command set process -p aa_aa_all_helicities_assembly -i 1L_ppmm string '
  352. 809.02 s gammaloop-nextest-integration> [stability]
  353. 809.02 s gammaloop-nextest-integration> check_on_norm = true
  354. 809.02 s gammaloop-nextest-integration> escalate_if_exact_zero = false
  355. 809.02 s gammaloop-nextest-integration> loop_momenta_norm_escalation_factor = -1.0
  356. 809.02 s gammaloop-nextest-integration> [...]
  357. 809.02 s gammaloop-nextest-integration> [2026-09-06 07:03:04.858] @gammaloop_api::se... INFO : Running command set process -p aa_aa_all_helicities -i 1L_mpmm string '
  358. 809.02 s gammaloop-nextest-integration> [stability]
  359. 809.02 s gammaloop-nextest-integration> check_on_norm = true
  360. 809.02 s gammaloop-nextest-integration> escalate_if_exact_zero = false
  361. 809.02 s gammaloop-nextest-integration> loop_momenta_norm_escalation_factor = -1.0
  362. 809.02 s gammaloop-nextest-integration> [...]
  363. 809.02 s gammaloop-nextest-integration> [2026-09-06 07:03:04.859] @gammaloop_api::se... INFO : Running command set process -p aa_aa_all_helicities_assembly -i 1L_mpmm string '
  364. 809.02 s gammaloop-nextest-integration> [stability]
  365. 809.02 s gammaloop-nextest-integration> check_on_norm = true
  366. 809.02 s gammaloop-nextest-integration> escalate_if_exact_zero = false
  367. 809.02 s gammaloop-nextest-integration> loop_momenta_norm_escalation_factor = -1.0
  368. 809.02 s gammaloop-nextest-integration> [...]
  369. 809.02 s gammaloop-nextest-integration> [2026-09-06 07:03:04.859] @gammaloop_api::se... INFO : Running command set process -p aa_aa_all_helicities -i 1L_mmmm string '
  370. 809.02 s gammaloop-nextest-integration> [stability]
  371. 809.02 s gammaloop-nextest-integration> check_on_norm = true
  372. 809.02 s gammaloop-nextest-integration> escalate_if_exact_zero = false
  373. 809.02 s gammaloop-nextest-integration> loop_momenta_norm_escalation_factor = -1.0
  374. 809.02 s gammaloop-nextest-integration> [...]
  375. 809.02 s gammaloop-nextest-integration> [2026-09-06 07:03:04.860] @gammaloop_api::se... INFO : Running command set process -p aa_aa_all_helicities_assembly -i 1L_mmmm string '
  376. 809.02 s gammaloop-nextest-integration> [stability]
  377. 809.02 s gammaloop-nextest-integration> check_on_norm = true
  378. 809.02 s gammaloop-nextest-integration> escalate_if_exact_zero = false
  379. 809.02 s gammaloop-nextest-integration> loop_momenta_norm_escalation_factor = -1.0
  380. 809.02 s gammaloop-nextest-integration> [...]
  381. 809.02 s gammaloop-nextest-integration> [2026-09-06 07:03:04.861] @gammaloop_api::se... INFO : Running command set process -p aa_aa_all_helicities -i 1L_pmmp string '
  382. 809.02 s gammaloop-nextest-integration> [stability]
  383. 809.02 s gammaloop-nextest-integration> check_on_norm = true
  384. 809.02 s gammaloop-nextest-integration> escalate_if_exact_zero = false
  385. 809.02 s gammaloop-nextest-integration> loop_momenta_norm_escalation_factor = -1.0
  386. 809.02 s gammaloop-nextest-integration> [...]
  387. 809.02 s gammaloop-nextest-integration> [2026-09-06 07:03:04.861] @gammaloop_api::se... INFO : Running command set process -p aa_aa_all_helicities_assembly -i 1L_pmmp string '
  388. 809.02 s gammaloop-nextest-integration> [stability]
  389. 809.02 s gammaloop-nextest-integration> check_on_norm = true
  390. 809.02 s gammaloop-nextest-integration> escalate_if_exact_zero = false
  391. 809.02 s gammaloop-nextest-integration> loop_momenta_norm_escalation_factor = -1.0
  392. 809.02 s gammaloop-nextest-integration> [...]
  393. 809.02 s gammaloop-nextest-integration> [2026-09-06 07:03:04.862] @gammaloop_api::se... INFO : Running command set process -p aa_aa_all_helicities -i 1L_pmpm string '
  394. 809.02 s gammaloop-nextest-integration> [stability]
  395. 809.02 s gammaloop-nextest-integration> check_on_norm = true
  396. 809.02 s gammaloop-nextest-integration> escalate_if_exact_zero = false
  397. 809.02 s gammaloop-nextest-integration> loop_momenta_norm_escalation_factor = -1.0
  398. 809.02 s gammaloop-nextest-integration> [...]
  399. 809.02 s gammaloop-nextest-integration> [2026-09-06 07:03:04.863] @gammaloop_api::se... INFO : Running command set process -p aa_aa_all_helicities_assembly -i 1L_pmpm string '
  400. 809.02 s gammaloop-nextest-integration> [stability]
  401. 809.02 s gammaloop-nextest-integration> check_on_norm = true
  402. 809.02 s gammaloop-nextest-integration> escalate_if_exact_zero = false
  403. 809.02 s gammaloop-nextest-integration> loop_momenta_norm_escalation_factor = -1.0
  404. 809.02 s gammaloop-nextest-integration> [...]
  405. 809.02 s gammaloop-nextest-integration> [2026-09-06 07:03:04.867] @process::amplitude INFO : Input is below threshold: 0 existing threshold E-surfaces across 0/1 graph groups
  406. 809.02 s gammaloop-nextest-integration> [2026-09-06 07:03:04.867] @process::amplitude INFO : overlap structure of group 0: [0: []]
  407. 809.02 s gammaloop-nextest-integration> [2026-09-06 07:03:04.868] @integrands::process [{#im_is_nan, #re_is_nan}] WARNING : final process evaluation is nonfinite
  408. 809.02 s gammaloop-nextest-integration> [2026-09-06 07:03:04.868] @commands::inspect INFO :
  409. 809.02 s gammaloop-nextest-integration> Input point in momentum space:
  410. 809.02 s gammaloop-nextest-integration>
  411. 809.02 s gammaloop-nextest-integration> ( 0.1100000000000000, -0.0700000000000000, 0.1900000000000000 )
  412. 809.02 s gammaloop-nextest-integration>
  413. 809.02 s gammaloop-nextest-integration> The evaluation of integrand '1L_ppmm' is:
  414. 809.02 s gammaloop-nextest-integration>
  415. 809.02 s gammaloop-nextest-integration> ( +0.0000000000000000e0, +0.0000000000000000e0 i)
  416. 809.02 s gammaloop-nextest-integration>
  417. 809.02 s gammaloop-nextest-integration> [2026-09-06 07:03:04.871] @process::amplitude INFO : Input is below threshold: 0 existing threshold E-surfaces across 0/1 graph groups
  418. 809.02 s gammaloop-nextest-integration> [2026-09-06 07:03:04.871] @process::amplitude INFO : overlap structure of group 0: [0: []]
  419. 809.02 s gammaloop-nextest-integration> [2026-09-06 07:03:04.871] @commands::inspect INFO :
  420. 809.02 s gammaloop-nextest-integration> Input point in momentum space:
  421. 809.02 s gammaloop-nextest-integration>
  422. 809.02 s gammaloop-nextest-integration> ( 0.1100000000000000, -0.0700000000000000, 0.1900000000000000 )
  423. 809.02 s gammaloop-nextest-integration>
  424. 809.02 s gammaloop-nextest-integration> The evaluation of integrand '1L_ppmm' is:
  425. 809.02 s gammaloop-nextest-integration>
  426. 809.02 s gammaloop-nextest-integration> ( -1.7132462539328486e-28, -8.7105072229446864e-10 i)
  427. 809.02 s gammaloop-nextest-integration>
  428. 809.02 s gammaloop-nextest-integration> The application panicked (crashed).
  429. 809.02 s gammaloop-nextest-integration> Message: kinematics=a, integrand=1L_ppmm, graph_id=0: assembly vs symjit inspect: actual=(-0.00000000000000000000000000017132462539328486+-0.0000000008710507222944686i), expected=(0+0i), tolerance=0.0000000001
  430. 809.02 s gammaloop-nextest-integration> Location: tests/tests/test_runs/utils.rs:466
  431. 809.02 s gammaloop-nextest-integration>
  432. 809.02 s gammaloop-nextest-integration> ━━━━━━━━━━━━━━━━━━━━━━━━━━━━━━━━━━ BACKTRACE ━━━━━━━━━━━━━━━━━━━━━━━━━━━━━━━━━━━
  433. 809.02 s gammaloop-nextest-integration> 1: <color_eyre[51793ea62743adbd]::config::PanicHook>::panic_report<unknown>
  434. 809.02 s gammaloop-nextest-integration> at <unknown source file>:<unknown line>
  435. 809.02 s gammaloop-nextest-integration> 2: <color_eyre[51793ea62743adbd]::config::PanicHook>::into_panic_hook::{closure#0}<unknown>
  436. 809.02 s gammaloop-nextest-integration> at <unknown source file>:<unknown line>
  437. 809.02 s gammaloop-nextest-integration> 3: std[bcb96dfbba0ab899]::panicking::panic_with_hook<unknown>
  438. 809.02 s gammaloop-nextest-integration> at <unknown source file>:<unknown line>
  439. 809.02 s gammaloop-nextest-integration> 4: std[bcb96dfbba0ab899]::panicking::panic_handler::{closure#0}<unknown>
  440. 809.02 s gammaloop-nextest-integration> at <unknown source file>:<unknown line>
  441. 809.02 s gammaloop-nextest-integration> 5: std[bcb96dfbba0ab899]::sys::backtrace::__rust_end_short_backtrace::<std[bcb96dfbba0ab899]::panicking::panic_handler::{closure#0}, !><unknown>
  442. 809.02 s gammaloop-nextest-integration> at <unknown source file>:<unknown line>
  443. 809.02 s gammaloop-nextest-integration> 6: __rustc[6c289b9f9c454d21]::rust_begin_unwind<unknown>
  444. 809.02 s gammaloop-nextest-integration> at <unknown source file>:<unknown line>
  445. 809.02 s gammaloop-nextest-integration> 7: core[940e698046960fd5]::panicking::panic_fmt<unknown>
  446. 809.02 s gammaloop-nextest-integration> at <unknown source file>:<unknown line>
  447. 809.02 s gammaloop-nextest-integration> 8: <test_runs[66584badfeb6c7be]::aa_aa::important::aa_aa_local_inspect_backend_consistency::{closure#0} as core[940e698046960fd5]::ops::function::FnOnce<()>>::call_once<unknown>
  448. 809.02 s gammaloop-nextest-integration> at <unknown source file>:<unknown line>
  449. 809.02 s gammaloop-nextest-integration> 9: serial_test[cd99724524a2f1c0]::serial_code_lock::local_serial_core_with_return::<(), eyre[cb2fd339c0c40fca]::Report><unknown>
  450. 809.02 s gammaloop-nextest-integration> at <unknown source file>:<unknown line>
  451. 809.02 s gammaloop-nextest-integration> 10: <test_runs[66584badfeb6c7be]::aa_aa::important::aa_aa_local_inspect_backend_consistency::{closure#0} as core[940e698046960fd5]::ops::function::FnOnce<()>>::call_once<unknown>
  452. 809.02 s gammaloop-nextest-integration> at <unknown source file>:<unknown line>
  453. 809.02 s gammaloop-nextest-integration> 11: test[75d6903177b1d7e9]::__rust_begin_short_backtrace::<core[940e698046960fd5]::result::Result<(), alloc[2ea6bcb46fca0c42]::string::String>, fn() -> core[940e698046960fd5]::result::Result<(), alloc[2ea6bcb46fca0c42]::string::String>><unknown>
  454. 809.02 s gammaloop-nextest-integration> at <unknown source file>:<unknown line>
  455. 809.02 s gammaloop-nextest-integration> 12: test[75d6903177b1d7e9]::run_test::{closure#0}<unknown>
  456. 809.02 s gammaloop-nextest-integration> at <unknown source file>:<unknown line>
  457. 809.02 s gammaloop-nextest-integration> 13: std[bcb96dfbba0ab899]::sys::backtrace::__rust_begin_short_backtrace::<test[75d6903177b1d7e9]::run_test::{closure#1}, ()><unknown>
  458. 809.02 s gammaloop-nextest-integration> at <unknown source file>:<unknown line>
  459. 809.02 s gammaloop-nextest-integration> 14: <std[bcb96dfbba0ab899]::thread::lifecycle::spawn_unchecked<test[75d6903177b1d7e9]::run_test::{closure#1}, ()>::{closure#1} as core[940e698046960fd5]::ops::function::FnOnce<()>>::call_once::{shim:vtable#0}<unknown>
  460. 809.02 s gammaloop-nextest-integration> at <unknown source file>:<unknown line>
  461. 809.02 s gammaloop-nextest-integration> 15: <std[bcb96dfbba0ab899]::sys::thread::unix::Thread>::new::thread_start<unknown>
  462. 809.02 s gammaloop-nextest-integration> at <unknown source file>:<unknown line>
  463. 809.02 s gammaloop-nextest-integration> 16: start_thread<unknown>
  464. 809.02 s gammaloop-nextest-integration> at <unknown source file>:<unknown line>
  465. 809.02 s gammaloop-nextest-integration> 17: __clone3<unknown>
  466. 809.02 s gammaloop-nextest-integration> at <unknown source file>:<unknown line>
  467. 809.02 s gammaloop-nextest-integration>
  468. 809.02 s gammaloop-nextest-integration> Run with COLORBT_SHOW_HIDDEN=1 environment variable to disable frame filtering.
  469. 809.02 s gammaloop-nextest-integration> Run with RUST_BACKTRACE=full to include source snippets.
  470. 809.02 s gammaloop-nextest-integration>
  471. 809.10 s gammaloop-nextest-integration> error: test run failed
  472. 809.12 s gammaloop-nextest-integration>
  473. 809.12 s gammaloop-nextest-integration> ========== nextest test summary ==========
  474. 809.12 s gammaloop-nextest-integration> report: target/nextest/ci_gammaloop/junit.xml
  475. 809.12 s gammaloop-nextest-integration> tests: 152, failures: 1, errors: 0
  476. 809.12 s gammaloop-nextest-integration>
  477. 809.12 s gammaloop-nextest-integration> 1. gammaloop-integration-tests::test_runs::aa_aa::important::aa_aa_local_inspect_backend_consistency
  478. 809.12 s gammaloop-nextest-integration> failure: test failure with exit code 101
  479. 809.12 s gammaloop-nextest-integration> system-out
  480. 809.12 s gammaloop-nextest-integration> running 1 test
  481. 809.12 s gammaloop-nextest-integration> test aa_aa::important::aa_aa_local_inspect_backend_consistency has been running for over 60 seconds
  482. 809.12 s gammaloop-nextest-integration> test aa_aa::important::aa_aa_local_inspect_backend_consistency ... FAILED
  483. 809.12 s gammaloop-nextest-integration>
  484. 809.12 s gammaloop-nextest-integration> failures:
  485. 809.12 s gammaloop-nextest-integration>
  486. 809.12 s gammaloop-nextest-integration> failures:
  487. 809.12 s gammaloop-nextest-integration> aa_aa::important::aa_aa_local_inspect_backend_consistency
  488. 809.12 s gammaloop-nextest-integration>
  489. 809.12 s gammaloop-nextest-integration> test result: FAILED. 0 passed; 1 failed; 0 ignored; 0 measured; 258 filtered out; finished in 71.03s
  490. 809.12 s gammaloop-nextest-integration> system-err
  491. 809.12 s gammaloop-nextest-integration> [2026-09-06 07:01:54.337] @gammaloop_api::se... INFO : Running command import model sm-default.json
  492. 809.12 s gammaloop-nextest-integration> [2026-09-06 07:01:54.337] @import::model INFO : Loading built-in JSON model sm-default
  493. 809.12 s gammaloop-nextest-integration> [2026-09-06 07:01:54.356] @gammalooprs::model INFO : The following 11 external parameters were forced to zero by the restriction card:
  494. 809.12 s gammaloop-nextest-integration> lamWS, AWS, rhoWS, etaWS, ymc, yme, ymm, MC, Me, MM, WTau
  495. 809.12 s gammaloop-nextest-integration> [2026-09-06 07:01:54.356] @gammalooprs::model INFO : The following 34 vertex rules were removed by the restriction card:
  496. 809.12 s gammaloop-nextest-integration> V_82 -> (c~, d, G+) | V_83 -> (t~, d, G+) | V_84 -> (c~, s, G+) | V_85 -> (t~, s, G+) | V_86 -> (u~, b, G+) | V_87 -> (c~, b, G+) | V_90 -> (c~, d, W+) | V_91 -> (t~, d, W+) | V_92 -> (u~, s, W+) | V_94 -> (t~, s, W+) | V_95 -> (u~, b, W+) | V_96 -> (c~, b, W+) | V_101 -> (e+, e-, G0) | V_102 -> (mu+, mu-, G0) | V_104 -> (e+, e-, H) | V_105 -> (mu+, mu-, H) | V_110 -> (ve~, e-, G+) | V_111 -> (vm~, mu-, G+) | V_116 -> (b~, u, G-) | V_117 -> (d~, c, G-) | V_118 -> (s~, c, G-) | V_119 -> (b~, c, G-) | V_120 -> (d~, t, G-) | V_121 -> (s~, t, G-) | V_124 -> (s~, u, W-) | V_125 -> (b~, u, W-) | V_126 -> (d~, c, W-) | V_128 -> (b~, c, W-) | V_129 -> (d~, t, W-) | V_130 -> (s~, t, W-) | V_138 -> (c~, c, G0) | V_140 -> (c~, c, H) | V_145 -> (e+, ve, G-) | V_146 -> (mu+, vm, G-)
  497. 809.12 s gammaloop-nextest-integration> [2026-09-06 07:01:54.356] @gammalooprs::model INFO : The following 36 couplings were removed by the restriction card:
  498. 809.12 s gammaloop-nextest-integration> GC_13, GC_14, GC_16, GC_17, GC_18, GC_19, GC_20, GC_22, GC_23, GC_24, GC_25, GC_26, GC_28, GC_29, GC_42, GC_43, GC_44, GC_46, GC_47, GC_48, GC_84, GC_85, GC_86, GC_87, GC_88, GC_89, GC_90, GC_91, GC_92, GC_93, GC_101, GC_102, GC_103, GC_105, GC_106, GC_107
  499. 809.12 s gammaloop-nextest-integration> [2026-09-06 07:01:54.357] @gammaloop_api::se... INFO : Running command run set_model_parameters
  500. 809.12 s gammaloop-nextest-integration> [2026-09-06 07:01:54.357] @gammaloop_api::se... INFO : Starting command block set_model_parameters
  501. 809.12 s gammaloop-nextest-integration> [2026-09-06 07:01:54.357] @gammaloop_api::se... INFO : Running command set model MT=173.0
  502. 809.12 s gammaloop-nextest-integration> [2026-09-06 07:01:54.360] @gammaloop_api::se... INFO : Running command set model WT=0.0
  503. 809.12 s gammaloop-nextest-integration> [2026-09-06 07:01:54.364] @gammaloop_api::se... INFO : Running command set model ymt=173.0
  504. 809.12 s gammaloop-nextest-integration> [2026-09-06 07:01:54.367] @gammaloop_api::se... INFO : Running command set model aS=0.118
  505. 809.12 s gammaloop-nextest-integration> [2026-09-06 07:01:54.370] @gammaloop_api::se... INFO : Running command set model aEWM1=137.036
  506. 809.12 s gammaloop-nextest-integration> [2026-09-06 07:01:54.373] @gammaloop_api::se... INFO : Running command set model Gf=1.166390e-05
  507. 809.12 s gammaloop-nextest-integration> [2026-09-06 07:01:54.377] @gammaloop_api::se... INFO : Running command set model MZ=91.188
  508. 809.12 s gammaloop-nextest-integration> [2026-09-06 07:01:54.380] @gammaloop_api::se... INFO : Running command set global string '
  509. 809.12 s gammaloop-nextest-integration> [global.generation.compile]
  510. 809.12 s gammaloop-nextest-integration> compilation_mode = "symjit"
  511. 809.12 s gammaloop-nextest-integration> optimization_level = "O0"
  512. 809.12 s gammaloop-nextest-integration> fast_math = false
  513. 809.12 s gammaloop-nextest-integration> [...]
  514. 809.12 s gammaloop-nextest-integration> [2026-09-06 07:01:54.381] @gammaloop_api::se... INFO : Running command import graphs ./examples/cli/aa_aa/1L/aa_aa_1L.dot -p aa_aa_all_helicities -i 1L_ppmm -o
  515. 809.12 s gammaloop-nextest-integration> [2026-09-06 07:01:54.381] @commands::import INFO : Loading graphs from '/build/source/examples/cli/aa_aa/1L/aa_aa_1L.dot'
  516. 809.12 s gammaloop-nextest-integration> [2026-09-06 07:01:54.389] @gammaloop_api::se... INFO : Running command generate existing -p aa_aa_all_helicities
  517. 809.12 s gammaloop-nextest-integration> [2026-09-06 07:02:21.784] @commands::generate INFO :
  518. 809.12 s gammaloop-nextest-integration> Integrand generation summary
  519. 809.12 s gammaloop-nextest-integration> peak RAM 1.09 GiB | cores 1
  520. 809.12 s gammaloop-nextest-integration> ╭───────────┬───────┬─────────┬──────────────┬─────────────┬────────────────┬──────────────╮
  521. 809.12 s gammaloop-nextest-integration> │ integrand │ graph │ # evals │ expr build │ spenso │ symbolica eval │ compile │
  522. 809.12 s gammaloop-nextest-integration> ├───────────┼───────┼─────────┼──────────────┼─────────────┼────────────────┼──────────────┤
  523. 809.12 s gammaloop-nextest-integration> │ 1L_ppmm │ GL0 │ 13 │ 525ms (5.6%) │ 1.81s (19%) │ 6.12s (65%) │ 923ms (9.8%) │
  524. 809.12 s gammaloop-nextest-integration> │ 1L_ppmm │ GL2 │ 13 │ 490ms (5.6%) │ 1.57s (18%) │ 5.81s (66%) │ 890ms (10%) │
  525. 809.12 s gammaloop-nextest-integration> │ 1L_ppmm │ GL4 │ 11 │ 503ms (5.5%) │ 1.79s (19%) │ 6.06s (66%) │ 875ms (9.5%) │
  526. 809.12 s gammaloop-nextest-integration> ├───────────┼───────┼─────────┼──────────────┼─────────────┼────────────────┼──────────────┤
  527. 809.12 s gammaloop-nextest-integration> │ Total │ │ 37 │ 1.52s (5.6%) │ 5.17s (19%) │ 18.00s (66%) │ 2.69s (9.8%) │
  528. 809.12 s gammaloop-nextest-integration> ╰───────────┴───────┴─────────┴──────────────┴─────────────┴────────────────┴──────────────╯
  529. 809.12 s gammaloop-nextest-integration> [2026-09-06 07:02:22.731] @gammaloop_api::se... INFO : Running command import model sm-default.json
  530. 809.12 s gammaloop-nextest-integration> [2026-09-06 07:02:22.731] @import::model INFO : Loading built-in JSON model sm-default
  531. 809.12 s gammaloop-nextest-integration> [2026-09-06 07:02:22.753] @gammalooprs::model INFO : The following 11 external parameters were forced to zero by the restriction card:
  532. 809.12 s gammaloop-nextest-integration> lamWS, AWS, rhoWS, etaWS, ymc, yme, ymm, MC, Me, MM, WTau
  533. 809.12 s gammaloop-nextest-integration> [2026-09-06 07:02:22.753] @gammalooprs::model INFO : The following 34 vertex rules were removed by the restriction card:
  534. 809.12 s gammaloop-nextest-integration> V_82 -> (c~, d, G+) | V_83 -> (t~, d, G+) | V_84 -> (c~, s, G+) | V_85 -> (t~, s, G+) | V_86 -> (u~, b, G+) | V_87 -> (c~, b, G+) | V_90 -> (c~, d, W+) | V_91 -> (t~, d, W+) | V_92 -> (u~, s, W+) | V_94 -> (t~, s, W+) | V_95 -> (u~, b, W+) | V_96 -> (c~, b, W+) | V_101 -> (e+, e-, G0) | V_102 -> (mu+, mu-, G0) | V_104 -> (e+, e-, H) | V_105 -> (mu+, mu-, H) | V_110 -> (ve~, e-, G+) | V_111 -> (vm~, mu-, G+) | V_116 -> (b~, u, G-) | V_117 -> (d~, c, G-) | V_118 -> (s~, c, G-) | V_119 -> (b~, c, G-) | V_120 -> (d~, t, G-) | V_121 -> (s~, t, G-) | V_124 -> (s~, u, W-) | V_125 -> (b~, u, W-) | V_126 -> (d~, c, W-) | V_128 -> (b~, c, W-) | V_129 -> (d~, t, W-) | V_130 -> (s~, t, W-) | V_138 -> (c~, c, G0) | V_140 -> (c~, c, H) | V_145 -> (e+, ve, G-) | V_146 -> (mu+, vm, G-)
  535. 809.12 s gammaloop-nextest-integration> [2026-09-06 07:02:22.753] @gammalooprs::model INFO : The following 36 couplings were removed by the restriction card:
  536. 809.12 s gammaloop-nextest-integration> GC_13, GC_14, GC_16, GC_17, GC_18, GC_19, GC_20, GC_22, GC_23, GC_24, GC_25, GC_26, GC_28, GC_29, GC_42, GC_43, GC_44, GC_46, GC_47, GC_48, GC_84, GC_85, GC_86, GC_87, GC_88, GC_89, GC_90, GC_91, GC_92, GC_93, GC_101, GC_102, GC_103, GC_105, GC_106, GC_107
  537. 809.12 s gammaloop-nextest-integration> [2026-09-06 07:02:22.754] @gammaloop_api::se... INFO : Running command run set_model_parameters
  538. 809.12 s gammaloop-nextest-integration> [2026-09-06 07:02:22.754] @gammaloop_api::se... INFO : Starting command block set_model_parameters
  539. 809.12 s gammaloop-nextest-integration> [2026-09-06 07:02:22.754] @gammaloop_api::se... INFO : Running command set model MT=173.0
  540. 809.12 s gammaloop-nextest-integration> [2026-09-06 07:02:22.758] @gammaloop_api::se... INFO : Running command set model WT=0.0
  541. 809.12 s gammaloop-nextest-integration> [2026-09-06 07:02:22.762] @gammaloop_api::se... INFO : Running command set model ymt=173.0
  542. 809.12 s gammaloop-nextest-integration> [2026-09-06 07:02:22.766] @gammaloop_api::se... INFO : Running command set model aS=0.118
  543. 809.12 s gammaloop-nextest-integration> [2026-09-06 07:02:22.770] @gammaloop_api::se... INFO : Running command set model aEWM1=137.036
  544. 809.12 s gammaloop-nextest-integration> [2026-09-06 07:02:22.774] @gammaloop_api::se... INFO : Running command set model Gf=1.166390e-05
  545. 809.12 s gammaloop-nextest-integration> [2026-09-06 07:02:22.777] @gammaloop_api::se... INFO : Running command set model MZ=91.188
  546. 809.12 s gammaloop-nextest-integration> [2026-09-06 07:02:22.782] @gammaloop_api::se... INFO : Running command set global string '
  547. 809.12 s gammaloop-nextest-integration> [global.generation.compile]
  548. 809.12 s gammaloop-nextest-integration> compilation_mode = "assembly"
  549. 809.12 s gammaloop-nextest-integration> optimization_level = "O0"
  550. 809.12 s gammaloop-nextest-integration> fast_math = false
  551. 809.12 s gammaloop-nextest-integration> [...]
  552. 809.12 s gammaloop-nextest-integration> [2026-09-06 07:02:22.783] @gammaloop_api::se... INFO : Running command import graphs ./examples/cli/aa_aa/1L/aa_aa_1L.dot -p aa_aa_all_helicities_assembly -i 1L_ppmm -o
  553. 809.12 s gammaloop-nextest-integration> [2026-09-06 07:02:22.783] @commands::import INFO : Loading graphs from '/build/source/examples/cli/aa_aa/1L/aa_aa_1L.dot'
  554. 809.12 s gammaloop-nextest-integration> [2026-09-06 07:02:22.791] @gammaloop_api::se... INFO : Running command generate existing -p aa_aa_all_helicities_assembly
  555. 809.12 s gammaloop-nextest-integration> [2026-09-06 07:02:45.043] @processes::amplitude INFO : Compiling amplitude 1L_ppmm
  556. 809.12 s gammaloop-nextest-integration> [2026-09-06 07:03:04.191] @commands::generate INFO : Removed 34 generated C++ source file(s). Use '--keep-sources' to keep them.
  557. 809.12 s gammaloop-nextest-integration> [2026-09-06 07:03:04.191] @commands::generate INFO :
  558. 809.12 s gammaloop-nextest-integration> Integrand generation summary
  559. 809.12 s gammaloop-nextest-integration> peak RAM 2.21 GiB | cores 1
  560. 809.12 s gammaloop-nextest-integration> ╭───────────┬───────┬─────────┬──────────────┬──────────────┬────────────────┬──────────────╮
  561. 809.12 s gammaloop-nextest-integration> │ integrand │ graph │ # evals │ expr build │ spenso │ symbolica eval │ compile │
  562. 809.12 s gammaloop-nextest-integration> ├───────────┼───────┼─────────┼──────────────┼──────────────┼────────────────┼──────────────┤
  563. 809.12 s gammaloop-nextest-integration> │ 1L_ppmm │ GL0 │ 13 │ 562ms (4.0%) │ 1.51s (11%) │ 5.68s (41%) │ 6.16s (44%) │
  564. 809.12 s gammaloop-nextest-integration> │ 1L_ppmm │ GL2 │ 13 │ 593ms (4.2%) │ 1.37s (9.6%) │ 5.34s (37%) │ 6.95s (49%) │
  565. 809.13 s gammaloop-nextest-integration> │ 1L_ppmm │ GL4 │ 11 │ 581ms (4.4%) │ 1.35s (10%) │ 5.23s (40%) │ 6.03s (46%) │
  566. 809.13 s gammaloop-nextest-integration> ├───────────┼───────┼─────────┼──────────────┼──────────────┼────────────────┼──────────────┤
  567. 809.13 s gammaloop-nextest-integration> │ Total │ │ 37 │ 1.74s (4.2%) │ 4.24s (10%) │ 16.25s (39%) │ 19.14s (46%) │
  568. 809.13 s gammaloop-nextest-integration> ╰───────────┴───────┴─────────┴──────────────┴──────────────┴────────────────┴──────────────╯
  569. 809.13 s gammaloop-nextest-integration> [2026-09-06 07:03:04.857] @gammaloop_api::se... INFO : Running command set process -p aa_aa_all_helicities -i 1L_ppmm string '
  570. 809.13 s gammaloop-nextest-integration> [stability]
  571. 809.13 s gammaloop-nextest-integration> check_on_norm = true
  572. 809.13 s gammaloop-nextest-integration> escalate_if_exact_zero = false
  573. 809.13 s gammaloop-nextest-integration> loop_momenta_norm_escalation_factor = -1.0
  574. 809.13 s gammaloop-nextest-integration> [...]
  575. 809.13 s gammaloop-nextest-integration> [2026-09-06 07:03:04.857] @gammaloop_api::se... INFO : Running command set process -p aa_aa_all_helicities_assembly -i 1L_ppmm string '
  576. 809.13 s gammaloop-nextest-integration> [stability]
  577. 809.13 s gammaloop-nextest-integration> check_on_norm = true
  578. 809.13 s gammaloop-nextest-integration> escalate_if_exact_zero = false
  579. 809.13 s gammaloop-nextest-integration> loop_momenta_norm_escalation_factor = -1.0
  580. 809.13 s gammaloop-nextest-integration> [...]
  581. 809.13 s gammaloop-nextest-integration> [2026-09-06 07:03:04.858] @gammaloop_api::se... INFO : Running command set process -p aa_aa_all_helicities -i 1L_mpmm string '
  582. 809.13 s gammaloop-nextest-integration> [stability]
  583. 809.13 s gammaloop-nextest-integration> check_on_norm = true
  584. 809.13 s gammaloop-nextest-integration> escalate_if_exact_zero = false
  585. 809.13 s gammaloop-nextest-integration> loop_momenta_norm_escalation_factor = -1.0
  586. 809.13 s gammaloop-nextest-integration> [...]
  587. 809.13 s gammaloop-nextest-integration> [2026-09-06 07:03:04.859] @gammaloop_api::se... INFO : Running command set process -p aa_aa_all_helicities_assembly -i 1L_mpmm string '
  588. 809.13 s gammaloop-nextest-integration> [stability]
  589. 809.13 s gammaloop-nextest-integration> check_on_norm = true
  590. 809.13 s gammaloop-nextest-integration> escalate_if_exact_zero = false
  591. 809.13 s gammaloop-nextest-integration> loop_momenta_norm_escalation_factor = -1.0
  592. 809.13 s gammaloop-nextest-integration> [...]
  593. 809.13 s gammaloop-nextest-integration> [2026-09-06 07:03:04.859] @gammaloop_api::se... INFO : Running command set process -p aa_aa_all_helicities -i 1L_mmmm string '
  594. 809.13 s gammaloop-nextest-integration> [stability]
  595. 809.13 s gammaloop-nextest-integration> check_on_norm = true
  596. 809.13 s gammaloop-nextest-integration> escalate_if_exact_zero = false
  597. 809.13 s gammaloop-nextest-integration> loop_momenta_norm_escalation_factor = -1.0
  598. 809.13 s gammaloop-nextest-integration> [...]
  599. 809.13 s gammaloop-nextest-integration> [2026-09-06 07:03:04.860] @gammaloop_api::se... INFO : Running command set process -p aa_aa_all_helicities_assembly -i 1L_mmmm string '
  600. 809.13 s gammaloop-nextest-integration> [stability]
  601. 809.13 s gammaloop-nextest-integration> check_on_norm = true
  602. 809.13 s gammaloop-nextest-integration> escalate_if_exact_zero = false
  603. 809.13 s gammaloop-nextest-integration> loop_momenta_norm_escalation_factor = -1.0
  604. 809.13 s gammaloop-nextest-integration> [...]
  605. 809.13 s gammaloop-nextest-integration> [2026-09-06 07:03:04.861] @gammaloop_api::se... INFO : Running command set process -p aa_aa_all_helicities -i 1L_pmmp string '
  606. 809.13 s gammaloop-nextest-integration> [stability]
  607. 809.13 s gammaloop-nextest-integration> check_on_norm = true
  608. 809.13 s gammaloop-nextest-integration> escalate_if_exact_zero = false
  609. 809.13 s gammaloop-nextest-integration> loop_momenta_norm_escalation_factor = -1.0
  610. 809.13 s gammaloop-nextest-integration> ... omitted 84 more lines; see full nextest output above
  611. 809.13 s gammaloop-nextest-integration> =========================================
  612. 809.23 s error: Cannot build '/nix/store/3qpyi4i089mjhqx61pnq05lcl2pfrw3d-gammaloop-nextest-integration.drv'.
  613. 809.23 s Reason: builder failed with exit code 100.
  614. 809.23 s Output paths:
  615. 809.23 s /nix/store/qyb58cjmy2g43lf39wd171npb5v3mmpa-gammaloop-nextest-integration
  616. 809.23 s Last 586 log lines:
  617. 809.23 s > Extracting 13 binaries, 1 build script output directory, and 3 linked paths to /build/nextest-archive-930Ufy
  618. 809.23 s > Extracted 30 files to /build/nextest-archive-930Ufy in 2.02s
  619. 809.23 s > ------------
  620. 809.23 s > Nextest run ID 6fb25a9f-db91-4514-9c64-4d5c1962672f with nextest profile: ci_gammaloop
  621. 809.23 s > Starting 152 tests across 13 binaries (208 tests skipped, including 207 tests via profile.ci_gammaloop.default-filter)
  622. 809.23 s > FAIL [ 71.208s] ( 54/152) gammaloop-integration-tests::test_runs aa_aa::important::aa_aa_local_inspect_backend_consistency
  623. 809.23 s > stdout ---
  624. 809.23 s >
  625. 809.23 s > running 1 test
  626. 809.23 s > test aa_aa::important::aa_aa_local_inspect_backend_consistency has been running for over 60 seconds
  627. 809.23 s > test aa_aa::important::aa_aa_local_inspect_backend_consistency ... FAILED
  628. 809.23 s >
  629. 809.23 s > failures:
  630. 809.23 s >
  631. 809.23 s > failures:
  632. 809.23 s > aa_aa::important::aa_aa_local_inspect_backend_consistency
  633. 809.23 s >
  634. 809.23 s > test result: FAILED. 0 passed; 1 failed; 0 ignored; 0 measured; 258 filtered out; finished in 71.03s
  635. 809.23 s >
  636. 809.23 s > stderr ---
  637. 809.23 s > [2026-09-06 07:01:54.337] @gammaloop_api::se... INFO : Running command import model sm-default.json
  638. 809.23 s > [2026-09-06 07:01:54.337] @import::model INFO : Loading built-in JSON model sm-default
  639. 809.23 s > [2026-09-06 07:01:54.356] @gammalooprs::model INFO : The following 11 external parameters were forced to zero by the restriction card:
  640. 809.23 s > lamWS, AWS, rhoWS, etaWS, ymc, yme, ymm, MC, Me, MM, WTau
  641. 809.23 s > [2026-09-06 07:01:54.356] @gammalooprs::model INFO : The following 34 vertex rules were removed by the restriction card:
  642. 809.23 s > V_82 -> (c~, d, G+) | V_83 -> (t~, d, G+) | V_84 -> (c~, s, G+) | V_85 -> (t~, s, G+) | V_86 -> (u~, b, G+) | V_87 -> (c~, b, G+) | V_90 -> (c~, d, W+) | V_91 -> (t~, d, W+) | V_92 -> (u~, s, W+) | V_94 -> (t~, s, W+) | V_95 -> (u~, b, W+) | V_96 -> (c~, b, W+) | V_101 -> (e+, e-, G0) | V_102 -> (mu+, mu-, G0) | V_104 -> (e+, e-, H) | V_105 -> (mu+, mu-, H) | V_110 -> (ve~, e-, G+) | V_111 -> (vm~, mu-, G+) | V_116 -> (b~, u, G-) | V_117 -> (d~, c, G-) | V_118 -> (s~, c, G-) | V_119 -> (b~, c, G-) | V_120 -> (d~, t, G-) | V_121 -> (s~, t, G-) | V_124 -> (s~, u, W-) | V_125 -> (b~, u, W-) | V_126 -> (d~, c, W-) | V_128 -> (b~, c, W-) | V_129 -> (d~, t, W-) | V_130 -> (s~, t, W-) | V_138 -> (c~, c, G0) | V_140 -> (c~, c, H) | V_145 -> (e+, ve, G-) | V_146 -> (mu+, vm, G-)
  643. 809.23 s > [2026-09-06 07:01:54.356] @gammalooprs::model INFO : The following 36 couplings were removed by the restriction card:
  644. 809.23 s > GC_13, GC_14, GC_16, GC_17, GC_18, GC_19, GC_20, GC_22, GC_23, GC_24, GC_25, GC_26, GC_28, GC_29, GC_42, GC_43, GC_44, GC_46, GC_47, GC_48, GC_84, GC_85, GC_86, GC_87, GC_88, GC_89, GC_90, GC_91, GC_92, GC_93, GC_101, GC_102, GC_103, GC_105, GC_106, GC_107
  645. 809.23 s > [2026-09-06 07:01:54.357] @gammaloop_api::se... INFO : Running command run set_model_parameters
  646. 809.23 s > [2026-09-06 07:01:54.357] @gammaloop_api::se... INFO : Starting command block set_model_parameters
  647. 809.23 s > [2026-09-06 07:01:54.357] @gammaloop_api::se... INFO : Running command set model MT=173.0
  648. 809.23 s > [2026-09-06 07:01:54.360] @gammaloop_api::se... INFO : Running command set model WT=0.0
  649. 809.23 s > [2026-09-06 07:01:54.364] @gammaloop_api::se... INFO : Running command set model ymt=173.0
  650. 809.23 s > [2026-09-06 07:01:54.367] @gammaloop_api::se... INFO : Running command set model aS=0.118
  651. 809.23 s > [2026-09-06 07:01:54.370] @gammaloop_api::se... INFO : Running command set model aEWM1=137.036
  652. 809.23 s > [2026-09-06 07:01:54.373] @gammaloop_api::se... INFO : Running command set model Gf=1.166390e-05
  653. 809.23 s > [2026-09-06 07:01:54.377] @gammaloop_api::se... INFO : Running command set model MZ=91.188
  654. 809.23 s > [2026-09-06 07:01:54.380] @gammaloop_api::se... INFO : Running command set global string '
  655. 809.23 s > [global.generation.compile]
  656. 809.23 s > compilation_mode = "symjit"
  657. 809.23 s > optimization_level = "O0"
  658. 809.23 s > fast_math = false
  659. 809.23 s > [...]
  660. 809.23 s > [2026-09-06 07:01:54.381] @gammaloop_api::se... INFO : Running command import graphs ./examples/cli/aa_aa/1L/aa_aa_1L.dot -p aa_aa_all_helicities -i 1L_ppmm -o
  661. 809.23 s > [2026-09-06 07:01:54.381] @commands::import INFO : Loading graphs from '/build/source/examples/cli/aa_aa/1L/aa_aa_1L.dot'
  662. 809.23 s > [2026-09-06 07:01:54.389] @gammaloop_api::se... INFO : Running command generate existing -p aa_aa_all_helicities
  663. 809.23 s > [2026-09-06 07:02:21.784] @commands::generate INFO :
  664. 809.23 s > Integrand generation summary
  665. 809.23 s > peak RAM 1.09 GiB | cores 1
  666. 809.23 s > ╭───────────┬───────┬─────────┬──────────────┬─────────────┬────────────────┬──────────────╮
  667. 809.23 s > │ integrand │ graph │ # evals │ expr build │ spenso │ symbolica eval │ compile │
  668. 809.23 s > ├───────────┼───────┼─────────┼──────────────┼─────────────┼────────────────┼──────────────┤
  669. 809.23 s > │ 1L_ppmm │ GL0 │ 13 │ 525ms (5.6%) │ 1.81s (19%) │ 6.12s (65%) │ 923ms (9.8%) │
  670. 809.23 s > │ 1L_ppmm │ GL2 │ 13 │ 490ms (5.6%) │ 1.57s (18%) │ 5.81s (66%) │ 890ms (10%) │
  671. 809.23 s > │ 1L_ppmm │ GL4 │ 11 │ 503ms (5.5%) │ 1.79s (19%) │ 6.06s (66%) │ 875ms (9.5%) │
  672. 809.23 s > ├───────────┼───────┼─────────┼──────────────┼─────────────┼────────────────┼──────────────┤
  673. 809.23 s > │ Total │ │ 37 │ 1.52s (5.6%) │ 5.17s (19%) │ 18.00s (66%) │ 2.69s (9.8%) │
  674. 809.23 s > ╰───────────┴───────┴─────────┴──────────────┴─────────────┴────────────────┴──────────────╯
  675. 809.23 s > [2026-09-06 07:02:22.731] @gammaloop_api::se... INFO : Running command import model sm-default.json
  676. 809.23 s > [2026-09-06 07:02:22.731] @import::model INFO : Loading built-in JSON model sm-default
  677. 809.23 s > [2026-09-06 07:02:22.753] @gammalooprs::model INFO : The following 11 external parameters were forced to zero by the restriction card:
  678. 809.23 s > lamWS, AWS, rhoWS, etaWS, ymc, yme, ymm, MC, Me, MM, WTau
  679. 809.23 s > [2026-09-06 07:02:22.753] @gammalooprs::model INFO : The following 34 vertex rules were removed by the restriction card:
  680. 809.23 s > V_82 -> (c~, d, G+) | V_83 -> (t~, d, G+) | V_84 -> (c~, s, G+) | V_85 -> (t~, s, G+) | V_86 -> (u~, b, G+) | V_87 -> (c~, b, G+) | V_90 -> (c~, d, W+) | V_91 -> (t~, d, W+) | V_92 -> (u~, s, W+) | V_94 -> (t~, s, W+) | V_95 -> (u~, b, W+) | V_96 -> (c~, b, W+) | V_101 -> (e+, e-, G0) | V_102 -> (mu+, mu-, G0) | V_104 -> (e+, e-, H) | V_105 -> (mu+, mu-, H) | V_110 -> (ve~, e-, G+) | V_111 -> (vm~, mu-, G+) | V_116 -> (b~, u, G-) | V_117 -> (d~, c, G-) | V_118 -> (s~, c, G-) | V_119 -> (b~, c, G-) | V_120 -> (d~, t, G-) | V_121 -> (s~, t, G-) | V_124 -> (s~, u, W-) | V_125 -> (b~, u, W-) | V_126 -> (d~, c, W-) | V_128 -> (b~, c, W-) | V_129 -> (d~, t, W-) | V_130 -> (s~, t, W-) | V_138 -> (c~, c, G0) | V_140 -> (c~, c, H) | V_145 -> (e+, ve, G-) | V_146 -> (mu+, vm, G-)
  681. 809.23 s > [2026-09-06 07:02:22.753] @gammalooprs::model INFO : The following 36 couplings were removed by the restriction card:
  682. 809.23 s > GC_13, GC_14, GC_16, GC_17, GC_18, GC_19, GC_20, GC_22, GC_23, GC_24, GC_25, GC_26, GC_28, GC_29, GC_42, GC_43, GC_44, GC_46, GC_47, GC_48, GC_84, GC_85, GC_86, GC_87, GC_88, GC_89, GC_90, GC_91, GC_92, GC_93, GC_101, GC_102, GC_103, GC_105, GC_106, GC_107
  683. 809.23 s > [2026-09-06 07:02:22.754] @gammaloop_api::se... INFO : Running command run set_model_parameters
  684. 809.23 s > [2026-09-06 07:02:22.754] @gammaloop_api::se... INFO : Starting command block set_model_parameters
  685. 809.23 s > [2026-09-06 07:02:22.754] @gammaloop_api::se... INFO : Running command set model MT=173.0
  686. 809.23 s > [2026-09-06 07:02:22.758] @gammaloop_api::se... INFO : Running command set model WT=0.0
  687. 809.23 s > [2026-09-06 07:02:22.762] @gammaloop_api::se... INFO : Running command set model ymt=173.0
  688. 809.23 s > [2026-09-06 07:02:22.766] @gammaloop_api::se... INFO : Running command set model aS=0.118
  689. 809.23 s > [2026-09-06 07:02:22.770] @gammaloop_api::se... INFO : Running command set model aEWM1=137.036
  690. 809.23 s > [2026-09-06 07:02:22.774] @gammaloop_api::se... INFO : Running command set model Gf=1.166390e-05
  691. 809.23 s > [2026-09-06 07:02:22.777] @gammaloop_api::se... INFO : Running command set model MZ=91.188
  692. 809.23 s > [2026-09-06 07:02:22.782] @gammaloop_api::se... INFO : Running command set global string '
  693. 809.23 s > [global.generation.compile]
  694. 809.23 s > compilation_mode = "assembly"
  695. 809.23 s > optimization_level = "O0"
  696. 809.23 s > fast_math = false
  697. 809.23 s > [...]
  698. 809.23 s > [2026-09-06 07:02:22.783] @gammaloop_api::se... INFO : Running command import graphs ./examples/cli/aa_aa/1L/aa_aa_1L.dot -p aa_aa_all_helicities_assembly -i 1L_ppmm -o
  699. 809.23 s > [2026-09-06 07:02:22.783] @commands::import INFO : Loading graphs from '/build/source/examples/cli/aa_aa/1L/aa_aa_1L.dot'
  700. 809.23 s > [2026-09-06 07:02:22.791] @gammaloop_api::se... INFO : Running command generate existing -p aa_aa_all_helicities_assembly
  701. 809.23 s > [2026-09-06 07:02:45.043] @processes::amplitude INFO : Compiling amplitude 1L_ppmm
  702. 809.23 s > [2026-09-06 07:03:04.191] @commands::generate INFO : Removed 34 generated C++ source file(s). Use '--keep-sources' to keep them.
  703. 809.23 s > [2026-09-06 07:03:04.191] @commands::generate INFO :
  704. 809.23 s > Integrand generation summary
  705. 809.23 s > peak RAM 2.21 GiB | cores 1
  706. 809.23 s > ╭───────────┬───────┬─────────┬──────────────┬──────────────┬────────────────┬──────────────╮
  707. 809.23 s > │ integrand │ graph │ # evals │ expr build │ spenso │ symbolica eval │ compile │
  708. 809.23 s > ├───────────┼───────┼─────────┼──────────────┼──────────────┼────────────────┼──────────────┤
  709. 809.23 s > │ 1L_ppmm │ GL0 │ 13 │ 562ms (4.0%) │ 1.51s (11%) │ 5.68s (41%) │ 6.16s (44%) │
  710. 809.23 s > │ 1L_ppmm │ GL2 │ 13 │ 593ms (4.2%) │ 1.37s (9.6%) │ 5.34s (37%) │ 6.95s (49%) │
  711. 809.23 s > │ 1L_ppmm │ GL4 │ 11 │ 581ms (4.4%) │ 1.35s (10%) │ 5.23s (40%) │ 6.03s (46%) │
  712. 809.23 s > ├───────────┼───────┼─────────┼──────────────┼──────────────┼────────────────┼──────────────┤
  713. 809.23 s > │ Total │ │ 37 │ 1.74s (4.2%) │ 4.24s (10%) │ 16.25s (39%) │ 19.14s (46%) │
  714. 809.23 s > ╰───────────┴───────┴─────────┴──────────────┴──────────────┴────────────────┴──────────────╯
  715. 809.23 s > [2026-09-06 07:03:04.857] @gammaloop_api::se... INFO : Running command set process -p aa_aa_all_helicities -i 1L_ppmm string '
  716. 809.23 s > [stability]
  717. 809.23 s > check_on_norm = true
  718. 809.23 s > escalate_if_exact_zero = false
  719. 809.23 s > loop_momenta_norm_escalation_factor = -1.0
  720. 809.23 s > [...]
  721. 809.23 s > [2026-09-06 07:03:04.857] @gammaloop_api::se... INFO : Running command set process -p aa_aa_all_helicities_assembly -i 1L_ppmm string '
  722. 809.23 s > [stability]
  723. 809.23 s > check_on_norm = true
  724. 809.23 s > escalate_if_exact_zero = false
  725. 809.23 s > loop_momenta_norm_escalation_factor = -1.0
  726. 809.23 s > [...]
  727. 809.23 s > [2026-09-06 07:03:04.858] @gammaloop_api::se... INFO : Running command set process -p aa_aa_all_helicities -i 1L_mpmm string '
  728. 809.23 s > [stability]
  729. 809.23 s > check_on_norm = true
  730. 809.23 s > escalate_if_exact_zero = false
  731. 809.23 s > loop_momenta_norm_escalation_factor = -1.0
  732. 809.23 s > [...]
  733. 809.23 s > [2026-09-06 07:03:04.859] @gammaloop_api::se... INFO : Running command set process -p aa_aa_all_helicities_assembly -i 1L_mpmm string '
  734. 809.23 s > [stability]
  735. 809.23 s > check_on_norm = true
  736. 809.23 s > escalate_if_exact_zero = false
  737. 809.23 s > loop_momenta_norm_escalation_factor = -1.0
  738. 809.23 s > [...]
  739. 809.23 s > [2026-09-06 07:03:04.859] @gammaloop_api::se... INFO : Running command set process -p aa_aa_all_helicities -i 1L_mmmm string '
  740. 809.23 s > [stability]
  741. 809.23 s > check_on_norm = true
  742. 809.23 s > escalate_if_exact_zero = false
  743. 809.23 s > loop_momenta_norm_escalation_factor = -1.0
  744. 809.23 s > [...]
  745. 809.23 s > [2026-09-06 07:03:04.860] @gammaloop_api::se... INFO : Running command set process -p aa_aa_all_helicities_assembly -i 1L_mmmm string '
  746. 809.23 s > [stability]
  747. 809.23 s > check_on_norm = true
  748. 809.23 s > escalate_if_exact_zero = false
  749. 809.23 s > loop_momenta_norm_escalation_factor = -1.0
  750. 809.23 s > [...]
  751. 809.23 s > [2026-09-06 07:03:04.861] @gammaloop_api::se... INFO : Running command set process -p aa_aa_all_helicities -i 1L_pmmp string '
  752. 809.23 s > [stability]
  753. 809.23 s > check_on_norm = true
  754. 809.23 s > escalate_if_exact_zero = false
  755. 809.23 s > loop_momenta_norm_escalation_factor = -1.0
  756. 809.23 s > [...]
  757. 809.23 s > [2026-09-06 07:03:04.861] @gammaloop_api::se... INFO : Running command set process -p aa_aa_all_helicities_assembly -i 1L_pmmp string '
  758. 809.23 s > [stability]
  759. 809.23 s > check_on_norm = true
  760. 809.23 s > escalate_if_exact_zero = false
  761. 809.23 s > loop_momenta_norm_escalation_factor = -1.0
  762. 809.23 s > [...]
  763. 809.23 s > [2026-09-06 07:03:04.862] @gammaloop_api::se... INFO : Running command set process -p aa_aa_all_helicities -i 1L_pmpm string '
  764. 809.23 s > [stability]
  765. 809.23 s > check_on_norm = true
  766. 809.23 s > escalate_if_exact_zero = false
  767. 809.23 s > loop_momenta_norm_escalation_factor = -1.0
  768. 809.23 s > [...]
  769. 809.23 s > [2026-09-06 07:03:04.863] @gammaloop_api::se... INFO : Running command set process -p aa_aa_all_helicities_assembly -i 1L_pmpm string '
  770. 809.23 s > [stability]
  771. 809.23 s > check_on_norm = true
  772. 809.23 s > escalate_if_exact_zero = false
  773. 809.23 s > loop_momenta_norm_escalation_factor = -1.0
  774. 809.23 s > [...]
  775. 809.23 s > [2026-09-06 07:03:04.867] @process::amplitude INFO : Input is below threshold: 0 existing threshold E-surfaces across 0/1 graph groups
  776. 809.23 s > [2026-09-06 07:03:04.867] @process::amplitude INFO : overlap structure of group 0: [0: []]
  777. 809.23 s > [2026-09-06 07:03:04.868] @integrands::process [{#im_is_nan, #re_is_nan}] WARNING : final process evaluation is nonfinite
  778. 809.23 s > [2026-09-06 07:03:04.868] @commands::inspect INFO :
  779. 809.23 s > Input point in momentum space:
  780. 809.23 s >
  781. 809.23 s > ( 0.1100000000000000, -0.0700000000000000, 0.1900000000000000 )
  782. 809.23 s >
  783. 809.23 s > The evaluation of integrand '1L_ppmm' is:
  784. 809.23 s >
  785. 809.23 s > ( +0.0000000000000000e0, +0.0000000000000000e0 i)
  786. 809.23 s >
  787. 809.23 s > [2026-09-06 07:03:04.871] @process::amplitude INFO : Input is below threshold: 0 existing threshold E-surfaces across 0/1 graph groups
  788. 809.23 s > [2026-09-06 07:03:04.871] @process::amplitude INFO : overlap structure of group 0: [0: []]
  789. 809.23 s > [2026-09-06 07:03:04.871] @commands::inspect INFO :
  790. 809.23 s > Input point in momentum space:
  791. 809.23 s >
  792. 809.23 s > ( 0.1100000000000000, -0.0700000000000000, 0.1900000000000000 )
  793. 809.23 s >
  794. 809.23 s > The evaluation of integrand '1L_ppmm' is:
  795. 809.23 s >
  796. 809.23 s > ( -1.7132462539328486e-28, -8.7105072229446864e-10 i)
  797. 809.23 s >
  798. 809.23 s > The application panicked (crashed).
  799. 809.23 s > Message: kinematics=a, integrand=1L_ppmm, graph_id=0: assembly vs symjit inspect: actual=(-0.00000000000000000000000000017132462539328486+-0.0000000008710507222944686i), expected=(0+0i), tolerance=0.0000000001
  800. 809.23 s > Location: tests/tests/test_runs/utils.rs:466
  801. 809.23 s >
  802. 809.23 s > ━━━━━━━━━━━━━━━━━━━━━━━━━━━━━━━━━━ BACKTRACE ━━━━━━━━━━━━━━━━━━━━━━━━━━━━━━━━━━━
  803. 809.23 s > 1: <color_eyre[51793ea62743adbd]::config::PanicHook>::panic_report<unknown>
  804. 809.23 s > at <unknown source file>:<unknown line>
  805. 809.23 s > 2: <color_eyre[51793ea62743adbd]::config::PanicHook>::into_panic_hook::{closure#0}<unknown>
  806. 809.23 s > at <unknown source file>:<unknown line>
  807. 809.23 s > 3: std[bcb96dfbba0ab899]::panicking::panic_with_hook<unknown>
  808. 809.23 s > at <unknown source file>:<unknown line>
  809. 809.23 s > 4: std[bcb96dfbba0ab899]::panicking::panic_handler::{closure#0}<unknown>
  810. 809.23 s > at <unknown source file>:<unknown line>
  811. 809.23 s > 5: std[bcb96dfbba0ab899]::sys::backtrace::__rust_end_short_backtrace::<std[bcb96dfbba0ab899]::panicking::panic_handler::{closure#0}, !><unknown>
  812. 809.23 s > at <unknown source file>:<unknown line>
  813. 809.23 s > 6: __rustc[6c289b9f9c454d21]::rust_begin_unwind<unknown>
  814. 809.23 s > at <unknown source file>:<unknown line>
  815. 809.23 s > 7: core[940e698046960fd5]::panicking::panic_fmt<unknown>
  816. 809.23 s > at <unknown source file>:<unknown line>
  817. 809.23 s > 8: <test_runs[66584badfeb6c7be]::aa_aa::important::aa_aa_local_inspect_backend_consistency::{closure#0} as core[940e698046960fd5]::ops::function::FnOnce<()>>::call_once<unknown>
  818. 809.23 s > at <unknown source file>:<unknown line>
  819. 809.23 s > 9: serial_test[cd99724524a2f1c0]::serial_code_lock::local_serial_core_with_return::<(), eyre[cb2fd339c0c40fca]::Report><unknown>
  820. 809.23 s > at <unknown source file>:<unknown line>
  821. 809.23 s > 10: <test_runs[66584badfeb6c7be]::aa_aa::important::aa_aa_local_inspect_backend_consistency::{closure#0} as core[940e698046960fd5]::ops::function::FnOnce<()>>::call_once<unknown>
  822. 809.23 s > at <unknown source file>:<unknown line>
  823. 809.23 s > 11: test[75d6903177b1d7e9]::__rust_begin_short_backtrace::<core[940e698046960fd5]::result::Result<(), alloc[2ea6bcb46fca0c42]::string::String>, fn() -> core[940e698046960fd5]::result::Result<(), alloc[2ea6bcb46fca0c42]::string::String>><unknown>
  824. 809.23 s > at <unknown source file>:<unknown line>
  825. 809.23 s > 12: test[75d6903177b1d7e9]::run_test::{closure#0}<unknown>
  826. 809.23 s > at <unknown source file>:<unknown line>
  827. 809.23 s > 13: std[bcb96dfbba0ab899]::sys::backtrace::__rust_begin_short_backtrace::<test[75d6903177b1d7e9]::run_test::{closure#1}, ()><unknown>
  828. 809.23 s > at <unknown source file>:<unknown line>
  829. 809.23 s > 14: <std[bcb96dfbba0ab899]::thread::lifecycle::spawn_unchecked<test[75d6903177b1d7e9]::run_test::{closure#1}, ()>::{closure#1} as core[940e698046960fd5]::ops::function::FnOnce<()>>::call_once::{shim:vtable#0}<unknown>
  830. 809.23 s > at <unknown source file>:<unknown line>
  831. 809.23 s > 15: <std[bcb96dfbba0ab899]::sys::thread::unix::Thread>::new::thread_start<unknown>
  832. 809.23 s > at <unknown source file>:<unknown line>
  833. 809.23 s > 16: start_thread<unknown>
  834. 809.23 s > at <unknown source file>:<unknown line>
  835. 809.23 s > 17: __clone3<unknown>
  836. 809.23 s > at <unknown source file>:<unknown line>
  837. 809.23 s >
  838. 809.23 s > Run with COLORBT_SHOW_HIDDEN=1 environment variable to disable frame filtering.
  839. 809.23 s > Run with RUST_BACKTRACE=full to include source snippets.
  840. 809.23 s >
  841. 809.23 s > ------------
  842. 809.23 s > Summary [ 751.167s] 152 tests run: 151 passed, 1 failed, 208 skipped
  843. 809.23 s > FAIL [ 71.208s] ( 54/152) gammaloop-integration-tests::test_runs aa_aa::important::aa_aa_local_inspect_backend_consistency
  844. 809.23 s > stdout ---
  845. 809.23 s >
  846. 809.23 s > running 1 test
  847. 809.23 s > test aa_aa::important::aa_aa_local_inspect_backend_consistency has been running for over 60 seconds
  848. 809.23 s > test aa_aa::important::aa_aa_local_inspect_backend_consistency ... FAILED
  849. 809.23 s >
  850. 809.23 s > failures:
  851. 809.23 s >
  852. 809.23 s > failures:
  853. 809.23 s > aa_aa::important::aa_aa_local_inspect_backend_consistency
  854. 809.23 s >
  855. 809.23 s > test result: FAILED. 0 passed; 1 failed; 0 ignored; 0 measured; 258 filtered out; finished in 71.03s
  856. 809.23 s >
  857. 809.23 s > stderr ---
  858. 809.23 s > [2026-09-06 07:01:54.337] @gammaloop_api::se... INFO : Running command import model sm-default.json
  859. 809.23 s > [2026-09-06 07:01:54.337] @import::model INFO : Loading built-in JSON model sm-default
  860. 809.23 s > [2026-09-06 07:01:54.356] @gammalooprs::model INFO : The following 11 external parameters were forced to zero by the restriction card:
  861. 809.23 s > lamWS, AWS, rhoWS, etaWS, ymc, yme, ymm, MC, Me, MM, WTau
  862. 809.23 s > [2026-09-06 07:01:54.356] @gammalooprs::model INFO : The following 34 vertex rules were removed by the restriction card:
  863. 809.23 s > V_82 -> (c~, d, G+) | V_83 -> (t~, d, G+) | V_84 -> (c~, s, G+) | V_85 -> (t~, s, G+) | V_86 -> (u~, b, G+) | V_87 -> (c~, b, G+) | V_90 -> (c~, d, W+) | V_91 -> (t~, d, W+) | V_92 -> (u~, s, W+) | V_94 -> (t~, s, W+) | V_95 -> (u~, b, W+) | V_96 -> (c~, b, W+) | V_101 -> (e+, e-, G0) | V_102 -> (mu+, mu-, G0) | V_104 -> (e+, e-, H) | V_105 -> (mu+, mu-, H) | V_110 -> (ve~, e-, G+) | V_111 -> (vm~, mu-, G+) | V_116 -> (b~, u, G-) | V_117 -> (d~, c, G-) | V_118 -> (s~, c, G-) | V_119 -> (b~, c, G-) | V_120 -> (d~, t, G-) | V_121 -> (s~, t, G-) | V_124 -> (s~, u, W-) | V_125 -> (b~, u, W-) | V_126 -> (d~, c, W-) | V_128 -> (b~, c, W-) | V_129 -> (d~, t, W-) | V_130 -> (s~, t, W-) | V_138 -> (c~, c, G0) | V_140 -> (c~, c, H) | V_145 -> (e+, ve, G-) | V_146 -> (mu+, vm, G-)
  864. 809.23 s > [2026-09-06 07:01:54.356] @gammalooprs::model INFO : The following 36 couplings were removed by the restriction card:
  865. 809.23 s > GC_13, GC_14, GC_16, GC_17, GC_18, GC_19, GC_20, GC_22, GC_23, GC_24, GC_25, GC_26, GC_28, GC_29, GC_42, GC_43, GC_44, GC_46, GC_47, GC_48, GC_84, GC_85, GC_86, GC_87, GC_88, GC_89, GC_90, GC_91, GC_92, GC_93, GC_101, GC_102, GC_103, GC_105, GC_106, GC_107
  866. 809.23 s > [2026-09-06 07:01:54.357] @gammaloop_api::se... INFO : Running command run set_model_parameters
  867. 809.23 s > [2026-09-06 07:01:54.357] @gammaloop_api::se... INFO : Starting command block set_model_parameters
  868. 809.23 s > [2026-09-06 07:01:54.357] @gammaloop_api::se... INFO : Running command set model MT=173.0
  869. 809.23 s > [2026-09-06 07:01:54.360] @gammaloop_api::se... INFO : Running command set model WT=0.0
  870. 809.23 s > [2026-09-06 07:01:54.364] @gammaloop_api::se... INFO : Running command set model ymt=173.0
  871. 809.23 s > [2026-09-06 07:01:54.367] @gammaloop_api::se... INFO : Running command set model aS=0.118
  872. 809.23 s > [2026-09-06 07:01:54.370] @gammaloop_api::se... INFO : Running command set model aEWM1=137.036
  873. 809.23 s > [2026-09-06 07:01:54.373] @gammaloop_api::se... INFO : Running command set model Gf=1.166390e-05
  874. 809.23 s > [2026-09-06 07:01:54.377] @gammaloop_api::se... INFO : Running command set model MZ=91.188
  875. 809.23 s > [2026-09-06 07:01:54.380] @gammaloop_api::se... INFO : Running command set global string '
  876. 809.23 s > [global.generation.compile]
  877. 809.23 s > compilation_mode = "symjit"
  878. 809.23 s > optimization_level = "O0"
  879. 809.23 s > fast_math = false
  880. 809.23 s > [...]
  881. 809.23 s > [2026-09-06 07:01:54.381] @gammaloop_api::se... INFO : Running command import graphs ./examples/cli/aa_aa/1L/aa_aa_1L.dot -p aa_aa_all_helicities -i 1L_ppmm -o
  882. 809.23 s > [2026-09-06 07:01:54.381] @commands::import INFO : Loading graphs from '/build/source/examples/cli/aa_aa/1L/aa_aa_1L.dot'
  883. 809.23 s > [2026-09-06 07:01:54.389] @gammaloop_api::se... INFO : Running command generate existing -p aa_aa_all_helicities
  884. 809.23 s > [2026-09-06 07:02:21.784] @commands::generate INFO :
  885. 809.23 s > Integrand generation summary
  886. 809.23 s > peak RAM 1.09 GiB | cores 1
  887. 809.23 s > ╭───────────┬───────┬─────────┬──────────────┬─────────────┬────────────────┬──────────────╮
  888. 809.23 s > │ integrand │ graph │ # evals │ expr build │ spenso │ symbolica eval │ compile │
  889. 809.23 s > ├───────────┼───────┼─────────┼──────────────┼─────────────┼────────────────┼──────────────┤
  890. 809.23 s > │ 1L_ppmm │ GL0 │ 13 │ 525ms (5.6%) │ 1.81s (19%) │ 6.12s (65%) │ 923ms (9.8%) │
  891. 809.23 s > │ 1L_ppmm │ GL2 │ 13 │ 490ms (5.6%) │ 1.57s (18%) │ 5.81s (66%) │ 890ms (10%) │
  892. 809.23 s > │ 1L_ppmm │ GL4 │ 11 │ 503ms (5.5%) │ 1.79s (19%) │ 6.06s (66%) │ 875ms (9.5%) │
  893. 809.23 s > ├───────────┼───────┼─────────┼──────────────┼─────────────┼────────────────┼──────────────┤
  894. 809.23 s > │ Total │ │ 37 │ 1.52s (5.6%) │ 5.17s (19%) │ 18.00s (66%) │ 2.69s (9.8%) │
  895. 809.23 s > ╰───────────┴───────┴─────────┴──────────────┴─────────────┴────────────────┴──────────────╯
  896. 809.23 s > [2026-09-06 07:02:22.731] @gammaloop_api::se... INFO : Running command import model sm-default.json
  897. 809.23 s > [2026-09-06 07:02:22.731] @import::model INFO : Loading built-in JSON model sm-default
  898. 809.23 s > [2026-09-06 07:02:22.753] @gammalooprs::model INFO : The following 11 external parameters were forced to zero by the restriction card:
  899. 809.23 s > lamWS, AWS, rhoWS, etaWS, ymc, yme, ymm, MC, Me, MM, WTau
  900. 809.23 s > [2026-09-06 07:02:22.753] @gammalooprs::model INFO : The following 34 vertex rules were removed by the restriction card:
  901. 809.23 s > V_82 -> (c~, d, G+) | V_83 -> (t~, d, G+) | V_84 -> (c~, s, G+) | V_85 -> (t~, s, G+) | V_86 -> (u~, b, G+) | V_87 -> (c~, b, G+) | V_90 -> (c~, d, W+) | V_91 -> (t~, d, W+) | V_92 -> (u~, s, W+) | V_94 -> (t~, s, W+) | V_95 -> (u~, b, W+) | V_96 -> (c~, b, W+) | V_101 -> (e+, e-, G0) | V_102 -> (mu+, mu-, G0) | V_104 -> (e+, e-, H) | V_105 -> (mu+, mu-, H) | V_110 -> (ve~, e-, G+) | V_111 -> (vm~, mu-, G+) | V_116 -> (b~, u, G-) | V_117 -> (d~, c, G-) | V_118 -> (s~, c, G-) | V_119 -> (b~, c, G-) | V_120 -> (d~, t, G-) | V_121 -> (s~, t, G-) | V_124 -> (s~, u, W-) | V_125 -> (b~, u, W-) | V_126 -> (d~, c, W-) | V_128 -> (b~, c, W-) | V_129 -> (d~, t, W-) | V_130 -> (s~, t, W-) | V_138 -> (c~, c, G0) | V_140 -> (c~, c, H) | V_145 -> (e+, ve, G-) | V_146 -> (mu+, vm, G-)
  902. 809.23 s > [2026-09-06 07:02:22.753] @gammalooprs::model INFO : The following 36 couplings were removed by the restriction card:
  903. 809.23 s > GC_13, GC_14, GC_16, GC_17, GC_18, GC_19, GC_20, GC_22, GC_23, GC_24, GC_25, GC_26, GC_28, GC_29, GC_42, GC_43, GC_44, GC_46, GC_47, GC_48, GC_84, GC_85, GC_86, GC_87, GC_88, GC_89, GC_90, GC_91, GC_92, GC_93, GC_101, GC_102, GC_103, GC_105, GC_106, GC_107
  904. 809.23 s > [2026-09-06 07:02:22.754] @gammaloop_api::se... INFO : Running command run set_model_parameters
  905. 809.23 s > [2026-09-06 07:02:22.754] @gammaloop_api::se... INFO : Starting command block set_model_parameters
  906. 809.23 s > [2026-09-06 07:02:22.754] @gammaloop_api::se... INFO : Running command set model MT=173.0
  907. 809.23 s > [2026-09-06 07:02:22.758] @gammaloop_api::se... INFO : Running command set model WT=0.0
  908. 809.23 s > [2026-09-06 07:02:22.762] @gammaloop_api::se... INFO : Running command set model ymt=173.0
  909. 809.23 s > [2026-09-06 07:02:22.766] @gammaloop_api::se... INFO : Running command set model aS=0.118
  910. 809.23 s > [2026-09-06 07:02:22.770] @gammaloop_api::se... INFO : Running command set model aEWM1=137.036
  911. 809.23 s > [2026-09-06 07:02:22.774] @gammaloop_api::se... INFO : Running command set model Gf=1.166390e-05
  912. 809.23 s > [2026-09-06 07:02:22.777] @gammaloop_api::se... INFO : Running command set model MZ=91.188
  913. 809.23 s > [2026-09-06 07:02:22.782] @gammaloop_api::se... INFO : Running command set global string '
  914. 809.23 s > [global.generation.compile]
  915. 809.23 s > compilation_mode = "assembly"
  916. 809.23 s > optimization_level = "O0"
  917. 809.23 s > fast_math = false
  918. 809.23 s > [...]
  919. 809.23 s > [2026-09-06 07:02:22.783] @gammaloop_api::se... INFO : Running command import graphs ./examples/cli/aa_aa/1L/aa_aa_1L.dot -p aa_aa_all_helicities_assembly -i 1L_ppmm -o
  920. 809.23 s > [2026-09-06 07:02:22.783] @commands::import INFO : Loading graphs from '/build/source/examples/cli/aa_aa/1L/aa_aa_1L.dot'
  921. 809.23 s > [2026-09-06 07:02:22.791] @gammaloop_api::se... INFO : Running command generate existing -p aa_aa_all_helicities_assembly
  922. 809.23 s > [2026-09-06 07:02:45.043] @processes::amplitude INFO : Compiling amplitude 1L_ppmm
  923. 809.23 s > [2026-09-06 07:03:04.191] @commands::generate INFO : Removed 34 generated C++ source file(s). Use '--keep-sources' to keep them.
  924. 809.23 s > [2026-09-06 07:03:04.191] @commands::generate INFO :
  925. 809.23 s > Integrand generation summary
  926. 809.23 s > peak RAM 2.21 GiB | cores 1
  927. 809.23 s > ╭───────────┬───────┬─────────┬──────────────┬──────────────┬────────────────┬──────────────╮
  928. 809.23 s > │ integrand │ graph │ # evals │ expr build │ spenso │ symbolica eval │ compile │
  929. 809.23 s > ├───────────┼───────┼─────────┼──────────────┼──────────────┼────────────────┼──────────────┤
  930. 809.23 s > │ 1L_ppmm │ GL0 │ 13 │ 562ms (4.0%) │ 1.51s (11%) │ 5.68s (41%) │ 6.16s (44%) │
  931. 809.23 s > │ 1L_ppmm │ GL2 │ 13 │ 593ms (4.2%) │ 1.37s (9.6%) │ 5.34s (37%) │ 6.95s (49%) │
  932. 809.23 s > │ 1L_ppmm │ GL4 │ 11 │ 581ms (4.4%) │ 1.35s (10%) │ 5.23s (40%) │ 6.03s (46%) │
  933. 809.23 s > ├───────────┼───────┼─────────┼──────────────┼──────────────┼────────────────┼──────────────┤
  934. 809.23 s > │ Total │ │ 37 │ 1.74s (4.2%) │ 4.24s (10%) │ 16.25s (39%) │ 19.14s (46%) │
  935. 809.23 s > ╰───────────┴───────┴─────────┴──────────────┴──────────────┴────────────────┴──────────────╯
  936. 809.23 s > [2026-09-06 07:03:04.857] @gammaloop_api::se... INFO : Running command set process -p aa_aa_all_helicities -i 1L_ppmm string '
  937. 809.23 s > [stability]
  938. 809.23 s > check_on_norm = true
  939. 809.23 s > escalate_if_exact_zero = false
  940. 809.23 s > loop_momenta_norm_escalation_factor = -1.0
  941. 809.23 s > [...]
  942. 809.23 s > [2026-09-06 07:03:04.857] @gammaloop_api::se... INFO : Running command set process -p aa_aa_all_helicities_assembly -i 1L_ppmm string '
  943. 809.23 s > [stability]
  944. 809.23 s > check_on_norm = true
  945. 809.23 s > escalate_if_exact_zero = false
  946. 809.23 s > loop_momenta_norm_escalation_factor = -1.0
  947. 809.23 s > [...]
  948. 809.23 s > [2026-09-06 07:03:04.858] @gammaloop_api::se... INFO : Running command set process -p aa_aa_all_helicities -i 1L_mpmm string '
  949. 809.23 s > [stability]
  950. 809.23 s > check_on_norm = true
  951. 809.23 s > escalate_if_exact_zero = false
  952. 809.23 s > loop_momenta_norm_escalation_factor = -1.0
  953. 809.23 s > [...]
  954. 809.23 s > [2026-09-06 07:03:04.859] @gammaloop_api::se... INFO : Running command set process -p aa_aa_all_helicities_assembly -i 1L_mpmm string '
  955. 809.23 s > [stability]
  956. 809.23 s > check_on_norm = true
  957. 809.23 s > escalate_if_exact_zero = false
  958. 809.23 s > loop_momenta_norm_escalation_factor = -1.0
  959. 809.23 s > [...]
  960. 809.23 s > [2026-09-06 07:03:04.859] @gammaloop_api::se... INFO : Running command set process -p aa_aa_all_helicities -i 1L_mmmm string '
  961. 809.23 s > [stability]
  962. 809.23 s > check_on_norm = true
  963. 809.23 s > escalate_if_exact_zero = false
  964. 809.23 s > loop_momenta_norm_escalation_factor = -1.0
  965. 809.23 s > [...]
  966. 809.23 s > [2026-09-06 07:03:04.860] @gammaloop_api::se... INFO : Running command set process -p aa_aa_all_helicities_assembly -i 1L_mmmm string '
  967. 809.23 s > [stability]
  968. 809.23 s > check_on_norm = true
  969. 809.23 s > escalate_if_exact_zero = false
  970. 809.23 s > loop_momenta_norm_escalation_factor = -1.0
  971. 809.23 s > [...]
  972. 809.23 s > [2026-09-06 07:03:04.861] @gammaloop_api::se... INFO : Running command set process -p aa_aa_all_helicities -i 1L_pmmp string '
  973. 809.23 s > [stability]
  974. 809.23 s > check_on_norm = true
  975. 809.23 s > escalate_if_exact_zero = false
  976. 809.23 s > loop_momenta_norm_escalation_factor = -1.0
  977. 809.23 s > [...]
  978. 809.23 s > [2026-09-06 07:03:04.861] @gammaloop_api::se... INFO : Running command set process -p aa_aa_all_helicities_assembly -i 1L_pmmp string '
  979. 809.23 s > [stability]
  980. 809.23 s > check_on_norm = true
  981. 809.23 s > escalate_if_exact_zero = false
  982. 809.23 s > loop_momenta_norm_escalation_factor = -1.0
  983. 809.23 s > [...]
  984. 809.23 s > [2026-09-06 07:03:04.862] @gammaloop_api::se... INFO : Running command set process -p aa_aa_all_helicities -i 1L_pmpm string '
  985. 809.23 s > [stability]
  986. 809.23 s > check_on_norm = true
  987. 809.23 s > escalate_if_exact_zero = false
  988. 809.23 s > loop_momenta_norm_escalation_factor = -1.0
  989. 809.23 s > [...]
  990. 809.23 s > [2026-09-06 07:03:04.863] @gammaloop_api::se... INFO : Running command set process -p aa_aa_all_helicities_assembly -i 1L_pmpm string '
  991. 809.23 s > [stability]
  992. 809.23 s > check_on_norm = true
  993. 809.23 s > escalate_if_exact_zero = false
  994. 809.23 s > loop_momenta_norm_escalation_factor = -1.0
  995. 809.23 s > [...]
  996. 809.23 s > [2026-09-06 07:03:04.867] @process::amplitude INFO : Input is below threshold: 0 existing threshold E-surfaces across 0/1 graph groups
  997. 809.23 s > [2026-09-06 07:03:04.867] @process::amplitude INFO : overlap structure of group 0: [0: []]
  998. 809.23 s > [2026-09-06 07:03:04.868] @integrands::process [{#im_is_nan, #re_is_nan}] WARNING : final process evaluation is nonfinite
  999. 809.23 s > [2026-09-06 07:03:04.868] @commands::inspect INFO :
  1000. 809.23 s > Input point in momentum space:
  1001. 809.23 s >
  1002. 809.23 s > ( 0.1100000000000000, -0.0700000000000000, 0.1900000000000000 )
  1003. 809.23 s >
  1004. 809.23 s > The evaluation of integrand '1L_ppmm' is:
  1005. 809.23 s >
  1006. 809.23 s > ( +0.0000000000000000e0, +0.0000000000000000e0 i)
  1007. 809.23 s >
  1008. 809.23 s > [2026-09-06 07:03:04.871] @process::amplitude INFO : Input is below threshold: 0 existing threshold E-surfaces across 0/1 graph groups
  1009. 809.23 s > [2026-09-06 07:03:04.871] @process::amplitude INFO : overlap structure of group 0: [0: []]
  1010. 809.23 s > [2026-09-06 07:03:04.871] @commands::inspect INFO :
  1011. 809.23 s > Input point in momentum space:
  1012. 809.23 s >
  1013. 809.23 s > ( 0.1100000000000000, -0.0700000000000000, 0.1900000000000000 )
  1014. 809.23 s >
  1015. 809.23 s > The evaluation of integrand '1L_ppmm' is:
  1016. 809.23 s >
  1017. 809.23 s > ( -1.7132462539328486e-28, -8.7105072229446864e-10 i)
  1018. 809.23 s >
  1019. 809.23 s > The application panicked (crashed).
  1020. 809.23 s > Message: kinematics=a, integrand=1L_ppmm, graph_id=0: assembly vs symjit inspect: actual=(-0.00000000000000000000000000017132462539328486+-0.0000000008710507222944686i), expected=(0+0i), tolerance=0.0000000001
  1021. 809.23 s > Location: tests/tests/test_runs/utils.rs:466
  1022. 809.23 s >
  1023. 809.23 s > ━━━━━━━━━━━━━━━━━━━━━━━━━━━━━━━━━━ BACKTRACE ━━━━━━━━━━━━━━━━━━━━━━━━━━━━━━━━━━━
  1024. 809.23 s > 1: <color_eyre[51793ea62743adbd]::config::PanicHook>::panic_report<unknown>
  1025. 809.23 s > at <unknown source file>:<unknown line>
  1026. 809.23 s > 2: <color_eyre[51793ea62743adbd]::config::PanicHook>::into_panic_hook::{closure#0}<unknown>
  1027. 809.23 s > at <unknown source file>:<unknown line>
  1028. 809.23 s > 3: std[bcb96dfbba0ab899]::panicking::panic_with_hook<unknown>
  1029. 809.23 s > at <unknown source file>:<unknown line>
  1030. 809.23 s > 4: std[bcb96dfbba0ab899]::panicking::panic_handler::{closure#0}<unknown>
  1031. 809.23 s > at <unknown source file>:<unknown line>
  1032. 809.23 s > 5: std[bcb96dfbba0ab899]::sys::backtrace::__rust_end_short_backtrace::<std[bcb96dfbba0ab899]::panicking::panic_handler::{closure#0}, !><unknown>
  1033. 809.23 s > at <unknown source file>:<unknown line>
  1034. 809.23 s > 6: __rustc[6c289b9f9c454d21]::rust_begin_unwind<unknown>
  1035. 809.23 s > at <unknown source file>:<unknown line>
  1036. 809.23 s > 7: core[940e698046960fd5]::panicking::panic_fmt<unknown>
  1037. 809.23 s > at <unknown source file>:<unknown line>
  1038. 809.23 s > 8: <test_runs[66584badfeb6c7be]::aa_aa::important::aa_aa_local_inspect_backend_consistency::{closure#0} as core[940e698046960fd5]::ops::function::FnOnce<()>>::call_once<unknown>
  1039. 809.23 s > at <unknown source file>:<unknown line>
  1040. 809.23 s > 9: serial_test[cd99724524a2f1c0]::serial_code_lock::local_serial_core_with_return::<(), eyre[cb2fd339c0c40fca]::Report><unknown>
  1041. 809.23 s > at <unknown source file>:<unknown line>
  1042. 809.23 s > 10: <test_runs[66584badfeb6c7be]::aa_aa::important::aa_aa_local_inspect_backend_consistency::{closure#0} as core[940e698046960fd5]::ops::function::FnOnce<()>>::call_once<unknown>
  1043. 809.23 s > at <unknown source file>:<unknown line>
  1044. 809.23 s > 11: test[75d6903177b1d7e9]::__rust_begin_short_backtrace::<core[940e698046960fd5]::result::Result<(), alloc[2ea6bcb46fca0c42]::string::String>, fn() -> core[940e698046960fd5]::result::Result<(), alloc[2ea6bcb46fca0c42]::string::String>><unknown>
  1045. 809.23 s > at <unknown source file>:<unknown line>
  1046. 809.23 s > 12: test[75d6903177b1d7e9]::run_test::{closure#0}<unknown>
  1047. 809.23 s > at <unknown source file>:<unknown line>
  1048. 809.23 s > 13: std[bcb96dfbba0ab899]::sys::backtrace::__rust_begin_short_backtrace::<test[75d6903177b1d7e9]::run_test::{closure#1}, ()><unknown>
  1049. 809.23 s > at <unknown source file>:<unknown line>
  1050. 809.23 s > 14: <std[bcb96dfbba0ab899]::thread::lifecycle::spawn_unchecked<test[75d6903177b1d7e9]::run_test::{closure#1}, ()>::{closure#1} as core[940e698046960fd5]::ops::function::FnOnce<()>>::call_once::{shim:vtable#0}<unknown>
  1051. 809.23 s > at <unknown source file>:<unknown line>
  1052. 809.23 s > 15: <std[bcb96dfbba0ab899]::sys::thread::unix::Thread>::new::thread_start<unknown>
  1053. 809.23 s > at <unknown source file>:<unknown line>
  1054. 809.23 s > 16: start_thread<unknown>
  1055. 809.23 s > at <unknown source file>:<unknown line>
  1056. 809.23 s > 17: __clone3<unknown>
  1057. 809.23 s > at <unknown source file>:<unknown line>
  1058. 809.23 s >
  1059. 809.23 s > Run with COLORBT_SHOW_HIDDEN=1 environment variable to disable frame filtering.
  1060. 809.23 s > Run with RUST_BACKTRACE=full to include source snippets.
  1061. 809.23 s >
  1062. 809.23 s > error: test run failed
  1063. 809.23 s >
  1064. 809.23 s > ========== nextest test summary ==========
  1065. 809.23 s > report: target/nextest/ci_gammaloop/junit.xml
  1066. 809.23 s > tests: 152, failures: 1, errors: 0
  1067. 809.23 s >
  1068. 809.23 s > 1. gammaloop-integration-tests::test_runs::aa_aa::important::aa_aa_local_inspect_backend_consistency
  1069. 809.23 s > failure: test failure with exit code 101
  1070. 809.23 s > system-out
  1071. 809.23 s > running 1 test
  1072. 809.23 s > test aa_aa::important::aa_aa_local_inspect_backend_consistency has been running for over 60 seconds
  1073. 809.23 s > test aa_aa::important::aa_aa_local_inspect_backend_consistency ... FAILED
  1074. 809.23 s >
  1075. 809.23 s > failures:
  1076. 809.23 s >
  1077. 809.23 s > failures:
  1078. 809.23 s > aa_aa::important::aa_aa_local_inspect_backend_consistency
  1079. 809.23 s >
  1080. 809.23 s > test result: FAILED. 0 passed; 1 failed; 0 ignored; 0 measured; 258 filtered out; finished in 71.03s
  1081. 809.23 s > system-err
  1082. 809.23 s > [2026-09-06 07:01:54.337] @gammaloop_api::se... INFO : Running command import model sm-default.json
  1083. 809.23 s > [2026-09-06 07:01:54.337] @import::model INFO : Loading built-in JSON model sm-default
  1084. 809.23 s > [2026-09-06 07:01:54.356] @gammalooprs::model INFO : The following 11 external parameters were forced to zero by the restriction card:
  1085. 809.23 s > lamWS, AWS, rhoWS, etaWS, ymc, yme, ymm, MC, Me, MM, WTau
  1086. 809.23 s > [2026-09-06 07:01:54.356] @gammalooprs::model INFO : The following 34 vertex rules were removed by the restriction card:
  1087. 809.23 s > V_82 -> (c~, d, G+) | V_83 -> (t~, d, G+) | V_84 -> (c~, s, G+) | V_85 -> (t~, s, G+) | V_86 -> (u~, b, G+) | V_87 -> (c~, b, G+) | V_90 -> (c~, d, W+) | V_91 -> (t~, d, W+) | V_92 -> (u~, s, W+) | V_94 -> (t~, s, W+) | V_95 -> (u~, b, W+) | V_96 -> (c~, b, W+) | V_101 -> (e+, e-, G0) | V_102 -> (mu+, mu-, G0) | V_104 -> (e+, e-, H) | V_105 -> (mu+, mu-, H) | V_110 -> (ve~, e-, G+) | V_111 -> (vm~, mu-, G+) | V_116 -> (b~, u, G-) | V_117 -> (d~, c, G-) | V_118 -> (s~, c, G-) | V_119 -> (b~, c, G-) | V_120 -> (d~, t, G-) | V_121 -> (s~, t, G-) | V_124 -> (s~, u, W-) | V_125 -> (b~, u, W-) | V_126 -> (d~, c, W-) | V_128 -> (b~, c, W-) | V_129 -> (d~, t, W-) | V_130 -> (s~, t, W-) | V_138 -> (c~, c, G0) | V_140 -> (c~, c, H) | V_145 -> (e+, ve, G-) | V_146 -> (mu+, vm, G-)
  1088. 809.23 s > [2026-09-06 07:01:54.356] @gammalooprs::model INFO : The following 36 couplings were removed by the restriction card:
  1089. 809.23 s > GC_13, GC_14, GC_16, GC_17, GC_18, GC_19, GC_20, GC_22, GC_23, GC_24, GC_25, GC_26, GC_28, GC_29, GC_42, GC_43, GC_44, GC_46, GC_47, GC_48, GC_84, GC_85, GC_86, GC_87, GC_88, GC_89, GC_90, GC_91, GC_92, GC_93, GC_101, GC_102, GC_103, GC_105, GC_106, GC_107
  1090. 809.23 s > [2026-09-06 07:01:54.357] @gammaloop_api::se... INFO : Running command run set_model_parameters
  1091. 809.23 s > [2026-09-06 07:01:54.357] @gammaloop_api::se... INFO : Starting command block set_model_parameters
  1092. 809.23 s > [2026-09-06 07:01:54.357] @gammaloop_api::se... INFO : Running command set model MT=173.0
  1093. 809.23 s > [2026-09-06 07:01:54.360] @gammaloop_api::se... INFO : Running command set model WT=0.0
  1094. 809.23 s > [2026-09-06 07:01:54.364] @gammaloop_api::se... INFO : Running command set model ymt=173.0
  1095. 809.23 s > [2026-09-06 07:01:54.367] @gammaloop_api::se... INFO : Running command set model aS=0.118
  1096. 809.23 s > [2026-09-06 07:01:54.370] @gammaloop_api::se... INFO : Running command set model aEWM1=137.036
  1097. 809.23 s > [2026-09-06 07:01:54.373] @gammaloop_api::se... INFO : Running command set model Gf=1.166390e-05
  1098. 809.23 s > [2026-09-06 07:01:54.377] @gammaloop_api::se... INFO : Running command set model MZ=91.188
  1099. 809.23 s > [2026-09-06 07:01:54.380] @gammaloop_api::se... INFO : Running command set global string '
  1100. 809.23 s > [global.generation.compile]
  1101. 809.23 s > compilation_mode = "symjit"
  1102. 809.23 s > optimization_level = "O0"
  1103. 809.23 s > fast_math = false
  1104. 809.23 s > [...]
  1105. 809.23 s > [2026-09-06 07:01:54.381] @gammaloop_api::se... INFO : Running command import graphs ./examples/cli/aa_aa/1L/aa_aa_1L.dot -p aa_aa_all_helicities -i 1L_ppmm -o
  1106. 809.23 s > [2026-09-06 07:01:54.381] @commands::import INFO : Loading graphs from '/build/source/examples/cli/aa_aa/1L/aa_aa_1L.dot'
  1107. 809.23 s > [2026-09-06 07:01:54.389] @gammaloop_api::se... INFO : Running command generate existing -p aa_aa_all_helicities
  1108. 809.23 s > [2026-09-06 07:02:21.784] @commands::generate INFO :
  1109. 809.23 s > Integrand generation summary
  1110. 809.23 s > peak RAM 1.09 GiB | cores 1
  1111. 809.23 s > ╭───────────┬───────┬─────────┬──────────────┬─────────────┬────────────────┬──────────────╮
  1112. 809.23 s > │ integrand │ graph │ # evals │ expr build │ spenso │ symbolica eval │ compile │
  1113. 809.23 s > ├───────────┼───────┼─────────┼──────────────┼─────────────┼────────────────┼──────────────┤
  1114. 809.23 s > │ 1L_ppmm │ GL0 │ 13 │ 525ms (5.6%) │ 1.81s (19%) │ 6.12s (65%) │ 923ms (9.8%) │
  1115. 809.23 s > │ 1L_ppmm │ GL2 │ 13 │ 490ms (5.6%) │ 1.57s (18%) │ 5.81s (66%) │ 890ms (10%) │
  1116. 809.23 s > │ 1L_ppmm │ GL4 │ 11 │ 503ms (5.5%) │ 1.79s (19%) │ 6.06s (66%) │ 875ms (9.5%) │
  1117. 809.23 s > ├───────────┼───────┼─────────┼──────────────┼─────────────┼────────────────┼──────────────┤
  1118. 809.23 s > │ Total │ │ 37 │ 1.52s (5.6%) │ 5.17s (19%) │ 18.00s (66%) │ 2.69s (9.8%) │
  1119. 809.23 s > ╰───────────┴───────┴─────────┴──────────────┴─────────────┴────────────────┴──────────────╯
  1120. 809.23 s > [2026-09-06 07:02:22.731] @gammaloop_api::se... INFO : Running command import model sm-default.json
  1121. 809.23 s > [2026-09-06 07:02:22.731] @import::model INFO : Loading built-in JSON model sm-default
  1122. 809.23 s > [2026-09-06 07:02:22.753] @gammalooprs::model INFO : The following 11 external parameters were forced to zero by the restriction card:
  1123. 809.23 s > lamWS, AWS, rhoWS, etaWS, ymc, yme, ymm, MC, Me, MM, WTau
  1124. 809.23 s > [2026-09-06 07:02:22.753] @gammalooprs::model INFO : The following 34 vertex rules were removed by the restriction card:
  1125. 809.23 s > V_82 -> (c~, d, G+) | V_83 -> (t~, d, G+) | V_84 -> (c~, s, G+) | V_85 -> (t~, s, G+) | V_86 -> (u~, b, G+) | V_87 -> (c~, b, G+) | V_90 -> (c~, d, W+) | V_91 -> (t~, d, W+) | V_92 -> (u~, s, W+) | V_94 -> (t~, s, W+) | V_95 -> (u~, b, W+) | V_96 -> (c~, b, W+) | V_101 -> (e+, e-, G0) | V_102 -> (mu+, mu-, G0) | V_104 -> (e+, e-, H) | V_105 -> (mu+, mu-, H) | V_110 -> (ve~, e-, G+) | V_111 -> (vm~, mu-, G+) | V_116 -> (b~, u, G-) | V_117 -> (d~, c, G-) | V_118 -> (s~, c, G-) | V_119 -> (b~, c, G-) | V_120 -> (d~, t, G-) | V_121 -> (s~, t, G-) | V_124 -> (s~, u, W-) | V_125 -> (b~, u, W-) | V_126 -> (d~, c, W-) | V_128 -> (b~, c, W-) | V_129 -> (d~, t, W-) | V_130 -> (s~, t, W-) | V_138 -> (c~, c, G0) | V_140 -> (c~, c, H) | V_145 -> (e+, ve, G-) | V_146 -> (mu+, vm, G-)
  1126. 809.23 s > [2026-09-06 07:02:22.753] @gammalooprs::model INFO : The following 36 couplings were removed by the restriction card:
  1127. 809.23 s > GC_13, GC_14, GC_16, GC_17, GC_18, GC_19, GC_20, GC_22, GC_23, GC_24, GC_25, GC_26, GC_28, GC_29, GC_42, GC_43, GC_44, GC_46, GC_47, GC_48, GC_84, GC_85, GC_86, GC_87, GC_88, GC_89, GC_90, GC_91, GC_92, GC_93, GC_101, GC_102, GC_103, GC_105, GC_106, GC_107
  1128. 809.23 s > [2026-09-06 07:02:22.754] @gammaloop_api::se... INFO : Running command run set_model_parameters
  1129. 809.23 s > [2026-09-06 07:02:22.754] @gammaloop_api::se... INFO : Starting command block set_model_parameters
  1130. 809.23 s > [2026-09-06 07:02:22.754] @gammaloop_api::se... INFO : Running command set model MT=173.0
  1131. 809.23 s > [2026-09-06 07:02:22.758] @gammaloop_api::se... INFO : Running command set model WT=0.0
  1132. 809.23 s > [2026-09-06 07:02:22.762] @gammaloop_api::se... INFO : Running command set model ymt=173.0
  1133. 809.23 s > [2026-09-06 07:02:22.766] @gammaloop_api::se... INFO : Running command set model aS=0.118
  1134. 809.23 s > [2026-09-06 07:02:22.770] @gammaloop_api::se... INFO : Running command set model aEWM1=137.036
  1135. 809.23 s > [2026-09-06 07:02:22.774] @gammaloop_api::se... INFO : Running command set model Gf=1.166390e-05
  1136. 809.23 s > [2026-09-06 07:02:22.777] @gammaloop_api::se... INFO : Running command set model MZ=91.188
  1137. 809.23 s > [2026-09-06 07:02:22.782] @gammaloop_api::se... INFO : Running command set global string '
  1138. 809.23 s > [global.generation.compile]
  1139. 809.23 s > compilation_mode = "assembly"
  1140. 809.23 s > optimization_level = "O0"
  1141. 809.23 s > fast_math = false
  1142. 809.23 s > [...]
  1143. 809.23 s > [2026-09-06 07:02:22.783] @gammaloop_api::se... INFO : Running command import graphs ./examples/cli/aa_aa/1L/aa_aa_1L.dot -p aa_aa_all_helicities_assembly -i 1L_ppmm -o
  1144. 809.23 s > [2026-09-06 07:02:22.783] @commands::import INFO : Loading graphs from '/build/source/examples/cli/aa_aa/1L/aa_aa_1L.dot'
  1145. 809.23 s > [2026-09-06 07:02:22.791] @gammaloop_api::se... INFO : Running command generate existing -p aa_aa_all_helicities_assembly
  1146. 809.23 s > [2026-09-06 07:02:45.043] @processes::amplitude INFO : Compiling amplitude 1L_ppmm
  1147. 809.23 s > [2026-09-06 07:03:04.191] @commands::generate INFO : Removed 34 generated C++ source file(s). Use '--keep-sources' to keep them.
  1148. 809.23 s > [2026-09-06 07:03:04.191] @commands::generate INFO :
  1149. 809.23 s > Integrand generation summary
  1150. 809.23 s > peak RAM 2.21 GiB | cores 1
  1151. 809.23 s > ╭───────────┬───────┬─────────┬──────────────┬──────────────┬────────────────┬──────────────╮
  1152. 809.23 s > │ integrand │ graph │ # evals │ expr build │ spenso │ symbolica eval │ compile │
  1153. 809.23 s > ├───────────┼───────┼─────────┼──────────────┼──────────────┼────────────────┼──────────────┤
  1154. 809.23 s > │ 1L_ppmm │ GL0 │ 13 │ 562ms (4.0%) │ 1.51s (11%) │ 5.68s (41%) │ 6.16s (44%) │
  1155. 809.23 s > │ 1L_ppmm │ GL2 │ 13 │ 593ms (4.2%) │ 1.37s (9.6%) │ 5.34s (37%) │ 6.95s (49%) │
  1156. 809.23 s > │ 1L_ppmm │ GL4 │ 11 │ 581ms (4.4%) │ 1.35s (10%) │ 5.23s (40%) │ 6.03s (46%) │
  1157. 809.23 s > ├───────────┼───────┼─────────┼──────────────┼──────────────┼────────────────┼──────────────┤
  1158. 809.23 s > │ Total │ │ 37 │ 1.74s (4.2%) │ 4.24s (10%) │ 16.25s (39%) │ 19.14s (46%) │
  1159. 809.23 s > ╰───────────┴───────┴─────────┴──────────────┴──────────────┴────────────────┴──────────────╯
  1160. 809.23 s > [2026-09-06 07:03:04.857] @gammaloop_api::se... INFO : Running command set process -p aa_aa_all_helicities -i 1L_ppmm string '
  1161. 809.23 s > [stability]
  1162. 809.23 s > check_on_norm = true
  1163. 809.23 s > escalate_if_exact_zero = false
  1164. 809.23 s > loop_momenta_norm_escalation_factor = -1.0
  1165. 809.23 s > [...]
  1166. 809.23 s > [2026-09-06 07:03:04.857] @gammaloop_api::se... INFO : Running command set process -p aa_aa_all_helicities_assembly -i 1L_ppmm string '
  1167. 809.23 s > [stability]
  1168. 809.23 s > check_on_norm = true
  1169. 809.23 s > escalate_if_exact_zero = false
  1170. 809.23 s > loop_momenta_norm_escalation_factor = -1.0
  1171. 809.23 s > [...]
  1172. 809.23 s > [2026-09-06 07:03:04.858] @gammaloop_api::se... INFO : Running command set process -p aa_aa_all_helicities -i 1L_mpmm string '
  1173. 809.23 s > [stability]
  1174. 809.23 s > check_on_norm = true
  1175. 809.23 s > escalate_if_exact_zero = false
  1176. 809.23 s > loop_momenta_norm_escalation_factor = -1.0
  1177. 809.23 s > [...]
  1178. 809.23 s > [2026-09-06 07:03:04.859] @gammaloop_api::se... INFO : Running command set process -p aa_aa_all_helicities_assembly -i 1L_mpmm string '
  1179. 809.23 s > [stability]
  1180. 809.23 s > check_on_norm = true
  1181. 809.23 s > escalate_if_exact_zero = false
  1182. 809.23 s > loop_momenta_norm_escalation_factor = -1.0
  1183. 809.23 s > [...]
  1184. 809.23 s > [2026-09-06 07:03:04.859] @gammaloop_api::se... INFO : Running command set process -p aa_aa_all_helicities -i 1L_mmmm string '
  1185. 809.23 s > [stability]
  1186. 809.23 s > check_on_norm = true
  1187. 809.23 s > escalate_if_exact_zero = false
  1188. 809.23 s > loop_momenta_norm_escalation_factor = -1.0
  1189. 809.23 s > [...]
  1190. 809.23 s > [2026-09-06 07:03:04.860] @gammaloop_api::se... INFO : Running command set process -p aa_aa_all_helicities_assembly -i 1L_mmmm string '
  1191. 809.23 s > [stability]
  1192. 809.23 s > check_on_norm = true
  1193. 809.23 s > escalate_if_exact_zero = false
  1194. 809.23 s > loop_momenta_norm_escalation_factor = -1.0
  1195. 809.23 s > [...]
  1196. 809.23 s > [2026-09-06 07:03:04.861] @gammaloop_api::se... INFO : Running command set process -p aa_aa_all_helicities -i 1L_pmmp string '
  1197. 809.23 s > [stability]
  1198. 809.23 s > check_on_norm = true
  1199. 809.23 s > escalate_if_exact_zero = false
  1200. 809.23 s > loop_momenta_norm_escalation_factor = -1.0
  1201. 809.23 s > ... omitted 84 more lines; see full nextest output above
  1202. 809.23 s > =========================================
  1203. 809.23 s For full logs, run:
  1204. 809.23 s nix log /nix/store/3qpyi4i089mjhqx61pnq05lcl2pfrw3d-gammaloop-nextest-integration.drv
  1205. 809.36 s [0 built (1 failed), 0.0Run failed.