0.00 s
$ /nix/store/9ypz3flqsrl5xl495mm8h645gadjsxi1-coreutils-9.11/bin/timeout --kill-after=15s 7200s /nix/store/23zk8sgzamrbmj1fday15szf7f2279s8-nix-2.34.7/bin/nix --extra-experimental-features nix-command --extra-experimental-features flakes flake clone git+https://github.com/alphal00p/gammaloop --dest /tmp/nix-ci-worker/stable-pwd/repo/
0.12 s
Cloning into '/tmp/nix-ci-worker/stable-pwd/repo'...
0.82 s
remote: Enumerating objects: 78074, done.
1.05 s
remote: Counting objects: 0% (1/13896)
remote: Counting objects: 1% (139/13896)
remote: Counting objects: 2% (278/13896)
remote: Counting objects: 3% (417/13896)
remote: Counting objects: 4% (556/13896)
remote: Counting objects: 5% (695/13896)
remote: Counting objects: 6% (834/13896)
remote: Counting objects: 7% (973/13896)
remote: Counting objects: 8% (1112/13896)
remote: Counting objects: 9% (1251/13896)
remote: Counting objects: 10% (1390/13896)
remote: Counting objects: 11% (1529/13896)
remote: Counting objects: 12% (1668/13896)
remote: Counting objects: 13% (1807/13896)
remote: Counting objects: 14% (1946/13896)
remote: Counting objects: 15% (2085/13896)
remote: Counting objects: 16% (2224/13896)
remote: Counting objects: 17% (2363/13896)
remote: Counting objects: 18% (2502/13896)
remote: Counting objects: 19% (2641/13896)
remote: Counting objects: 20% (2780/13896)
remote: Counting objects: 21% (2919/13896)
remote: Counting objects: 22% (3058/13896)
remote: Counting objects: 23% (3197/13896)
remote: Counting objects: 24% (3336/13896)
remote: Counting objects: 25% (3474/13896)
remote: Counting objects: 26% (3613/13896)
remote: Counting objects: 27% (3752/13896)
remote: Counting objects: 28% (3891/13896)
remote: Counting objects: 29% (4030/13896)
remote: Counting objects: 30% (4169/13896)
remote: Counting objects: 31% (4308/13896)
remote: Counting objects: 32% (4447/13896)
remote: Counting objects: 33% (4586/13896)
remote: Counting objects: 34% (4725/13896)
remote: Counting objects: 35% (4864/13896)
remote: Counting objects: 36% (5003/13896)
remote: Counting objects: 37% (5142/13896)
remote: Counting objects: 38% (5281/13896)
remote: Counting objects: 39% (5420/13896)
remote: Counting objects: 40% (5559/13896)
remote: Counting objects: 41% (5698/13896)
remote: Counting objects: 42% (5837/13896)
remote: Counting objects: 43% (5976/13896)
remote: Counting objects: 44% (6115/13896)
remote: Counting objects: 45% (6254/13896)
remote: Counting objects: 46% (6393/13896)
remote: Counting objects: 47% (6532/13896)
remote: Counting objects: 48% (6671/13896)
remote: Counting objects: 49% (6810/13896)
remote: Counting objects: 50% (6948/13896)
remote: Counting objects: 51% (7087/13896)
remote: Counting objects: 52% (7226/13896)
remote: Counting objects: 53% (7365/13896)
remote: Counting objects: 54% (7504/13896)
remote: Counting objects: 55% (7643/13896)
remote: Counting objects: 56% (7782/13896)
remote: Counting objects: 57% (7921/13896)
remote: Counting objects: 58% (8060/13896)
remote: Counting objects: 59% (8199/13896)
remote: Counting objects: 60% (8338/13896)
remote: Counting objects: 61% (8477/13896)
remote: Counting objects: 62% (8616/13896)
remote: Counting objects: 63% (8755/13896)
remote: Counting objects: 64% (8894/13896)
remote: Counting objects: 65% (9033/13896)
remote: Counting objects: 66% (9172/13896)
remote: Counting objects: 67% (9311/13896)
remote: Counting objects: 68% (9450/13896)
remote: Counting objects: 69% (9589/13896)
remote: Counting objects: 70% (9728/13896)
remote: Counting objects: 71% (9867/13896)
remote: Counting objects: 72% (10006/13896)
remote: Counting objects: 73% (10145/13896)
remote: Counting objects: 74% (10284/13896)
remote: Counting objects: 75% (10422/13896)
remote: Counting objects: 76% (10561/13896)
remote: Counting objects: 77% (10700/13896)
remote: Counting objects: 78% (10839/13896)
remote: Counting objects: 79% (10978/13896)
remote: Counting objects: 80% (11117/13896)
remote: Counting objects: 81% (11256/13896)
remote: Counting objects: 82% (11395/13896)
remote: Counting objects: 83% (11534/13896)
remote: Counting objects: 84% (11673/13896)
remote: Counting objects: 85% (11812/13896)
remote: Counting objects: 86% (11951/13896)
remote: Counting objects: 87% (12090/13896)
remote: Counting objects: 88% (12229/13896)
remote: Counting objects: 89% (12368/13896)
remote: Counting objects: 90% (12507/13896)
remote: Counting objects: 91% (12646/13896)
remote: Counting objects: 92% (12785/13896)
remote: Counting objects: 93% (12924/13896)
remote: Counting objects: 94% (13063/13896)
remote: Counting objects: 95% (13202/13896)
remote: Counting objects: 96% (13341/13896)
remote: Counting objects: 97% (13480/13896)
remote: Counting objects: 98% (13619/13896)
remote: Counting objects: 99% (13758/13896)
remote: Counting objects: 100% (13896/13896)
remote: Counting objects: 100% (13896/13896), done.
3.75 s
remote: Compressing objects: 0% (1/3083)
remote: Compressing objects: 1% (31/3083)
remote: Compressing objects: 2% (62/3083)
remote: Compressing objects: 3% (93/3083)
remote: Compressing objects: 4% (124/3083)
remote: Compressing objects: 5% (155/3083)
remote: Compressing objects: 6% (185/3083)
remote: Compressing objects: 7% (216/3083)
remote: Compressing objects: 8% (247/3083)
remote: Compressing objects: 9% (278/3083)
remote: Compressing objects: 10% (309/3083)
remote: Compressing objects: 11% (340/3083)
remote: Compressing objects: 12% (370/3083)
remote: Compressing objects: 13% (401/3083)
remote: Compressing objects: 14% (432/3083)
remote: Compressing objects: 15% (463/3083)
remote: Compressing objects: 16% (494/3083)
remote: Compressing objects: 17% (525/3083)
remote: Compressing objects: 18% (555/3083)
remote: Compressing objects: 19% (586/3083)
remote: Compressing objects: 20% (617/3083)
remote: Compressing objects: 21% (648/3083)
remote: Compressing objects: 22% (679/3083)
remote: Compressing objects: 23% (710/3083)
remote: Compressing objects: 24% (740/3083)
remote: Compressing objects: 24% (769/3083)
remote: Compressing objects: 25% (771/3083)
remote: Compressing objects: 26% (802/3083)
remote: Compressing objects: 27% (833/3083)
remote: Compressing objects: 28% (864/3083)
remote: Compressing objects: 28% (875/3083)
remote: Compressing objects: 29% (895/3083)
remote: Compressing objects: 30% (925/3083)
remote: Compressing objects: 31% (956/3083)
remote: Compressing objects: 32% (987/3083)
remote: Compressing objects: 33% (1018/3083)
remote: Compressing objects: 34% (1049/3083)
remote: Compressing objects: 35% (1080/3083)
remote: Compressing objects: 36% (1110/3083)
remote: Compressing objects: 37% (1141/3083)
remote: Compressing objects: 38% (1172/3083)
remote: Compressing objects: 39% (1203/3083)
remote: Compressing objects: 40% (1234/3083)
remote: Compressing objects: 41% (1265/3083)
remote: Compressing objects: 42% (1295/3083)
remote: Compressing objects: 43% (1326/3083)
remote: Compressing objects: 44% (1357/3083)
remote: Compressing objects: 45% (1388/3083)
remote: Compressing objects: 46% (1419/3083)
remote: Compressing objects: 47% (1450/3083)
remote: Compressing objects: 48% (1480/3083)
remote: Compressing objects: 49% (1511/3083)
remote: Compressing objects: 50% (1542/3083)
remote: Compressing objects: 51% (1573/3083)
remote: Compressing objects: 52% (1604/3083)
remote: Compressing objects: 53% (1634/3083)
remote: Compressing objects: 54% (1665/3083)
remote: Compressing objects: 55% (1696/3083)
remote: Compressing objects: 56% (1727/3083)
remote: Compressing objects: 57% (1758/3083)
remote: Compressing objects: 58% (1789/3083)
remote: Compressing objects: 59% (1819/3083)
remote: Compressing objects: 60% (1850/3083)
remote: Compressing objects: 61% (1881/3083)
remote: Compressing objects: 62% (1912/3083)
remote: Compressing objects: 63% (1943/3083)
remote: Compressing objects: 64% (1974/3083)
remote: Compressing objects: 65% (2004/3083)
remote: Compressing objects: 66% (2035/3083)
remote: Compressing objects: 67% (2066/3083)
remote: Compressing objects: 68% (2097/3083)
remote: Compressing objects: 69% (2128/3083)
remote: Compressing objects: 70% (2159/3083)
remote: Compressing objects: 71% (2189/3083)
remote: Compressing objects: 72% (2220/3083)
remote: Compressing objects: 73% (2251/3083)
remote: Compressing objects: 74% (2282/3083)
remote: Compressing objects: 75% (2313/3083)
remote: Compressing objects: 76% (2344/3083)
remote: Compressing objects: 77% (2374/3083)
remote: Compressing objects: 78% (2405/3083)
remote: Compressing objects: 79% (2436/3083)
remote: Compressing objects: 80% (2467/3083)
remote: Compressing objects: 81% (2498/3083)
remote: Compressing objects: 82% (2529/3083)
remote: Compressing objects: 83% (2559/3083)
remote: Compressing objects: 84% (2590/3083)
remote: Compressing objects: 85% (2621/3083)
remote: Compressing objects: 86% (2652/3083)
remote: Compressing objects: 87% (2683/3083)
remote: Compressing objects: 88% (2714/3083)
remote: Compressing objects: 89% (2744/3083)
remote: Compressing objects: 90% (2775/3083)
remote: Compressing objects: 91% (2806/3083)
remote: Compressing objects: 92% (2837/3083)
remote: Compressing objects: 93% (2868/3083)
remote: Compressing objects: 94% (2899/3083)
remote: Compressing objects: 95% (2929/3083)
remote: Compressing objects: 96% (2960/3083)
remote: Compressing objects: 97% (2991/3083)
remote: Compressing objects: 98% (3022/3083)
remote: Compressing objects: 99% (3053/3083)
remote: Compressing objects: 100% (3083/3083)
remote: Compressing objects: 100% (3083/3083), done.
7.68 s
Receiving objects: 0% (1/78074)
Receiving objects: 1% (781/78074)
Receiving objects: 2% (1562/78074)
Receiving objects: 3% (2343/78074)
Receiving objects: 4% (3123/78074)
Receiving objects: 5% (3904/78074)
Receiving objects: 6% (4685/78074)
Receiving objects: 7% (5466/78074), 9.32 MiB | 18.63 MiB/s
Receiving objects: 8% (6246/78074), 9.32 MiB | 18.63 MiB/s
Receiving objects: 9% (7027/78074), 9.32 MiB | 18.63 MiB/s
Receiving objects: 10% (7808/78074), 9.32 MiB | 18.63 MiB/s
Receiving objects: 11% (8589/78074), 9.32 MiB | 18.63 MiB/s
Receiving objects: 12% (9369/78074), 9.32 MiB | 18.63 MiB/s
Receiving objects: 13% (10150/78074), 9.32 MiB | 18.63 MiB/s
Receiving objects: 14% (10931/78074), 9.32 MiB | 18.63 MiB/s
Receiving objects: 15% (11712/78074), 9.32 MiB | 18.63 MiB/s
Receiving objects: 16% (12492/78074), 9.32 MiB | 18.63 MiB/s
Receiving objects: 17% (13273/78074), 9.32 MiB | 18.63 MiB/s
Receiving objects: 18% (14054/78074), 9.32 MiB | 18.63 MiB/s
Receiving objects: 19% (14835/78074), 9.32 MiB | 18.63 MiB/s
Receiving objects: 20% (15615/78074), 9.32 MiB | 18.63 MiB/s
Receiving objects: 21% (16396/78074), 9.32 MiB | 18.63 MiB/s
Receiving objects: 22% (17177/78074), 9.32 MiB | 18.63 MiB/s
Receiving objects: 23% (17958/78074), 9.32 MiB | 18.63 MiB/s
Receiving objects: 24% (18738/78074), 9.32 MiB | 18.63 MiB/s
Receiving objects: 25% (19519/78074), 9.32 MiB | 18.63 MiB/s
Receiving objects: 26% (20300/78074), 9.32 MiB | 18.63 MiB/s
Receiving objects: 27% (21080/78074), 9.32 MiB | 18.63 MiB/s
Receiving objects: 28% (21861/78074), 9.32 MiB | 18.63 MiB/s
Receiving objects: 28% (22601/78074), 9.32 MiB | 18.63 MiB/s
Receiving objects: 29% (22642/78074), 23.14 MiB | 23.13 MiB/s
Receiving objects: 30% (23423/78074), 23.14 MiB | 23.13 MiB/s
Receiving objects: 31% (24203/78074), 23.14 MiB | 23.13 MiB/s
Receiving objects: 32% (24984/78074), 23.14 MiB | 23.13 MiB/s
Receiving objects: 33% (25765/78074), 23.14 MiB | 23.13 MiB/s
Receiving objects: 34% (26546/78074), 23.14 MiB | 23.13 MiB/s
Receiving objects: 35% (27326/78074), 23.14 MiB | 23.13 MiB/s
Receiving objects: 36% (28107/78074), 23.14 MiB | 23.13 MiB/s
Receiving objects: 37% (28888/78074), 23.14 MiB | 23.13 MiB/s
Receiving objects: 38% (29669/78074), 23.14 MiB | 23.13 MiB/s
Receiving objects: 39% (30449/78074), 23.14 MiB | 23.13 MiB/s
Receiving objects: 40% (31230/78074), 23.14 MiB | 23.13 MiB/s
Receiving objects: 41% (32011/78074), 23.14 MiB | 23.13 MiB/s
Receiving objects: 42% (32792/78074), 23.14 MiB | 23.13 MiB/s
Receiving objects: 43% (33572/78074), 23.14 MiB | 23.13 MiB/s
Receiving objects: 44% (34353/78074), 23.14 MiB | 23.13 MiB/s
Receiving objects: 45% (35134/78074), 23.14 MiB | 23.13 MiB/s
Receiving objects: 46% (35915/78074), 23.14 MiB | 23.13 MiB/s
Receiving objects: 47% (36695/78074), 23.14 MiB | 23.13 MiB/s
Receiving objects: 48% (37476/78074), 23.14 MiB | 23.13 MiB/s
Receiving objects: 49% (38257/78074), 23.14 MiB | 23.13 MiB/s
Receiving objects: 50% (39037/78074), 43.20 MiB | 28.70 MiB/s
Receiving objects: 51% (39818/78074), 43.20 MiB | 28.70 MiB/s
Receiving objects: 52% (40599/78074), 43.20 MiB | 28.70 MiB/s
Receiving objects: 53% (41380/78074), 43.20 MiB | 28.70 MiB/s
Receiving objects: 54% (42160/78074), 43.20 MiB | 28.70 MiB/s
Receiving objects: 55% (42941/78074), 43.20 MiB | 28.70 MiB/s
Receiving objects: 56% (43722/78074), 43.20 MiB | 28.70 MiB/s
Receiving objects: 57% (44503/78074), 43.20 MiB | 28.70 MiB/s
Receiving objects: 58% (45283/78074), 43.20 MiB | 28.70 MiB/s
Receiving objects: 59% (46064/78074), 43.20 MiB | 28.70 MiB/s
Receiving objects: 60% (46845/78074), 43.20 MiB | 28.70 MiB/s
Receiving objects: 60% (47292/78074), 59.71 MiB | 29.51 MiB/s
Receiving objects: 61% (47626/78074), 59.71 MiB | 29.51 MiB/s
Receiving objects: 62% (48406/78074), 59.71 MiB | 29.51 MiB/s
Receiving objects: 63% (49187/78074), 59.71 MiB | 29.51 MiB/s
Receiving objects: 64% (49968/78074), 59.71 MiB | 29.51 MiB/s
Receiving objects: 65% (50749/78074), 59.71 MiB | 29.51 MiB/s
Receiving objects: 66% (51529/78074), 59.71 MiB | 29.51 MiB/s
Receiving objects: 67% (52310/78074), 59.71 MiB | 29.51 MiB/s
Receiving objects: 68% (53091/78074), 75.40 MiB | 29.83 MiB/s
Receiving objects: 69% (53872/78074), 75.40 MiB | 29.83 MiB/s
Receiving objects: 70% (54652/78074), 75.40 MiB | 29.83 MiB/s
Receiving objects: 71% (55433/78074), 75.40 MiB | 29.83 MiB/s
Receiving objects: 72% (56214/78074), 75.40 MiB | 29.83 MiB/s
Receiving objects: 73% (56995/78074), 75.40 MiB | 29.83 MiB/s
Receiving objects: 74% (57775/78074), 75.40 MiB | 29.83 MiB/s
Receiving objects: 75% (58556/78074), 75.40 MiB | 29.83 MiB/s
Receiving objects: 76% (59337/78074), 75.40 MiB | 29.83 MiB/s
Receiving objects: 77% (60117/78074), 75.40 MiB | 29.83 MiB/s
Receiving objects: 77% (60793/78074), 75.40 MiB | 29.83 MiB/s
Receiving objects: 78% (60898/78074), 75.40 MiB | 29.83 MiB/s
Receiving objects: 79% (61679/78074), 91.86 MiB | 30.34 MiB/s
Receiving objects: 80% (62460/78074), 91.86 MiB | 30.34 MiB/s
Receiving objects: 81% (63240/78074), 91.86 MiB | 30.34 MiB/s
Receiving objects: 82% (64021/78074), 108.12 MiB | 30.60 MiB/s
Receiving objects: 83% (64802/78074), 108.12 MiB | 30.60 MiB/s
Receiving objects: 84% (65583/78074), 108.12 MiB | 30.60 MiB/s
Receiving objects: 85% (66363/78074), 108.12 MiB | 30.60 MiB/s
Receiving objects: 86% (67144/78074), 108.12 MiB | 30.60 MiB/s
Receiving objects: 87% (67925/78074), 108.12 MiB | 30.60 MiB/s
Receiving objects: 88% (68706/78074), 108.12 MiB | 30.60 MiB/s
Receiving objects: 89% (69486/78074), 108.12 MiB | 30.60 MiB/s
Receiving objects: 90% (70267/78074), 108.12 MiB | 30.60 MiB/s
Receiving objects: 91% (71048/78074), 108.12 MiB | 30.60 MiB/s
Receiving objects: 92% (71829/78074), 108.12 MiB | 30.60 MiB/s
Receiving objects: 93% (72609/78074), 108.12 MiB | 30.60 MiB/s
Receiving objects: 94% (73390/78074), 108.12 MiB | 30.60 MiB/s
Receiving objects: 95% (74171/78074), 108.12 MiB | 30.60 MiB/s
Receiving objects: 96% (74952/78074), 108.12 MiB | 30.60 MiB/s
Receiving objects: 97% (75732/78074), 108.12 MiB | 30.60 MiB/s
Receiving objects: 98% (76513/78074), 108.12 MiB | 30.60 MiB/s
Receiving objects: 99% (77294/78074), 108.12 MiB | 30.60 MiB/s
remote: Total 78074 (delta 9798), reused 11670 (delta 8716), pack-reused 64178 (from 2)
7.68 s
Receiving objects: 100% (78074/78074), 108.12 MiB | 30.60 MiB/s
Receiving objects: 100% (78074/78074), 120.78 MiB | 30.70 MiB/s, done.
9.10 s
Resolving deltas: 0% (0/53117)
Resolving deltas: 1% (532/53117)
Resolving deltas: 2% (1063/53117)
Resolving deltas: 3% (1594/53117)
Resolving deltas: 4% (2126/53117)
Resolving deltas: 5% (2656/53117)
Resolving deltas: 6% (3188/53117)
Resolving deltas: 7% (3719/53117)
Resolving deltas: 8% (4250/53117)
Resolving deltas: 9% (4781/53117)
Resolving deltas: 10% (5312/53117)
Resolving deltas: 11% (5844/53117)
Resolving deltas: 12% (6375/53117)
Resolving deltas: 13% (6906/53117)
Resolving deltas: 14% (7439/53117)
Resolving deltas: 15% (7968/53117)
Resolving deltas: 16% (8499/53117)
Resolving deltas: 17% (9031/53117)
Resolving deltas: 18% (9563/53117)
Resolving deltas: 19% (10093/53117)
Resolving deltas: 20% (10624/53117)
Resolving deltas: 21% (11155/53117)
Resolving deltas: 22% (11687/53117)
Resolving deltas: 23% (12217/53117)
Resolving deltas: 24% (12749/53117)
Resolving deltas: 25% (13280/53117)
Resolving deltas: 26% (13811/53117)
Resolving deltas: 27% (14342/53117)
Resolving deltas: 28% (14873/53117)
Resolving deltas: 29% (15404/53117)
Resolving deltas: 30% (15937/53117)
Resolving deltas: 31% (16467/53117)
Resolving deltas: 32% (16998/53117)
Resolving deltas: 33% (17529/53117)
Resolving deltas: 34% (18060/53117)
Resolving deltas: 35% (18591/53117)
Resolving deltas: 36% (19123/53117)
Resolving deltas: 37% (19657/53117)
Resolving deltas: 38% (20185/53117)
Resolving deltas: 39% (20716/53117)
Resolving deltas: 40% (21247/53117)
Resolving deltas: 41% (21778/53117)
Resolving deltas: 42% (22310/53117)
Resolving deltas: 43% (22841/53117)
Resolving deltas: 44% (23372/53117)
Resolving deltas: 45% (23903/53117)
Resolving deltas: 46% (24434/53117)
Resolving deltas: 47% (24965/53117)
Resolving deltas: 48% (25498/53117)
Resolving deltas: 49% (26028/53117)
Resolving deltas: 50% (26559/53117)
Resolving deltas: 51% (27090/53117)
Resolving deltas: 52% (27621/53117)
Resolving deltas: 53% (28153/53117)
Resolving deltas: 54% (28685/53117)
Resolving deltas: 55% (29216/53117)
Resolving deltas: 56% (29746/53117)
Resolving deltas: 57% (30277/53117)
Resolving deltas: 58% (30808/53117)
Resolving deltas: 59% (31340/53117)
Resolving deltas: 60% (31871/53117)
Resolving deltas: 61% (32402/53117)
Resolving deltas: 62% (32934/53117)
Resolving deltas: 63% (33464/53117)
Resolving deltas: 64% (33995/53117)
Resolving deltas: 65% (34527/53117)
Resolving deltas: 66% (35058/53117)
Resolving deltas: 67% (35589/53117)
Resolving deltas: 68% (36120/53117)
Resolving deltas: 69% (36651/53117)
Resolving deltas: 70% (37182/53117)
Resolving deltas: 71% (37714/53117)
Resolving deltas: 72% (38245/53117)
Resolving deltas: 73% (38777/53117)
Resolving deltas: 73% (39267/53117)
Resolving deltas: 74% (39307/53117)
Resolving deltas: 75% (39838/53117)
Resolving deltas: 76% (40369/53117)
Resolving deltas: 77% (40903/53117)
Resolving deltas: 78% (41432/53117)
Resolving deltas: 79% (41963/53117)
Resolving deltas: 80% (42494/53117)
Resolving deltas: 81% (43026/53117)
Resolving deltas: 82% (43556/53117)
Resolving deltas: 83% (44089/53117)
Resolving deltas: 84% (44619/53117)
Resolving deltas: 85% (45150/53117)
Resolving deltas: 86% (45681/53117)
Resolving deltas: 87% (46212/53117)
Resolving deltas: 88% (46743/53117)
Resolving deltas: 89% (47276/53117)
Resolving deltas: 90% (47806/53117)
Resolving deltas: 91% (48337/53117)
Resolving deltas: 92% (48868/53117)
Resolving deltas: 93% (49399/53117)
Resolving deltas: 94% (49930/53117)
Resolving deltas: 95% (50462/53117)
Resolving deltas: 96% (50994/53117)
Resolving deltas: 97% (51524/53117)
Resolving deltas: 98% (52055/53117)
Resolving deltas: 99% (52586/53117)
Resolving deltas: 100% (53117/53117)
Resolving deltas: 100% (53117/53117), done.
9.68 s
Fetching commit d3dd17d9365e2ca30d668d40432f3a1d094af28e for raised_energy_cff_wip ...
9.68 s
$ /nix/store/bcnisk3ydfgv26v2gw3zlky24g00yww2-git-2.54.0/bin/git fetch origin d3dd17d9365e2ca30d668d40432f3a1d094af28e
10.13 s
From https://github.com/alphal00p/gammaloop
10.13 s
* branch d3dd17d9365e2ca30d668d40432f3a1d094af28e -> FETCH_HEAD
10.15 s
$ /nix/store/9ypz3flqsrl5xl495mm8h645gadjsxi1-coreutils-9.11/bin/timeout --kill-after=15s 7200s /nix/store/bcnisk3ydfgv26v2gw3zlky24g00yww2-git-2.54.0/bin/git -c advice.detachedHead=false checkout d3dd17d9365e2ca30d668d40432f3a1d094af28e
10.48 s
HEAD is now at d3dd17d93 stream lower-sector CFF component products
10.48 s
$ /nix/store/9ypz3flqsrl5xl495mm8h645gadjsxi1-coreutils-9.11/bin/timeout --kill-after=15s 7200s /nix/store/23zk8sgzamrbmj1fday15szf7f2279s8-nix-2.34.7/bin/nix --extra-experimental-features nix-command --extra-experimental-features flakes --log-format internal-json run .#packages.x86_64-linux.nix-ci-check-gammaloop-nextest-integration --print-build-logs
16.63 s
23.70 s
evaluating derivation 'g
copying '/nix/store/jc0j
evaluating derivation 'g
copying '/nix/store/jc0j
evaluating derivation 'g
copying '/nix/store/jc0j
evaluating derivation 'g
copying '/nix/store/jc0j
evaluating derivation 'g
copying '/nix/store/jc0j
evaluating derivation 'g
copying '/nix/store/jc0j
evaluating derivation 'g
querying gammaloop-nexte
[0.0 KiB DL] querying in
[0 /1 built, 0.0 KiB DL]
[1 /0 /1 built, 0.0 KiB DLgammaloop-nextest-integration> Extracting 13 binaries, 1 build script output directory, and 3 linked paths to /build/nextest-archive-NQT8UU
27.72 s
gammaloop-nextest-integration> Extracted 30 files to /build/nextest-archive-NQT8UU in 4.02s
27.75 s
gammaloop-nextest-integration> ------------
27.75 s
gammaloop-nextest-integration> Nextest run ID 6aed0418-7abc-45b2-8ea8-4c0f1aa68250 with nextest profile: ci_gammaloop
27.75 s
gammaloop-nextest-integration> Starting 152 tests across 13 binaries (208 tests skipped , including 207 tests via profile.ci_gammaloop.default-filter )
446.21 s
gammaloop-nextest-integration> FAIL [ 69.376s] ( 54/152) gammaloop-integration-tests::test_runs aa_aa::important :: aa_aa_local_inspect_backend_consistency
446.21 s
gammaloop-nextest-integration> stdout ---
446.21 s
gammaloop-nextest-integration>
446.21 s
gammaloop-nextest-integration> running 1 test
446.21 s
gammaloop-nextest-integration> test aa_aa::important::aa_aa_local_inspect_backend_consistency has been running for over 60 seconds
446.21 s
gammaloop-nextest-integration> test aa_aa::important::aa_aa_local_inspect_backend_consistency ... FAILED
446.21 s
gammaloop-nextest-integration>
446.21 s
gammaloop-nextest-integration> failures:
446.21 s
gammaloop-nextest-integration>
446.21 s
gammaloop-nextest-integration> failures:
446.21 s
gammaloop-nextest-integration> aa_aa::important::aa_aa_local_inspect_backend_consistency
446.21 s
gammaloop-nextest-integration>
446.21 s
gammaloop-nextest-integration> test result: FAILED. 0 passed; 1 failed; 0 ignored; 0 measured; 258 filtered out; finished in 69.15s
446.21 s
gammaloop-nextest-integration>
446.21 s
gammaloop-nextest-integration> stderr ---
446.21 s
gammaloop-nextest-integration> [2026-09-06 07:16:27.882] @gammaloop_api::se... INFO : Running command import model sm-default.json
446.21 s
gammaloop-nextest-integration> [2026-09-06 07:16:27.882] @import::model INFO : Loading built-in JSON model sm-default
446.21 s
gammaloop-nextest-integration> [2026-09-06 07:16:27.903] @gammalooprs::model INFO : The following 11 external parameters were forced to zero by the restriction card:
446.21 s
gammaloop-nextest-integration> lamWS, AWS, rhoWS, etaWS, ymc, yme, ymm, MC, Me, MM, WTau
446.21 s
gammaloop-nextest-integration> [2026-09-06 07:16:27.903] @gammalooprs::model INFO : The following 34 vertex rules were removed by the restriction card:
446.21 s
gammaloop-nextest-integration> V_82 -> (c~, d, G+) | V_83 -> (t~, d, G+) | V_84 -> (c~, s, G+) | V_85 -> (t~, s, G+) | V_86 -> (u~, b, G+) | V_87 -> (c~, b, G+) | V_90 -> (c~, d, W+) | V_91 -> (t~, d, W+) | V_92 -> (u~, s, W+) | V_94 -> (t~, s, W+) | V_95 -> (u~, b, W+) | V_96 -> (c~, b, W+) | V_101 -> (e+, e-, G0) | V_102 -> (mu+, mu-, G0) | V_104 -> (e+, e-, H) | V_105 -> (mu+, mu-, H) | V_110 -> (ve~, e-, G+) | V_111 -> (vm~, mu-, G+) | V_116 -> (b~, u, G-) | V_117 -> (d~, c, G-) | V_118 -> (s~, c, G-) | V_119 -> (b~, c, G-) | V_120 -> (d~, t, G-) | V_121 -> (s~, t, G-) | V_124 -> (s~, u, W-) | V_125 -> (b~, u, W-) | V_126 -> (d~, c, W-) | V_128 -> (b~, c, W-) | V_129 -> (d~, t, W-) | V_130 -> (s~, t, W-) | V_138 -> (c~, c, G0) | V_140 -> (c~, c, H) | V_145 -> (e+, ve, G-) | V_146 -> (mu+, vm, G-)
446.21 s
gammaloop-nextest-integration> [2026-09-06 07:16:27.903] @gammalooprs::model INFO : The following 36 couplings were removed by the restriction card:
446.21 s
gammaloop-nextest-integration> GC_13, GC_14, GC_16, GC_17, GC_18, GC_19, GC_20, GC_22, GC_23, GC_24, GC_25, GC_26, GC_28, GC_29, GC_42, GC_43, GC_44, GC_46, GC_47, GC_48, GC_84, GC_85, GC_86, GC_87, GC_88, GC_89, GC_90, GC_91, GC_92, GC_93, GC_101, GC_102, GC_103, GC_105, GC_106, GC_107
446.21 s
gammaloop-nextest-integration> [2026-09-06 07:16:27.903] @gammaloop_api::se... INFO : Running command run set_model_parameters
446.21 s
gammaloop-nextest-integration> [2026-09-06 07:16:27.903] @gammaloop_api::se... INFO : Starting command block set_model_parameters
446.21 s
gammaloop-nextest-integration> [2026-09-06 07:16:27.904] @gammaloop_api::se... INFO : Running command set model MT=173.0
446.21 s
gammaloop-nextest-integration> [2026-09-06 07:16:27.908] @gammaloop_api::se... INFO : Running command set model WT=0.0
446.21 s
gammaloop-nextest-integration> [2026-09-06 07:16:27.911] @gammaloop_api::se... INFO : Running command set model ymt=173.0
446.21 s
gammaloop-nextest-integration> [2026-09-06 07:16:27.915] @gammaloop_api::se... INFO : Running command set model aS=0.118
446.21 s
gammaloop-nextest-integration> [2026-09-06 07:16:27.919] @gammaloop_api::se... INFO : Running command set model aEWM1=137.036
446.21 s
gammaloop-nextest-integration> [2026-09-06 07:16:27.922] @gammaloop_api::se... INFO : Running command set model Gf=1.166390e-05
446.21 s
gammaloop-nextest-integration> [2026-09-06 07:16:27.926] @gammaloop_api::se... INFO : Running command set model MZ=91.188
446.21 s
gammaloop-nextest-integration> [2026-09-06 07:16:27.930] @gammaloop_api::se... INFO : Running command set global string '
446.21 s
gammaloop-nextest-integration> [global.generation.compile]
446.21 s
gammaloop-nextest-integration> compilation_mode = "symjit"
446.21 s
gammaloop-nextest-integration> optimization_level = "O0"
446.21 s
gammaloop-nextest-integration> fast_math = false
446.21 s
gammaloop-nextest-integration> [...]
446.21 s
gammaloop-nextest-integration> [2026-09-06 07:16:27.930] @gammaloop_api::se... INFO : Running command import graphs ./examples/cli/aa_aa/1L/aa_aa_1L.dot -p aa_aa_all_helicities -i 1L_ppmm -o
446.21 s
gammaloop-nextest-integration> [2026-09-06 07:16:27.930] @commands::import INFO : Loading graphs from '/build/source/examples/cli/aa_aa/1L/aa_aa_1L.dot'
446.21 s
gammaloop-nextest-integration> [2026-09-06 07:16:27.939] @gammaloop_api::se... INFO : Running command generate existing -p aa_aa_all_helicities
446.21 s
gammaloop-nextest-integration> [2026-09-06 07:16:53.477] @commands::generate INFO :
446.21 s
gammaloop-nextest-integration> Integrand generation summary
446.21 s
gammaloop-nextest-integration> peak RAM 1.06 GiB | cores 1
446.21 s
gammaloop-nextest-integration> ╭───────────┬───────┬─────────┬──────────────┬─────────────┬────────────────┬──────────────╮
446.21 s
gammaloop-nextest-integration> │ integrand │ graph │ # evals │ expr build │ spenso │ symbolica eval │ compile │
446.21 s
gammaloop-nextest-integration> ├───────────┼───────┼─────────┼──────────────┼─────────────┼────────────────┼──────────────┤
446.21 s
gammaloop-nextest-integration> │ 1L_ppmm │ GL0 │ 13 │ 544ms (6.2% ) │ 1.76s (20% ) │ 5.63s (64% ) │ 844ms (9.6% ) │
446.21 s
gammaloop-nextest-integration> │ 1L_ppmm │ GL2 │ 13 │ 545ms (6.4% ) │ 1.46s (17% ) │ 5.67s (67% ) │ 802ms (9.5% ) │
446.21 s
gammaloop-nextest-integration> │ 1L_ppmm │ GL4 │ 11 │ 533ms (6.5% ) │ 1.40s (17% ) │ 5.49s (67% ) │ 796ms (9.7% ) │
446.21 s
gammaloop-nextest-integration> ├───────────┼───────┼─────────┼──────────────┼─────────────┼────────────────┼──────────────┤
446.21 s
gammaloop-nextest-integration> │ Total │ │ 37 │ 1.62s (6.4% ) │ 4.62s (18% ) │ 16.79s (66% ) │ 2.44s (9.6% ) │
446.21 s
gammaloop-nextest-integration> ╰───────────┴───────┴─────────┴──────────────┴─────────────┴────────────────┴──────────────╯
446.21 s
gammaloop-nextest-integration> [2026-09-06 07:16:54.136] @gammaloop_api::se... INFO : Running command import model sm-default.json
446.21 s
gammaloop-nextest-integration> [2026-09-06 07:16:54.136] @import::model INFO : Loading built-in JSON model sm-default
446.21 s
gammaloop-nextest-integration> [2026-09-06 07:16:54.155] @gammalooprs::model INFO : The following 11 external parameters were forced to zero by the restriction card:
446.21 s
gammaloop-nextest-integration> lamWS, AWS, rhoWS, etaWS, ymc, yme, ymm, MC, Me, MM, WTau
446.21 s
gammaloop-nextest-integration> [2026-09-06 07:16:54.155] @gammalooprs::model INFO : The following 34 vertex rules were removed by the restriction card:
446.21 s
gammaloop-nextest-integration> V_82 -> (c~, d, G+) | V_83 -> (t~, d, G+) | V_84 -> (c~, s, G+) | V_85 -> (t~, s, G+) | V_86 -> (u~, b, G+) | V_87 -> (c~, b, G+) | V_90 -> (c~, d, W+) | V_91 -> (t~, d, W+) | V_92 -> (u~, s, W+) | V_94 -> (t~, s, W+) | V_95 -> (u~, b, W+) | V_96 -> (c~, b, W+) | V_101 -> (e+, e-, G0) | V_102 -> (mu+, mu-, G0) | V_104 -> (e+, e-, H) | V_105 -> (mu+, mu-, H) | V_110 -> (ve~, e-, G+) | V_111 -> (vm~, mu-, G+) | V_116 -> (b~, u, G-) | V_117 -> (d~, c, G-) | V_118 -> (s~, c, G-) | V_119 -> (b~, c, G-) | V_120 -> (d~, t, G-) | V_121 -> (s~, t, G-) | V_124 -> (s~, u, W-) | V_125 -> (b~, u, W-) | V_126 -> (d~, c, W-) | V_128 -> (b~, c, W-) | V_129 -> (d~, t, W-) | V_130 -> (s~, t, W-) | V_138 -> (c~, c, G0) | V_140 -> (c~, c, H) | V_145 -> (e+, ve, G-) | V_146 -> (mu+, vm, G-)
446.21 s
gammaloop-nextest-integration> [2026-09-06 07:16:54.155] @gammalooprs::model INFO : The following 36 couplings were removed by the restriction card:
446.22 s
gammaloop-nextest-integration> GC_13, GC_14, GC_16, GC_17, GC_18, GC_19, GC_20, GC_22, GC_23, GC_24, GC_25, GC_26, GC_28, GC_29, GC_42, GC_43, GC_44, GC_46, GC_47, GC_48, GC_84, GC_85, GC_86, GC_87, GC_88, GC_89, GC_90, GC_91, GC_92, GC_93, GC_101, GC_102, GC_103, GC_105, GC_106, GC_107
446.22 s
gammaloop-nextest-integration> [2026-09-06 07:16:54.155] @gammaloop_api::se... INFO : Running command run set_model_parameters
446.22 s
gammaloop-nextest-integration> [2026-09-06 07:16:54.155] @gammaloop_api::se... INFO : Starting command block set_model_parameters
446.22 s
gammaloop-nextest-integration> [2026-09-06 07:16:54.156] @gammaloop_api::se... INFO : Running command set model MT=173.0
446.22 s
gammaloop-nextest-integration> [2026-09-06 07:16:54.159] @gammaloop_api::se... INFO : Running command set model WT=0.0
446.22 s
gammaloop-nextest-integration> [2026-09-06 07:16:54.162] @gammaloop_api::se... INFO : Running command set model ymt=173.0
446.22 s
gammaloop-nextest-integration> [2026-09-06 07:16:54.165] @gammaloop_api::se... INFO : Running command set model aS=0.118
446.22 s
gammaloop-nextest-integration> [2026-09-06 07:16:54.169] @gammaloop_api::se... INFO : Running command set model aEWM1=137.036
446.22 s
gammaloop-nextest-integration> [2026-09-06 07:16:54.172] @gammaloop_api::se... INFO : Running command set model Gf=1.166390e-05
446.22 s
gammaloop-nextest-integration> [2026-09-06 07:16:54.175] @gammaloop_api::se... INFO : Running command set model MZ=91.188
446.22 s
gammaloop-nextest-integration> [2026-09-06 07:16:54.179] @gammaloop_api::se... INFO : Running command set global string '
446.22 s
gammaloop-nextest-integration> [global.generation.compile]
446.22 s
gammaloop-nextest-integration> compilation_mode = "assembly"
446.22 s
gammaloop-nextest-integration> optimization_level = "O0"
446.22 s
gammaloop-nextest-integration> fast_math = false
446.22 s
gammaloop-nextest-integration> [...]
446.22 s
gammaloop-nextest-integration> [2026-09-06 07:16:54.180] @gammaloop_api::se... INFO : Running command import graphs ./examples/cli/aa_aa/1L/aa_aa_1L.dot -p aa_aa_all_helicities_assembly -i 1L_ppmm -o
446.22 s
gammaloop-nextest-integration> [2026-09-06 07:16:54.180] @commands::import INFO : Loading graphs from '/build/source/examples/cli/aa_aa/1L/aa_aa_1L.dot'
446.22 s
gammaloop-nextest-integration> [2026-09-06 07:16:54.187] @gammaloop_api::se... INFO : Running command generate existing -p aa_aa_all_helicities_assembly
446.22 s
gammaloop-nextest-integration> [2026-09-06 07:17:16.399] @processes::amplitude INFO : Compiling amplitude 1L_ppmm
446.22 s
gammaloop-nextest-integration> [2026-09-06 07:17:35.501] @commands::generate INFO : Removed 34 generated C++ source file(s). Use '--keep-sources ' to keep them.
446.22 s
gammaloop-nextest-integration> [2026-09-06 07:17:35.501] @commands::generate INFO :
446.22 s
gammaloop-nextest-integration> Integrand generation summary
446.22 s
gammaloop-nextest-integration> peak RAM 2.20 GiB | cores 1
446.22 s
gammaloop-nextest-integration> ╭───────────┬───────┬─────────┬──────────────┬──────────────┬────────────────┬──────────────╮
446.22 s
gammaloop-nextest-integration> │ integrand │ graph │ # evals │ expr build │ spenso │ symbolica eval │ compile │
446.22 s
gammaloop-nextest-integration> ├───────────┼───────┼─────────┼──────────────┼──────────────┼────────────────┼──────────────┤
446.22 s
gammaloop-nextest-integration> │ 1L_ppmm │ GL0 │ 13 │ 500ms (3.6% ) │ 1.39s (10% ) │ 5.50s (40% ) │ 6.41s (46% ) │
446.22 s
gammaloop-nextest-integration> │ 1L_ppmm │ GL2 │ 13 │ 493ms (3.5% ) │ 1.41s (9.9% ) │ 5.58s (39% ) │ 6.80s (48% ) │
446.22 s
gammaloop-nextest-integration> │ 1L_ppmm │ GL4 │ 11 │ 485ms (3.7% ) │ 1.40s (11% ) │ 5.44s (41% ) │ 5.88s (45% ) │
446.22 s
gammaloop-nextest-integration> ├───────────┼───────┼─────────┼──────────────┼──────────────┼────────────────┼──────────────┤
446.22 s
gammaloop-nextest-integration> │ Total │ │ 37 │ 1.48s (3.6% ) │ 4.20s (10% ) │ 16.52s (40% ) │ 19.09s (46% ) │
446.22 s
gammaloop-nextest-integration> ╰───────────┴───────┴─────────┴──────────────┴──────────────┴────────────────┴──────────────╯
446.22 s
gammaloop-nextest-integration> [2026-09-06 07:17:36.385] @gammaloop_api::se... INFO : Running command set process -p aa_aa_all_helicities -i 1L_ppmm string '
446.22 s
gammaloop-nextest-integration> [stability]
446.22 s
gammaloop-nextest-integration> check_on_norm = true
446.22 s
gammaloop-nextest-integration> escalate_if_exact_zero = false
446.22 s
gammaloop-nextest-integration> loop_momenta_norm_escalation_factor = -1.0
446.22 s
gammaloop-nextest-integration> [...]
446.22 s
gammaloop-nextest-integration> [2026-09-06 07:17:36.386] @gammaloop_api::se... INFO : Running command set process -p aa_aa_all_helicities_assembly -i 1L_ppmm string '
446.22 s
gammaloop-nextest-integration> [stability]
446.22 s
gammaloop-nextest-integration> check_on_norm = true
446.22 s
gammaloop-nextest-integration> escalate_if_exact_zero = false
446.22 s
gammaloop-nextest-integration> loop_momenta_norm_escalation_factor = -1.0
446.22 s
gammaloop-nextest-integration> [...]
446.22 s
gammaloop-nextest-integration> [2026-09-06 07:17:36.387] @gammaloop_api::se... INFO : Running command set process -p aa_aa_all_helicities -i 1L_mpmm string '
446.22 s
gammaloop-nextest-integration> [stability]
446.22 s
gammaloop-nextest-integration> check_on_norm = true
446.22 s
gammaloop-nextest-integration> escalate_if_exact_zero = false
446.22 s
gammaloop-nextest-integration> loop_momenta_norm_escalation_factor = -1.0
446.22 s
gammaloop-nextest-integration> [...]
446.22 s
gammaloop-nextest-integration> [2026-09-06 07:17:36.388] @gammaloop_api::se... INFO : Running command set process -p aa_aa_all_helicities_assembly -i 1L_mpmm string '
446.22 s
gammaloop-nextest-integration> [stability]
446.22 s
gammaloop-nextest-integration> check_on_norm = true
446.22 s
gammaloop-nextest-integration> escalate_if_exact_zero = false
446.22 s
gammaloop-nextest-integration> loop_momenta_norm_escalation_factor = -1.0
446.22 s
gammaloop-nextest-integration> [...]
446.22 s
gammaloop-nextest-integration> [2026-09-06 07:17:36.389] @gammaloop_api::se... INFO : Running command set process -p aa_aa_all_helicities -i 1L_mmmm string '
446.22 s
gammaloop-nextest-integration> [stability]
446.22 s
gammaloop-nextest-integration> check_on_norm = true
446.22 s
gammaloop-nextest-integration> escalate_if_exact_zero = false
446.22 s
gammaloop-nextest-integration> loop_momenta_norm_escalation_factor = -1.0
446.22 s
gammaloop-nextest-integration> [...]
446.22 s
gammaloop-nextest-integration> [2026-09-06 07:17:36.390] @gammaloop_api::se... INFO : Running command set process -p aa_aa_all_helicities_assembly -i 1L_mmmm string '
446.22 s
gammaloop-nextest-integration> [stability]
446.22 s
gammaloop-nextest-integration> check_on_norm = true
446.22 s
gammaloop-nextest-integration> escalate_if_exact_zero = false
446.22 s
gammaloop-nextest-integration> loop_momenta_norm_escalation_factor = -1.0
446.22 s
gammaloop-nextest-integration> [...]
446.22 s
gammaloop-nextest-integration> [2026-09-06 07:17:36.391] @gammaloop_api::se... INFO : Running command set process -p aa_aa_all_helicities -i 1L_pmmp string '
446.22 s
gammaloop-nextest-integration> [stability]
446.22 s
gammaloop-nextest-integration> check_on_norm = true
446.22 s
gammaloop-nextest-integration> escalate_if_exact_zero = false
446.22 s
gammaloop-nextest-integration> loop_momenta_norm_escalation_factor = -1.0
446.22 s
gammaloop-nextest-integration> [...]
446.22 s
gammaloop-nextest-integration> [2026-09-06 07:17:36.392] @gammaloop_api::se... INFO : Running command set process -p aa_aa_all_helicities_assembly -i 1L_pmmp string '
446.22 s
gammaloop-nextest-integration> [stability]
446.22 s
gammaloop-nextest-integration> check_on_norm = true
446.22 s
gammaloop-nextest-integration> escalate_if_exact_zero = false
446.22 s
gammaloop-nextest-integration> loop_momenta_norm_escalation_factor = -1.0
446.22 s
gammaloop-nextest-integration> [...]
446.22 s
gammaloop-nextest-integration> [2026-09-06 07:17:36.393] @gammaloop_api::se... INFO : Running command set process -p aa_aa_all_helicities -i 1L_pmpm string '
446.22 s
gammaloop-nextest-integration> [stability]
446.22 s
gammaloop-nextest-integration> check_on_norm = true
446.22 s
gammaloop-nextest-integration> escalate_if_exact_zero = false
446.22 s
gammaloop-nextest-integration> loop_momenta_norm_escalation_factor = -1.0
446.22 s
gammaloop-nextest-integration> [...]
446.22 s
gammaloop-nextest-integration> [2026-09-06 07:17:36.394] @gammaloop_api::se... INFO : Running command set process -p aa_aa_all_helicities_assembly -i 1L_pmpm string '
446.22 s
gammaloop-nextest-integration> [stability]
446.22 s
gammaloop-nextest-integration> check_on_norm = true
446.22 s
gammaloop-nextest-integration> escalate_if_exact_zero = false
446.22 s
gammaloop-nextest-integration> loop_momenta_norm_escalation_factor = -1.0
446.22 s
gammaloop-nextest-integration> [...]
446.22 s
gammaloop-nextest-integration> [2026-09-06 07:17:36.402] @process::amplitude INFO : Input is below threshold: 0 existing threshold E-surfaces across 0/1 graph groups
446.22 s
gammaloop-nextest-integration> [2026-09-06 07:17:36.402] @process::amplitude INFO : overlap structure of group 0: [0: []]
446.22 s
gammaloop-nextest-integration> [2026-09-06 07:17:36.402] @integrands::process [{#im_is_nan, #re_is_nan}] WARNING : final process evaluation is nonfinite
446.22 s
gammaloop-nextest-integration> [2026-09-06 07:17:36.402] @commands::inspect INFO :
446.22 s
gammaloop-nextest-integration> Input point in momentum space:
446.22 s
gammaloop-nextest-integration>
446.22 s
gammaloop-nextest-integration> ( 0.1100000000000000, -0.0700000000000000, 0.1900000000000000 )
446.22 s
gammaloop-nextest-integration>
446.22 s
gammaloop-nextest-integration> The evaluation of integrand '1L_ppmm' is:
446.22 s
gammaloop-nextest-integration>
446.22 s
gammaloop-nextest-integration> ( +0.0000000000000000e0, +0.0000000000000000e0 i)
446.22 s
gammaloop-nextest-integration>
446.22 s
gammaloop-nextest-integration> [2026-09-06 07:17:36.408] @process::amplitude INFO : Input is below threshold: 0 existing threshold E-surfaces across 0/1 graph groups
446.22 s
gammaloop-nextest-integration> [2026-09-06 07:17:36.408] @process::amplitude INFO : overlap structure of group 0: [0: []]
446.22 s
gammaloop-nextest-integration> [2026-09-06 07:17:36.409] @commands::inspect INFO :
446.22 s
gammaloop-nextest-integration> Input point in momentum space:
446.22 s
gammaloop-nextest-integration>
446.22 s
gammaloop-nextest-integration> ( 0.1100000000000000, -0.0700000000000000, 0.1900000000000000 )
446.22 s
gammaloop-nextest-integration>
446.22 s
gammaloop-nextest-integration> The evaluation of integrand '1L_ppmm' is:
446.22 s
gammaloop-nextest-integration>
446.22 s
gammaloop-nextest-integration> ( -1.7132462539328486e-28, -8.7105072229446864e-10 i)
446.22 s
gammaloop-nextest-integration>
446.22 s
gammaloop-nextest-integration> The application panicked (crashed).
446.22 s
gammaloop-nextest-integration> Message: kinematics=a, integrand=1L_ppmm, graph_id=0: assembly vs symjit inspect: actual=(-0.00000000000000000000000000017132462539328486+-0.0000000008710507222944686i), expected=(0+0i), tolerance=0.0000000001
446.22 s
gammaloop-nextest-integration> Location: tests/tests/test_runs/utils.rs :466
446.22 s
gammaloop-nextest-integration>
446.22 s
gammaloop-nextest-integration> ━━━━━━━━━━━━━━━━━━━━━━━━━━━━━━━━━━ BACKTRACE ━━━━━━━━━━━━━━━━━━━━━━━━━━━━━━━━━━━
446.22 s
gammaloop-nextest-integration> 1: <color_eyre[51793ea62743adbd]::config::PanicHook>::panic_report <unknown>
446.22 s
gammaloop-nextest-integration> at <unknown source file> :<unknown line>
446.22 s
gammaloop-nextest-integration> 2: <color_eyre[51793ea62743adbd]::config::PanicHook>::into_panic_hook::{closure#0} <unknown>
446.22 s
gammaloop-nextest-integration> at <unknown source file> :<unknown line>
446.22 s
gammaloop-nextest-integration> 3: std[bcb96dfbba0ab899]::panicking::panic_with_hook <unknown>
446.22 s
gammaloop-nextest-integration> at <unknown source file> :<unknown line>
446.22 s
gammaloop-nextest-integration> 4: std[bcb96dfbba0ab899]::panicking::panic_handler::{closure#0} <unknown>
446.22 s
gammaloop-nextest-integration> at <unknown source file> :<unknown line>
446.22 s
gammaloop-nextest-integration> 5: std[bcb96dfbba0ab899]::sys::backtrace::__rust_end_short_backtrace::<std[bcb96dfbba0ab899]::panicking::panic_handler::{closure#0}, !> <unknown>
446.22 s
gammaloop-nextest-integration> at <unknown source file> :<unknown line>
446.22 s
gammaloop-nextest-integration> 6: __rustc[6c289b9f9c454d21]::rust_begin_unwind <unknown>
446.22 s
gammaloop-nextest-integration> at <unknown source file> :<unknown line>
446.22 s
gammaloop-nextest-integration> 7: core[940e698046960fd5]::panicking::panic_fmt <unknown>
446.22 s
gammaloop-nextest-integration> at <unknown source file> :<unknown line>
446.22 s
gammaloop-nextest-integration> 8: <test_runs[66584badfeb6c7be]::aa_aa::important::aa_aa_local_inspect_backend_consistency::{closure#0} as core[940e698046960fd5]::ops::function::FnOnce<()>>::call_once <unknown>
446.22 s
gammaloop-nextest-integration> at <unknown source file> :<unknown line>
446.22 s
gammaloop-nextest-integration> 9: serial_test[cd99724524a2f1c0]::serial_code_lock::local_serial_core_with_return::<(), eyre[cb2fd339c0c40fca]::Report> <unknown>
446.22 s
gammaloop-nextest-integration> at <unknown source file> :<unknown line>
446.22 s
gammaloop-nextest-integration> 10: <test_runs[66584badfeb6c7be]::aa_aa::important::aa_aa_local_inspect_backend_consistency::{closure#0} as core[940e698046960fd5]::ops::function::FnOnce<()>>::call_once <unknown>
446.22 s
gammaloop-nextest-integration> at <unknown source file> :<unknown line>
446.22 s
gammaloop-nextest-integration> 11: test[75d6903177b1d7e9]::__rust_begin_short_backtrace::<core[940e698046960fd5]::result::Result<(), alloc[2ea6bcb46fca0c42]::string::String>, fn() -> core[940e698046960fd5]::result::Result<(), alloc[2ea6bcb46fca0c42]::string::String>> <unknown>
446.22 s
gammaloop-nextest-integration> at <unknown source file> :<unknown line>
446.22 s
gammaloop-nextest-integration> 12: test[75d6903177b1d7e9]::run_test::{closure#0} <unknown>
446.22 s
gammaloop-nextest-integration> at <unknown source file> :<unknown line>
446.22 s
gammaloop-nextest-integration> 13: std[bcb96dfbba0ab899]::sys::backtrace::__rust_begin_short_backtrace::<test[75d6903177b1d7e9]::run_test::{closure#1}, ()> <unknown>
446.22 s
gammaloop-nextest-integration> at <unknown source file> :<unknown line>
446.22 s
gammaloop-nextest-integration> 14: <std[bcb96dfbba0ab899]::thread::lifecycle::spawn_unchecked<test[75d6903177b1d7e9]::run_test::{closure#1}, ()>::{closure#1} as core[940e698046960fd5]::ops::function::FnOnce<()>>::call_once::{shim:vtable#0} <unknown>
446.22 s
gammaloop-nextest-integration> at <unknown source file> :<unknown line>
446.22 s
gammaloop-nextest-integration> 15: <std[bcb96dfbba0ab899]::sys::thread::unix::Thread>::new::thread_start <unknown>
446.22 s
gammaloop-nextest-integration> at <unknown source file> :<unknown line>
446.22 s
gammaloop-nextest-integration> 16: start_thread <unknown>
446.22 s
gammaloop-nextest-integration> at <unknown source file> :<unknown line>
446.22 s
gammaloop-nextest-integration> 17: __clone3 <unknown>
446.22 s
gammaloop-nextest-integration> at <unknown source file> :<unknown line>
446.22 s
gammaloop-nextest-integration>
446.22 s
gammaloop-nextest-integration> Run with COLORBT_SHOW_HIDDEN=1 environment variable to disable frame filtering.
446.22 s
gammaloop-nextest-integration> Run with RUST_BACKTRACE=full to include source snippets.
446.22 s
gammaloop-nextest-integration>
903.33 s
gammaloop-nextest-integration> ------------
903.33 s
gammaloop-nextest-integration> Summary [ 875.579s] 152 tests run: 151 passed , 1 failed , 208 skipped
903.33 s
gammaloop-nextest-integration> FAIL [ 69.376s] ( 54/152) gammaloop-integration-tests::test_runs aa_aa::important :: aa_aa_local_inspect_backend_consistency
903.33 s
gammaloop-nextest-integration> stdout ---
903.33 s
gammaloop-nextest-integration>
903.33 s
gammaloop-nextest-integration> running 1 test
903.33 s
gammaloop-nextest-integration> test aa_aa::important::aa_aa_local_inspect_backend_consistency has been running for over 60 seconds
903.33 s
gammaloop-nextest-integration> test aa_aa::important::aa_aa_local_inspect_backend_consistency ... FAILED
903.33 s
gammaloop-nextest-integration>
903.33 s
gammaloop-nextest-integration> failures:
903.33 s
gammaloop-nextest-integration>
903.33 s
gammaloop-nextest-integration> failures:
903.33 s
gammaloop-nextest-integration> aa_aa::important::aa_aa_local_inspect_backend_consistency
903.33 s
gammaloop-nextest-integration>
903.33 s
gammaloop-nextest-integration> test result: FAILED. 0 passed; 1 failed; 0 ignored; 0 measured; 258 filtered out; finished in 69.15s
903.33 s
gammaloop-nextest-integration>
903.33 s
gammaloop-nextest-integration> stderr ---
903.33 s
gammaloop-nextest-integration> [2026-09-06 07:16:27.882] @gammaloop_api::se... INFO : Running command import model sm-default.json
903.33 s
gammaloop-nextest-integration> [2026-09-06 07:16:27.882] @import::model INFO : Loading built-in JSON model sm-default
903.33 s
gammaloop-nextest-integration> [2026-09-06 07:16:27.903] @gammalooprs::model INFO : The following 11 external parameters were forced to zero by the restriction card:
903.33 s
gammaloop-nextest-integration> lamWS, AWS, rhoWS, etaWS, ymc, yme, ymm, MC, Me, MM, WTau
903.33 s
gammaloop-nextest-integration> [2026-09-06 07:16:27.903] @gammalooprs::model INFO : The following 34 vertex rules were removed by the restriction card:
903.33 s
gammaloop-nextest-integration> V_82 -> (c~, d, G+) | V_83 -> (t~, d, G+) | V_84 -> (c~, s, G+) | V_85 -> (t~, s, G+) | V_86 -> (u~, b, G+) | V_87 -> (c~, b, G+) | V_90 -> (c~, d, W+) | V_91 -> (t~, d, W+) | V_92 -> (u~, s, W+) | V_94 -> (t~, s, W+) | V_95 -> (u~, b, W+) | V_96 -> (c~, b, W+) | V_101 -> (e+, e-, G0) | V_102 -> (mu+, mu-, G0) | V_104 -> (e+, e-, H) | V_105 -> (mu+, mu-, H) | V_110 -> (ve~, e-, G+) | V_111 -> (vm~, mu-, G+) | V_116 -> (b~, u, G-) | V_117 -> (d~, c, G-) | V_118 -> (s~, c, G-) | V_119 -> (b~, c, G-) | V_120 -> (d~, t, G-) | V_121 -> (s~, t, G-) | V_124 -> (s~, u, W-) | V_125 -> (b~, u, W-) | V_126 -> (d~, c, W-) | V_128 -> (b~, c, W-) | V_129 -> (d~, t, W-) | V_130 -> (s~, t, W-) | V_138 -> (c~, c, G0) | V_140 -> (c~, c, H) | V_145 -> (e+, ve, G-) | V_146 -> (mu+, vm, G-)
903.33 s
gammaloop-nextest-integration> [2026-09-06 07:16:27.903] @gammalooprs::model INFO : The following 36 couplings were removed by the restriction card:
903.33 s
gammaloop-nextest-integration> GC_13, GC_14, GC_16, GC_17, GC_18, GC_19, GC_20, GC_22, GC_23, GC_24, GC_25, GC_26, GC_28, GC_29, GC_42, GC_43, GC_44, GC_46, GC_47, GC_48, GC_84, GC_85, GC_86, GC_87, GC_88, GC_89, GC_90, GC_91, GC_92, GC_93, GC_101, GC_102, GC_103, GC_105, GC_106, GC_107
903.33 s
gammaloop-nextest-integration> [2026-09-06 07:16:27.903] @gammaloop_api::se... INFO : Running command run set_model_parameters
903.33 s
gammaloop-nextest-integration> [2026-09-06 07:16:27.903] @gammaloop_api::se... INFO : Starting command block set_model_parameters
903.33 s
gammaloop-nextest-integration> [2026-09-06 07:16:27.904] @gammaloop_api::se... INFO : Running command set model MT=173.0
903.33 s
gammaloop-nextest-integration> [2026-09-06 07:16:27.908] @gammaloop_api::se... INFO : Running command set model WT=0.0
903.33 s
gammaloop-nextest-integration> [2026-09-06 07:16:27.911] @gammaloop_api::se... INFO : Running command set model ymt=173.0
903.33 s
gammaloop-nextest-integration> [2026-09-06 07:16:27.915] @gammaloop_api::se... INFO : Running command set model aS=0.118
903.33 s
gammaloop-nextest-integration> [2026-09-06 07:16:27.919] @gammaloop_api::se... INFO : Running command set model aEWM1=137.036
903.33 s
gammaloop-nextest-integration> [2026-09-06 07:16:27.922] @gammaloop_api::se... INFO : Running command set model Gf=1.166390e-05
903.33 s
gammaloop-nextest-integration> [2026-09-06 07:16:27.926] @gammaloop_api::se... INFO : Running command set model MZ=91.188
903.33 s
gammaloop-nextest-integration> [2026-09-06 07:16:27.930] @gammaloop_api::se... INFO : Running command set global string '
903.33 s
gammaloop-nextest-integration> [global.generation.compile]
903.33 s
gammaloop-nextest-integration> compilation_mode = "symjit"
903.33 s
gammaloop-nextest-integration> optimization_level = "O0"
903.33 s
gammaloop-nextest-integration> fast_math = false
903.33 s
gammaloop-nextest-integration> [...]
903.33 s
gammaloop-nextest-integration> [2026-09-06 07:16:27.930] @gammaloop_api::se... INFO : Running command import graphs ./examples/cli/aa_aa/1L/aa_aa_1L.dot -p aa_aa_all_helicities -i 1L_ppmm -o
903.33 s
gammaloop-nextest-integration> [2026-09-06 07:16:27.930] @commands::import INFO : Loading graphs from '/build/source/examples/cli/aa_aa/1L/aa_aa_1L.dot'
903.33 s
gammaloop-nextest-integration> [2026-09-06 07:16:27.939] @gammaloop_api::se... INFO : Running command generate existing -p aa_aa_all_helicities
903.33 s
gammaloop-nextest-integration> [2026-09-06 07:16:53.477] @commands::generate INFO :
903.33 s
gammaloop-nextest-integration> Integrand generation summary
903.33 s
gammaloop-nextest-integration> peak RAM 1.06 GiB | cores 1
903.33 s
gammaloop-nextest-integration> ╭───────────┬───────┬─────────┬──────────────┬─────────────┬────────────────┬──────────────╮
903.33 s
gammaloop-nextest-integration> │ integrand │ graph │ # evals │ expr build │ spenso │ symbolica eval │ compile │
903.33 s
gammaloop-nextest-integration> ├───────────┼───────┼─────────┼──────────────┼─────────────┼────────────────┼──────────────┤
903.33 s
gammaloop-nextest-integration> │ 1L_ppmm │ GL0 │ 13 │ 544ms (6.2% ) │ 1.76s (20% ) │ 5.63s (64% ) │ 844ms (9.6% ) │
903.33 s
gammaloop-nextest-integration> │ 1L_ppmm │ GL2 │ 13 │ 545ms (6.4% ) │ 1.46s (17% ) │ 5.67s (67% ) │ 802ms (9.5% ) │
903.33 s
gammaloop-nextest-integration> │ 1L_ppmm │ GL4 │ 11 │ 533ms (6.5% ) │ 1.40s (17% ) │ 5.49s (67% ) │ 796ms (9.7% ) │
903.33 s
gammaloop-nextest-integration> ├───────────┼───────┼─────────┼──────────────┼─────────────┼────────────────┼──────────────┤
903.33 s
gammaloop-nextest-integration> │ Total │ │ 37 │ 1.62s (6.4% ) │ 4.62s (18% ) │ 16.79s (66% ) │ 2.44s (9.6% ) │
903.33 s
gammaloop-nextest-integration> ╰───────────┴───────┴─────────┴──────────────┴─────────────┴────────────────┴──────────────╯
903.33 s
gammaloop-nextest-integration> [2026-09-06 07:16:54.136] @gammaloop_api::se... INFO : Running command import model sm-default.json
903.33 s
gammaloop-nextest-integration> [2026-09-06 07:16:54.136] @import::model INFO : Loading built-in JSON model sm-default
903.33 s
gammaloop-nextest-integration> [2026-09-06 07:16:54.155] @gammalooprs::model INFO : The following 11 external parameters were forced to zero by the restriction card:
903.33 s
gammaloop-nextest-integration> lamWS, AWS, rhoWS, etaWS, ymc, yme, ymm, MC, Me, MM, WTau
903.33 s
gammaloop-nextest-integration> [2026-09-06 07:16:54.155] @gammalooprs::model INFO : The following 34 vertex rules were removed by the restriction card:
903.33 s
gammaloop-nextest-integration> V_82 -> (c~, d, G+) | V_83 -> (t~, d, G+) | V_84 -> (c~, s, G+) | V_85 -> (t~, s, G+) | V_86 -> (u~, b, G+) | V_87 -> (c~, b, G+) | V_90 -> (c~, d, W+) | V_91 -> (t~, d, W+) | V_92 -> (u~, s, W+) | V_94 -> (t~, s, W+) | V_95 -> (u~, b, W+) | V_96 -> (c~, b, W+) | V_101 -> (e+, e-, G0) | V_102 -> (mu+, mu-, G0) | V_104 -> (e+, e-, H) | V_105 -> (mu+, mu-, H) | V_110 -> (ve~, e-, G+) | V_111 -> (vm~, mu-, G+) | V_116 -> (b~, u, G-) | V_117 -> (d~, c, G-) | V_118 -> (s~, c, G-) | V_119 -> (b~, c, G-) | V_120 -> (d~, t, G-) | V_121 -> (s~, t, G-) | V_124 -> (s~, u, W-) | V_125 -> (b~, u, W-) | V_126 -> (d~, c, W-) | V_128 -> (b~, c, W-) | V_129 -> (d~, t, W-) | V_130 -> (s~, t, W-) | V_138 -> (c~, c, G0) | V_140 -> (c~, c, H) | V_145 -> (e+, ve, G-) | V_146 -> (mu+, vm, G-)
903.33 s
gammaloop-nextest-integration> [2026-09-06 07:16:54.155] @gammalooprs::model INFO : The following 36 couplings were removed by the restriction card:
903.33 s
gammaloop-nextest-integration> GC_13, GC_14, GC_16, GC_17, GC_18, GC_19, GC_20, GC_22, GC_23, GC_24, GC_25, GC_26, GC_28, GC_29, GC_42, GC_43, GC_44, GC_46, GC_47, GC_48, GC_84, GC_85, GC_86, GC_87, GC_88, GC_89, GC_90, GC_91, GC_92, GC_93, GC_101, GC_102, GC_103, GC_105, GC_106, GC_107
903.33 s
gammaloop-nextest-integration> [2026-09-06 07:16:54.155] @gammaloop_api::se... INFO : Running command run set_model_parameters
903.33 s
gammaloop-nextest-integration> [2026-09-06 07:16:54.155] @gammaloop_api::se... INFO : Starting command block set_model_parameters
903.33 s
gammaloop-nextest-integration> [2026-09-06 07:16:54.156] @gammaloop_api::se... INFO : Running command set model MT=173.0
903.33 s
gammaloop-nextest-integration> [2026-09-06 07:16:54.159] @gammaloop_api::se... INFO : Running command set model WT=0.0
903.33 s
gammaloop-nextest-integration> [2026-09-06 07:16:54.162] @gammaloop_api::se... INFO : Running command set model ymt=173.0
903.33 s
gammaloop-nextest-integration> [2026-09-06 07:16:54.165] @gammaloop_api::se... INFO : Running command set model aS=0.118
903.33 s
gammaloop-nextest-integration> [2026-09-06 07:16:54.169] @gammaloop_api::se... INFO : Running command set model aEWM1=137.036
903.33 s
gammaloop-nextest-integration> [2026-09-06 07:16:54.172] @gammaloop_api::se... INFO : Running command set model Gf=1.166390e-05
903.33 s
gammaloop-nextest-integration> [2026-09-06 07:16:54.175] @gammaloop_api::se... INFO : Running command set model MZ=91.188
903.33 s
gammaloop-nextest-integration> [2026-09-06 07:16:54.179] @gammaloop_api::se... INFO : Running command set global string '
903.33 s
gammaloop-nextest-integration> [global.generation.compile]
903.33 s
gammaloop-nextest-integration> compilation_mode = "assembly"
903.33 s
gammaloop-nextest-integration> optimization_level = "O0"
903.33 s
gammaloop-nextest-integration> fast_math = false
903.33 s
gammaloop-nextest-integration> [...]
903.33 s
gammaloop-nextest-integration> [2026-09-06 07:16:54.180] @gammaloop_api::se... INFO : Running command import graphs ./examples/cli/aa_aa/1L/aa_aa_1L.dot -p aa_aa_all_helicities_assembly -i 1L_ppmm -o
903.33 s
gammaloop-nextest-integration> [2026-09-06 07:16:54.180] @commands::import INFO : Loading graphs from '/build/source/examples/cli/aa_aa/1L/aa_aa_1L.dot'
903.33 s
gammaloop-nextest-integration> [2026-09-06 07:16:54.187] @gammaloop_api::se... INFO : Running command generate existing -p aa_aa_all_helicities_assembly
903.33 s
gammaloop-nextest-integration> [2026-09-06 07:17:16.399] @processes::amplitude INFO : Compiling amplitude 1L_ppmm
903.33 s
gammaloop-nextest-integration> [2026-09-06 07:17:35.501] @commands::generate INFO : Removed 34 generated C++ source file(s). Use '--keep-sources ' to keep them.
903.33 s
gammaloop-nextest-integration> [2026-09-06 07:17:35.501] @commands::generate INFO :
903.33 s
gammaloop-nextest-integration> Integrand generation summary
903.33 s
gammaloop-nextest-integration> peak RAM 2.20 GiB | cores 1
903.33 s
gammaloop-nextest-integration> ╭───────────┬───────┬─────────┬──────────────┬──────────────┬────────────────┬──────────────╮
903.33 s
gammaloop-nextest-integration> │ integrand │ graph │ # evals │ expr build │ spenso │ symbolica eval │ compile │
903.33 s
gammaloop-nextest-integration> ├───────────┼───────┼─────────┼──────────────┼──────────────┼────────────────┼──────────────┤
903.33 s
gammaloop-nextest-integration> │ 1L_ppmm │ GL0 │ 13 │ 500ms (3.6% ) │ 1.39s (10% ) │ 5.50s (40% ) │ 6.41s (46% ) │
903.33 s
gammaloop-nextest-integration> │ 1L_ppmm │ GL2 │ 13 │ 493ms (3.5% ) │ 1.41s (9.9% ) │ 5.58s (39% ) │ 6.80s (48% ) │
903.33 s
gammaloop-nextest-integration> │ 1L_ppmm │ GL4 │ 11 │ 485ms (3.7% ) │ 1.40s (11% ) │ 5.44s (41% ) │ 5.88s (45% ) │
903.33 s
gammaloop-nextest-integration> ├───────────┼───────┼─────────┼──────────────┼──────────────┼────────────────┼──────────────┤
903.33 s
gammaloop-nextest-integration> │ Total │ │ 37 │ 1.48s (3.6% ) │ 4.20s (10% ) │ 16.52s (40% ) │ 19.09s (46% ) │
903.33 s
gammaloop-nextest-integration> ╰───────────┴───────┴─────────┴──────────────┴──────────────┴────────────────┴──────────────╯
903.33 s
gammaloop-nextest-integration> [2026-09-06 07:17:36.385] @gammaloop_api::se... INFO : Running command set process -p aa_aa_all_helicities -i 1L_ppmm string '
903.33 s
gammaloop-nextest-integration> [stability]
903.33 s
gammaloop-nextest-integration> check_on_norm = true
903.33 s
gammaloop-nextest-integration> escalate_if_exact_zero = false
903.33 s
gammaloop-nextest-integration> loop_momenta_norm_escalation_factor = -1.0
903.33 s
gammaloop-nextest-integration> [...]
903.33 s
gammaloop-nextest-integration> [2026-09-06 07:17:36.386] @gammaloop_api::se... INFO : Running command set process -p aa_aa_all_helicities_assembly -i 1L_ppmm string '
903.33 s
gammaloop-nextest-integration> [stability]
903.33 s
gammaloop-nextest-integration> check_on_norm = true
903.33 s
gammaloop-nextest-integration> escalate_if_exact_zero = false
903.33 s
gammaloop-nextest-integration> loop_momenta_norm_escalation_factor = -1.0
903.33 s
gammaloop-nextest-integration> [...]
903.33 s
gammaloop-nextest-integration> [2026-09-06 07:17:36.387] @gammaloop_api::se... INFO : Running command set process -p aa_aa_all_helicities -i 1L_mpmm string '
903.33 s
gammaloop-nextest-integration> [stability]
903.33 s
gammaloop-nextest-integration> check_on_norm = true
903.33 s
gammaloop-nextest-integration> escalate_if_exact_zero = false
903.33 s
gammaloop-nextest-integration> loop_momenta_norm_escalation_factor = -1.0
903.33 s
gammaloop-nextest-integration> [...]
903.33 s
gammaloop-nextest-integration> [2026-09-06 07:17:36.388] @gammaloop_api::se... INFO : Running command set process -p aa_aa_all_helicities_assembly -i 1L_mpmm string '
903.33 s
gammaloop-nextest-integration> [stability]
903.33 s
gammaloop-nextest-integration> check_on_norm = true
903.33 s
gammaloop-nextest-integration> escalate_if_exact_zero = false
903.33 s
gammaloop-nextest-integration> loop_momenta_norm_escalation_factor = -1.0
903.33 s
gammaloop-nextest-integration> [...]
903.33 s
gammaloop-nextest-integration> [2026-09-06 07:17:36.389] @gammaloop_api::se... INFO : Running command set process -p aa_aa_all_helicities -i 1L_mmmm string '
903.33 s
gammaloop-nextest-integration> [stability]
903.33 s
gammaloop-nextest-integration> check_on_norm = true
903.33 s
gammaloop-nextest-integration> escalate_if_exact_zero = false
903.33 s
gammaloop-nextest-integration> loop_momenta_norm_escalation_factor = -1.0
903.33 s
gammaloop-nextest-integration> [...]
903.33 s
gammaloop-nextest-integration> [2026-09-06 07:17:36.390] @gammaloop_api::se... INFO : Running command set process -p aa_aa_all_helicities_assembly -i 1L_mmmm string '
903.33 s
gammaloop-nextest-integration> [stability]
903.33 s
gammaloop-nextest-integration> check_on_norm = true
903.33 s
gammaloop-nextest-integration> escalate_if_exact_zero = false
903.33 s
gammaloop-nextest-integration> loop_momenta_norm_escalation_factor = -1.0
903.33 s
gammaloop-nextest-integration> [...]
903.33 s
gammaloop-nextest-integration> [2026-09-06 07:17:36.391] @gammaloop_api::se... INFO : Running command set process -p aa_aa_all_helicities -i 1L_pmmp string '
903.33 s
gammaloop-nextest-integration> [stability]
903.33 s
gammaloop-nextest-integration> check_on_norm = true
903.33 s
gammaloop-nextest-integration> escalate_if_exact_zero = false
903.33 s
gammaloop-nextest-integration> loop_momenta_norm_escalation_factor = -1.0
903.33 s
gammaloop-nextest-integration> [...]
903.33 s
gammaloop-nextest-integration> [2026-09-06 07:17:36.392] @gammaloop_api::se... INFO : Running command set process -p aa_aa_all_helicities_assembly -i 1L_pmmp string '
903.33 s
gammaloop-nextest-integration> [stability]
903.33 s
gammaloop-nextest-integration> check_on_norm = true
903.33 s
gammaloop-nextest-integration> escalate_if_exact_zero = false
903.33 s
gammaloop-nextest-integration> loop_momenta_norm_escalation_factor = -1.0
903.33 s
gammaloop-nextest-integration> [...]
903.33 s
gammaloop-nextest-integration> [2026-09-06 07:17:36.393] @gammaloop_api::se... INFO : Running command set process -p aa_aa_all_helicities -i 1L_pmpm string '
903.33 s
gammaloop-nextest-integration> [stability]
903.33 s
gammaloop-nextest-integration> check_on_norm = true
903.33 s
gammaloop-nextest-integration> escalate_if_exact_zero = false
903.33 s
gammaloop-nextest-integration> loop_momenta_norm_escalation_factor = -1.0
903.33 s
gammaloop-nextest-integration> [...]
903.33 s
gammaloop-nextest-integration> [2026-09-06 07:17:36.394] @gammaloop_api::se... INFO : Running command set process -p aa_aa_all_helicities_assembly -i 1L_pmpm string '
903.33 s
gammaloop-nextest-integration> [stability]
903.33 s
gammaloop-nextest-integration> check_on_norm = true
903.33 s
gammaloop-nextest-integration> escalate_if_exact_zero = false
903.33 s
gammaloop-nextest-integration> loop_momenta_norm_escalation_factor = -1.0
903.33 s
gammaloop-nextest-integration> [...]
903.33 s
gammaloop-nextest-integration> [2026-09-06 07:17:36.402] @process::amplitude INFO : Input is below threshold: 0 existing threshold E-surfaces across 0/1 graph groups
903.33 s
gammaloop-nextest-integration> [2026-09-06 07:17:36.402] @process::amplitude INFO : overlap structure of group 0: [0: []]
903.33 s
gammaloop-nextest-integration> [2026-09-06 07:17:36.402] @integrands::process [{#im_is_nan, #re_is_nan}] WARNING : final process evaluation is nonfinite
903.33 s
gammaloop-nextest-integration> [2026-09-06 07:17:36.402] @commands::inspect INFO :
903.33 s
gammaloop-nextest-integration> Input point in momentum space:
903.33 s
gammaloop-nextest-integration>
903.33 s
gammaloop-nextest-integration> ( 0.1100000000000000, -0.0700000000000000, 0.1900000000000000 )
903.33 s
gammaloop-nextest-integration>
903.33 s
gammaloop-nextest-integration> The evaluation of integrand '1L_ppmm' is:
903.33 s
gammaloop-nextest-integration>
903.33 s
gammaloop-nextest-integration> ( +0.0000000000000000e0, +0.0000000000000000e0 i)
903.33 s
gammaloop-nextest-integration>
903.33 s
gammaloop-nextest-integration> [2026-09-06 07:17:36.408] @process::amplitude INFO : Input is below threshold: 0 existing threshold E-surfaces across 0/1 graph groups
903.33 s
gammaloop-nextest-integration> [2026-09-06 07:17:36.408] @process::amplitude INFO : overlap structure of group 0: [0: []]
903.33 s
gammaloop-nextest-integration> [2026-09-06 07:17:36.409] @commands::inspect INFO :
903.33 s
gammaloop-nextest-integration> Input point in momentum space:
903.33 s
gammaloop-nextest-integration>
903.34 s
gammaloop-nextest-integration> ( 0.1100000000000000, -0.0700000000000000, 0.1900000000000000 )
903.34 s
gammaloop-nextest-integration>
903.34 s
gammaloop-nextest-integration> The evaluation of integrand '1L_ppmm' is:
903.34 s
gammaloop-nextest-integration>
903.34 s
gammaloop-nextest-integration> ( -1.7132462539328486e-28, -8.7105072229446864e-10 i)
903.34 s
gammaloop-nextest-integration>
903.34 s
gammaloop-nextest-integration> The application panicked (crashed).
903.34 s
gammaloop-nextest-integration> Message: kinematics=a, integrand=1L_ppmm, graph_id=0: assembly vs symjit inspect: actual=(-0.00000000000000000000000000017132462539328486+-0.0000000008710507222944686i), expected=(0+0i), tolerance=0.0000000001
903.34 s
gammaloop-nextest-integration> Location: tests/tests/test_runs/utils.rs :466
903.34 s
gammaloop-nextest-integration>
903.34 s
gammaloop-nextest-integration> ━━━━━━━━━━━━━━━━━━━━━━━━━━━━━━━━━━ BACKTRACE ━━━━━━━━━━━━━━━━━━━━━━━━━━━━━━━━━━━
903.34 s
gammaloop-nextest-integration> 1: <color_eyre[51793ea62743adbd]::config::PanicHook>::panic_report <unknown>
903.34 s
gammaloop-nextest-integration> at <unknown source file> :<unknown line>
903.34 s
gammaloop-nextest-integration> 2: <color_eyre[51793ea62743adbd]::config::PanicHook>::into_panic_hook::{closure#0} <unknown>
903.34 s
gammaloop-nextest-integration> at <unknown source file> :<unknown line>
903.34 s
gammaloop-nextest-integration> 3: std[bcb96dfbba0ab899]::panicking::panic_with_hook <unknown>
903.34 s
gammaloop-nextest-integration> at <unknown source file> :<unknown line>
903.34 s
gammaloop-nextest-integration> 4: std[bcb96dfbba0ab899]::panicking::panic_handler::{closure#0} <unknown>
903.34 s
gammaloop-nextest-integration> at <unknown source file> :<unknown line>
903.34 s
gammaloop-nextest-integration> 5: std[bcb96dfbba0ab899]::sys::backtrace::__rust_end_short_backtrace::<std[bcb96dfbba0ab899]::panicking::panic_handler::{closure#0}, !> <unknown>
903.34 s
gammaloop-nextest-integration> at <unknown source file> :<unknown line>
903.34 s
gammaloop-nextest-integration> 6: __rustc[6c289b9f9c454d21]::rust_begin_unwind <unknown>
903.34 s
gammaloop-nextest-integration> at <unknown source file> :<unknown line>
903.34 s
gammaloop-nextest-integration> 7: core[940e698046960fd5]::panicking::panic_fmt <unknown>
903.34 s
gammaloop-nextest-integration> at <unknown source file> :<unknown line>
903.34 s
gammaloop-nextest-integration> 8: <test_runs[66584badfeb6c7be]::aa_aa::important::aa_aa_local_inspect_backend_consistency::{closure#0} as core[940e698046960fd5]::ops::function::FnOnce<()>>::call_once <unknown>
903.34 s
gammaloop-nextest-integration> at <unknown source file> :<unknown line>
903.34 s
gammaloop-nextest-integration> 9: serial_test[cd99724524a2f1c0]::serial_code_lock::local_serial_core_with_return::<(), eyre[cb2fd339c0c40fca]::Report> <unknown>
903.34 s
gammaloop-nextest-integration> at <unknown source file> :<unknown line>
903.34 s
gammaloop-nextest-integration> 10: <test_runs[66584badfeb6c7be]::aa_aa::important::aa_aa_local_inspect_backend_consistency::{closure#0} as core[940e698046960fd5]::ops::function::FnOnce<()>>::call_once <unknown>
903.34 s
gammaloop-nextest-integration> at <unknown source file> :<unknown line>
903.34 s
gammaloop-nextest-integration> 11: test[75d6903177b1d7e9]::__rust_begin_short_backtrace::<core[940e698046960fd5]::result::Result<(), alloc[2ea6bcb46fca0c42]::string::String>, fn() -> core[940e698046960fd5]::result::Result<(), alloc[2ea6bcb46fca0c42]::string::String>> <unknown>
903.34 s
gammaloop-nextest-integration> at <unknown source file> :<unknown line>
903.34 s
gammaloop-nextest-integration> 12: test[75d6903177b1d7e9]::run_test::{closure#0} <unknown>
903.34 s
gammaloop-nextest-integration> at <unknown source file> :<unknown line>
903.34 s
gammaloop-nextest-integration> 13: std[bcb96dfbba0ab899]::sys::backtrace::__rust_begin_short_backtrace::<test[75d6903177b1d7e9]::run_test::{closure#1}, ()> <unknown>
903.34 s
gammaloop-nextest-integration> at <unknown source file> :<unknown line>
903.34 s
gammaloop-nextest-integration> 14: <std[bcb96dfbba0ab899]::thread::lifecycle::spawn_unchecked<test[75d6903177b1d7e9]::run_test::{closure#1}, ()>::{closure#1} as core[940e698046960fd5]::ops::function::FnOnce<()>>::call_once::{shim:vtable#0} <unknown>
903.34 s
gammaloop-nextest-integration> at <unknown source file> :<unknown line>
903.34 s
gammaloop-nextest-integration> 15: <std[bcb96dfbba0ab899]::sys::thread::unix::Thread>::new::thread_start <unknown>
903.34 s
gammaloop-nextest-integration> at <unknown source file> :<unknown line>
903.34 s
gammaloop-nextest-integration> 16: start_thread <unknown>
903.34 s
gammaloop-nextest-integration> at <unknown source file> :<unknown line>
903.34 s
gammaloop-nextest-integration> 17: __clone3 <unknown>
903.34 s
gammaloop-nextest-integration> at <unknown source file> :<unknown line>
903.34 s
gammaloop-nextest-integration>
903.34 s
gammaloop-nextest-integration> Run with COLORBT_SHOW_HIDDEN=1 environment variable to disable frame filtering.
903.34 s
gammaloop-nextest-integration> Run with RUST_BACKTRACE=full to include source snippets.
903.34 s
gammaloop-nextest-integration>
903.60 s
gammaloop-nextest-integration> error : test run failed
903.62 s
gammaloop-nextest-integration>
903.62 s
gammaloop-nextest-integration> ========== nextest test summary ==========
903.62 s
gammaloop-nextest-integration> report: target/nextest/ci_gammaloop/junit.xml
903.62 s
gammaloop-nextest-integration> tests: 152, failures: 1, errors: 0
903.62 s
gammaloop-nextest-integration>
903.62 s
gammaloop-nextest-integration> 1. gammaloop-integration-tests::test_runs::aa_aa::important::aa_aa_local_inspect_backend_consistency
903.62 s
gammaloop-nextest-integration> failure: test failure with exit code 101
903.62 s
gammaloop-nextest-integration> system-out
903.62 s
gammaloop-nextest-integration> running 1 test
903.62 s
gammaloop-nextest-integration> test aa_aa::important::aa_aa_local_inspect_backend_consistency has been running for over 60 seconds
903.62 s
gammaloop-nextest-integration> test aa_aa::important::aa_aa_local_inspect_backend_consistency ... FAILED
903.62 s
gammaloop-nextest-integration>
903.62 s
gammaloop-nextest-integration> failures:
903.62 s
gammaloop-nextest-integration>
903.62 s
gammaloop-nextest-integration> failures:
903.62 s
gammaloop-nextest-integration> aa_aa::important::aa_aa_local_inspect_backend_consistency
903.62 s
gammaloop-nextest-integration>
903.62 s
gammaloop-nextest-integration> test result: FAILED. 0 passed; 1 failed; 0 ignored; 0 measured; 258 filtered out; finished in 69.15s
903.62 s
gammaloop-nextest-integration> system-err
903.62 s
gammaloop-nextest-integration> [2026-09-06 07:16:27.882] @gammaloop_api::se... INFO : Running command import model sm-default.json
903.62 s
gammaloop-nextest-integration> [2026-09-06 07:16:27.882] @import::model INFO : Loading built-in JSON model sm-default
903.62 s
gammaloop-nextest-integration> [2026-09-06 07:16:27.903] @gammalooprs::model INFO : The following 11 external parameters were forced to zero by the restriction card:
903.62 s
gammaloop-nextest-integration> lamWS, AWS, rhoWS, etaWS, ymc, yme, ymm, MC, Me, MM, WTau
903.62 s
gammaloop-nextest-integration> [2026-09-06 07:16:27.903] @gammalooprs::model INFO : The following 34 vertex rules were removed by the restriction card:
903.62 s
gammaloop-nextest-integration> V_82 -> (c~, d, G+) | V_83 -> (t~, d, G+) | V_84 -> (c~, s, G+) | V_85 -> (t~, s, G+) | V_86 -> (u~, b, G+) | V_87 -> (c~, b, G+) | V_90 -> (c~, d, W+) | V_91 -> (t~, d, W+) | V_92 -> (u~, s, W+) | V_94 -> (t~, s, W+) | V_95 -> (u~, b, W+) | V_96 -> (c~, b, W+) | V_101 -> (e+, e-, G0) | V_102 -> (mu+, mu-, G0) | V_104 -> (e+, e-, H) | V_105 -> (mu+, mu-, H) | V_110 -> (ve~, e-, G+) | V_111 -> (vm~, mu-, G+) | V_116 -> (b~, u, G-) | V_117 -> (d~, c, G-) | V_118 -> (s~, c, G-) | V_119 -> (b~, c, G-) | V_120 -> (d~, t, G-) | V_121 -> (s~, t, G-) | V_124 -> (s~, u, W-) | V_125 -> (b~, u, W-) | V_126 -> (d~, c, W-) | V_128 -> (b~, c, W-) | V_129 -> (d~, t, W-) | V_130 -> (s~, t, W-) | V_138 -> (c~, c, G0) | V_140 -> (c~, c, H) | V_145 -> (e+, ve, G-) | V_146 -> (mu+, vm, G-)
903.62 s
gammaloop-nextest-integration> [2026-09-06 07:16:27.903] @gammalooprs::model INFO : The following 36 couplings were removed by the restriction card:
903.62 s
gammaloop-nextest-integration> GC_13, GC_14, GC_16, GC_17, GC_18, GC_19, GC_20, GC_22, GC_23, GC_24, GC_25, GC_26, GC_28, GC_29, GC_42, GC_43, GC_44, GC_46, GC_47, GC_48, GC_84, GC_85, GC_86, GC_87, GC_88, GC_89, GC_90, GC_91, GC_92, GC_93, GC_101, GC_102, GC_103, GC_105, GC_106, GC_107
903.62 s
gammaloop-nextest-integration> [2026-09-06 07:16:27.903] @gammaloop_api::se... INFO : Running command run set_model_parameters
903.62 s
gammaloop-nextest-integration> [2026-09-06 07:16:27.903] @gammaloop_api::se... INFO : Starting command block set_model_parameters
903.62 s
gammaloop-nextest-integration> [2026-09-06 07:16:27.904] @gammaloop_api::se... INFO : Running command set model MT=173.0
903.62 s
gammaloop-nextest-integration> [2026-09-06 07:16:27.908] @gammaloop_api::se... INFO : Running command set model WT=0.0
903.62 s
gammaloop-nextest-integration> [2026-09-06 07:16:27.911] @gammaloop_api::se... INFO : Running command set model ymt=173.0
903.62 s
gammaloop-nextest-integration> [2026-09-06 07:16:27.915] @gammaloop_api::se... INFO : Running command set model aS=0.118
903.62 s
gammaloop-nextest-integration> [2026-09-06 07:16:27.919] @gammaloop_api::se... INFO : Running command set model aEWM1=137.036
903.62 s
gammaloop-nextest-integration> [2026-09-06 07:16:27.922] @gammaloop_api::se... INFO : Running command set model Gf=1.166390e-05
903.62 s
gammaloop-nextest-integration> [2026-09-06 07:16:27.926] @gammaloop_api::se... INFO : Running command set model MZ=91.188
903.62 s
gammaloop-nextest-integration> [2026-09-06 07:16:27.930] @gammaloop_api::se... INFO : Running command set global string '
903.62 s
gammaloop-nextest-integration> [global.generation.compile]
903.62 s
gammaloop-nextest-integration> compilation_mode = "symjit"
903.62 s
gammaloop-nextest-integration> optimization_level = "O0"
903.62 s
gammaloop-nextest-integration> fast_math = false
903.62 s
gammaloop-nextest-integration> [...]
903.62 s
gammaloop-nextest-integration> [2026-09-06 07:16:27.930] @gammaloop_api::se... INFO : Running command import graphs ./examples/cli/aa_aa/1L/aa_aa_1L.dot -p aa_aa_all_helicities -i 1L_ppmm -o
903.62 s
gammaloop-nextest-integration> [2026-09-06 07:16:27.930] @commands::import INFO : Loading graphs from '/build/source/examples/cli/aa_aa/1L/aa_aa_1L.dot'
903.62 s
gammaloop-nextest-integration> [2026-09-06 07:16:27.939] @gammaloop_api::se... INFO : Running command generate existing -p aa_aa_all_helicities
903.62 s
gammaloop-nextest-integration> [2026-09-06 07:16:53.477] @commands::generate INFO :
903.62 s
gammaloop-nextest-integration> Integrand generation summary
903.62 s
gammaloop-nextest-integration> peak RAM 1.06 GiB | cores 1
903.62 s
gammaloop-nextest-integration> ╭───────────┬───────┬─────────┬──────────────┬─────────────┬────────────────┬──────────────╮
903.62 s
gammaloop-nextest-integration> │ integrand │ graph │ # evals │ expr build │ spenso │ symbolica eval │ compile │
903.62 s
gammaloop-nextest-integration> ├───────────┼───────┼─────────┼──────────────┼─────────────┼────────────────┼──────────────┤
903.62 s
gammaloop-nextest-integration> │ 1L_ppmm │ GL0 │ 13 │ 544ms (6.2%) │ 1.76s (20%) │ 5.63s (64%) │ 844ms (9.6%) │
903.62 s
gammaloop-nextest-integration> │ 1L_ppmm │ GL2 │ 13 │ 545ms (6.4%) │ 1.46s (17%) │ 5.67s (67%) │ 802ms (9.5%) │
903.62 s
gammaloop-nextest-integration> │ 1L_ppmm │ GL4 │ 11 │ 533ms (6.5%) │ 1.40s (17%) │ 5.49s (67%) │ 796ms (9.7%) │
903.62 s
gammaloop-nextest-integration> ├───────────┼───────┼─────────┼──────────────┼─────────────┼────────────────┼──────────────┤
903.62 s
gammaloop-nextest-integration> │ Total │ │ 37 │ 1.62s (6.4%) │ 4.62s (18%) │ 16.79s (66%) │ 2.44s (9.6%) │
903.62 s
gammaloop-nextest-integration> ╰───────────┴───────┴─────────┴──────────────┴─────────────┴────────────────┴──────────────╯
903.62 s
gammaloop-nextest-integration> [2026-09-06 07:16:54.136] @gammaloop_api::se... INFO : Running command import model sm-default.json
903.62 s
gammaloop-nextest-integration> [2026-09-06 07:16:54.136] @import::model INFO : Loading built-in JSON model sm-default
903.62 s
gammaloop-nextest-integration> [2026-09-06 07:16:54.155] @gammalooprs::model INFO : The following 11 external parameters were forced to zero by the restriction card:
903.62 s
gammaloop-nextest-integration> lamWS, AWS, rhoWS, etaWS, ymc, yme, ymm, MC, Me, MM, WTau
903.62 s
gammaloop-nextest-integration> [2026-09-06 07:16:54.155] @gammalooprs::model INFO : The following 34 vertex rules were removed by the restriction card:
903.62 s
gammaloop-nextest-integration> V_82 -> (c~, d, G+) | V_83 -> (t~, d, G+) | V_84 -> (c~, s, G+) | V_85 -> (t~, s, G+) | V_86 -> (u~, b, G+) | V_87 -> (c~, b, G+) | V_90 -> (c~, d, W+) | V_91 -> (t~, d, W+) | V_92 -> (u~, s, W+) | V_94 -> (t~, s, W+) | V_95 -> (u~, b, W+) | V_96 -> (c~, b, W+) | V_101 -> (e+, e-, G0) | V_102 -> (mu+, mu-, G0) | V_104 -> (e+, e-, H) | V_105 -> (mu+, mu-, H) | V_110 -> (ve~, e-, G+) | V_111 -> (vm~, mu-, G+) | V_116 -> (b~, u, G-) | V_117 -> (d~, c, G-) | V_118 -> (s~, c, G-) | V_119 -> (b~, c, G-) | V_120 -> (d~, t, G-) | V_121 -> (s~, t, G-) | V_124 -> (s~, u, W-) | V_125 -> (b~, u, W-) | V_126 -> (d~, c, W-) | V_128 -> (b~, c, W-) | V_129 -> (d~, t, W-) | V_130 -> (s~, t, W-) | V_138 -> (c~, c, G0) | V_140 -> (c~, c, H) | V_145 -> (e+, ve, G-) | V_146 -> (mu+, vm, G-)
903.62 s
gammaloop-nextest-integration> [2026-09-06 07:16:54.155] @gammalooprs::model INFO : The following 36 couplings were removed by the restriction card:
903.62 s
gammaloop-nextest-integration> GC_13, GC_14, GC_16, GC_17, GC_18, GC_19, GC_20, GC_22, GC_23, GC_24, GC_25, GC_26, GC_28, GC_29, GC_42, GC_43, GC_44, GC_46, GC_47, GC_48, GC_84, GC_85, GC_86, GC_87, GC_88, GC_89, GC_90, GC_91, GC_92, GC_93, GC_101, GC_102, GC_103, GC_105, GC_106, GC_107
903.62 s
gammaloop-nextest-integration> [2026-09-06 07:16:54.155] @gammaloop_api::se... INFO : Running command run set_model_parameters
903.62 s
gammaloop-nextest-integration> [2026-09-06 07:16:54.155] @gammaloop_api::se... INFO : Starting command block set_model_parameters
903.62 s
gammaloop-nextest-integration> [2026-09-06 07:16:54.156] @gammaloop_api::se... INFO : Running command set model MT=173.0
903.62 s
gammaloop-nextest-integration> [2026-09-06 07:16:54.159] @gammaloop_api::se... INFO : Running command set model WT=0.0
903.62 s
gammaloop-nextest-integration> [2026-09-06 07:16:54.162] @gammaloop_api::se... INFO : Running command set model ymt=173.0
903.62 s
gammaloop-nextest-integration> [2026-09-06 07:16:54.165] @gammaloop_api::se... INFO : Running command set model aS=0.118
903.62 s
gammaloop-nextest-integration> [2026-09-06 07:16:54.169] @gammaloop_api::se... INFO : Running command set model aEWM1=137.036
903.62 s
gammaloop-nextest-integration> [2026-09-06 07:16:54.172] @gammaloop_api::se... INFO : Running command set model Gf=1.166390e-05
903.62 s
gammaloop-nextest-integration> [2026-09-06 07:16:54.175] @gammaloop_api::se... INFO : Running command set model MZ=91.188
903.62 s
gammaloop-nextest-integration> [2026-09-06 07:16:54.179] @gammaloop_api::se... INFO : Running command set global string '
903.62 s
gammaloop-nextest-integration> [global.generation.compile]
903.62 s
gammaloop-nextest-integration> compilation_mode = "assembly"
903.62 s
gammaloop-nextest-integration> optimization_level = "O0"
903.62 s
gammaloop-nextest-integration> fast_math = false
903.62 s
gammaloop-nextest-integration> [...]
903.62 s
gammaloop-nextest-integration> [2026-09-06 07:16:54.180] @gammaloop_api::se... INFO : Running command import graphs ./examples/cli/aa_aa/1L/aa_aa_1L.dot -p aa_aa_all_helicities_assembly -i 1L_ppmm -o
903.62 s
gammaloop-nextest-integration> [2026-09-06 07:16:54.180] @commands::import INFO : Loading graphs from '/build/source/examples/cli/aa_aa/1L/aa_aa_1L.dot'
903.62 s
gammaloop-nextest-integration> [2026-09-06 07:16:54.187] @gammaloop_api::se... INFO : Running command generate existing -p aa_aa_all_helicities_assembly
903.62 s
gammaloop-nextest-integration> [2026-09-06 07:17:16.399] @processes::amplitude INFO : Compiling amplitude 1L_ppmm
903.62 s
gammaloop-nextest-integration> [2026-09-06 07:17:35.501] @commands::generate INFO : Removed 34 generated C++ source file(s). Use '--keep-sources' to keep them.
903.62 s
gammaloop-nextest-integration> [2026-09-06 07:17:35.501] @commands::generate INFO :
903.62 s
gammaloop-nextest-integration> Integrand generation summary
903.62 s
gammaloop-nextest-integration> peak RAM 2.20 GiB | cores 1
903.62 s
gammaloop-nextest-integration> ╭───────────┬───────┬─────────┬──────────────┬──────────────┬────────────────┬──────────────╮
903.62 s
gammaloop-nextest-integration> │ integrand │ graph │ # evals │ expr build │ spenso │ symbolica eval │ compile │
903.62 s
gammaloop-nextest-integration> ├───────────┼───────┼─────────┼──────────────┼──────────────┼────────────────┼──────────────┤
903.62 s
gammaloop-nextest-integration> │ 1L_ppmm │ GL0 │ 13 │ 500ms (3.6%) │ 1.39s (10%) │ 5.50s (40%) │ 6.41s (46%) │
903.62 s
gammaloop-nextest-integration> │ 1L_ppmm │ GL2 │ 13 │ 493ms (3.5%) │ 1.41s (9.9%) │ 5.58s (39%) │ 6.80s (48%) │
903.62 s
gammaloop-nextest-integration> │ 1L_ppmm │ GL4 │ 11 │ 485ms (3.7%) │ 1.40s (11%) │ 5.44s (41%) │ 5.88s (45%) │
903.62 s
gammaloop-nextest-integration> ├───────────┼───────┼─────────┼──────────────┼──────────────┼────────────────┼──────────────┤
903.62 s
gammaloop-nextest-integration> │ Total │ │ 37 │ 1.48s (3.6%) │ 4.20s (10%) │ 16.52s (40%) │ 19.09s (46%) │
903.62 s
gammaloop-nextest-integration> ╰───────────┴───────┴─────────┴──────────────┴──────────────┴────────────────┴──────────────╯
903.62 s
gammaloop-nextest-integration> [2026-09-06 07:17:36.385] @gammaloop_api::se... INFO : Running command set process -p aa_aa_all_helicities -i 1L_ppmm string '
903.62 s
gammaloop-nextest-integration> [stability]
903.62 s
gammaloop-nextest-integration> check_on_norm = true
903.62 s
gammaloop-nextest-integration> escalate_if_exact_zero = false
903.62 s
gammaloop-nextest-integration> loop_momenta_norm_escalation_factor = -1.0
903.62 s
gammaloop-nextest-integration> [...]
903.62 s
gammaloop-nextest-integration> [2026-09-06 07:17:36.386] @gammaloop_api::se... INFO : Running command set process -p aa_aa_all_helicities_assembly -i 1L_ppmm string '
903.62 s
gammaloop-nextest-integration> [stability]
903.62 s
gammaloop-nextest-integration> check_on_norm = true
903.62 s
gammaloop-nextest-integration> escalate_if_exact_zero = false
903.62 s
gammaloop-nextest-integration> loop_momenta_norm_escalation_factor = -1.0
903.62 s
gammaloop-nextest-integration> [...]
903.62 s
gammaloop-nextest-integration> [2026-09-06 07:17:36.387] @gammaloop_api::se... INFO : Running command set process -p aa_aa_all_helicities -i 1L_mpmm string '
903.62 s
gammaloop-nextest-integration> [stability]
903.62 s
gammaloop-nextest-integration> check_on_norm = true
903.62 s
gammaloop-nextest-integration> escalate_if_exact_zero = false
903.62 s
gammaloop-nextest-integration> loop_momenta_norm_escalation_factor = -1.0
903.62 s
gammaloop-nextest-integration> [...]
903.62 s
gammaloop-nextest-integration> [2026-09-06 07:17:36.388] @gammaloop_api::se... INFO : Running command set process -p aa_aa_all_helicities_assembly -i 1L_mpmm string '
903.62 s
gammaloop-nextest-integration> [stability]
903.62 s
gammaloop-nextest-integration> check_on_norm = true
903.62 s
gammaloop-nextest-integration> escalate_if_exact_zero = false
903.62 s
gammaloop-nextest-integration> loop_momenta_norm_escalation_factor = -1.0
903.62 s
gammaloop-nextest-integration> [...]
903.62 s
gammaloop-nextest-integration> [2026-09-06 07:17:36.389] @gammaloop_api::se... INFO : Running command set process -p aa_aa_all_helicities -i 1L_mmmm string '
903.62 s
gammaloop-nextest-integration> [stability]
903.62 s
gammaloop-nextest-integration> check_on_norm = true
903.62 s
gammaloop-nextest-integration> escalate_if_exact_zero = false
903.62 s
gammaloop-nextest-integration> loop_momenta_norm_escalation_factor = -1.0
903.62 s
gammaloop-nextest-integration> [...]
903.62 s
gammaloop-nextest-integration> [2026-09-06 07:17:36.390] @gammaloop_api::se... INFO : Running command set process -p aa_aa_all_helicities_assembly -i 1L_mmmm string '
903.62 s
gammaloop-nextest-integration> [stability]
903.62 s
gammaloop-nextest-integration> check_on_norm = true
903.62 s
gammaloop-nextest-integration> escalate_if_exact_zero = false
903.62 s
gammaloop-nextest-integration> loop_momenta_norm_escalation_factor = -1.0
903.62 s
gammaloop-nextest-integration> [...]
903.62 s
gammaloop-nextest-integration> [2026-09-06 07:17:36.391] @gammaloop_api::se... INFO : Running command set process -p aa_aa_all_helicities -i 1L_pmmp string '
903.62 s
gammaloop-nextest-integration> [stability]
903.62 s
gammaloop-nextest-integration> check_on_norm = true
903.62 s
gammaloop-nextest-integration> escalate_if_exact_zero = false
903.62 s
gammaloop-nextest-integration> loop_momenta_norm_escalation_factor = -1.0
903.62 s
gammaloop-nextest-integration> ... omitted 84 more lines; see full nextest output above
903.62 s
gammaloop-nextest-integration> =========================================
903.72 s
error: Cannot build '/nix/store/3qpyi4i089mjhqx61pnq05lcl2pfrw3d-gammaloop-nextest-integration.drv '.
903.72 s
Reason: builder failed with exit code 100 .
903.72 s
Output paths:
903.72 s
/nix/store/qyb58cjmy2g43lf39wd171npb5v3mmpa-gammaloop-nextest-integration
903.72 s
Last 586 log lines:
903.72 s
> Extracting 13 binaries, 1 build script output directory, and 3 linked paths to /build/nextest-archive-NQT8UU
903.72 s
> Extracted 30 files to /build/nextest-archive-NQT8UU in 4.02s
903.72 s
> ------------
903.72 s
> Nextest run ID 6aed0418-7abc-45b2-8ea8-4c0f1aa68250 with nextest profile: ci_gammaloop
903.72 s
> Starting 152 tests across 13 binaries (208 tests skipped , including 207 tests via profile.ci_gammaloop.default-filter )
903.72 s
> FAIL [ 69.376s] ( 54/152) gammaloop-integration-tests::test_runs aa_aa::important :: aa_aa_local_inspect_backend_consistency
903.72 s
> stdout ---
903.72 s
>
903.72 s
> running 1 test
903.72 s
> test aa_aa::important::aa_aa_local_inspect_backend_consistency has been running for over 60 seconds
903.72 s
> test aa_aa::important::aa_aa_local_inspect_backend_consistency ... FAILED
903.72 s
>
903.72 s
> failures:
903.72 s
>
903.72 s
> failures:
903.72 s
> aa_aa::important::aa_aa_local_inspect_backend_consistency
903.72 s
>
903.72 s
> test result: FAILED. 0 passed; 1 failed; 0 ignored; 0 measured; 258 filtered out; finished in 69.15s
903.72 s
>
903.72 s
> stderr ---
903.72 s
> [2026-09-06 07:16:27.882] @gammaloop_api::se... INFO : Running command import model sm-default.json
903.72 s
> [2026-09-06 07:16:27.882] @import::model INFO : Loading built-in JSON model sm-default
903.72 s
> [2026-09-06 07:16:27.903] @gammalooprs::model INFO : The following 11 external parameters were forced to zero by the restriction card:
903.72 s
> lamWS, AWS, rhoWS, etaWS, ymc, yme, ymm, MC, Me, MM, WTau
903.72 s
> [2026-09-06 07:16:27.903] @gammalooprs::model INFO : The following 34 vertex rules were removed by the restriction card:
903.72 s
> V_82 -> (c~, d, G+) | V_83 -> (t~, d, G+) | V_84 -> (c~, s, G+) | V_85 -> (t~, s, G+) | V_86 -> (u~, b, G+) | V_87 -> (c~, b, G+) | V_90 -> (c~, d, W+) | V_91 -> (t~, d, W+) | V_92 -> (u~, s, W+) | V_94 -> (t~, s, W+) | V_95 -> (u~, b, W+) | V_96 -> (c~, b, W+) | V_101 -> (e+, e-, G0) | V_102 -> (mu+, mu-, G0) | V_104 -> (e+, e-, H) | V_105 -> (mu+, mu-, H) | V_110 -> (ve~, e-, G+) | V_111 -> (vm~, mu-, G+) | V_116 -> (b~, u, G-) | V_117 -> (d~, c, G-) | V_118 -> (s~, c, G-) | V_119 -> (b~, c, G-) | V_120 -> (d~, t, G-) | V_121 -> (s~, t, G-) | V_124 -> (s~, u, W-) | V_125 -> (b~, u, W-) | V_126 -> (d~, c, W-) | V_128 -> (b~, c, W-) | V_129 -> (d~, t, W-) | V_130 -> (s~, t, W-) | V_138 -> (c~, c, G0) | V_140 -> (c~, c, H) | V_145 -> (e+, ve, G-) | V_146 -> (mu+, vm, G-)
903.72 s
> [2026-09-06 07:16:27.903] @gammalooprs::model INFO : The following 36 couplings were removed by the restriction card:
903.72 s
> GC_13, GC_14, GC_16, GC_17, GC_18, GC_19, GC_20, GC_22, GC_23, GC_24, GC_25, GC_26, GC_28, GC_29, GC_42, GC_43, GC_44, GC_46, GC_47, GC_48, GC_84, GC_85, GC_86, GC_87, GC_88, GC_89, GC_90, GC_91, GC_92, GC_93, GC_101, GC_102, GC_103, GC_105, GC_106, GC_107
903.72 s
> [2026-09-06 07:16:27.903] @gammaloop_api::se... INFO : Running command run set_model_parameters
903.72 s
> [2026-09-06 07:16:27.903] @gammaloop_api::se... INFO : Starting command block set_model_parameters
903.72 s
> [2026-09-06 07:16:27.904] @gammaloop_api::se... INFO : Running command set model MT=173.0
903.72 s
> [2026-09-06 07:16:27.908] @gammaloop_api::se... INFO : Running command set model WT=0.0
903.72 s
> [2026-09-06 07:16:27.911] @gammaloop_api::se... INFO : Running command set model ymt=173.0
903.72 s
> [2026-09-06 07:16:27.915] @gammaloop_api::se... INFO : Running command set model aS=0.118
903.72 s
> [2026-09-06 07:16:27.919] @gammaloop_api::se... INFO : Running command set model aEWM1=137.036
903.72 s
> [2026-09-06 07:16:27.922] @gammaloop_api::se... INFO : Running command set model Gf=1.166390e-05
903.72 s
> [2026-09-06 07:16:27.926] @gammaloop_api::se... INFO : Running command set model MZ=91.188
903.72 s
> [2026-09-06 07:16:27.930] @gammaloop_api::se... INFO : Running command set global string '
903.72 s
> [global.generation.compile]
903.72 s
> compilation_mode = "symjit"
903.72 s
> optimization_level = "O0"
903.72 s
> fast_math = false
903.72 s
> [...]
903.72 s
> [2026-09-06 07:16:27.930] @gammaloop_api::se... INFO : Running command import graphs ./examples/cli/aa_aa/1L/aa_aa_1L.dot -p aa_aa_all_helicities -i 1L_ppmm -o
903.72 s
> [2026-09-06 07:16:27.930] @commands::import INFO : Loading graphs from '/build/source/examples/cli/aa_aa/1L/aa_aa_1L.dot'
903.72 s
> [2026-09-06 07:16:27.939] @gammaloop_api::se... INFO : Running command generate existing -p aa_aa_all_helicities
903.72 s
> [2026-09-06 07:16:53.477] @commands::generate INFO :
903.72 s
> Integrand generation summary
903.72 s
> peak RAM 1.06 GiB | cores 1
903.72 s
> ╭───────────┬───────┬─────────┬──────────────┬─────────────┬────────────────┬──────────────╮
903.72 s
> │ integrand │ graph │ # evals │ expr build │ spenso │ symbolica eval │ compile │
903.72 s
> ├───────────┼───────┼─────────┼──────────────┼─────────────┼────────────────┼──────────────┤
903.72 s
> │ 1L_ppmm │ GL0 │ 13 │ 544ms (6.2% ) │ 1.76s (20% ) │ 5.63s (64% ) │ 844ms (9.6% ) │
903.72 s
> │ 1L_ppmm │ GL2 │ 13 │ 545ms (6.4% ) │ 1.46s (17% ) │ 5.67s (67% ) │ 802ms (9.5% ) │
903.72 s
> │ 1L_ppmm │ GL4 │ 11 │ 533ms (6.5% ) │ 1.40s (17% ) │ 5.49s (67% ) │ 796ms (9.7% ) │
903.72 s
> ├───────────┼───────┼─────────┼──────────────┼─────────────┼────────────────┼──────────────┤
903.72 s
> │ Total │ │ 37 │ 1.62s (6.4% ) │ 4.62s (18% ) │ 16.79s (66% ) │ 2.44s (9.6% ) │
903.72 s
> ╰───────────┴───────┴─────────┴──────────────┴─────────────┴────────────────┴──────────────╯
903.72 s
> [2026-09-06 07:16:54.136] @gammaloop_api::se... INFO : Running command import model sm-default.json
903.72 s
> [2026-09-06 07:16:54.136] @import::model INFO : Loading built-in JSON model sm-default
903.72 s
> [2026-09-06 07:16:54.155] @gammalooprs::model INFO : The following 11 external parameters were forced to zero by the restriction card:
903.72 s
> lamWS, AWS, rhoWS, etaWS, ymc, yme, ymm, MC, Me, MM, WTau
903.72 s
> [2026-09-06 07:16:54.155] @gammalooprs::model INFO : The following 34 vertex rules were removed by the restriction card:
903.72 s
> V_82 -> (c~, d, G+) | V_83 -> (t~, d, G+) | V_84 -> (c~, s, G+) | V_85 -> (t~, s, G+) | V_86 -> (u~, b, G+) | V_87 -> (c~, b, G+) | V_90 -> (c~, d, W+) | V_91 -> (t~, d, W+) | V_92 -> (u~, s, W+) | V_94 -> (t~, s, W+) | V_95 -> (u~, b, W+) | V_96 -> (c~, b, W+) | V_101 -> (e+, e-, G0) | V_102 -> (mu+, mu-, G0) | V_104 -> (e+, e-, H) | V_105 -> (mu+, mu-, H) | V_110 -> (ve~, e-, G+) | V_111 -> (vm~, mu-, G+) | V_116 -> (b~, u, G-) | V_117 -> (d~, c, G-) | V_118 -> (s~, c, G-) | V_119 -> (b~, c, G-) | V_120 -> (d~, t, G-) | V_121 -> (s~, t, G-) | V_124 -> (s~, u, W-) | V_125 -> (b~, u, W-) | V_126 -> (d~, c, W-) | V_128 -> (b~, c, W-) | V_129 -> (d~, t, W-) | V_130 -> (s~, t, W-) | V_138 -> (c~, c, G0) | V_140 -> (c~, c, H) | V_145 -> (e+, ve, G-) | V_146 -> (mu+, vm, G-)
903.72 s
> [2026-09-06 07:16:54.155] @gammalooprs::model INFO : The following 36 couplings were removed by the restriction card:
903.72 s
> GC_13, GC_14, GC_16, GC_17, GC_18, GC_19, GC_20, GC_22, GC_23, GC_24, GC_25, GC_26, GC_28, GC_29, GC_42, GC_43, GC_44, GC_46, GC_47, GC_48, GC_84, GC_85, GC_86, GC_87, GC_88, GC_89, GC_90, GC_91, GC_92, GC_93, GC_101, GC_102, GC_103, GC_105, GC_106, GC_107
903.72 s
> [2026-09-06 07:16:54.155] @gammaloop_api::se... INFO : Running command run set_model_parameters
903.72 s
> [2026-09-06 07:16:54.155] @gammaloop_api::se... INFO : Starting command block set_model_parameters
903.72 s
> [2026-09-06 07:16:54.156] @gammaloop_api::se... INFO : Running command set model MT=173.0
903.72 s
> [2026-09-06 07:16:54.159] @gammaloop_api::se... INFO : Running command set model WT=0.0
903.72 s
> [2026-09-06 07:16:54.162] @gammaloop_api::se... INFO : Running command set model ymt=173.0
903.72 s
> [2026-09-06 07:16:54.165] @gammaloop_api::se... INFO : Running command set model aS=0.118
903.72 s
> [2026-09-06 07:16:54.169] @gammaloop_api::se... INFO : Running command set model aEWM1=137.036
903.72 s
> [2026-09-06 07:16:54.172] @gammaloop_api::se... INFO : Running command set model Gf=1.166390e-05
903.72 s
> [2026-09-06 07:16:54.175] @gammaloop_api::se... INFO : Running command set model MZ=91.188
903.72 s
> [2026-09-06 07:16:54.179] @gammaloop_api::se... INFO : Running command set global string '
903.72 s
> [global.generation.compile]
903.72 s
> compilation_mode = "assembly"
903.72 s
> optimization_level = "O0"
903.72 s
> fast_math = false
903.72 s
> [...]
903.72 s
> [2026-09-06 07:16:54.180] @gammaloop_api::se... INFO : Running command import graphs ./examples/cli/aa_aa/1L/aa_aa_1L.dot -p aa_aa_all_helicities_assembly -i 1L_ppmm -o
903.72 s
> [2026-09-06 07:16:54.180] @commands::import INFO : Loading graphs from '/build/source/examples/cli/aa_aa/1L/aa_aa_1L.dot'
903.72 s
> [2026-09-06 07:16:54.187] @gammaloop_api::se... INFO : Running command generate existing -p aa_aa_all_helicities_assembly
903.72 s
> [2026-09-06 07:17:16.399] @processes::amplitude INFO : Compiling amplitude 1L_ppmm
903.72 s
> [2026-09-06 07:17:35.501] @commands::generate INFO : Removed 34 generated C++ source file(s). Use '--keep-sources ' to keep them.
903.72 s
> [2026-09-06 07:17:35.501] @commands::generate INFO :
903.72 s
> Integrand generation summary
903.72 s
> peak RAM 2.20 GiB | cores 1
903.72 s
> ╭───────────┬───────┬─────────┬──────────────┬──────────────┬────────────────┬──────────────╮
903.72 s
> │ integrand │ graph │ # evals │ expr build │ spenso │ symbolica eval │ compile │
903.72 s
> ├───────────┼───────┼─────────┼──────────────┼──────────────┼────────────────┼──────────────┤
903.72 s
> │ 1L_ppmm │ GL0 │ 13 │ 500ms (3.6% ) │ 1.39s (10% ) │ 5.50s (40% ) │ 6.41s (46% ) │
903.72 s
> │ 1L_ppmm │ GL2 │ 13 │ 493ms (3.5% ) │ 1.41s (9.9% ) │ 5.58s (39% ) │ 6.80s (48% ) │
903.72 s
> │ 1L_ppmm │ GL4 │ 11 │ 485ms (3.7% ) │ 1.40s (11% ) │ 5.44s (41% ) │ 5.88s (45% ) │
903.72 s
> ├───────────┼───────┼─────────┼──────────────┼──────────────┼────────────────┼──────────────┤
903.72 s
> │ Total │ │ 37 │ 1.48s (3.6% ) │ 4.20s (10% ) │ 16.52s (40% ) │ 19.09s (46% ) │
903.72 s
> ╰───────────┴───────┴─────────┴──────────────┴──────────────┴────────────────┴──────────────╯
903.72 s
> [2026-09-06 07:17:36.385] @gammaloop_api::se... INFO : Running command set process -p aa_aa_all_helicities -i 1L_ppmm string '
903.72 s
> [stability]
903.72 s
> check_on_norm = true
903.72 s
> escalate_if_exact_zero = false
903.72 s
> loop_momenta_norm_escalation_factor = -1.0
903.72 s
> [...]
903.72 s
> [2026-09-06 07:17:36.386] @gammaloop_api::se... INFO : Running command set process -p aa_aa_all_helicities_assembly -i 1L_ppmm string '
903.72 s
> [stability]
903.72 s
> check_on_norm = true
903.72 s
> escalate_if_exact_zero = false
903.72 s
> loop_momenta_norm_escalation_factor = -1.0
903.72 s
> [...]
903.72 s
> [2026-09-06 07:17:36.387] @gammaloop_api::se... INFO : Running command set process -p aa_aa_all_helicities -i 1L_mpmm string '
903.72 s
> [stability]
903.72 s
> check_on_norm = true
903.72 s
> escalate_if_exact_zero = false
903.72 s
> loop_momenta_norm_escalation_factor = -1.0
903.72 s
> [...]
903.72 s
> [2026-09-06 07:17:36.388] @gammaloop_api::se... INFO : Running command set process -p aa_aa_all_helicities_assembly -i 1L_mpmm string '
903.72 s
> [stability]
903.72 s
> check_on_norm = true
903.72 s
> escalate_if_exact_zero = false
903.72 s
> loop_momenta_norm_escalation_factor = -1.0
903.72 s
> [...]
903.72 s
> [2026-09-06 07:17:36.389] @gammaloop_api::se... INFO : Running command set process -p aa_aa_all_helicities -i 1L_mmmm string '
903.72 s
> [stability]
903.72 s
> check_on_norm = true
903.72 s
> escalate_if_exact_zero = false
903.72 s
> loop_momenta_norm_escalation_factor = -1.0
903.72 s
> [...]
903.72 s
> [2026-09-06 07:17:36.390] @gammaloop_api::se... INFO : Running command set process -p aa_aa_all_helicities_assembly -i 1L_mmmm string '
903.72 s
> [stability]
903.72 s
> check_on_norm = true
903.72 s
> escalate_if_exact_zero = false
903.72 s
> loop_momenta_norm_escalation_factor = -1.0
903.72 s
> [...]
903.72 s
> [2026-09-06 07:17:36.391] @gammaloop_api::se... INFO : Running command set process -p aa_aa_all_helicities -i 1L_pmmp string '
903.72 s
> [stability]
903.72 s
> check_on_norm = true
903.72 s
> escalate_if_exact_zero = false
903.72 s
> loop_momenta_norm_escalation_factor = -1.0
903.72 s
> [...]
903.72 s
> [2026-09-06 07:17:36.392] @gammaloop_api::se... INFO : Running command set process -p aa_aa_all_helicities_assembly -i 1L_pmmp string '
903.72 s
> [stability]
903.72 s
> check_on_norm = true
903.72 s
> escalate_if_exact_zero = false
903.72 s
> loop_momenta_norm_escalation_factor = -1.0
903.72 s
> [...]
903.72 s
> [2026-09-06 07:17:36.393] @gammaloop_api::se... INFO : Running command set process -p aa_aa_all_helicities -i 1L_pmpm string '
903.72 s
> [stability]
903.72 s
> check_on_norm = true
903.72 s
> escalate_if_exact_zero = false
903.72 s
> loop_momenta_norm_escalation_factor = -1.0
903.72 s
> [...]
903.72 s
> [2026-09-06 07:17:36.394] @gammaloop_api::se... INFO : Running command set process -p aa_aa_all_helicities_assembly -i 1L_pmpm string '
903.72 s
> [stability]
903.72 s
> check_on_norm = true
903.72 s
> escalate_if_exact_zero = false
903.72 s
> loop_momenta_norm_escalation_factor = -1.0
903.72 s
> [...]
903.72 s
> [2026-09-06 07:17:36.402] @process::amplitude INFO : Input is below threshold: 0 existing threshold E-surfaces across 0/1 graph groups
903.72 s
> [2026-09-06 07:17:36.402] @process::amplitude INFO : overlap structure of group 0: [0: []]
903.72 s
> [2026-09-06 07:17:36.402] @integrands::process [{#im_is_nan, #re_is_nan}] WARNING : final process evaluation is nonfinite
903.72 s
> [2026-09-06 07:17:36.402] @commands::inspect INFO :
903.72 s
> Input point in momentum space:
903.72 s
>
903.72 s
> ( 0.1100000000000000, -0.0700000000000000, 0.1900000000000000 )
903.72 s
>
903.72 s
> The evaluation of integrand '1L_ppmm' is:
903.72 s
>
903.72 s
> ( +0.0000000000000000e0, +0.0000000000000000e0 i)
903.72 s
>
903.72 s
> [2026-09-06 07:17:36.408] @process::amplitude INFO : Input is below threshold: 0 existing threshold E-surfaces across 0/1 graph groups
903.72 s
> [2026-09-06 07:17:36.408] @process::amplitude INFO : overlap structure of group 0: [0: []]
903.72 s
> [2026-09-06 07:17:36.409] @commands::inspect INFO :
903.72 s
> Input point in momentum space:
903.72 s
>
903.72 s
> ( 0.1100000000000000, -0.0700000000000000, 0.1900000000000000 )
903.72 s
>
903.72 s
> The evaluation of integrand '1L_ppmm' is:
903.72 s
>
903.72 s
> ( -1.7132462539328486e-28, -8.7105072229446864e-10 i)
903.72 s
>
903.72 s
> The application panicked (crashed).
903.72 s
> Message: kinematics=a, integrand=1L_ppmm, graph_id=0: assembly vs symjit inspect: actual=(-0.00000000000000000000000000017132462539328486+-0.0000000008710507222944686i), expected=(0+0i), tolerance=0.0000000001
903.72 s
> Location: tests/tests/test_runs/utils.rs :466
903.72 s
>
903.72 s
> ━━━━━━━━━━━━━━━━━━━━━━━━━━━━━━━━━━ BACKTRACE ━━━━━━━━━━━━━━━━━━━━━━━━━━━━━━━━━━━
903.72 s
> 1: <color_eyre[51793ea62743adbd]::config::PanicHook>::panic_report <unknown>
903.72 s
> at <unknown source file> :<unknown line>
903.72 s
> 2: <color_eyre[51793ea62743adbd]::config::PanicHook>::into_panic_hook::{closure#0} <unknown>
903.72 s
> at <unknown source file> :<unknown line>
903.72 s
> 3: std[bcb96dfbba0ab899]::panicking::panic_with_hook <unknown>
903.72 s
> at <unknown source file> :<unknown line>
903.72 s
> 4: std[bcb96dfbba0ab899]::panicking::panic_handler::{closure#0} <unknown>
903.72 s
> at <unknown source file> :<unknown line>
903.72 s
> 5: std[bcb96dfbba0ab899]::sys::backtrace::__rust_end_short_backtrace::<std[bcb96dfbba0ab899]::panicking::panic_handler::{closure#0}, !> <unknown>
903.72 s
> at <unknown source file> :<unknown line>
903.72 s
> 6: __rustc[6c289b9f9c454d21]::rust_begin_unwind <unknown>
903.72 s
> at <unknown source file> :<unknown line>
903.72 s
> 7: core[940e698046960fd5]::panicking::panic_fmt <unknown>
903.72 s
> at <unknown source file> :<unknown line>
903.72 s
> 8: <test_runs[66584badfeb6c7be]::aa_aa::important::aa_aa_local_inspect_backend_consistency::{closure#0} as core[940e698046960fd5]::ops::function::FnOnce<()>>::call_once <unknown>
903.72 s
> at <unknown source file> :<unknown line>
903.72 s
> 9: serial_test[cd99724524a2f1c0]::serial_code_lock::local_serial_core_with_return::<(), eyre[cb2fd339c0c40fca]::Report> <unknown>
903.72 s
> at <unknown source file> :<unknown line>
903.72 s
> 10: <test_runs[66584badfeb6c7be]::aa_aa::important::aa_aa_local_inspect_backend_consistency::{closure#0} as core[940e698046960fd5]::ops::function::FnOnce<()>>::call_once <unknown>
903.72 s
> at <unknown source file> :<unknown line>
903.72 s
> 11: test[75d6903177b1d7e9]::__rust_begin_short_backtrace::<core[940e698046960fd5]::result::Result<(), alloc[2ea6bcb46fca0c42]::string::String>, fn() -> core[940e698046960fd5]::result::Result<(), alloc[2ea6bcb46fca0c42]::string::String>> <unknown>
903.72 s
> at <unknown source file> :<unknown line>
903.72 s
> 12: test[75d6903177b1d7e9]::run_test::{closure#0} <unknown>
903.72 s
> at <unknown source file> :<unknown line>
903.72 s
> 13: std[bcb96dfbba0ab899]::sys::backtrace::__rust_begin_short_backtrace::<test[75d6903177b1d7e9]::run_test::{closure#1}, ()> <unknown>
903.72 s
> at <unknown source file> :<unknown line>
903.72 s
> 14: <std[bcb96dfbba0ab899]::thread::lifecycle::spawn_unchecked<test[75d6903177b1d7e9]::run_test::{closure#1}, ()>::{closure#1} as core[940e698046960fd5]::ops::function::FnOnce<()>>::call_once::{shim:vtable#0} <unknown>
903.72 s
> at <unknown source file> :<unknown line>
903.72 s
> 15: <std[bcb96dfbba0ab899]::sys::thread::unix::Thread>::new::thread_start <unknown>
903.72 s
> at <unknown source file> :<unknown line>
903.72 s
> 16: start_thread <unknown>
903.72 s
> at <unknown source file> :<unknown line>
903.72 s
> 17: __clone3 <unknown>
903.72 s
> at <unknown source file> :<unknown line>
903.72 s
>
903.72 s
> Run with COLORBT_SHOW_HIDDEN=1 environment variable to disable frame filtering.
903.72 s
> Run with RUST_BACKTRACE=full to include source snippets.
903.72 s
>
903.72 s
> ------------
903.72 s
> Summary [ 875.579s] 152 tests run: 151 passed , 1 failed , 208 skipped
903.72 s
> FAIL [ 69.376s] ( 54/152) gammaloop-integration-tests::test_runs aa_aa::important :: aa_aa_local_inspect_backend_consistency
903.72 s
> stdout ---
903.72 s
>
903.72 s
> running 1 test
903.72 s
> test aa_aa::important::aa_aa_local_inspect_backend_consistency has been running for over 60 seconds
903.72 s
> test aa_aa::important::aa_aa_local_inspect_backend_consistency ... FAILED
903.72 s
>
903.72 s
> failures:
903.72 s
>
903.72 s
> failures:
903.72 s
> aa_aa::important::aa_aa_local_inspect_backend_consistency
903.72 s
>
903.72 s
> test result: FAILED. 0 passed; 1 failed; 0 ignored; 0 measured; 258 filtered out; finished in 69.15s
903.72 s
>
903.72 s
> stderr ---
903.72 s
> [2026-09-06 07:16:27.882] @gammaloop_api::se... INFO : Running command import model sm-default.json
903.72 s
> [2026-09-06 07:16:27.882] @import::model INFO : Loading built-in JSON model sm-default
903.72 s
> [2026-09-06 07:16:27.903] @gammalooprs::model INFO : The following 11 external parameters were forced to zero by the restriction card:
903.72 s
> lamWS, AWS, rhoWS, etaWS, ymc, yme, ymm, MC, Me, MM, WTau
903.72 s
> [2026-09-06 07:16:27.903] @gammalooprs::model INFO : The following 34 vertex rules were removed by the restriction card:
903.72 s
> V_82 -> (c~, d, G+) | V_83 -> (t~, d, G+) | V_84 -> (c~, s, G+) | V_85 -> (t~, s, G+) | V_86 -> (u~, b, G+) | V_87 -> (c~, b, G+) | V_90 -> (c~, d, W+) | V_91 -> (t~, d, W+) | V_92 -> (u~, s, W+) | V_94 -> (t~, s, W+) | V_95 -> (u~, b, W+) | V_96 -> (c~, b, W+) | V_101 -> (e+, e-, G0) | V_102 -> (mu+, mu-, G0) | V_104 -> (e+, e-, H) | V_105 -> (mu+, mu-, H) | V_110 -> (ve~, e-, G+) | V_111 -> (vm~, mu-, G+) | V_116 -> (b~, u, G-) | V_117 -> (d~, c, G-) | V_118 -> (s~, c, G-) | V_119 -> (b~, c, G-) | V_120 -> (d~, t, G-) | V_121 -> (s~, t, G-) | V_124 -> (s~, u, W-) | V_125 -> (b~, u, W-) | V_126 -> (d~, c, W-) | V_128 -> (b~, c, W-) | V_129 -> (d~, t, W-) | V_130 -> (s~, t, W-) | V_138 -> (c~, c, G0) | V_140 -> (c~, c, H) | V_145 -> (e+, ve, G-) | V_146 -> (mu+, vm, G-)
903.72 s
> [2026-09-06 07:16:27.903] @gammalooprs::model INFO : The following 36 couplings were removed by the restriction card:
903.72 s
> GC_13, GC_14, GC_16, GC_17, GC_18, GC_19, GC_20, GC_22, GC_23, GC_24, GC_25, GC_26, GC_28, GC_29, GC_42, GC_43, GC_44, GC_46, GC_47, GC_48, GC_84, GC_85, GC_86, GC_87, GC_88, GC_89, GC_90, GC_91, GC_92, GC_93, GC_101, GC_102, GC_103, GC_105, GC_106, GC_107
903.72 s
> [2026-09-06 07:16:27.903] @gammaloop_api::se... INFO : Running command run set_model_parameters
903.72 s
> [2026-09-06 07:16:27.903] @gammaloop_api::se... INFO : Starting command block set_model_parameters
903.72 s
> [2026-09-06 07:16:27.904] @gammaloop_api::se... INFO : Running command set model MT=173.0
903.72 s
> [2026-09-06 07:16:27.908] @gammaloop_api::se... INFO : Running command set model WT=0.0
903.72 s
> [2026-09-06 07:16:27.911] @gammaloop_api::se... INFO : Running command set model ymt=173.0
903.72 s
> [2026-09-06 07:16:27.915] @gammaloop_api::se... INFO : Running command set model aS=0.118
903.72 s
> [2026-09-06 07:16:27.919] @gammaloop_api::se... INFO : Running command set model aEWM1=137.036
903.72 s
> [2026-09-06 07:16:27.922] @gammaloop_api::se... INFO : Running command set model Gf=1.166390e-05
903.72 s
> [2026-09-06 07:16:27.926] @gammaloop_api::se... INFO : Running command set model MZ=91.188
903.72 s
> [2026-09-06 07:16:27.930] @gammaloop_api::se... INFO : Running command set global string '
903.72 s
> [global.generation.compile]
903.72 s
> compilation_mode = "symjit"
903.72 s
> optimization_level = "O0"
903.72 s
> fast_math = false
903.72 s
> [...]
903.72 s
> [2026-09-06 07:16:27.930] @gammaloop_api::se... INFO : Running command import graphs ./examples/cli/aa_aa/1L/aa_aa_1L.dot -p aa_aa_all_helicities -i 1L_ppmm -o
903.72 s
> [2026-09-06 07:16:27.930] @commands::import INFO : Loading graphs from '/build/source/examples/cli/aa_aa/1L/aa_aa_1L.dot'
903.72 s
> [2026-09-06 07:16:27.939] @gammaloop_api::se... INFO : Running command generate existing -p aa_aa_all_helicities
903.72 s
> [2026-09-06 07:16:53.477] @commands::generate INFO :
903.72 s
> Integrand generation summary
903.72 s
> peak RAM 1.06 GiB | cores 1
903.72 s
> ╭───────────┬───────┬─────────┬──────────────┬─────────────┬────────────────┬──────────────╮
903.72 s
> │ integrand │ graph │ # evals │ expr build │ spenso │ symbolica eval │ compile │
903.72 s
> ├───────────┼───────┼─────────┼──────────────┼─────────────┼────────────────┼──────────────┤
903.72 s
> │ 1L_ppmm │ GL0 │ 13 │ 544ms (6.2% ) │ 1.76s (20% ) │ 5.63s (64% ) │ 844ms (9.6% ) │
903.72 s
> │ 1L_ppmm │ GL2 │ 13 │ 545ms (6.4% ) │ 1.46s (17% ) │ 5.67s (67% ) │ 802ms (9.5% ) │
903.72 s
> │ 1L_ppmm │ GL4 │ 11 │ 533ms (6.5% ) │ 1.40s (17% ) │ 5.49s (67% ) │ 796ms (9.7% ) │
903.72 s
> ├───────────┼───────┼─────────┼──────────────┼─────────────┼────────────────┼──────────────┤
903.72 s
> │ Total │ │ 37 │ 1.62s (6.4% ) │ 4.62s (18% ) │ 16.79s (66% ) │ 2.44s (9.6% ) │
903.72 s
> ╰───────────┴───────┴─────────┴──────────────┴─────────────┴────────────────┴──────────────╯
903.72 s
> [2026-09-06 07:16:54.136] @gammaloop_api::se... INFO : Running command import model sm-default.json
903.72 s
> [2026-09-06 07:16:54.136] @import::model INFO : Loading built-in JSON model sm-default
903.72 s
> [2026-09-06 07:16:54.155] @gammalooprs::model INFO : The following 11 external parameters were forced to zero by the restriction card:
903.72 s
> lamWS, AWS, rhoWS, etaWS, ymc, yme, ymm, MC, Me, MM, WTau
903.72 s
> [2026-09-06 07:16:54.155] @gammalooprs::model INFO : The following 34 vertex rules were removed by the restriction card:
903.72 s
> V_82 -> (c~, d, G+) | V_83 -> (t~, d, G+) | V_84 -> (c~, s, G+) | V_85 -> (t~, s, G+) | V_86 -> (u~, b, G+) | V_87 -> (c~, b, G+) | V_90 -> (c~, d, W+) | V_91 -> (t~, d, W+) | V_92 -> (u~, s, W+) | V_94 -> (t~, s, W+) | V_95 -> (u~, b, W+) | V_96 -> (c~, b, W+) | V_101 -> (e+, e-, G0) | V_102 -> (mu+, mu-, G0) | V_104 -> (e+, e-, H) | V_105 -> (mu+, mu-, H) | V_110 -> (ve~, e-, G+) | V_111 -> (vm~, mu-, G+) | V_116 -> (b~, u, G-) | V_117 -> (d~, c, G-) | V_118 -> (s~, c, G-) | V_119 -> (b~, c, G-) | V_120 -> (d~, t, G-) | V_121 -> (s~, t, G-) | V_124 -> (s~, u, W-) | V_125 -> (b~, u, W-) | V_126 -> (d~, c, W-) | V_128 -> (b~, c, W-) | V_129 -> (d~, t, W-) | V_130 -> (s~, t, W-) | V_138 -> (c~, c, G0) | V_140 -> (c~, c, H) | V_145 -> (e+, ve, G-) | V_146 -> (mu+, vm, G-)
903.72 s
> [2026-09-06 07:16:54.155] @gammalooprs::model INFO : The following 36 couplings were removed by the restriction card:
903.72 s
> GC_13, GC_14, GC_16, GC_17, GC_18, GC_19, GC_20, GC_22, GC_23, GC_24, GC_25, GC_26, GC_28, GC_29, GC_42, GC_43, GC_44, GC_46, GC_47, GC_48, GC_84, GC_85, GC_86, GC_87, GC_88, GC_89, GC_90, GC_91, GC_92, GC_93, GC_101, GC_102, GC_103, GC_105, GC_106, GC_107
903.72 s
> [2026-09-06 07:16:54.155] @gammaloop_api::se... INFO : Running command run set_model_parameters
903.72 s
> [2026-09-06 07:16:54.155] @gammaloop_api::se... INFO : Starting command block set_model_parameters
903.72 s
> [2026-09-06 07:16:54.156] @gammaloop_api::se... INFO : Running command set model MT=173.0
903.72 s
> [2026-09-06 07:16:54.159] @gammaloop_api::se... INFO : Running command set model WT=0.0
903.72 s
> [2026-09-06 07:16:54.162] @gammaloop_api::se... INFO : Running command set model ymt=173.0
903.72 s
> [2026-09-06 07:16:54.165] @gammaloop_api::se... INFO : Running command set model aS=0.118
903.72 s
> [2026-09-06 07:16:54.169] @gammaloop_api::se... INFO : Running command set model aEWM1=137.036
903.72 s
> [2026-09-06 07:16:54.172] @gammaloop_api::se... INFO : Running command set model Gf=1.166390e-05
903.72 s
> [2026-09-06 07:16:54.175] @gammaloop_api::se... INFO : Running command set model MZ=91.188
903.72 s
> [2026-09-06 07:16:54.179] @gammaloop_api::se... INFO : Running command set global string '
903.72 s
> [global.generation.compile]
903.72 s
> compilation_mode = "assembly"
903.72 s
> optimization_level = "O0"
903.72 s
> fast_math = false
903.72 s
> [...]
903.72 s
> [2026-09-06 07:16:54.180] @gammaloop_api::se... INFO : Running command import graphs ./examples/cli/aa_aa/1L/aa_aa_1L.dot -p aa_aa_all_helicities_assembly -i 1L_ppmm -o
903.72 s
> [2026-09-06 07:16:54.180] @commands::import INFO : Loading graphs from '/build/source/examples/cli/aa_aa/1L/aa_aa_1L.dot'
903.72 s
> [2026-09-06 07:16:54.187] @gammaloop_api::se... INFO : Running command generate existing -p aa_aa_all_helicities_assembly
903.72 s
> [2026-09-06 07:17:16.399] @processes::amplitude INFO : Compiling amplitude 1L_ppmm
903.72 s
> [2026-09-06 07:17:35.501] @commands::generate INFO : Removed 34 generated C++ source file(s). Use '--keep-sources ' to keep them.
903.72 s
> [2026-09-06 07:17:35.501] @commands::generate INFO :
903.72 s
> Integrand generation summary
903.72 s
> peak RAM 2.20 GiB | cores 1
903.72 s
> ╭───────────┬───────┬─────────┬──────────────┬──────────────┬────────────────┬──────────────╮
903.72 s
> │ integrand │ graph │ # evals │ expr build │ spenso │ symbolica eval │ compile │
903.72 s
> ├───────────┼───────┼─────────┼──────────────┼──────────────┼────────────────┼──────────────┤
903.72 s
> │ 1L_ppmm │ GL0 │ 13 │ 500ms (3.6% ) │ 1.39s (10% ) │ 5.50s (40% ) │ 6.41s (46% ) │
903.72 s
> │ 1L_ppmm │ GL2 │ 13 │ 493ms (3.5% ) │ 1.41s (9.9% ) │ 5.58s (39% ) │ 6.80s (48% ) │
903.72 s
> │ 1L_ppmm │ GL4 │ 11 │ 485ms (3.7% ) │ 1.40s (11% ) │ 5.44s (41% ) │ 5.88s (45% ) │
903.72 s
> ├───────────┼───────┼─────────┼──────────────┼──────────────┼────────────────┼──────────────┤
903.72 s
> │ Total │ │ 37 │ 1.48s (3.6% ) │ 4.20s (10% ) │ 16.52s (40% ) │ 19.09s (46% ) │
903.72 s
> ╰───────────┴───────┴─────────┴──────────────┴──────────────┴────────────────┴──────────────╯
903.72 s
> [2026-09-06 07:17:36.385] @gammaloop_api::se... INFO : Running command set process -p aa_aa_all_helicities -i 1L_ppmm string '
903.72 s
> [stability]
903.72 s
> check_on_norm = true
903.72 s
> escalate_if_exact_zero = false
903.72 s
> loop_momenta_norm_escalation_factor = -1.0
903.72 s
> [...]
903.72 s
> [2026-09-06 07:17:36.386] @gammaloop_api::se... INFO : Running command set process -p aa_aa_all_helicities_assembly -i 1L_ppmm string '
903.72 s
> [stability]
903.72 s
> check_on_norm = true
903.72 s
> escalate_if_exact_zero = false
903.72 s
> loop_momenta_norm_escalation_factor = -1.0
903.72 s
> [...]
903.72 s
> [2026-09-06 07:17:36.387] @gammaloop_api::se... INFO : Running command set process -p aa_aa_all_helicities -i 1L_mpmm string '
903.72 s
> [stability]
903.72 s
> check_on_norm = true
903.72 s
> escalate_if_exact_zero = false
903.72 s
> loop_momenta_norm_escalation_factor = -1.0
903.72 s
> [...]
903.72 s
> [2026-09-06 07:17:36.388] @gammaloop_api::se... INFO : Running command set process -p aa_aa_all_helicities_assembly -i 1L_mpmm string '
903.72 s
> [stability]
903.72 s
> check_on_norm = true
903.72 s
> escalate_if_exact_zero = false
903.72 s
> loop_momenta_norm_escalation_factor = -1.0
903.72 s
> [...]
903.72 s
> [2026-09-06 07:17:36.389] @gammaloop_api::se... INFO : Running command set process -p aa_aa_all_helicities -i 1L_mmmm string '
903.72 s
> [stability]
903.72 s
> check_on_norm = true
903.72 s
> escalate_if_exact_zero = false
903.72 s
> loop_momenta_norm_escalation_factor = -1.0
903.72 s
> [...]
903.72 s
> [2026-09-06 07:17:36.390] @gammaloop_api::se... INFO : Running command set process -p aa_aa_all_helicities_assembly -i 1L_mmmm string '
903.72 s
> [stability]
903.72 s
> check_on_norm = true
903.72 s
> escalate_if_exact_zero = false
903.72 s
> loop_momenta_norm_escalation_factor = -1.0
903.72 s
> [...]
903.72 s
> [2026-09-06 07:17:36.391] @gammaloop_api::se... INFO : Running command set process -p aa_aa_all_helicities -i 1L_pmmp string '
903.72 s
> [stability]
903.72 s
> check_on_norm = true
903.72 s
> escalate_if_exact_zero = false
903.72 s
> loop_momenta_norm_escalation_factor = -1.0
903.72 s
> [...]
903.72 s
> [2026-09-06 07:17:36.392] @gammaloop_api::se... INFO : Running command set process -p aa_aa_all_helicities_assembly -i 1L_pmmp string '
903.72 s
> [stability]
903.72 s
> check_on_norm = true
903.72 s
> escalate_if_exact_zero = false
903.72 s
> loop_momenta_norm_escalation_factor = -1.0
903.72 s
> [...]
903.72 s
> [2026-09-06 07:17:36.393] @gammaloop_api::se... INFO : Running command set process -p aa_aa_all_helicities -i 1L_pmpm string '
903.72 s
> [stability]
903.72 s
> check_on_norm = true
903.72 s
> escalate_if_exact_zero = false
903.72 s
> loop_momenta_norm_escalation_factor = -1.0
903.72 s
> [...]
903.72 s
> [2026-09-06 07:17:36.394] @gammaloop_api::se... INFO : Running command set process -p aa_aa_all_helicities_assembly -i 1L_pmpm string '
903.72 s
> [stability]
903.72 s
> check_on_norm = true
903.72 s
> escalate_if_exact_zero = false
903.72 s
> loop_momenta_norm_escalation_factor = -1.0
903.72 s
> [...]
903.72 s
> [2026-09-06 07:17:36.402] @process::amplitude INFO : Input is below threshold: 0 existing threshold E-surfaces across 0/1 graph groups
903.72 s
> [2026-09-06 07:17:36.402] @process::amplitude INFO : overlap structure of group 0: [0: []]
903.72 s
> [2026-09-06 07:17:36.402] @integrands::process [{#im_is_nan, #re_is_nan}] WARNING : final process evaluation is nonfinite
903.72 s
> [2026-09-06 07:17:36.402] @commands::inspect INFO :
903.72 s
> Input point in momentum space:
903.72 s
>
903.72 s
> ( 0.1100000000000000, -0.0700000000000000, 0.1900000000000000 )
903.72 s
>
903.72 s
> The evaluation of integrand '1L_ppmm' is:
903.72 s
>
903.72 s
> ( +0.0000000000000000e0, +0.0000000000000000e0 i)
903.72 s
>
903.72 s
> [2026-09-06 07:17:36.408] @process::amplitude INFO : Input is below threshold: 0 existing threshold E-surfaces across 0/1 graph groups
903.72 s
> [2026-09-06 07:17:36.408] @process::amplitude INFO : overlap structure of group 0: [0: []]
903.72 s
> [2026-09-06 07:17:36.409] @commands::inspect INFO :
903.72 s
> Input point in momentum space:
903.72 s
>
903.72 s
> ( 0.1100000000000000, -0.0700000000000000, 0.1900000000000000 )
903.72 s
>
903.72 s
> The evaluation of integrand '1L_ppmm' is:
903.72 s
>
903.72 s
> ( -1.7132462539328486e-28, -8.7105072229446864e-10 i)
903.72 s
>
903.72 s
> The application panicked (crashed).
903.72 s
> Message: kinematics=a, integrand=1L_ppmm, graph_id=0: assembly vs symjit inspect: actual=(-0.00000000000000000000000000017132462539328486+-0.0000000008710507222944686i), expected=(0+0i), tolerance=0.0000000001
903.72 s
> Location: tests/tests/test_runs/utils.rs :466
903.72 s
>
903.72 s
> ━━━━━━━━━━━━━━━━━━━━━━━━━━━━━━━━━━ BACKTRACE ━━━━━━━━━━━━━━━━━━━━━━━━━━━━━━━━━━━
903.72 s
> 1: <color_eyre[51793ea62743adbd]::config::PanicHook>::panic_report <unknown>
903.72 s
> at <unknown source file> :<unknown line>
903.72 s
> 2: <color_eyre[51793ea62743adbd]::config::PanicHook>::into_panic_hook::{closure#0} <unknown>
903.72 s
> at <unknown source file> :<unknown line>
903.72 s
> 3: std[bcb96dfbba0ab899]::panicking::panic_with_hook <unknown>
903.72 s
> at <unknown source file> :<unknown line>
903.72 s
> 4: std[bcb96dfbba0ab899]::panicking::panic_handler::{closure#0} <unknown>
903.72 s
> at <unknown source file> :<unknown line>
903.72 s
> 5: std[bcb96dfbba0ab899]::sys::backtrace::__rust_end_short_backtrace::<std[bcb96dfbba0ab899]::panicking::panic_handler::{closure#0}, !> <unknown>
903.72 s
> at <unknown source file> :<unknown line>
903.72 s
> 6: __rustc[6c289b9f9c454d21]::rust_begin_unwind <unknown>
903.72 s
> at <unknown source file> :<unknown line>
903.72 s
> 7: core[940e698046960fd5]::panicking::panic_fmt <unknown>
903.72 s
> at <unknown source file> :<unknown line>
903.72 s
> 8: <test_runs[66584badfeb6c7be]::aa_aa::important::aa_aa_local_inspect_backend_consistency::{closure#0} as core[940e698046960fd5]::ops::function::FnOnce<()>>::call_once <unknown>
903.72 s
> at <unknown source file> :<unknown line>
903.72 s
> 9: serial_test[cd99724524a2f1c0]::serial_code_lock::local_serial_core_with_return::<(), eyre[cb2fd339c0c40fca]::Report> <unknown>
903.72 s
> at <unknown source file> :<unknown line>
903.72 s
> 10: <test_runs[66584badfeb6c7be]::aa_aa::important::aa_aa_local_inspect_backend_consistency::{closure#0} as core[940e698046960fd5]::ops::function::FnOnce<()>>::call_once <unknown>
903.72 s
> at <unknown source file> :<unknown line>
903.72 s
> 11: test[75d6903177b1d7e9]::__rust_begin_short_backtrace::<core[940e698046960fd5]::result::Result<(), alloc[2ea6bcb46fca0c42]::string::String>, fn() -> core[940e698046960fd5]::result::Result<(), alloc[2ea6bcb46fca0c42]::string::String>> <unknown>
903.72 s
> at <unknown source file> :<unknown line>
903.72 s
> 12: test[75d6903177b1d7e9]::run_test::{closure#0} <unknown>
903.72 s
> at <unknown source file> :<unknown line>
903.72 s
> 13: std[bcb96dfbba0ab899]::sys::backtrace::__rust_begin_short_backtrace::<test[75d6903177b1d7e9]::run_test::{closure#1}, ()> <unknown>
903.72 s
> at <unknown source file> :<unknown line>
903.72 s
> 14: <std[bcb96dfbba0ab899]::thread::lifecycle::spawn_unchecked<test[75d6903177b1d7e9]::run_test::{closure#1}, ()>::{closure#1} as core[940e698046960fd5]::ops::function::FnOnce<()>>::call_once::{shim:vtable#0} <unknown>
903.72 s
> at <unknown source file> :<unknown line>
903.72 s
> 15: <std[bcb96dfbba0ab899]::sys::thread::unix::Thread>::new::thread_start <unknown>
903.72 s
> at <unknown source file> :<unknown line>
903.72 s
> 16: start_thread <unknown>
903.72 s
> at <unknown source file> :<unknown line>
903.72 s
> 17: __clone3 <unknown>
903.72 s
> at <unknown source file> :<unknown line>
903.72 s
>
903.72 s
> Run with COLORBT_SHOW_HIDDEN=1 environment variable to disable frame filtering.
903.72 s
> Run with RUST_BACKTRACE=full to include source snippets.
903.72 s
>
903.72 s
> error : test run failed
903.72 s
>
903.72 s
> ========== nextest test summary ==========
903.72 s
> report: target/nextest/ci_gammaloop/junit.xml
903.72 s
> tests: 152, failures: 1, errors: 0
903.72 s
>
903.72 s
> 1. gammaloop-integration-tests::test_runs::aa_aa::important::aa_aa_local_inspect_backend_consistency
903.72 s
> failure: test failure with exit code 101
903.72 s
> system-out
903.72 s
> running 1 test
903.72 s
> test aa_aa::important::aa_aa_local_inspect_backend_consistency has been running for over 60 seconds
903.72 s
> test aa_aa::important::aa_aa_local_inspect_backend_consistency ... FAILED
903.72 s
>
903.72 s
> failures:
903.72 s
>
903.72 s
> failures:
903.72 s
> aa_aa::important::aa_aa_local_inspect_backend_consistency
903.72 s
>
903.72 s
> test result: FAILED. 0 passed; 1 failed; 0 ignored; 0 measured; 258 filtered out; finished in 69.15s
903.72 s
> system-err
903.72 s
> [2026-09-06 07:16:27.882] @gammaloop_api::se... INFO : Running command import model sm-default.json
903.72 s
> [2026-09-06 07:16:27.882] @import::model INFO : Loading built-in JSON model sm-default
903.72 s
> [2026-09-06 07:16:27.903] @gammalooprs::model INFO : The following 11 external parameters were forced to zero by the restriction card:
903.72 s
> lamWS, AWS, rhoWS, etaWS, ymc, yme, ymm, MC, Me, MM, WTau
903.72 s
> [2026-09-06 07:16:27.903] @gammalooprs::model INFO : The following 34 vertex rules were removed by the restriction card:
903.72 s
> V_82 -> (c~, d, G+) | V_83 -> (t~, d, G+) | V_84 -> (c~, s, G+) | V_85 -> (t~, s, G+) | V_86 -> (u~, b, G+) | V_87 -> (c~, b, G+) | V_90 -> (c~, d, W+) | V_91 -> (t~, d, W+) | V_92 -> (u~, s, W+) | V_94 -> (t~, s, W+) | V_95 -> (u~, b, W+) | V_96 -> (c~, b, W+) | V_101 -> (e+, e-, G0) | V_102 -> (mu+, mu-, G0) | V_104 -> (e+, e-, H) | V_105 -> (mu+, mu-, H) | V_110 -> (ve~, e-, G+) | V_111 -> (vm~, mu-, G+) | V_116 -> (b~, u, G-) | V_117 -> (d~, c, G-) | V_118 -> (s~, c, G-) | V_119 -> (b~, c, G-) | V_120 -> (d~, t, G-) | V_121 -> (s~, t, G-) | V_124 -> (s~, u, W-) | V_125 -> (b~, u, W-) | V_126 -> (d~, c, W-) | V_128 -> (b~, c, W-) | V_129 -> (d~, t, W-) | V_130 -> (s~, t, W-) | V_138 -> (c~, c, G0) | V_140 -> (c~, c, H) | V_145 -> (e+, ve, G-) | V_146 -> (mu+, vm, G-)
903.72 s
> [2026-09-06 07:16:27.903] @gammalooprs::model INFO : The following 36 couplings were removed by the restriction card:
903.72 s
> GC_13, GC_14, GC_16, GC_17, GC_18, GC_19, GC_20, GC_22, GC_23, GC_24, GC_25, GC_26, GC_28, GC_29, GC_42, GC_43, GC_44, GC_46, GC_47, GC_48, GC_84, GC_85, GC_86, GC_87, GC_88, GC_89, GC_90, GC_91, GC_92, GC_93, GC_101, GC_102, GC_103, GC_105, GC_106, GC_107
903.72 s
> [2026-09-06 07:16:27.903] @gammaloop_api::se... INFO : Running command run set_model_parameters
903.72 s
> [2026-09-06 07:16:27.903] @gammaloop_api::se... INFO : Starting command block set_model_parameters
903.72 s
> [2026-09-06 07:16:27.904] @gammaloop_api::se... INFO : Running command set model MT=173.0
903.72 s
> [2026-09-06 07:16:27.908] @gammaloop_api::se... INFO : Running command set model WT=0.0
903.72 s
> [2026-09-06 07:16:27.911] @gammaloop_api::se... INFO : Running command set model ymt=173.0
903.72 s
> [2026-09-06 07:16:27.915] @gammaloop_api::se... INFO : Running command set model aS=0.118
903.72 s
> [2026-09-06 07:16:27.919] @gammaloop_api::se... INFO : Running command set model aEWM1=137.036
903.72 s
> [2026-09-06 07:16:27.922] @gammaloop_api::se... INFO : Running command set model Gf=1.166390e-05
903.72 s
> [2026-09-06 07:16:27.926] @gammaloop_api::se... INFO : Running command set model MZ=91.188
903.72 s
> [2026-09-06 07:16:27.930] @gammaloop_api::se... INFO : Running command set global string '
903.72 s
> [global.generation.compile]
903.72 s
> compilation_mode = "symjit"
903.72 s
> optimization_level = "O0"
903.72 s
> fast_math = false
903.72 s
> [...]
903.72 s
> [2026-09-06 07:16:27.930] @gammaloop_api::se... INFO : Running command import graphs ./examples/cli/aa_aa/1L/aa_aa_1L.dot -p aa_aa_all_helicities -i 1L_ppmm -o
903.72 s
> [2026-09-06 07:16:27.930] @commands::import INFO : Loading graphs from '/build/source/examples/cli/aa_aa/1L/aa_aa_1L.dot'
903.72 s
> [2026-09-06 07:16:27.939] @gammaloop_api::se... INFO : Running command generate existing -p aa_aa_all_helicities
903.72 s
> [2026-09-06 07:16:53.477] @commands::generate INFO :
903.72 s
> Integrand generation summary
903.72 s
> peak RAM 1.06 GiB | cores 1
903.72 s
> ╭───────────┬───────┬─────────┬──────────────┬─────────────┬────────────────┬──────────────╮
903.72 s
> │ integrand │ graph │ # evals │ expr build │ spenso │ symbolica eval │ compile │
903.72 s
> ├───────────┼───────┼─────────┼──────────────┼─────────────┼────────────────┼──────────────┤
903.72 s
> │ 1L_ppmm │ GL0 │ 13 │ 544ms (6.2%) │ 1.76s (20%) │ 5.63s (64%) │ 844ms (9.6%) │
903.72 s
> │ 1L_ppmm │ GL2 │ 13 │ 545ms (6.4%) │ 1.46s (17%) │ 5.67s (67%) │ 802ms (9.5%) │
903.72 s
> │ 1L_ppmm │ GL4 │ 11 │ 533ms (6.5%) │ 1.40s (17%) │ 5.49s (67%) │ 796ms (9.7%) │
903.72 s
> ├───────────┼───────┼─────────┼──────────────┼─────────────┼────────────────┼──────────────┤
903.72 s
> │ Total │ │ 37 │ 1.62s (6.4%) │ 4.62s (18%) │ 16.79s (66%) │ 2.44s (9.6%) │
903.72 s
> ╰───────────┴───────┴─────────┴──────────────┴─────────────┴────────────────┴──────────────╯
903.72 s
> [2026-09-06 07:16:54.136] @gammaloop_api::se... INFO : Running command import model sm-default.json
903.72 s
> [2026-09-06 07:16:54.136] @import::model INFO : Loading built-in JSON model sm-default
903.72 s
> [2026-09-06 07:16:54.155] @gammalooprs::model INFO : The following 11 external parameters were forced to zero by the restriction card:
903.72 s
> lamWS, AWS, rhoWS, etaWS, ymc, yme, ymm, MC, Me, MM, WTau
903.72 s
> [2026-09-06 07:16:54.155] @gammalooprs::model INFO : The following 34 vertex rules were removed by the restriction card:
903.72 s
> V_82 -> (c~, d, G+) | V_83 -> (t~, d, G+) | V_84 -> (c~, s, G+) | V_85 -> (t~, s, G+) | V_86 -> (u~, b, G+) | V_87 -> (c~, b, G+) | V_90 -> (c~, d, W+) | V_91 -> (t~, d, W+) | V_92 -> (u~, s, W+) | V_94 -> (t~, s, W+) | V_95 -> (u~, b, W+) | V_96 -> (c~, b, W+) | V_101 -> (e+, e-, G0) | V_102 -> (mu+, mu-, G0) | V_104 -> (e+, e-, H) | V_105 -> (mu+, mu-, H) | V_110 -> (ve~, e-, G+) | V_111 -> (vm~, mu-, G+) | V_116 -> (b~, u, G-) | V_117 -> (d~, c, G-) | V_118 -> (s~, c, G-) | V_119 -> (b~, c, G-) | V_120 -> (d~, t, G-) | V_121 -> (s~, t, G-) | V_124 -> (s~, u, W-) | V_125 -> (b~, u, W-) | V_126 -> (d~, c, W-) | V_128 -> (b~, c, W-) | V_129 -> (d~, t, W-) | V_130 -> (s~, t, W-) | V_138 -> (c~, c, G0) | V_140 -> (c~, c, H) | V_145 -> (e+, ve, G-) | V_146 -> (mu+, vm, G-)
903.72 s
> [2026-09-06 07:16:54.155] @gammalooprs::model INFO : The following 36 couplings were removed by the restriction card:
903.72 s
> GC_13, GC_14, GC_16, GC_17, GC_18, GC_19, GC_20, GC_22, GC_23, GC_24, GC_25, GC_26, GC_28, GC_29, GC_42, GC_43, GC_44, GC_46, GC_47, GC_48, GC_84, GC_85, GC_86, GC_87, GC_88, GC_89, GC_90, GC_91, GC_92, GC_93, GC_101, GC_102, GC_103, GC_105, GC_106, GC_107
903.72 s
> [2026-09-06 07:16:54.155] @gammaloop_api::se... INFO : Running command run set_model_parameters
903.72 s
> [2026-09-06 07:16:54.155] @gammaloop_api::se... INFO : Starting command block set_model_parameters
903.72 s
> [2026-09-06 07:16:54.156] @gammaloop_api::se... INFO : Running command set model MT=173.0
903.72 s
> [2026-09-06 07:16:54.159] @gammaloop_api::se... INFO : Running command set model WT=0.0
903.72 s
> [2026-09-06 07:16:54.162] @gammaloop_api::se... INFO : Running command set model ymt=173.0
903.72 s
> [2026-09-06 07:16:54.165] @gammaloop_api::se... INFO : Running command set model aS=0.118
903.72 s
> [2026-09-06 07:16:54.169] @gammaloop_api::se... INFO : Running command set model aEWM1=137.036
903.72 s
> [2026-09-06 07:16:54.172] @gammaloop_api::se... INFO : Running command set model Gf=1.166390e-05
903.72 s
> [2026-09-06 07:16:54.175] @gammaloop_api::se... INFO : Running command set model MZ=91.188
903.72 s
> [2026-09-06 07:16:54.179] @gammaloop_api::se... INFO : Running command set global string '
903.72 s
> [global.generation.compile]
903.72 s
> compilation_mode = "assembly"
903.72 s
> optimization_level = "O0"
903.72 s
> fast_math = false
903.72 s
> [...]
903.72 s
> [2026-09-06 07:16:54.180] @gammaloop_api::se... INFO : Running command import graphs ./examples/cli/aa_aa/1L/aa_aa_1L.dot -p aa_aa_all_helicities_assembly -i 1L_ppmm -o
903.72 s
> [2026-09-06 07:16:54.180] @commands::import INFO : Loading graphs from '/build/source/examples/cli/aa_aa/1L/aa_aa_1L.dot'
903.72 s
> [2026-09-06 07:16:54.187] @gammaloop_api::se... INFO : Running command generate existing -p aa_aa_all_helicities_assembly
903.72 s
> [2026-09-06 07:17:16.399] @processes::amplitude INFO : Compiling amplitude 1L_ppmm
903.72 s
> [2026-09-06 07:17:35.501] @commands::generate INFO : Removed 34 generated C++ source file(s). Use '--keep-sources' to keep them.
903.72 s
> [2026-09-06 07:17:35.501] @commands::generate INFO :
903.72 s
> Integrand generation summary
903.72 s
> peak RAM 2.20 GiB | cores 1
903.72 s
> ╭───────────┬───────┬─────────┬──────────────┬──────────────┬────────────────┬──────────────╮
903.72 s
> │ integrand │ graph │ # evals │ expr build │ spenso │ symbolica eval │ compile │
903.72 s
> ├───────────┼───────┼─────────┼──────────────┼──────────────┼────────────────┼──────────────┤
903.72 s
> │ 1L_ppmm │ GL0 │ 13 │ 500ms (3.6%) │ 1.39s (10%) │ 5.50s (40%) │ 6.41s (46%) │
903.72 s
> │ 1L_ppmm │ GL2 │ 13 │ 493ms (3.5%) │ 1.41s (9.9%) │ 5.58s (39%) │ 6.80s (48%) │
903.72 s
> │ 1L_ppmm │ GL4 │ 11 │ 485ms (3.7%) │ 1.40s (11%) │ 5.44s (41%) │ 5.88s (45%) │
903.72 s
> ├───────────┼───────┼─────────┼──────────────┼──────────────┼────────────────┼──────────────┤
903.72 s
> │ Total │ │ 37 │ 1.48s (3.6%) │ 4.20s (10%) │ 16.52s (40%) │ 19.09s (46%) │
903.72 s
> ╰───────────┴───────┴─────────┴──────────────┴──────────────┴────────────────┴──────────────╯
903.72 s
> [2026-09-06 07:17:36.385] @gammaloop_api::se... INFO : Running command set process -p aa_aa_all_helicities -i 1L_ppmm string '
903.72 s
> [stability]
903.72 s
> check_on_norm = true
903.72 s
> escalate_if_exact_zero = false
903.72 s
> loop_momenta_norm_escalation_factor = -1.0
903.72 s
> [...]
903.72 s
> [2026-09-06 07:17:36.386] @gammaloop_api::se... INFO : Running command set process -p aa_aa_all_helicities_assembly -i 1L_ppmm string '
903.72 s
> [stability]
903.72 s
> check_on_norm = true
903.72 s
> escalate_if_exact_zero = false
903.72 s
> loop_momenta_norm_escalation_factor = -1.0
903.72 s
> [...]
903.72 s
> [2026-09-06 07:17:36.387] @gammaloop_api::se... INFO : Running command set process -p aa_aa_all_helicities -i 1L_mpmm string '
903.72 s
> [stability]
903.72 s
> check_on_norm = true
903.72 s
> escalate_if_exact_zero = false
903.72 s
> loop_momenta_norm_escalation_factor = -1.0
903.72 s
> [...]
903.72 s
> [2026-09-06 07:17:36.388] @gammaloop_api::se... INFO : Running command set process -p aa_aa_all_helicities_assembly -i 1L_mpmm string '
903.72 s
> [stability]
903.72 s
> check_on_norm = true
903.72 s
> escalate_if_exact_zero = false
903.72 s
> loop_momenta_norm_escalation_factor = -1.0
903.72 s
> [...]
903.72 s
> [2026-09-06 07:17:36.389] @gammaloop_api::se... INFO : Running command set process -p aa_aa_all_helicities -i 1L_mmmm string '
903.72 s
> [stability]
903.72 s
> check_on_norm = true
903.72 s
> escalate_if_exact_zero = false
903.72 s
> loop_momenta_norm_escalation_factor = -1.0
903.72 s
> [...]
903.72 s
> [2026-09-06 07:17:36.390] @gammaloop_api::se... INFO : Running command set process -p aa_aa_all_helicities_assembly -i 1L_mmmm string '
903.72 s
> [stability]
903.72 s
> check_on_norm = true
903.72 s
> escalate_if_exact_zero = false
903.72 s
> loop_momenta_norm_escalation_factor = -1.0
903.72 s
> [...]
903.72 s
> [2026-09-06 07:17:36.391] @gammaloop_api::se... INFO : Running command set process -p aa_aa_all_helicities -i 1L_pmmp string '
903.72 s
> [stability]
903.72 s
> check_on_norm = true
903.72 s
> escalate_if_exact_zero = false
903.72 s
> loop_momenta_norm_escalation_factor = -1.0
903.72 s
> ... omitted 84 more lines; see full nextest output above
903.72 s
> =========================================
903.72 s
For full logs, run:
903.72 s
nix log /nix/store/3qpyi4i089mjhqx61pnq05lcl2pfrw3d-gammaloop-nextest-integration.drv
903.84 s
[0 built (1 failed ), 0.0 Run failed.