test packages.x86_64-linux.nix-ci-check-gammaloop-nextest-integration

Reproduce this run
Original Run
  1. 0.00 s $ /nix/store/9ypz3flqsrl5xl495mm8h645gadjsxi1-coreutils-9.11/bin/timeout --kill-after=15s 7200s /nix/store/23zk8sgzamrbmj1fday15szf7f2279s8-nix-2.34.7/bin/nix --extra-experimental-features nix-command --extra-experimental-features flakes flake clone git+https://github.com/alphal00p/gammaloop --dest /tmp/nix-ci-worker/stable-pwd/repo/
  2. 0.12 s Cloning into '/tmp/nix-ci-worker/stable-pwd/repo'...
  3. 0.82 s remote: Enumerating objects: 78074, done.
  4. 1.05 s remote: Counting objects: 0% (1/13896) remote: Counting objects: 1% (139/13896) remote: Counting objects: 2% (278/13896) remote: Counting objects: 3% (417/13896) remote: Counting objects: 4% (556/13896) remote: Counting objects: 5% (695/13896) remote: Counting objects: 6% (834/13896) remote: Counting objects: 7% (973/13896) remote: Counting objects: 8% (1112/13896) remote: Counting objects: 9% (1251/13896) remote: Counting objects: 10% (1390/13896) remote: Counting objects: 11% (1529/13896) remote: Counting objects: 12% (1668/13896) remote: Counting objects: 13% (1807/13896) remote: Counting objects: 14% (1946/13896) remote: Counting objects: 15% (2085/13896) remote: Counting objects: 16% (2224/13896) remote: Counting objects: 17% (2363/13896) remote: Counting objects: 18% (2502/13896) remote: Counting objects: 19% (2641/13896) remote: Counting objects: 20% (2780/13896) remote: Counting objects: 21% (2919/13896) remote: Counting objects: 22% (3058/13896) remote: Counting objects: 23% (3197/13896) remote: Counting objects: 24% (3336/13896) remote: Counting objects: 25% (3474/13896) remote: Counting objects: 26% (3613/13896) remote: Counting objects: 27% (3752/13896) remote: Counting objects: 28% (3891/13896) remote: Counting objects: 29% (4030/13896) remote: Counting objects: 30% (4169/13896) remote: Counting objects: 31% (4308/13896) remote: Counting objects: 32% (4447/13896) remote: Counting objects: 33% (4586/13896) remote: Counting objects: 34% (4725/13896) remote: Counting objects: 35% (4864/13896) remote: Counting objects: 36% (5003/13896) remote: Counting objects: 37% (5142/13896) remote: Counting objects: 38% (5281/13896) remote: Counting objects: 39% (5420/13896) remote: Counting objects: 40% (5559/13896) remote: Counting objects: 41% (5698/13896) remote: Counting objects: 42% (5837/13896) remote: Counting objects: 43% (5976/13896) remote: Counting objects: 44% (6115/13896) remote: Counting objects: 45% (6254/13896) remote: Counting objects: 46% (6393/13896) remote: Counting objects: 47% (6532/13896) remote: Counting objects: 48% (6671/13896) remote: Counting objects: 49% (6810/13896) remote: Counting objects: 50% (6948/13896) remote: Counting objects: 51% (7087/13896) remote: Counting objects: 52% (7226/13896) remote: Counting objects: 53% (7365/13896) remote: Counting objects: 54% (7504/13896) remote: Counting objects: 55% (7643/13896) remote: Counting objects: 56% (7782/13896) remote: Counting objects: 57% (7921/13896) remote: Counting objects: 58% (8060/13896) remote: Counting objects: 59% (8199/13896) remote: Counting objects: 60% (8338/13896) remote: Counting objects: 61% (8477/13896) remote: Counting objects: 62% (8616/13896) remote: Counting objects: 63% (8755/13896) remote: Counting objects: 64% (8894/13896) remote: Counting objects: 65% (9033/13896) remote: Counting objects: 66% (9172/13896) remote: Counting objects: 67% (9311/13896) remote: Counting objects: 68% (9450/13896) remote: Counting objects: 69% (9589/13896) remote: Counting objects: 70% (9728/13896) remote: Counting objects: 71% (9867/13896) remote: Counting objects: 72% (10006/13896) remote: Counting objects: 73% (10145/13896) remote: Counting objects: 74% (10284/13896) remote: Counting objects: 75% (10422/13896) remote: Counting objects: 76% (10561/13896) remote: Counting objects: 77% (10700/13896) remote: Counting objects: 78% (10839/13896) remote: Counting objects: 79% (10978/13896) remote: Counting objects: 80% (11117/13896) remote: Counting objects: 81% (11256/13896) remote: Counting objects: 82% (11395/13896) remote: Counting objects: 83% (11534/13896) remote: Counting objects: 84% (11673/13896) remote: Counting objects: 85% (11812/13896) remote: Counting objects: 86% (11951/13896) remote: Counting objects: 87% (12090/13896) remote: Counting objects: 88% (12229/13896) remote: Counting objects: 89% (12368/13896) remote: Counting objects: 90% (12507/13896) remote: Counting objects: 91% (12646/13896) remote: Counting objects: 92% (12785/13896) remote: Counting objects: 93% (12924/13896) remote: Counting objects: 94% (13063/13896) remote: Counting objects: 95% (13202/13896) remote: Counting objects: 96% (13341/13896) remote: Counting objects: 97% (13480/13896) remote: Counting objects: 98% (13619/13896) remote: Counting objects: 99% (13758/13896) remote: Counting objects: 100% (13896/13896) remote: Counting objects: 100% (13896/13896), done.
  5. 3.75 s remote: Compressing objects: 0% (1/3083) remote: Compressing objects: 1% (31/3083) remote: Compressing objects: 2% (62/3083) remote: Compressing objects: 3% (93/3083) remote: Compressing objects: 4% (124/3083) remote: Compressing objects: 5% (155/3083) remote: Compressing objects: 6% (185/3083) remote: Compressing objects: 7% (216/3083) remote: Compressing objects: 8% (247/3083) remote: Compressing objects: 9% (278/3083) remote: Compressing objects: 10% (309/3083) remote: Compressing objects: 11% (340/3083) remote: Compressing objects: 12% (370/3083) remote: Compressing objects: 13% (401/3083) remote: Compressing objects: 14% (432/3083) remote: Compressing objects: 15% (463/3083) remote: Compressing objects: 16% (494/3083) remote: Compressing objects: 17% (525/3083) remote: Compressing objects: 18% (555/3083) remote: Compressing objects: 19% (586/3083) remote: Compressing objects: 20% (617/3083) remote: Compressing objects: 21% (648/3083) remote: Compressing objects: 22% (679/3083) remote: Compressing objects: 23% (710/3083) remote: Compressing objects: 24% (740/3083) remote: Compressing objects: 24% (769/3083) remote: Compressing objects: 25% (771/3083) remote: Compressing objects: 26% (802/3083) remote: Compressing objects: 27% (833/3083) remote: Compressing objects: 28% (864/3083) remote: Compressing objects: 28% (875/3083) remote: Compressing objects: 29% (895/3083) remote: Compressing objects: 30% (925/3083) remote: Compressing objects: 31% (956/3083) remote: Compressing objects: 32% (987/3083) remote: Compressing objects: 33% (1018/3083) remote: Compressing objects: 34% (1049/3083) remote: Compressing objects: 35% (1080/3083) remote: Compressing objects: 36% (1110/3083) remote: Compressing objects: 37% (1141/3083) remote: Compressing objects: 38% (1172/3083) remote: Compressing objects: 39% (1203/3083) remote: Compressing objects: 40% (1234/3083) remote: Compressing objects: 41% (1265/3083) remote: Compressing objects: 42% (1295/3083) remote: Compressing objects: 43% (1326/3083) remote: Compressing objects: 44% (1357/3083) remote: Compressing objects: 45% (1388/3083) remote: Compressing objects: 46% (1419/3083) remote: Compressing objects: 47% (1450/3083) remote: Compressing objects: 48% (1480/3083) remote: Compressing objects: 49% (1511/3083) remote: Compressing objects: 50% (1542/3083) remote: Compressing objects: 51% (1573/3083) remote: Compressing objects: 52% (1604/3083) remote: Compressing objects: 53% (1634/3083) remote: Compressing objects: 54% (1665/3083) remote: Compressing objects: 55% (1696/3083) remote: Compressing objects: 56% (1727/3083) remote: Compressing objects: 57% (1758/3083) remote: Compressing objects: 58% (1789/3083) remote: Compressing objects: 59% (1819/3083) remote: Compressing objects: 60% (1850/3083) remote: Compressing objects: 61% (1881/3083) remote: Compressing objects: 62% (1912/3083) remote: Compressing objects: 63% (1943/3083) remote: Compressing objects: 64% (1974/3083) remote: Compressing objects: 65% (2004/3083) remote: Compressing objects: 66% (2035/3083) remote: Compressing objects: 67% (2066/3083) remote: Compressing objects: 68% (2097/3083) remote: Compressing objects: 69% (2128/3083) remote: Compressing objects: 70% (2159/3083) remote: Compressing objects: 71% (2189/3083) remote: Compressing objects: 72% (2220/3083) remote: Compressing objects: 73% (2251/3083) remote: Compressing objects: 74% (2282/3083) remote: Compressing objects: 75% (2313/3083) remote: Compressing objects: 76% (2344/3083) remote: Compressing objects: 77% (2374/3083) remote: Compressing objects: 78% (2405/3083) remote: Compressing objects: 79% (2436/3083) remote: Compressing objects: 80% (2467/3083) remote: Compressing objects: 81% (2498/3083) remote: Compressing objects: 82% (2529/3083) remote: Compressing objects: 83% (2559/3083) remote: Compressing objects: 84% (2590/3083) remote: Compressing objects: 85% (2621/3083) remote: Compressing objects: 86% (2652/3083) remote: Compressing objects: 87% (2683/3083) remote: Compressing objects: 88% (2714/3083) remote: Compressing objects: 89% (2744/3083) remote: Compressing objects: 90% (2775/3083) remote: Compressing objects: 91% (2806/3083) remote: Compressing objects: 92% (2837/3083) remote: Compressing objects: 93% (2868/3083) remote: Compressing objects: 94% (2899/3083) remote: Compressing objects: 95% (2929/3083) remote: Compressing objects: 96% (2960/3083) remote: Compressing objects: 97% (2991/3083) remote: Compressing objects: 98% (3022/3083) remote: Compressing objects: 99% (3053/3083) remote: Compressing objects: 100% (3083/3083) remote: Compressing objects: 100% (3083/3083), done.
  6. 7.68 s Receiving objects: 0% (1/78074) Receiving objects: 1% (781/78074) Receiving objects: 2% (1562/78074) Receiving objects: 3% (2343/78074) Receiving objects: 4% (3123/78074) Receiving objects: 5% (3904/78074) Receiving objects: 6% (4685/78074) Receiving objects: 7% (5466/78074), 9.32 MiB | 18.63 MiB/s Receiving objects: 8% (6246/78074), 9.32 MiB | 18.63 MiB/s Receiving objects: 9% (7027/78074), 9.32 MiB | 18.63 MiB/s Receiving objects: 10% (7808/78074), 9.32 MiB | 18.63 MiB/s Receiving objects: 11% (8589/78074), 9.32 MiB | 18.63 MiB/s Receiving objects: 12% (9369/78074), 9.32 MiB | 18.63 MiB/s Receiving objects: 13% (10150/78074), 9.32 MiB | 18.63 MiB/s Receiving objects: 14% (10931/78074), 9.32 MiB | 18.63 MiB/s Receiving objects: 15% (11712/78074), 9.32 MiB | 18.63 MiB/s Receiving objects: 16% (12492/78074), 9.32 MiB | 18.63 MiB/s Receiving objects: 17% (13273/78074), 9.32 MiB | 18.63 MiB/s Receiving objects: 18% (14054/78074), 9.32 MiB | 18.63 MiB/s Receiving objects: 19% (14835/78074), 9.32 MiB | 18.63 MiB/s Receiving objects: 20% (15615/78074), 9.32 MiB | 18.63 MiB/s Receiving objects: 21% (16396/78074), 9.32 MiB | 18.63 MiB/s Receiving objects: 22% (17177/78074), 9.32 MiB | 18.63 MiB/s Receiving objects: 23% (17958/78074), 9.32 MiB | 18.63 MiB/s Receiving objects: 24% (18738/78074), 9.32 MiB | 18.63 MiB/s Receiving objects: 25% (19519/78074), 9.32 MiB | 18.63 MiB/s Receiving objects: 26% (20300/78074), 9.32 MiB | 18.63 MiB/s Receiving objects: 27% (21080/78074), 9.32 MiB | 18.63 MiB/s Receiving objects: 28% (21861/78074), 9.32 MiB | 18.63 MiB/s Receiving objects: 28% (22601/78074), 9.32 MiB | 18.63 MiB/s Receiving objects: 29% (22642/78074), 23.14 MiB | 23.13 MiB/s Receiving objects: 30% (23423/78074), 23.14 MiB | 23.13 MiB/s Receiving objects: 31% (24203/78074), 23.14 MiB | 23.13 MiB/s Receiving objects: 32% (24984/78074), 23.14 MiB | 23.13 MiB/s Receiving objects: 33% (25765/78074), 23.14 MiB | 23.13 MiB/s Receiving objects: 34% (26546/78074), 23.14 MiB | 23.13 MiB/s Receiving objects: 35% (27326/78074), 23.14 MiB | 23.13 MiB/s Receiving objects: 36% (28107/78074), 23.14 MiB | 23.13 MiB/s Receiving objects: 37% (28888/78074), 23.14 MiB | 23.13 MiB/s Receiving objects: 38% (29669/78074), 23.14 MiB | 23.13 MiB/s Receiving objects: 39% (30449/78074), 23.14 MiB | 23.13 MiB/s Receiving objects: 40% (31230/78074), 23.14 MiB | 23.13 MiB/s Receiving objects: 41% (32011/78074), 23.14 MiB | 23.13 MiB/s Receiving objects: 42% (32792/78074), 23.14 MiB | 23.13 MiB/s Receiving objects: 43% (33572/78074), 23.14 MiB | 23.13 MiB/s Receiving objects: 44% (34353/78074), 23.14 MiB | 23.13 MiB/s Receiving objects: 45% (35134/78074), 23.14 MiB | 23.13 MiB/s Receiving objects: 46% (35915/78074), 23.14 MiB | 23.13 MiB/s Receiving objects: 47% (36695/78074), 23.14 MiB | 23.13 MiB/s Receiving objects: 48% (37476/78074), 23.14 MiB | 23.13 MiB/s Receiving objects: 49% (38257/78074), 23.14 MiB | 23.13 MiB/s Receiving objects: 50% (39037/78074), 43.20 MiB | 28.70 MiB/s Receiving objects: 51% (39818/78074), 43.20 MiB | 28.70 MiB/s Receiving objects: 52% (40599/78074), 43.20 MiB | 28.70 MiB/s Receiving objects: 53% (41380/78074), 43.20 MiB | 28.70 MiB/s Receiving objects: 54% (42160/78074), 43.20 MiB | 28.70 MiB/s Receiving objects: 55% (42941/78074), 43.20 MiB | 28.70 MiB/s Receiving objects: 56% (43722/78074), 43.20 MiB | 28.70 MiB/s Receiving objects: 57% (44503/78074), 43.20 MiB | 28.70 MiB/s Receiving objects: 58% (45283/78074), 43.20 MiB | 28.70 MiB/s Receiving objects: 59% (46064/78074), 43.20 MiB | 28.70 MiB/s Receiving objects: 60% (46845/78074), 43.20 MiB | 28.70 MiB/s Receiving objects: 60% (47292/78074), 59.71 MiB | 29.51 MiB/s Receiving objects: 61% (47626/78074), 59.71 MiB | 29.51 MiB/s Receiving objects: 62% (48406/78074), 59.71 MiB | 29.51 MiB/s Receiving objects: 63% (49187/78074), 59.71 MiB | 29.51 MiB/s Receiving objects: 64% (49968/78074), 59.71 MiB | 29.51 MiB/s Receiving objects: 65% (50749/78074), 59.71 MiB | 29.51 MiB/s Receiving objects: 66% (51529/78074), 59.71 MiB | 29.51 MiB/s Receiving objects: 67% (52310/78074), 59.71 MiB | 29.51 MiB/s Receiving objects: 68% (53091/78074), 75.40 MiB | 29.83 MiB/s Receiving objects: 69% (53872/78074), 75.40 MiB | 29.83 MiB/s Receiving objects: 70% (54652/78074), 75.40 MiB | 29.83 MiB/s Receiving objects: 71% (55433/78074), 75.40 MiB | 29.83 MiB/s Receiving objects: 72% (56214/78074), 75.40 MiB | 29.83 MiB/s Receiving objects: 73% (56995/78074), 75.40 MiB | 29.83 MiB/s Receiving objects: 74% (57775/78074), 75.40 MiB | 29.83 MiB/s Receiving objects: 75% (58556/78074), 75.40 MiB | 29.83 MiB/s Receiving objects: 76% (59337/78074), 75.40 MiB | 29.83 MiB/s Receiving objects: 77% (60117/78074), 75.40 MiB | 29.83 MiB/s Receiving objects: 77% (60793/78074), 75.40 MiB | 29.83 MiB/s Receiving objects: 78% (60898/78074), 75.40 MiB | 29.83 MiB/s Receiving objects: 79% (61679/78074), 91.86 MiB | 30.34 MiB/s Receiving objects: 80% (62460/78074), 91.86 MiB | 30.34 MiB/s Receiving objects: 81% (63240/78074), 91.86 MiB | 30.34 MiB/s Receiving objects: 82% (64021/78074), 108.12 MiB | 30.60 MiB/s Receiving objects: 83% (64802/78074), 108.12 MiB | 30.60 MiB/s Receiving objects: 84% (65583/78074), 108.12 MiB | 30.60 MiB/s Receiving objects: 85% (66363/78074), 108.12 MiB | 30.60 MiB/s Receiving objects: 86% (67144/78074), 108.12 MiB | 30.60 MiB/s Receiving objects: 87% (67925/78074), 108.12 MiB | 30.60 MiB/s Receiving objects: 88% (68706/78074), 108.12 MiB | 30.60 MiB/s Receiving objects: 89% (69486/78074), 108.12 MiB | 30.60 MiB/s Receiving objects: 90% (70267/78074), 108.12 MiB | 30.60 MiB/s Receiving objects: 91% (71048/78074), 108.12 MiB | 30.60 MiB/s Receiving objects: 92% (71829/78074), 108.12 MiB | 30.60 MiB/s Receiving objects: 93% (72609/78074), 108.12 MiB | 30.60 MiB/s Receiving objects: 94% (73390/78074), 108.12 MiB | 30.60 MiB/s Receiving objects: 95% (74171/78074), 108.12 MiB | 30.60 MiB/s Receiving objects: 96% (74952/78074), 108.12 MiB | 30.60 MiB/s Receiving objects: 97% (75732/78074), 108.12 MiB | 30.60 MiB/s Receiving objects: 98% (76513/78074), 108.12 MiB | 30.60 MiB/s Receiving objects: 99% (77294/78074), 108.12 MiB | 30.60 MiB/s remote: Total 78074 (delta 9798), reused 11670 (delta 8716), pack-reused 64178 (from 2)
  7. 7.68 s Receiving objects: 100% (78074/78074), 108.12 MiB | 30.60 MiB/s Receiving objects: 100% (78074/78074), 120.78 MiB | 30.70 MiB/s, done.
  8. 9.10 s Resolving deltas: 0% (0/53117) Resolving deltas: 1% (532/53117) Resolving deltas: 2% (1063/53117) Resolving deltas: 3% (1594/53117) Resolving deltas: 4% (2126/53117) Resolving deltas: 5% (2656/53117) Resolving deltas: 6% (3188/53117) Resolving deltas: 7% (3719/53117) Resolving deltas: 8% (4250/53117) Resolving deltas: 9% (4781/53117) Resolving deltas: 10% (5312/53117) Resolving deltas: 11% (5844/53117) Resolving deltas: 12% (6375/53117) Resolving deltas: 13% (6906/53117) Resolving deltas: 14% (7439/53117) Resolving deltas: 15% (7968/53117) Resolving deltas: 16% (8499/53117) Resolving deltas: 17% (9031/53117) Resolving deltas: 18% (9563/53117) Resolving deltas: 19% (10093/53117) Resolving deltas: 20% (10624/53117) Resolving deltas: 21% (11155/53117) Resolving deltas: 22% (11687/53117) Resolving deltas: 23% (12217/53117) Resolving deltas: 24% (12749/53117) Resolving deltas: 25% (13280/53117) Resolving deltas: 26% (13811/53117) Resolving deltas: 27% (14342/53117) Resolving deltas: 28% (14873/53117) Resolving deltas: 29% (15404/53117) Resolving deltas: 30% (15937/53117) Resolving deltas: 31% (16467/53117) Resolving deltas: 32% (16998/53117) Resolving deltas: 33% (17529/53117) Resolving deltas: 34% (18060/53117) Resolving deltas: 35% (18591/53117) Resolving deltas: 36% (19123/53117) Resolving deltas: 37% (19657/53117) Resolving deltas: 38% (20185/53117) Resolving deltas: 39% (20716/53117) Resolving deltas: 40% (21247/53117) Resolving deltas: 41% (21778/53117) Resolving deltas: 42% (22310/53117) Resolving deltas: 43% (22841/53117) Resolving deltas: 44% (23372/53117) Resolving deltas: 45% (23903/53117) Resolving deltas: 46% (24434/53117) Resolving deltas: 47% (24965/53117) Resolving deltas: 48% (25498/53117) Resolving deltas: 49% (26028/53117) Resolving deltas: 50% (26559/53117) Resolving deltas: 51% (27090/53117) Resolving deltas: 52% (27621/53117) Resolving deltas: 53% (28153/53117) Resolving deltas: 54% (28685/53117) Resolving deltas: 55% (29216/53117) Resolving deltas: 56% (29746/53117) Resolving deltas: 57% (30277/53117) Resolving deltas: 58% (30808/53117) Resolving deltas: 59% (31340/53117) Resolving deltas: 60% (31871/53117) Resolving deltas: 61% (32402/53117) Resolving deltas: 62% (32934/53117) Resolving deltas: 63% (33464/53117) Resolving deltas: 64% (33995/53117) Resolving deltas: 65% (34527/53117) Resolving deltas: 66% (35058/53117) Resolving deltas: 67% (35589/53117) Resolving deltas: 68% (36120/53117) Resolving deltas: 69% (36651/53117) Resolving deltas: 70% (37182/53117) Resolving deltas: 71% (37714/53117) Resolving deltas: 72% (38245/53117) Resolving deltas: 73% (38777/53117) Resolving deltas: 73% (39267/53117) Resolving deltas: 74% (39307/53117) Resolving deltas: 75% (39838/53117) Resolving deltas: 76% (40369/53117) Resolving deltas: 77% (40903/53117) Resolving deltas: 78% (41432/53117) Resolving deltas: 79% (41963/53117) Resolving deltas: 80% (42494/53117) Resolving deltas: 81% (43026/53117) Resolving deltas: 82% (43556/53117) Resolving deltas: 83% (44089/53117) Resolving deltas: 84% (44619/53117) Resolving deltas: 85% (45150/53117) Resolving deltas: 86% (45681/53117) Resolving deltas: 87% (46212/53117) Resolving deltas: 88% (46743/53117) Resolving deltas: 89% (47276/53117) Resolving deltas: 90% (47806/53117) Resolving deltas: 91% (48337/53117) Resolving deltas: 92% (48868/53117) Resolving deltas: 93% (49399/53117) Resolving deltas: 94% (49930/53117) Resolving deltas: 95% (50462/53117) Resolving deltas: 96% (50994/53117) Resolving deltas: 97% (51524/53117) Resolving deltas: 98% (52055/53117) Resolving deltas: 99% (52586/53117) Resolving deltas: 100% (53117/53117) Resolving deltas: 100% (53117/53117), done.
  9. 9.68 s Fetching commit d3dd17d9365e2ca30d668d40432f3a1d094af28e for raised_energy_cff_wip ...
  10. 9.68 s $ /nix/store/bcnisk3ydfgv26v2gw3zlky24g00yww2-git-2.54.0/bin/git fetch origin d3dd17d9365e2ca30d668d40432f3a1d094af28e
  11. 10.13 s From https://github.com/alphal00p/gammaloop
  12. 10.13 s * branch d3dd17d9365e2ca30d668d40432f3a1d094af28e -> FETCH_HEAD
  13. 10.15 s $ /nix/store/9ypz3flqsrl5xl495mm8h645gadjsxi1-coreutils-9.11/bin/timeout --kill-after=15s 7200s /nix/store/bcnisk3ydfgv26v2gw3zlky24g00yww2-git-2.54.0/bin/git -c advice.detachedHead=false checkout d3dd17d9365e2ca30d668d40432f3a1d094af28e
  14. 10.48 s HEAD is now at d3dd17d93 stream lower-sector CFF component products
  15. 10.48 s $ /nix/store/9ypz3flqsrl5xl495mm8h645gadjsxi1-coreutils-9.11/bin/timeout --kill-after=15s 7200s /nix/store/23zk8sgzamrbmj1fday15szf7f2279s8-nix-2.34.7/bin/nix --extra-experimental-features nix-command --extra-experimental-features flakes --log-format internal-json run .#packages.x86_64-linux.nix-ci-check-gammaloop-nextest-integration --print-build-logs
  16. 16.63 s
  17. 23.70 s evaluating derivation 'g copying '/nix/store/jc0j evaluating derivation 'g copying '/nix/store/jc0j evaluating derivation 'g copying '/nix/store/jc0j evaluating derivation 'g copying '/nix/store/jc0j evaluating derivation 'g copying '/nix/store/jc0j evaluating derivation 'g copying '/nix/store/jc0j evaluating derivation 'g querying gammaloop-nexte [0.0 KiB DL] querying in [0/1 built, 0.0 KiB DL] [1/0/1 built, 0.0 KiB DLgammaloop-nextest-integration> Extracting 13 binaries, 1 build script output directory, and 3 linked paths to /build/nextest-archive-NQT8UU
  18. 27.72 s gammaloop-nextest-integration> Extracted 30 files to /build/nextest-archive-NQT8UU in 4.02s
  19. 27.75 s gammaloop-nextest-integration> ------------
  20. 27.75 s gammaloop-nextest-integration> Nextest run ID 6aed0418-7abc-45b2-8ea8-4c0f1aa68250 with nextest profile: ci_gammaloop
  21. 27.75 s gammaloop-nextest-integration> Starting 152 tests across 13 binaries (208 tests skipped, including 207 tests via profile.ci_gammaloop.default-filter)
  22. 446.21 s gammaloop-nextest-integration> FAIL [ 69.376s] ( 54/152) gammaloop-integration-tests::test_runs aa_aa::important::aa_aa_local_inspect_backend_consistency
  23. 446.21 s gammaloop-nextest-integration> stdout ---
  24. 446.21 s gammaloop-nextest-integration>
  25. 446.21 s gammaloop-nextest-integration> running 1 test
  26. 446.21 s gammaloop-nextest-integration> test aa_aa::important::aa_aa_local_inspect_backend_consistency has been running for over 60 seconds
  27. 446.21 s gammaloop-nextest-integration> test aa_aa::important::aa_aa_local_inspect_backend_consistency ... FAILED
  28. 446.21 s gammaloop-nextest-integration>
  29. 446.21 s gammaloop-nextest-integration> failures:
  30. 446.21 s gammaloop-nextest-integration>
  31. 446.21 s gammaloop-nextest-integration> failures:
  32. 446.21 s gammaloop-nextest-integration> aa_aa::important::aa_aa_local_inspect_backend_consistency
  33. 446.21 s gammaloop-nextest-integration>
  34. 446.21 s gammaloop-nextest-integration> test result: FAILED. 0 passed; 1 failed; 0 ignored; 0 measured; 258 filtered out; finished in 69.15s
  35. 446.21 s gammaloop-nextest-integration>
  36. 446.21 s gammaloop-nextest-integration> stderr ---
  37. 446.21 s gammaloop-nextest-integration> [2026-09-06 07:16:27.882] @gammaloop_api::se... INFO : Running command import model sm-default.json
  38. 446.21 s gammaloop-nextest-integration> [2026-09-06 07:16:27.882] @import::model INFO : Loading built-in JSON model sm-default
  39. 446.21 s gammaloop-nextest-integration> [2026-09-06 07:16:27.903] @gammalooprs::model INFO : The following 11 external parameters were forced to zero by the restriction card:
  40. 446.21 s gammaloop-nextest-integration> lamWS, AWS, rhoWS, etaWS, ymc, yme, ymm, MC, Me, MM, WTau
  41. 446.21 s gammaloop-nextest-integration> [2026-09-06 07:16:27.903] @gammalooprs::model INFO : The following 34 vertex rules were removed by the restriction card:
  42. 446.21 s gammaloop-nextest-integration> V_82 -> (c~, d, G+) | V_83 -> (t~, d, G+) | V_84 -> (c~, s, G+) | V_85 -> (t~, s, G+) | V_86 -> (u~, b, G+) | V_87 -> (c~, b, G+) | V_90 -> (c~, d, W+) | V_91 -> (t~, d, W+) | V_92 -> (u~, s, W+) | V_94 -> (t~, s, W+) | V_95 -> (u~, b, W+) | V_96 -> (c~, b, W+) | V_101 -> (e+, e-, G0) | V_102 -> (mu+, mu-, G0) | V_104 -> (e+, e-, H) | V_105 -> (mu+, mu-, H) | V_110 -> (ve~, e-, G+) | V_111 -> (vm~, mu-, G+) | V_116 -> (b~, u, G-) | V_117 -> (d~, c, G-) | V_118 -> (s~, c, G-) | V_119 -> (b~, c, G-) | V_120 -> (d~, t, G-) | V_121 -> (s~, t, G-) | V_124 -> (s~, u, W-) | V_125 -> (b~, u, W-) | V_126 -> (d~, c, W-) | V_128 -> (b~, c, W-) | V_129 -> (d~, t, W-) | V_130 -> (s~, t, W-) | V_138 -> (c~, c, G0) | V_140 -> (c~, c, H) | V_145 -> (e+, ve, G-) | V_146 -> (mu+, vm, G-)
  43. 446.21 s gammaloop-nextest-integration> [2026-09-06 07:16:27.903] @gammalooprs::model INFO : The following 36 couplings were removed by the restriction card:
  44. 446.21 s gammaloop-nextest-integration> GC_13, GC_14, GC_16, GC_17, GC_18, GC_19, GC_20, GC_22, GC_23, GC_24, GC_25, GC_26, GC_28, GC_29, GC_42, GC_43, GC_44, GC_46, GC_47, GC_48, GC_84, GC_85, GC_86, GC_87, GC_88, GC_89, GC_90, GC_91, GC_92, GC_93, GC_101, GC_102, GC_103, GC_105, GC_106, GC_107
  45. 446.21 s gammaloop-nextest-integration> [2026-09-06 07:16:27.903] @gammaloop_api::se... INFO : Running command run set_model_parameters
  46. 446.21 s gammaloop-nextest-integration> [2026-09-06 07:16:27.903] @gammaloop_api::se... INFO : Starting command block set_model_parameters
  47. 446.21 s gammaloop-nextest-integration> [2026-09-06 07:16:27.904] @gammaloop_api::se... INFO : Running command set model MT=173.0
  48. 446.21 s gammaloop-nextest-integration> [2026-09-06 07:16:27.908] @gammaloop_api::se... INFO : Running command set model WT=0.0
  49. 446.21 s gammaloop-nextest-integration> [2026-09-06 07:16:27.911] @gammaloop_api::se... INFO : Running command set model ymt=173.0
  50. 446.21 s gammaloop-nextest-integration> [2026-09-06 07:16:27.915] @gammaloop_api::se... INFO : Running command set model aS=0.118
  51. 446.21 s gammaloop-nextest-integration> [2026-09-06 07:16:27.919] @gammaloop_api::se... INFO : Running command set model aEWM1=137.036
  52. 446.21 s gammaloop-nextest-integration> [2026-09-06 07:16:27.922] @gammaloop_api::se... INFO : Running command set model Gf=1.166390e-05
  53. 446.21 s gammaloop-nextest-integration> [2026-09-06 07:16:27.926] @gammaloop_api::se... INFO : Running command set model MZ=91.188
  54. 446.21 s gammaloop-nextest-integration> [2026-09-06 07:16:27.930] @gammaloop_api::se... INFO : Running command set global string '
  55. 446.21 s gammaloop-nextest-integration> [global.generation.compile]
  56. 446.21 s gammaloop-nextest-integration> compilation_mode = "symjit"
  57. 446.21 s gammaloop-nextest-integration> optimization_level = "O0"
  58. 446.21 s gammaloop-nextest-integration> fast_math = false
  59. 446.21 s gammaloop-nextest-integration> [...]
  60. 446.21 s gammaloop-nextest-integration> [2026-09-06 07:16:27.930] @gammaloop_api::se... INFO : Running command import graphs ./examples/cli/aa_aa/1L/aa_aa_1L.dot -p aa_aa_all_helicities -i 1L_ppmm -o
  61. 446.21 s gammaloop-nextest-integration> [2026-09-06 07:16:27.930] @commands::import INFO : Loading graphs from '/build/source/examples/cli/aa_aa/1L/aa_aa_1L.dot'
  62. 446.21 s gammaloop-nextest-integration> [2026-09-06 07:16:27.939] @gammaloop_api::se... INFO : Running command generate existing -p aa_aa_all_helicities
  63. 446.21 s gammaloop-nextest-integration> [2026-09-06 07:16:53.477] @commands::generate INFO :
  64. 446.21 s gammaloop-nextest-integration> Integrand generation summary
  65. 446.21 s gammaloop-nextest-integration> peak RAM 1.06 GiB | cores 1
  66. 446.21 s gammaloop-nextest-integration> ╭───────────┬───────┬─────────┬──────────────┬─────────────┬────────────────┬──────────────╮
  67. 446.21 s gammaloop-nextest-integration> │ integrand │ graph │ # evals │ expr build │ spenso │ symbolica eval │ compile │
  68. 446.21 s gammaloop-nextest-integration> ├───────────┼───────┼─────────┼──────────────┼─────────────┼────────────────┼──────────────┤
  69. 446.21 s gammaloop-nextest-integration> │ 1L_ppmm │ GL0 │ 13 │ 544ms (6.2%) │ 1.76s (20%) │ 5.63s (64%) │ 844ms (9.6%) │
  70. 446.21 s gammaloop-nextest-integration> │ 1L_ppmm │ GL2 │ 13 │ 545ms (6.4%) │ 1.46s (17%) │ 5.67s (67%) │ 802ms (9.5%) │
  71. 446.21 s gammaloop-nextest-integration> │ 1L_ppmm │ GL4 │ 11 │ 533ms (6.5%) │ 1.40s (17%) │ 5.49s (67%) │ 796ms (9.7%) │
  72. 446.21 s gammaloop-nextest-integration> ├───────────┼───────┼─────────┼──────────────┼─────────────┼────────────────┼──────────────┤
  73. 446.21 s gammaloop-nextest-integration> │ Total │ │ 37 │ 1.62s (6.4%) │ 4.62s (18%) │ 16.79s (66%) │ 2.44s (9.6%) │
  74. 446.21 s gammaloop-nextest-integration> ╰───────────┴───────┴─────────┴──────────────┴─────────────┴────────────────┴──────────────╯
  75. 446.21 s gammaloop-nextest-integration> [2026-09-06 07:16:54.136] @gammaloop_api::se... INFO : Running command import model sm-default.json
  76. 446.21 s gammaloop-nextest-integration> [2026-09-06 07:16:54.136] @import::model INFO : Loading built-in JSON model sm-default
  77. 446.21 s gammaloop-nextest-integration> [2026-09-06 07:16:54.155] @gammalooprs::model INFO : The following 11 external parameters were forced to zero by the restriction card:
  78. 446.21 s gammaloop-nextest-integration> lamWS, AWS, rhoWS, etaWS, ymc, yme, ymm, MC, Me, MM, WTau
  79. 446.21 s gammaloop-nextest-integration> [2026-09-06 07:16:54.155] @gammalooprs::model INFO : The following 34 vertex rules were removed by the restriction card:
  80. 446.21 s gammaloop-nextest-integration> V_82 -> (c~, d, G+) | V_83 -> (t~, d, G+) | V_84 -> (c~, s, G+) | V_85 -> (t~, s, G+) | V_86 -> (u~, b, G+) | V_87 -> (c~, b, G+) | V_90 -> (c~, d, W+) | V_91 -> (t~, d, W+) | V_92 -> (u~, s, W+) | V_94 -> (t~, s, W+) | V_95 -> (u~, b, W+) | V_96 -> (c~, b, W+) | V_101 -> (e+, e-, G0) | V_102 -> (mu+, mu-, G0) | V_104 -> (e+, e-, H) | V_105 -> (mu+, mu-, H) | V_110 -> (ve~, e-, G+) | V_111 -> (vm~, mu-, G+) | V_116 -> (b~, u, G-) | V_117 -> (d~, c, G-) | V_118 -> (s~, c, G-) | V_119 -> (b~, c, G-) | V_120 -> (d~, t, G-) | V_121 -> (s~, t, G-) | V_124 -> (s~, u, W-) | V_125 -> (b~, u, W-) | V_126 -> (d~, c, W-) | V_128 -> (b~, c, W-) | V_129 -> (d~, t, W-) | V_130 -> (s~, t, W-) | V_138 -> (c~, c, G0) | V_140 -> (c~, c, H) | V_145 -> (e+, ve, G-) | V_146 -> (mu+, vm, G-)
  81. 446.21 s gammaloop-nextest-integration> [2026-09-06 07:16:54.155] @gammalooprs::model INFO : The following 36 couplings were removed by the restriction card:
  82. 446.22 s gammaloop-nextest-integration> GC_13, GC_14, GC_16, GC_17, GC_18, GC_19, GC_20, GC_22, GC_23, GC_24, GC_25, GC_26, GC_28, GC_29, GC_42, GC_43, GC_44, GC_46, GC_47, GC_48, GC_84, GC_85, GC_86, GC_87, GC_88, GC_89, GC_90, GC_91, GC_92, GC_93, GC_101, GC_102, GC_103, GC_105, GC_106, GC_107
  83. 446.22 s gammaloop-nextest-integration> [2026-09-06 07:16:54.155] @gammaloop_api::se... INFO : Running command run set_model_parameters
  84. 446.22 s gammaloop-nextest-integration> [2026-09-06 07:16:54.155] @gammaloop_api::se... INFO : Starting command block set_model_parameters
  85. 446.22 s gammaloop-nextest-integration> [2026-09-06 07:16:54.156] @gammaloop_api::se... INFO : Running command set model MT=173.0
  86. 446.22 s gammaloop-nextest-integration> [2026-09-06 07:16:54.159] @gammaloop_api::se... INFO : Running command set model WT=0.0
  87. 446.22 s gammaloop-nextest-integration> [2026-09-06 07:16:54.162] @gammaloop_api::se... INFO : Running command set model ymt=173.0
  88. 446.22 s gammaloop-nextest-integration> [2026-09-06 07:16:54.165] @gammaloop_api::se... INFO : Running command set model aS=0.118
  89. 446.22 s gammaloop-nextest-integration> [2026-09-06 07:16:54.169] @gammaloop_api::se... INFO : Running command set model aEWM1=137.036
  90. 446.22 s gammaloop-nextest-integration> [2026-09-06 07:16:54.172] @gammaloop_api::se... INFO : Running command set model Gf=1.166390e-05
  91. 446.22 s gammaloop-nextest-integration> [2026-09-06 07:16:54.175] @gammaloop_api::se... INFO : Running command set model MZ=91.188
  92. 446.22 s gammaloop-nextest-integration> [2026-09-06 07:16:54.179] @gammaloop_api::se... INFO : Running command set global string '
  93. 446.22 s gammaloop-nextest-integration> [global.generation.compile]
  94. 446.22 s gammaloop-nextest-integration> compilation_mode = "assembly"
  95. 446.22 s gammaloop-nextest-integration> optimization_level = "O0"
  96. 446.22 s gammaloop-nextest-integration> fast_math = false
  97. 446.22 s gammaloop-nextest-integration> [...]
  98. 446.22 s gammaloop-nextest-integration> [2026-09-06 07:16:54.180] @gammaloop_api::se... INFO : Running command import graphs ./examples/cli/aa_aa/1L/aa_aa_1L.dot -p aa_aa_all_helicities_assembly -i 1L_ppmm -o
  99. 446.22 s gammaloop-nextest-integration> [2026-09-06 07:16:54.180] @commands::import INFO : Loading graphs from '/build/source/examples/cli/aa_aa/1L/aa_aa_1L.dot'
  100. 446.22 s gammaloop-nextest-integration> [2026-09-06 07:16:54.187] @gammaloop_api::se... INFO : Running command generate existing -p aa_aa_all_helicities_assembly
  101. 446.22 s gammaloop-nextest-integration> [2026-09-06 07:17:16.399] @processes::amplitude INFO : Compiling amplitude 1L_ppmm
  102. 446.22 s gammaloop-nextest-integration> [2026-09-06 07:17:35.501] @commands::generate INFO : Removed 34 generated C++ source file(s). Use '--keep-sources' to keep them.
  103. 446.22 s gammaloop-nextest-integration> [2026-09-06 07:17:35.501] @commands::generate INFO :
  104. 446.22 s gammaloop-nextest-integration> Integrand generation summary
  105. 446.22 s gammaloop-nextest-integration> peak RAM 2.20 GiB | cores 1
  106. 446.22 s gammaloop-nextest-integration> ╭───────────┬───────┬─────────┬──────────────┬──────────────┬────────────────┬──────────────╮
  107. 446.22 s gammaloop-nextest-integration> │ integrand │ graph │ # evals │ expr build │ spenso │ symbolica eval │ compile │
  108. 446.22 s gammaloop-nextest-integration> ├───────────┼───────┼─────────┼──────────────┼──────────────┼────────────────┼──────────────┤
  109. 446.22 s gammaloop-nextest-integration> │ 1L_ppmm │ GL0 │ 13 │ 500ms (3.6%) │ 1.39s (10%) │ 5.50s (40%) │ 6.41s (46%) │
  110. 446.22 s gammaloop-nextest-integration> │ 1L_ppmm │ GL2 │ 13 │ 493ms (3.5%) │ 1.41s (9.9%) │ 5.58s (39%) │ 6.80s (48%) │
  111. 446.22 s gammaloop-nextest-integration> │ 1L_ppmm │ GL4 │ 11 │ 485ms (3.7%) │ 1.40s (11%) │ 5.44s (41%) │ 5.88s (45%) │
  112. 446.22 s gammaloop-nextest-integration> ├───────────┼───────┼─────────┼──────────────┼──────────────┼────────────────┼──────────────┤
  113. 446.22 s gammaloop-nextest-integration> │ Total │ │ 37 │ 1.48s (3.6%) │ 4.20s (10%) │ 16.52s (40%) │ 19.09s (46%) │
  114. 446.22 s gammaloop-nextest-integration> ╰───────────┴───────┴─────────┴──────────────┴──────────────┴────────────────┴──────────────╯
  115. 446.22 s gammaloop-nextest-integration> [2026-09-06 07:17:36.385] @gammaloop_api::se... INFO : Running command set process -p aa_aa_all_helicities -i 1L_ppmm string '
  116. 446.22 s gammaloop-nextest-integration> [stability]
  117. 446.22 s gammaloop-nextest-integration> check_on_norm = true
  118. 446.22 s gammaloop-nextest-integration> escalate_if_exact_zero = false
  119. 446.22 s gammaloop-nextest-integration> loop_momenta_norm_escalation_factor = -1.0
  120. 446.22 s gammaloop-nextest-integration> [...]
  121. 446.22 s gammaloop-nextest-integration> [2026-09-06 07:17:36.386] @gammaloop_api::se... INFO : Running command set process -p aa_aa_all_helicities_assembly -i 1L_ppmm string '
  122. 446.22 s gammaloop-nextest-integration> [stability]
  123. 446.22 s gammaloop-nextest-integration> check_on_norm = true
  124. 446.22 s gammaloop-nextest-integration> escalate_if_exact_zero = false
  125. 446.22 s gammaloop-nextest-integration> loop_momenta_norm_escalation_factor = -1.0
  126. 446.22 s gammaloop-nextest-integration> [...]
  127. 446.22 s gammaloop-nextest-integration> [2026-09-06 07:17:36.387] @gammaloop_api::se... INFO : Running command set process -p aa_aa_all_helicities -i 1L_mpmm string '
  128. 446.22 s gammaloop-nextest-integration> [stability]
  129. 446.22 s gammaloop-nextest-integration> check_on_norm = true
  130. 446.22 s gammaloop-nextest-integration> escalate_if_exact_zero = false
  131. 446.22 s gammaloop-nextest-integration> loop_momenta_norm_escalation_factor = -1.0
  132. 446.22 s gammaloop-nextest-integration> [...]
  133. 446.22 s gammaloop-nextest-integration> [2026-09-06 07:17:36.388] @gammaloop_api::se... INFO : Running command set process -p aa_aa_all_helicities_assembly -i 1L_mpmm string '
  134. 446.22 s gammaloop-nextest-integration> [stability]
  135. 446.22 s gammaloop-nextest-integration> check_on_norm = true
  136. 446.22 s gammaloop-nextest-integration> escalate_if_exact_zero = false
  137. 446.22 s gammaloop-nextest-integration> loop_momenta_norm_escalation_factor = -1.0
  138. 446.22 s gammaloop-nextest-integration> [...]
  139. 446.22 s gammaloop-nextest-integration> [2026-09-06 07:17:36.389] @gammaloop_api::se... INFO : Running command set process -p aa_aa_all_helicities -i 1L_mmmm string '
  140. 446.22 s gammaloop-nextest-integration> [stability]
  141. 446.22 s gammaloop-nextest-integration> check_on_norm = true
  142. 446.22 s gammaloop-nextest-integration> escalate_if_exact_zero = false
  143. 446.22 s gammaloop-nextest-integration> loop_momenta_norm_escalation_factor = -1.0
  144. 446.22 s gammaloop-nextest-integration> [...]
  145. 446.22 s gammaloop-nextest-integration> [2026-09-06 07:17:36.390] @gammaloop_api::se... INFO : Running command set process -p aa_aa_all_helicities_assembly -i 1L_mmmm string '
  146. 446.22 s gammaloop-nextest-integration> [stability]
  147. 446.22 s gammaloop-nextest-integration> check_on_norm = true
  148. 446.22 s gammaloop-nextest-integration> escalate_if_exact_zero = false
  149. 446.22 s gammaloop-nextest-integration> loop_momenta_norm_escalation_factor = -1.0
  150. 446.22 s gammaloop-nextest-integration> [...]
  151. 446.22 s gammaloop-nextest-integration> [2026-09-06 07:17:36.391] @gammaloop_api::se... INFO : Running command set process -p aa_aa_all_helicities -i 1L_pmmp string '
  152. 446.22 s gammaloop-nextest-integration> [stability]
  153. 446.22 s gammaloop-nextest-integration> check_on_norm = true
  154. 446.22 s gammaloop-nextest-integration> escalate_if_exact_zero = false
  155. 446.22 s gammaloop-nextest-integration> loop_momenta_norm_escalation_factor = -1.0
  156. 446.22 s gammaloop-nextest-integration> [...]
  157. 446.22 s gammaloop-nextest-integration> [2026-09-06 07:17:36.392] @gammaloop_api::se... INFO : Running command set process -p aa_aa_all_helicities_assembly -i 1L_pmmp string '
  158. 446.22 s gammaloop-nextest-integration> [stability]
  159. 446.22 s gammaloop-nextest-integration> check_on_norm = true
  160. 446.22 s gammaloop-nextest-integration> escalate_if_exact_zero = false
  161. 446.22 s gammaloop-nextest-integration> loop_momenta_norm_escalation_factor = -1.0
  162. 446.22 s gammaloop-nextest-integration> [...]
  163. 446.22 s gammaloop-nextest-integration> [2026-09-06 07:17:36.393] @gammaloop_api::se... INFO : Running command set process -p aa_aa_all_helicities -i 1L_pmpm string '
  164. 446.22 s gammaloop-nextest-integration> [stability]
  165. 446.22 s gammaloop-nextest-integration> check_on_norm = true
  166. 446.22 s gammaloop-nextest-integration> escalate_if_exact_zero = false
  167. 446.22 s gammaloop-nextest-integration> loop_momenta_norm_escalation_factor = -1.0
  168. 446.22 s gammaloop-nextest-integration> [...]
  169. 446.22 s gammaloop-nextest-integration> [2026-09-06 07:17:36.394] @gammaloop_api::se... INFO : Running command set process -p aa_aa_all_helicities_assembly -i 1L_pmpm string '
  170. 446.22 s gammaloop-nextest-integration> [stability]
  171. 446.22 s gammaloop-nextest-integration> check_on_norm = true
  172. 446.22 s gammaloop-nextest-integration> escalate_if_exact_zero = false
  173. 446.22 s gammaloop-nextest-integration> loop_momenta_norm_escalation_factor = -1.0
  174. 446.22 s gammaloop-nextest-integration> [...]
  175. 446.22 s gammaloop-nextest-integration> [2026-09-06 07:17:36.402] @process::amplitude INFO : Input is below threshold: 0 existing threshold E-surfaces across 0/1 graph groups
  176. 446.22 s gammaloop-nextest-integration> [2026-09-06 07:17:36.402] @process::amplitude INFO : overlap structure of group 0: [0: []]
  177. 446.22 s gammaloop-nextest-integration> [2026-09-06 07:17:36.402] @integrands::process [{#im_is_nan, #re_is_nan}] WARNING : final process evaluation is nonfinite
  178. 446.22 s gammaloop-nextest-integration> [2026-09-06 07:17:36.402] @commands::inspect INFO :
  179. 446.22 s gammaloop-nextest-integration> Input point in momentum space:
  180. 446.22 s gammaloop-nextest-integration>
  181. 446.22 s gammaloop-nextest-integration> ( 0.1100000000000000, -0.0700000000000000, 0.1900000000000000 )
  182. 446.22 s gammaloop-nextest-integration>
  183. 446.22 s gammaloop-nextest-integration> The evaluation of integrand '1L_ppmm' is:
  184. 446.22 s gammaloop-nextest-integration>
  185. 446.22 s gammaloop-nextest-integration> ( +0.0000000000000000e0, +0.0000000000000000e0 i)
  186. 446.22 s gammaloop-nextest-integration>
  187. 446.22 s gammaloop-nextest-integration> [2026-09-06 07:17:36.408] @process::amplitude INFO : Input is below threshold: 0 existing threshold E-surfaces across 0/1 graph groups
  188. 446.22 s gammaloop-nextest-integration> [2026-09-06 07:17:36.408] @process::amplitude INFO : overlap structure of group 0: [0: []]
  189. 446.22 s gammaloop-nextest-integration> [2026-09-06 07:17:36.409] @commands::inspect INFO :
  190. 446.22 s gammaloop-nextest-integration> Input point in momentum space:
  191. 446.22 s gammaloop-nextest-integration>
  192. 446.22 s gammaloop-nextest-integration> ( 0.1100000000000000, -0.0700000000000000, 0.1900000000000000 )
  193. 446.22 s gammaloop-nextest-integration>
  194. 446.22 s gammaloop-nextest-integration> The evaluation of integrand '1L_ppmm' is:
  195. 446.22 s gammaloop-nextest-integration>
  196. 446.22 s gammaloop-nextest-integration> ( -1.7132462539328486e-28, -8.7105072229446864e-10 i)
  197. 446.22 s gammaloop-nextest-integration>
  198. 446.22 s gammaloop-nextest-integration> The application panicked (crashed).
  199. 446.22 s gammaloop-nextest-integration> Message: kinematics=a, integrand=1L_ppmm, graph_id=0: assembly vs symjit inspect: actual=(-0.00000000000000000000000000017132462539328486+-0.0000000008710507222944686i), expected=(0+0i), tolerance=0.0000000001
  200. 446.22 s gammaloop-nextest-integration> Location: tests/tests/test_runs/utils.rs:466
  201. 446.22 s gammaloop-nextest-integration>
  202. 446.22 s gammaloop-nextest-integration> ━━━━━━━━━━━━━━━━━━━━━━━━━━━━━━━━━━ BACKTRACE ━━━━━━━━━━━━━━━━━━━━━━━━━━━━━━━━━━━
  203. 446.22 s gammaloop-nextest-integration> 1: <color_eyre[51793ea62743adbd]::config::PanicHook>::panic_report<unknown>
  204. 446.22 s gammaloop-nextest-integration> at <unknown source file>:<unknown line>
  205. 446.22 s gammaloop-nextest-integration> 2: <color_eyre[51793ea62743adbd]::config::PanicHook>::into_panic_hook::{closure#0}<unknown>
  206. 446.22 s gammaloop-nextest-integration> at <unknown source file>:<unknown line>
  207. 446.22 s gammaloop-nextest-integration> 3: std[bcb96dfbba0ab899]::panicking::panic_with_hook<unknown>
  208. 446.22 s gammaloop-nextest-integration> at <unknown source file>:<unknown line>
  209. 446.22 s gammaloop-nextest-integration> 4: std[bcb96dfbba0ab899]::panicking::panic_handler::{closure#0}<unknown>
  210. 446.22 s gammaloop-nextest-integration> at <unknown source file>:<unknown line>
  211. 446.22 s gammaloop-nextest-integration> 5: std[bcb96dfbba0ab899]::sys::backtrace::__rust_end_short_backtrace::<std[bcb96dfbba0ab899]::panicking::panic_handler::{closure#0}, !><unknown>
  212. 446.22 s gammaloop-nextest-integration> at <unknown source file>:<unknown line>
  213. 446.22 s gammaloop-nextest-integration> 6: __rustc[6c289b9f9c454d21]::rust_begin_unwind<unknown>
  214. 446.22 s gammaloop-nextest-integration> at <unknown source file>:<unknown line>
  215. 446.22 s gammaloop-nextest-integration> 7: core[940e698046960fd5]::panicking::panic_fmt<unknown>
  216. 446.22 s gammaloop-nextest-integration> at <unknown source file>:<unknown line>
  217. 446.22 s gammaloop-nextest-integration> 8: <test_runs[66584badfeb6c7be]::aa_aa::important::aa_aa_local_inspect_backend_consistency::{closure#0} as core[940e698046960fd5]::ops::function::FnOnce<()>>::call_once<unknown>
  218. 446.22 s gammaloop-nextest-integration> at <unknown source file>:<unknown line>
  219. 446.22 s gammaloop-nextest-integration> 9: serial_test[cd99724524a2f1c0]::serial_code_lock::local_serial_core_with_return::<(), eyre[cb2fd339c0c40fca]::Report><unknown>
  220. 446.22 s gammaloop-nextest-integration> at <unknown source file>:<unknown line>
  221. 446.22 s gammaloop-nextest-integration> 10: <test_runs[66584badfeb6c7be]::aa_aa::important::aa_aa_local_inspect_backend_consistency::{closure#0} as core[940e698046960fd5]::ops::function::FnOnce<()>>::call_once<unknown>
  222. 446.22 s gammaloop-nextest-integration> at <unknown source file>:<unknown line>
  223. 446.22 s gammaloop-nextest-integration> 11: test[75d6903177b1d7e9]::__rust_begin_short_backtrace::<core[940e698046960fd5]::result::Result<(), alloc[2ea6bcb46fca0c42]::string::String>, fn() -> core[940e698046960fd5]::result::Result<(), alloc[2ea6bcb46fca0c42]::string::String>><unknown>
  224. 446.22 s gammaloop-nextest-integration> at <unknown source file>:<unknown line>
  225. 446.22 s gammaloop-nextest-integration> 12: test[75d6903177b1d7e9]::run_test::{closure#0}<unknown>
  226. 446.22 s gammaloop-nextest-integration> at <unknown source file>:<unknown line>
  227. 446.22 s gammaloop-nextest-integration> 13: std[bcb96dfbba0ab899]::sys::backtrace::__rust_begin_short_backtrace::<test[75d6903177b1d7e9]::run_test::{closure#1}, ()><unknown>
  228. 446.22 s gammaloop-nextest-integration> at <unknown source file>:<unknown line>
  229. 446.22 s gammaloop-nextest-integration> 14: <std[bcb96dfbba0ab899]::thread::lifecycle::spawn_unchecked<test[75d6903177b1d7e9]::run_test::{closure#1}, ()>::{closure#1} as core[940e698046960fd5]::ops::function::FnOnce<()>>::call_once::{shim:vtable#0}<unknown>
  230. 446.22 s gammaloop-nextest-integration> at <unknown source file>:<unknown line>
  231. 446.22 s gammaloop-nextest-integration> 15: <std[bcb96dfbba0ab899]::sys::thread::unix::Thread>::new::thread_start<unknown>
  232. 446.22 s gammaloop-nextest-integration> at <unknown source file>:<unknown line>
  233. 446.22 s gammaloop-nextest-integration> 16: start_thread<unknown>
  234. 446.22 s gammaloop-nextest-integration> at <unknown source file>:<unknown line>
  235. 446.22 s gammaloop-nextest-integration> 17: __clone3<unknown>
  236. 446.22 s gammaloop-nextest-integration> at <unknown source file>:<unknown line>
  237. 446.22 s gammaloop-nextest-integration>
  238. 446.22 s gammaloop-nextest-integration> Run with COLORBT_SHOW_HIDDEN=1 environment variable to disable frame filtering.
  239. 446.22 s gammaloop-nextest-integration> Run with RUST_BACKTRACE=full to include source snippets.
  240. 446.22 s gammaloop-nextest-integration>
  241. 903.33 s gammaloop-nextest-integration> ------------
  242. 903.33 s gammaloop-nextest-integration> Summary [ 875.579s] 152 tests run: 151 passed, 1 failed, 208 skipped
  243. 903.33 s gammaloop-nextest-integration> FAIL [ 69.376s] ( 54/152) gammaloop-integration-tests::test_runs aa_aa::important::aa_aa_local_inspect_backend_consistency
  244. 903.33 s gammaloop-nextest-integration> stdout ---
  245. 903.33 s gammaloop-nextest-integration>
  246. 903.33 s gammaloop-nextest-integration> running 1 test
  247. 903.33 s gammaloop-nextest-integration> test aa_aa::important::aa_aa_local_inspect_backend_consistency has been running for over 60 seconds
  248. 903.33 s gammaloop-nextest-integration> test aa_aa::important::aa_aa_local_inspect_backend_consistency ... FAILED
  249. 903.33 s gammaloop-nextest-integration>
  250. 903.33 s gammaloop-nextest-integration> failures:
  251. 903.33 s gammaloop-nextest-integration>
  252. 903.33 s gammaloop-nextest-integration> failures:
  253. 903.33 s gammaloop-nextest-integration> aa_aa::important::aa_aa_local_inspect_backend_consistency
  254. 903.33 s gammaloop-nextest-integration>
  255. 903.33 s gammaloop-nextest-integration> test result: FAILED. 0 passed; 1 failed; 0 ignored; 0 measured; 258 filtered out; finished in 69.15s
  256. 903.33 s gammaloop-nextest-integration>
  257. 903.33 s gammaloop-nextest-integration> stderr ---
  258. 903.33 s gammaloop-nextest-integration> [2026-09-06 07:16:27.882] @gammaloop_api::se... INFO : Running command import model sm-default.json
  259. 903.33 s gammaloop-nextest-integration> [2026-09-06 07:16:27.882] @import::model INFO : Loading built-in JSON model sm-default
  260. 903.33 s gammaloop-nextest-integration> [2026-09-06 07:16:27.903] @gammalooprs::model INFO : The following 11 external parameters were forced to zero by the restriction card:
  261. 903.33 s gammaloop-nextest-integration> lamWS, AWS, rhoWS, etaWS, ymc, yme, ymm, MC, Me, MM, WTau
  262. 903.33 s gammaloop-nextest-integration> [2026-09-06 07:16:27.903] @gammalooprs::model INFO : The following 34 vertex rules were removed by the restriction card:
  263. 903.33 s gammaloop-nextest-integration> V_82 -> (c~, d, G+) | V_83 -> (t~, d, G+) | V_84 -> (c~, s, G+) | V_85 -> (t~, s, G+) | V_86 -> (u~, b, G+) | V_87 -> (c~, b, G+) | V_90 -> (c~, d, W+) | V_91 -> (t~, d, W+) | V_92 -> (u~, s, W+) | V_94 -> (t~, s, W+) | V_95 -> (u~, b, W+) | V_96 -> (c~, b, W+) | V_101 -> (e+, e-, G0) | V_102 -> (mu+, mu-, G0) | V_104 -> (e+, e-, H) | V_105 -> (mu+, mu-, H) | V_110 -> (ve~, e-, G+) | V_111 -> (vm~, mu-, G+) | V_116 -> (b~, u, G-) | V_117 -> (d~, c, G-) | V_118 -> (s~, c, G-) | V_119 -> (b~, c, G-) | V_120 -> (d~, t, G-) | V_121 -> (s~, t, G-) | V_124 -> (s~, u, W-) | V_125 -> (b~, u, W-) | V_126 -> (d~, c, W-) | V_128 -> (b~, c, W-) | V_129 -> (d~, t, W-) | V_130 -> (s~, t, W-) | V_138 -> (c~, c, G0) | V_140 -> (c~, c, H) | V_145 -> (e+, ve, G-) | V_146 -> (mu+, vm, G-)
  264. 903.33 s gammaloop-nextest-integration> [2026-09-06 07:16:27.903] @gammalooprs::model INFO : The following 36 couplings were removed by the restriction card:
  265. 903.33 s gammaloop-nextest-integration> GC_13, GC_14, GC_16, GC_17, GC_18, GC_19, GC_20, GC_22, GC_23, GC_24, GC_25, GC_26, GC_28, GC_29, GC_42, GC_43, GC_44, GC_46, GC_47, GC_48, GC_84, GC_85, GC_86, GC_87, GC_88, GC_89, GC_90, GC_91, GC_92, GC_93, GC_101, GC_102, GC_103, GC_105, GC_106, GC_107
  266. 903.33 s gammaloop-nextest-integration> [2026-09-06 07:16:27.903] @gammaloop_api::se... INFO : Running command run set_model_parameters
  267. 903.33 s gammaloop-nextest-integration> [2026-09-06 07:16:27.903] @gammaloop_api::se... INFO : Starting command block set_model_parameters
  268. 903.33 s gammaloop-nextest-integration> [2026-09-06 07:16:27.904] @gammaloop_api::se... INFO : Running command set model MT=173.0
  269. 903.33 s gammaloop-nextest-integration> [2026-09-06 07:16:27.908] @gammaloop_api::se... INFO : Running command set model WT=0.0
  270. 903.33 s gammaloop-nextest-integration> [2026-09-06 07:16:27.911] @gammaloop_api::se... INFO : Running command set model ymt=173.0
  271. 903.33 s gammaloop-nextest-integration> [2026-09-06 07:16:27.915] @gammaloop_api::se... INFO : Running command set model aS=0.118
  272. 903.33 s gammaloop-nextest-integration> [2026-09-06 07:16:27.919] @gammaloop_api::se... INFO : Running command set model aEWM1=137.036
  273. 903.33 s gammaloop-nextest-integration> [2026-09-06 07:16:27.922] @gammaloop_api::se... INFO : Running command set model Gf=1.166390e-05
  274. 903.33 s gammaloop-nextest-integration> [2026-09-06 07:16:27.926] @gammaloop_api::se... INFO : Running command set model MZ=91.188
  275. 903.33 s gammaloop-nextest-integration> [2026-09-06 07:16:27.930] @gammaloop_api::se... INFO : Running command set global string '
  276. 903.33 s gammaloop-nextest-integration> [global.generation.compile]
  277. 903.33 s gammaloop-nextest-integration> compilation_mode = "symjit"
  278. 903.33 s gammaloop-nextest-integration> optimization_level = "O0"
  279. 903.33 s gammaloop-nextest-integration> fast_math = false
  280. 903.33 s gammaloop-nextest-integration> [...]
  281. 903.33 s gammaloop-nextest-integration> [2026-09-06 07:16:27.930] @gammaloop_api::se... INFO : Running command import graphs ./examples/cli/aa_aa/1L/aa_aa_1L.dot -p aa_aa_all_helicities -i 1L_ppmm -o
  282. 903.33 s gammaloop-nextest-integration> [2026-09-06 07:16:27.930] @commands::import INFO : Loading graphs from '/build/source/examples/cli/aa_aa/1L/aa_aa_1L.dot'
  283. 903.33 s gammaloop-nextest-integration> [2026-09-06 07:16:27.939] @gammaloop_api::se... INFO : Running command generate existing -p aa_aa_all_helicities
  284. 903.33 s gammaloop-nextest-integration> [2026-09-06 07:16:53.477] @commands::generate INFO :
  285. 903.33 s gammaloop-nextest-integration> Integrand generation summary
  286. 903.33 s gammaloop-nextest-integration> peak RAM 1.06 GiB | cores 1
  287. 903.33 s gammaloop-nextest-integration> ╭───────────┬───────┬─────────┬──────────────┬─────────────┬────────────────┬──────────────╮
  288. 903.33 s gammaloop-nextest-integration> │ integrand │ graph │ # evals │ expr build │ spenso │ symbolica eval │ compile │
  289. 903.33 s gammaloop-nextest-integration> ├───────────┼───────┼─────────┼──────────────┼─────────────┼────────────────┼──────────────┤
  290. 903.33 s gammaloop-nextest-integration> │ 1L_ppmm │ GL0 │ 13 │ 544ms (6.2%) │ 1.76s (20%) │ 5.63s (64%) │ 844ms (9.6%) │
  291. 903.33 s gammaloop-nextest-integration> │ 1L_ppmm │ GL2 │ 13 │ 545ms (6.4%) │ 1.46s (17%) │ 5.67s (67%) │ 802ms (9.5%) │
  292. 903.33 s gammaloop-nextest-integration> │ 1L_ppmm │ GL4 │ 11 │ 533ms (6.5%) │ 1.40s (17%) │ 5.49s (67%) │ 796ms (9.7%) │
  293. 903.33 s gammaloop-nextest-integration> ├───────────┼───────┼─────────┼──────────────┼─────────────┼────────────────┼──────────────┤
  294. 903.33 s gammaloop-nextest-integration> │ Total │ │ 37 │ 1.62s (6.4%) │ 4.62s (18%) │ 16.79s (66%) │ 2.44s (9.6%) │
  295. 903.33 s gammaloop-nextest-integration> ╰───────────┴───────┴─────────┴──────────────┴─────────────┴────────────────┴──────────────╯
  296. 903.33 s gammaloop-nextest-integration> [2026-09-06 07:16:54.136] @gammaloop_api::se... INFO : Running command import model sm-default.json
  297. 903.33 s gammaloop-nextest-integration> [2026-09-06 07:16:54.136] @import::model INFO : Loading built-in JSON model sm-default
  298. 903.33 s gammaloop-nextest-integration> [2026-09-06 07:16:54.155] @gammalooprs::model INFO : The following 11 external parameters were forced to zero by the restriction card:
  299. 903.33 s gammaloop-nextest-integration> lamWS, AWS, rhoWS, etaWS, ymc, yme, ymm, MC, Me, MM, WTau
  300. 903.33 s gammaloop-nextest-integration> [2026-09-06 07:16:54.155] @gammalooprs::model INFO : The following 34 vertex rules were removed by the restriction card:
  301. 903.33 s gammaloop-nextest-integration> V_82 -> (c~, d, G+) | V_83 -> (t~, d, G+) | V_84 -> (c~, s, G+) | V_85 -> (t~, s, G+) | V_86 -> (u~, b, G+) | V_87 -> (c~, b, G+) | V_90 -> (c~, d, W+) | V_91 -> (t~, d, W+) | V_92 -> (u~, s, W+) | V_94 -> (t~, s, W+) | V_95 -> (u~, b, W+) | V_96 -> (c~, b, W+) | V_101 -> (e+, e-, G0) | V_102 -> (mu+, mu-, G0) | V_104 -> (e+, e-, H) | V_105 -> (mu+, mu-, H) | V_110 -> (ve~, e-, G+) | V_111 -> (vm~, mu-, G+) | V_116 -> (b~, u, G-) | V_117 -> (d~, c, G-) | V_118 -> (s~, c, G-) | V_119 -> (b~, c, G-) | V_120 -> (d~, t, G-) | V_121 -> (s~, t, G-) | V_124 -> (s~, u, W-) | V_125 -> (b~, u, W-) | V_126 -> (d~, c, W-) | V_128 -> (b~, c, W-) | V_129 -> (d~, t, W-) | V_130 -> (s~, t, W-) | V_138 -> (c~, c, G0) | V_140 -> (c~, c, H) | V_145 -> (e+, ve, G-) | V_146 -> (mu+, vm, G-)
  302. 903.33 s gammaloop-nextest-integration> [2026-09-06 07:16:54.155] @gammalooprs::model INFO : The following 36 couplings were removed by the restriction card:
  303. 903.33 s gammaloop-nextest-integration> GC_13, GC_14, GC_16, GC_17, GC_18, GC_19, GC_20, GC_22, GC_23, GC_24, GC_25, GC_26, GC_28, GC_29, GC_42, GC_43, GC_44, GC_46, GC_47, GC_48, GC_84, GC_85, GC_86, GC_87, GC_88, GC_89, GC_90, GC_91, GC_92, GC_93, GC_101, GC_102, GC_103, GC_105, GC_106, GC_107
  304. 903.33 s gammaloop-nextest-integration> [2026-09-06 07:16:54.155] @gammaloop_api::se... INFO : Running command run set_model_parameters
  305. 903.33 s gammaloop-nextest-integration> [2026-09-06 07:16:54.155] @gammaloop_api::se... INFO : Starting command block set_model_parameters
  306. 903.33 s gammaloop-nextest-integration> [2026-09-06 07:16:54.156] @gammaloop_api::se... INFO : Running command set model MT=173.0
  307. 903.33 s gammaloop-nextest-integration> [2026-09-06 07:16:54.159] @gammaloop_api::se... INFO : Running command set model WT=0.0
  308. 903.33 s gammaloop-nextest-integration> [2026-09-06 07:16:54.162] @gammaloop_api::se... INFO : Running command set model ymt=173.0
  309. 903.33 s gammaloop-nextest-integration> [2026-09-06 07:16:54.165] @gammaloop_api::se... INFO : Running command set model aS=0.118
  310. 903.33 s gammaloop-nextest-integration> [2026-09-06 07:16:54.169] @gammaloop_api::se... INFO : Running command set model aEWM1=137.036
  311. 903.33 s gammaloop-nextest-integration> [2026-09-06 07:16:54.172] @gammaloop_api::se... INFO : Running command set model Gf=1.166390e-05
  312. 903.33 s gammaloop-nextest-integration> [2026-09-06 07:16:54.175] @gammaloop_api::se... INFO : Running command set model MZ=91.188
  313. 903.33 s gammaloop-nextest-integration> [2026-09-06 07:16:54.179] @gammaloop_api::se... INFO : Running command set global string '
  314. 903.33 s gammaloop-nextest-integration> [global.generation.compile]
  315. 903.33 s gammaloop-nextest-integration> compilation_mode = "assembly"
  316. 903.33 s gammaloop-nextest-integration> optimization_level = "O0"
  317. 903.33 s gammaloop-nextest-integration> fast_math = false
  318. 903.33 s gammaloop-nextest-integration> [...]
  319. 903.33 s gammaloop-nextest-integration> [2026-09-06 07:16:54.180] @gammaloop_api::se... INFO : Running command import graphs ./examples/cli/aa_aa/1L/aa_aa_1L.dot -p aa_aa_all_helicities_assembly -i 1L_ppmm -o
  320. 903.33 s gammaloop-nextest-integration> [2026-09-06 07:16:54.180] @commands::import INFO : Loading graphs from '/build/source/examples/cli/aa_aa/1L/aa_aa_1L.dot'
  321. 903.33 s gammaloop-nextest-integration> [2026-09-06 07:16:54.187] @gammaloop_api::se... INFO : Running command generate existing -p aa_aa_all_helicities_assembly
  322. 903.33 s gammaloop-nextest-integration> [2026-09-06 07:17:16.399] @processes::amplitude INFO : Compiling amplitude 1L_ppmm
  323. 903.33 s gammaloop-nextest-integration> [2026-09-06 07:17:35.501] @commands::generate INFO : Removed 34 generated C++ source file(s). Use '--keep-sources' to keep them.
  324. 903.33 s gammaloop-nextest-integration> [2026-09-06 07:17:35.501] @commands::generate INFO :
  325. 903.33 s gammaloop-nextest-integration> Integrand generation summary
  326. 903.33 s gammaloop-nextest-integration> peak RAM 2.20 GiB | cores 1
  327. 903.33 s gammaloop-nextest-integration> ╭───────────┬───────┬─────────┬──────────────┬──────────────┬────────────────┬──────────────╮
  328. 903.33 s gammaloop-nextest-integration> │ integrand │ graph │ # evals │ expr build │ spenso │ symbolica eval │ compile │
  329. 903.33 s gammaloop-nextest-integration> ├───────────┼───────┼─────────┼──────────────┼──────────────┼────────────────┼──────────────┤
  330. 903.33 s gammaloop-nextest-integration> │ 1L_ppmm │ GL0 │ 13 │ 500ms (3.6%) │ 1.39s (10%) │ 5.50s (40%) │ 6.41s (46%) │
  331. 903.33 s gammaloop-nextest-integration> │ 1L_ppmm │ GL2 │ 13 │ 493ms (3.5%) │ 1.41s (9.9%) │ 5.58s (39%) │ 6.80s (48%) │
  332. 903.33 s gammaloop-nextest-integration> │ 1L_ppmm │ GL4 │ 11 │ 485ms (3.7%) │ 1.40s (11%) │ 5.44s (41%) │ 5.88s (45%) │
  333. 903.33 s gammaloop-nextest-integration> ├───────────┼───────┼─────────┼──────────────┼──────────────┼────────────────┼──────────────┤
  334. 903.33 s gammaloop-nextest-integration> │ Total │ │ 37 │ 1.48s (3.6%) │ 4.20s (10%) │ 16.52s (40%) │ 19.09s (46%) │
  335. 903.33 s gammaloop-nextest-integration> ╰───────────┴───────┴─────────┴──────────────┴──────────────┴────────────────┴──────────────╯
  336. 903.33 s gammaloop-nextest-integration> [2026-09-06 07:17:36.385] @gammaloop_api::se... INFO : Running command set process -p aa_aa_all_helicities -i 1L_ppmm string '
  337. 903.33 s gammaloop-nextest-integration> [stability]
  338. 903.33 s gammaloop-nextest-integration> check_on_norm = true
  339. 903.33 s gammaloop-nextest-integration> escalate_if_exact_zero = false
  340. 903.33 s gammaloop-nextest-integration> loop_momenta_norm_escalation_factor = -1.0
  341. 903.33 s gammaloop-nextest-integration> [...]
  342. 903.33 s gammaloop-nextest-integration> [2026-09-06 07:17:36.386] @gammaloop_api::se... INFO : Running command set process -p aa_aa_all_helicities_assembly -i 1L_ppmm string '
  343. 903.33 s gammaloop-nextest-integration> [stability]
  344. 903.33 s gammaloop-nextest-integration> check_on_norm = true
  345. 903.33 s gammaloop-nextest-integration> escalate_if_exact_zero = false
  346. 903.33 s gammaloop-nextest-integration> loop_momenta_norm_escalation_factor = -1.0
  347. 903.33 s gammaloop-nextest-integration> [...]
  348. 903.33 s gammaloop-nextest-integration> [2026-09-06 07:17:36.387] @gammaloop_api::se... INFO : Running command set process -p aa_aa_all_helicities -i 1L_mpmm string '
  349. 903.33 s gammaloop-nextest-integration> [stability]
  350. 903.33 s gammaloop-nextest-integration> check_on_norm = true
  351. 903.33 s gammaloop-nextest-integration> escalate_if_exact_zero = false
  352. 903.33 s gammaloop-nextest-integration> loop_momenta_norm_escalation_factor = -1.0
  353. 903.33 s gammaloop-nextest-integration> [...]
  354. 903.33 s gammaloop-nextest-integration> [2026-09-06 07:17:36.388] @gammaloop_api::se... INFO : Running command set process -p aa_aa_all_helicities_assembly -i 1L_mpmm string '
  355. 903.33 s gammaloop-nextest-integration> [stability]
  356. 903.33 s gammaloop-nextest-integration> check_on_norm = true
  357. 903.33 s gammaloop-nextest-integration> escalate_if_exact_zero = false
  358. 903.33 s gammaloop-nextest-integration> loop_momenta_norm_escalation_factor = -1.0
  359. 903.33 s gammaloop-nextest-integration> [...]
  360. 903.33 s gammaloop-nextest-integration> [2026-09-06 07:17:36.389] @gammaloop_api::se... INFO : Running command set process -p aa_aa_all_helicities -i 1L_mmmm string '
  361. 903.33 s gammaloop-nextest-integration> [stability]
  362. 903.33 s gammaloop-nextest-integration> check_on_norm = true
  363. 903.33 s gammaloop-nextest-integration> escalate_if_exact_zero = false
  364. 903.33 s gammaloop-nextest-integration> loop_momenta_norm_escalation_factor = -1.0
  365. 903.33 s gammaloop-nextest-integration> [...]
  366. 903.33 s gammaloop-nextest-integration> [2026-09-06 07:17:36.390] @gammaloop_api::se... INFO : Running command set process -p aa_aa_all_helicities_assembly -i 1L_mmmm string '
  367. 903.33 s gammaloop-nextest-integration> [stability]
  368. 903.33 s gammaloop-nextest-integration> check_on_norm = true
  369. 903.33 s gammaloop-nextest-integration> escalate_if_exact_zero = false
  370. 903.33 s gammaloop-nextest-integration> loop_momenta_norm_escalation_factor = -1.0
  371. 903.33 s gammaloop-nextest-integration> [...]
  372. 903.33 s gammaloop-nextest-integration> [2026-09-06 07:17:36.391] @gammaloop_api::se... INFO : Running command set process -p aa_aa_all_helicities -i 1L_pmmp string '
  373. 903.33 s gammaloop-nextest-integration> [stability]
  374. 903.33 s gammaloop-nextest-integration> check_on_norm = true
  375. 903.33 s gammaloop-nextest-integration> escalate_if_exact_zero = false
  376. 903.33 s gammaloop-nextest-integration> loop_momenta_norm_escalation_factor = -1.0
  377. 903.33 s gammaloop-nextest-integration> [...]
  378. 903.33 s gammaloop-nextest-integration> [2026-09-06 07:17:36.392] @gammaloop_api::se... INFO : Running command set process -p aa_aa_all_helicities_assembly -i 1L_pmmp string '
  379. 903.33 s gammaloop-nextest-integration> [stability]
  380. 903.33 s gammaloop-nextest-integration> check_on_norm = true
  381. 903.33 s gammaloop-nextest-integration> escalate_if_exact_zero = false
  382. 903.33 s gammaloop-nextest-integration> loop_momenta_norm_escalation_factor = -1.0
  383. 903.33 s gammaloop-nextest-integration> [...]
  384. 903.33 s gammaloop-nextest-integration> [2026-09-06 07:17:36.393] @gammaloop_api::se... INFO : Running command set process -p aa_aa_all_helicities -i 1L_pmpm string '
  385. 903.33 s gammaloop-nextest-integration> [stability]
  386. 903.33 s gammaloop-nextest-integration> check_on_norm = true
  387. 903.33 s gammaloop-nextest-integration> escalate_if_exact_zero = false
  388. 903.33 s gammaloop-nextest-integration> loop_momenta_norm_escalation_factor = -1.0
  389. 903.33 s gammaloop-nextest-integration> [...]
  390. 903.33 s gammaloop-nextest-integration> [2026-09-06 07:17:36.394] @gammaloop_api::se... INFO : Running command set process -p aa_aa_all_helicities_assembly -i 1L_pmpm string '
  391. 903.33 s gammaloop-nextest-integration> [stability]
  392. 903.33 s gammaloop-nextest-integration> check_on_norm = true
  393. 903.33 s gammaloop-nextest-integration> escalate_if_exact_zero = false
  394. 903.33 s gammaloop-nextest-integration> loop_momenta_norm_escalation_factor = -1.0
  395. 903.33 s gammaloop-nextest-integration> [...]
  396. 903.33 s gammaloop-nextest-integration> [2026-09-06 07:17:36.402] @process::amplitude INFO : Input is below threshold: 0 existing threshold E-surfaces across 0/1 graph groups
  397. 903.33 s gammaloop-nextest-integration> [2026-09-06 07:17:36.402] @process::amplitude INFO : overlap structure of group 0: [0: []]
  398. 903.33 s gammaloop-nextest-integration> [2026-09-06 07:17:36.402] @integrands::process [{#im_is_nan, #re_is_nan}] WARNING : final process evaluation is nonfinite
  399. 903.33 s gammaloop-nextest-integration> [2026-09-06 07:17:36.402] @commands::inspect INFO :
  400. 903.33 s gammaloop-nextest-integration> Input point in momentum space:
  401. 903.33 s gammaloop-nextest-integration>
  402. 903.33 s gammaloop-nextest-integration> ( 0.1100000000000000, -0.0700000000000000, 0.1900000000000000 )
  403. 903.33 s gammaloop-nextest-integration>
  404. 903.33 s gammaloop-nextest-integration> The evaluation of integrand '1L_ppmm' is:
  405. 903.33 s gammaloop-nextest-integration>
  406. 903.33 s gammaloop-nextest-integration> ( +0.0000000000000000e0, +0.0000000000000000e0 i)
  407. 903.33 s gammaloop-nextest-integration>
  408. 903.33 s gammaloop-nextest-integration> [2026-09-06 07:17:36.408] @process::amplitude INFO : Input is below threshold: 0 existing threshold E-surfaces across 0/1 graph groups
  409. 903.33 s gammaloop-nextest-integration> [2026-09-06 07:17:36.408] @process::amplitude INFO : overlap structure of group 0: [0: []]
  410. 903.33 s gammaloop-nextest-integration> [2026-09-06 07:17:36.409] @commands::inspect INFO :
  411. 903.33 s gammaloop-nextest-integration> Input point in momentum space:
  412. 903.33 s gammaloop-nextest-integration>
  413. 903.34 s gammaloop-nextest-integration> ( 0.1100000000000000, -0.0700000000000000, 0.1900000000000000 )
  414. 903.34 s gammaloop-nextest-integration>
  415. 903.34 s gammaloop-nextest-integration> The evaluation of integrand '1L_ppmm' is:
  416. 903.34 s gammaloop-nextest-integration>
  417. 903.34 s gammaloop-nextest-integration> ( -1.7132462539328486e-28, -8.7105072229446864e-10 i)
  418. 903.34 s gammaloop-nextest-integration>
  419. 903.34 s gammaloop-nextest-integration> The application panicked (crashed).
  420. 903.34 s gammaloop-nextest-integration> Message: kinematics=a, integrand=1L_ppmm, graph_id=0: assembly vs symjit inspect: actual=(-0.00000000000000000000000000017132462539328486+-0.0000000008710507222944686i), expected=(0+0i), tolerance=0.0000000001
  421. 903.34 s gammaloop-nextest-integration> Location: tests/tests/test_runs/utils.rs:466
  422. 903.34 s gammaloop-nextest-integration>
  423. 903.34 s gammaloop-nextest-integration> ━━━━━━━━━━━━━━━━━━━━━━━━━━━━━━━━━━ BACKTRACE ━━━━━━━━━━━━━━━━━━━━━━━━━━━━━━━━━━━
  424. 903.34 s gammaloop-nextest-integration> 1: <color_eyre[51793ea62743adbd]::config::PanicHook>::panic_report<unknown>
  425. 903.34 s gammaloop-nextest-integration> at <unknown source file>:<unknown line>
  426. 903.34 s gammaloop-nextest-integration> 2: <color_eyre[51793ea62743adbd]::config::PanicHook>::into_panic_hook::{closure#0}<unknown>
  427. 903.34 s gammaloop-nextest-integration> at <unknown source file>:<unknown line>
  428. 903.34 s gammaloop-nextest-integration> 3: std[bcb96dfbba0ab899]::panicking::panic_with_hook<unknown>
  429. 903.34 s gammaloop-nextest-integration> at <unknown source file>:<unknown line>
  430. 903.34 s gammaloop-nextest-integration> 4: std[bcb96dfbba0ab899]::panicking::panic_handler::{closure#0}<unknown>
  431. 903.34 s gammaloop-nextest-integration> at <unknown source file>:<unknown line>
  432. 903.34 s gammaloop-nextest-integration> 5: std[bcb96dfbba0ab899]::sys::backtrace::__rust_end_short_backtrace::<std[bcb96dfbba0ab899]::panicking::panic_handler::{closure#0}, !><unknown>
  433. 903.34 s gammaloop-nextest-integration> at <unknown source file>:<unknown line>
  434. 903.34 s gammaloop-nextest-integration> 6: __rustc[6c289b9f9c454d21]::rust_begin_unwind<unknown>
  435. 903.34 s gammaloop-nextest-integration> at <unknown source file>:<unknown line>
  436. 903.34 s gammaloop-nextest-integration> 7: core[940e698046960fd5]::panicking::panic_fmt<unknown>
  437. 903.34 s gammaloop-nextest-integration> at <unknown source file>:<unknown line>
  438. 903.34 s gammaloop-nextest-integration> 8: <test_runs[66584badfeb6c7be]::aa_aa::important::aa_aa_local_inspect_backend_consistency::{closure#0} as core[940e698046960fd5]::ops::function::FnOnce<()>>::call_once<unknown>
  439. 903.34 s gammaloop-nextest-integration> at <unknown source file>:<unknown line>
  440. 903.34 s gammaloop-nextest-integration> 9: serial_test[cd99724524a2f1c0]::serial_code_lock::local_serial_core_with_return::<(), eyre[cb2fd339c0c40fca]::Report><unknown>
  441. 903.34 s gammaloop-nextest-integration> at <unknown source file>:<unknown line>
  442. 903.34 s gammaloop-nextest-integration> 10: <test_runs[66584badfeb6c7be]::aa_aa::important::aa_aa_local_inspect_backend_consistency::{closure#0} as core[940e698046960fd5]::ops::function::FnOnce<()>>::call_once<unknown>
  443. 903.34 s gammaloop-nextest-integration> at <unknown source file>:<unknown line>
  444. 903.34 s gammaloop-nextest-integration> 11: test[75d6903177b1d7e9]::__rust_begin_short_backtrace::<core[940e698046960fd5]::result::Result<(), alloc[2ea6bcb46fca0c42]::string::String>, fn() -> core[940e698046960fd5]::result::Result<(), alloc[2ea6bcb46fca0c42]::string::String>><unknown>
  445. 903.34 s gammaloop-nextest-integration> at <unknown source file>:<unknown line>
  446. 903.34 s gammaloop-nextest-integration> 12: test[75d6903177b1d7e9]::run_test::{closure#0}<unknown>
  447. 903.34 s gammaloop-nextest-integration> at <unknown source file>:<unknown line>
  448. 903.34 s gammaloop-nextest-integration> 13: std[bcb96dfbba0ab899]::sys::backtrace::__rust_begin_short_backtrace::<test[75d6903177b1d7e9]::run_test::{closure#1}, ()><unknown>
  449. 903.34 s gammaloop-nextest-integration> at <unknown source file>:<unknown line>
  450. 903.34 s gammaloop-nextest-integration> 14: <std[bcb96dfbba0ab899]::thread::lifecycle::spawn_unchecked<test[75d6903177b1d7e9]::run_test::{closure#1}, ()>::{closure#1} as core[940e698046960fd5]::ops::function::FnOnce<()>>::call_once::{shim:vtable#0}<unknown>
  451. 903.34 s gammaloop-nextest-integration> at <unknown source file>:<unknown line>
  452. 903.34 s gammaloop-nextest-integration> 15: <std[bcb96dfbba0ab899]::sys::thread::unix::Thread>::new::thread_start<unknown>
  453. 903.34 s gammaloop-nextest-integration> at <unknown source file>:<unknown line>
  454. 903.34 s gammaloop-nextest-integration> 16: start_thread<unknown>
  455. 903.34 s gammaloop-nextest-integration> at <unknown source file>:<unknown line>
  456. 903.34 s gammaloop-nextest-integration> 17: __clone3<unknown>
  457. 903.34 s gammaloop-nextest-integration> at <unknown source file>:<unknown line>
  458. 903.34 s gammaloop-nextest-integration>
  459. 903.34 s gammaloop-nextest-integration> Run with COLORBT_SHOW_HIDDEN=1 environment variable to disable frame filtering.
  460. 903.34 s gammaloop-nextest-integration> Run with RUST_BACKTRACE=full to include source snippets.
  461. 903.34 s gammaloop-nextest-integration>
  462. 903.60 s gammaloop-nextest-integration> error: test run failed
  463. 903.62 s gammaloop-nextest-integration>
  464. 903.62 s gammaloop-nextest-integration> ========== nextest test summary ==========
  465. 903.62 s gammaloop-nextest-integration> report: target/nextest/ci_gammaloop/junit.xml
  466. 903.62 s gammaloop-nextest-integration> tests: 152, failures: 1, errors: 0
  467. 903.62 s gammaloop-nextest-integration>
  468. 903.62 s gammaloop-nextest-integration> 1. gammaloop-integration-tests::test_runs::aa_aa::important::aa_aa_local_inspect_backend_consistency
  469. 903.62 s gammaloop-nextest-integration> failure: test failure with exit code 101
  470. 903.62 s gammaloop-nextest-integration> system-out
  471. 903.62 s gammaloop-nextest-integration> running 1 test
  472. 903.62 s gammaloop-nextest-integration> test aa_aa::important::aa_aa_local_inspect_backend_consistency has been running for over 60 seconds
  473. 903.62 s gammaloop-nextest-integration> test aa_aa::important::aa_aa_local_inspect_backend_consistency ... FAILED
  474. 903.62 s gammaloop-nextest-integration>
  475. 903.62 s gammaloop-nextest-integration> failures:
  476. 903.62 s gammaloop-nextest-integration>
  477. 903.62 s gammaloop-nextest-integration> failures:
  478. 903.62 s gammaloop-nextest-integration> aa_aa::important::aa_aa_local_inspect_backend_consistency
  479. 903.62 s gammaloop-nextest-integration>
  480. 903.62 s gammaloop-nextest-integration> test result: FAILED. 0 passed; 1 failed; 0 ignored; 0 measured; 258 filtered out; finished in 69.15s
  481. 903.62 s gammaloop-nextest-integration> system-err
  482. 903.62 s gammaloop-nextest-integration> [2026-09-06 07:16:27.882] @gammaloop_api::se... INFO : Running command import model sm-default.json
  483. 903.62 s gammaloop-nextest-integration> [2026-09-06 07:16:27.882] @import::model INFO : Loading built-in JSON model sm-default
  484. 903.62 s gammaloop-nextest-integration> [2026-09-06 07:16:27.903] @gammalooprs::model INFO : The following 11 external parameters were forced to zero by the restriction card:
  485. 903.62 s gammaloop-nextest-integration> lamWS, AWS, rhoWS, etaWS, ymc, yme, ymm, MC, Me, MM, WTau
  486. 903.62 s gammaloop-nextest-integration> [2026-09-06 07:16:27.903] @gammalooprs::model INFO : The following 34 vertex rules were removed by the restriction card:
  487. 903.62 s gammaloop-nextest-integration> V_82 -> (c~, d, G+) | V_83 -> (t~, d, G+) | V_84 -> (c~, s, G+) | V_85 -> (t~, s, G+) | V_86 -> (u~, b, G+) | V_87 -> (c~, b, G+) | V_90 -> (c~, d, W+) | V_91 -> (t~, d, W+) | V_92 -> (u~, s, W+) | V_94 -> (t~, s, W+) | V_95 -> (u~, b, W+) | V_96 -> (c~, b, W+) | V_101 -> (e+, e-, G0) | V_102 -> (mu+, mu-, G0) | V_104 -> (e+, e-, H) | V_105 -> (mu+, mu-, H) | V_110 -> (ve~, e-, G+) | V_111 -> (vm~, mu-, G+) | V_116 -> (b~, u, G-) | V_117 -> (d~, c, G-) | V_118 -> (s~, c, G-) | V_119 -> (b~, c, G-) | V_120 -> (d~, t, G-) | V_121 -> (s~, t, G-) | V_124 -> (s~, u, W-) | V_125 -> (b~, u, W-) | V_126 -> (d~, c, W-) | V_128 -> (b~, c, W-) | V_129 -> (d~, t, W-) | V_130 -> (s~, t, W-) | V_138 -> (c~, c, G0) | V_140 -> (c~, c, H) | V_145 -> (e+, ve, G-) | V_146 -> (mu+, vm, G-)
  488. 903.62 s gammaloop-nextest-integration> [2026-09-06 07:16:27.903] @gammalooprs::model INFO : The following 36 couplings were removed by the restriction card:
  489. 903.62 s gammaloop-nextest-integration> GC_13, GC_14, GC_16, GC_17, GC_18, GC_19, GC_20, GC_22, GC_23, GC_24, GC_25, GC_26, GC_28, GC_29, GC_42, GC_43, GC_44, GC_46, GC_47, GC_48, GC_84, GC_85, GC_86, GC_87, GC_88, GC_89, GC_90, GC_91, GC_92, GC_93, GC_101, GC_102, GC_103, GC_105, GC_106, GC_107
  490. 903.62 s gammaloop-nextest-integration> [2026-09-06 07:16:27.903] @gammaloop_api::se... INFO : Running command run set_model_parameters
  491. 903.62 s gammaloop-nextest-integration> [2026-09-06 07:16:27.903] @gammaloop_api::se... INFO : Starting command block set_model_parameters
  492. 903.62 s gammaloop-nextest-integration> [2026-09-06 07:16:27.904] @gammaloop_api::se... INFO : Running command set model MT=173.0
  493. 903.62 s gammaloop-nextest-integration> [2026-09-06 07:16:27.908] @gammaloop_api::se... INFO : Running command set model WT=0.0
  494. 903.62 s gammaloop-nextest-integration> [2026-09-06 07:16:27.911] @gammaloop_api::se... INFO : Running command set model ymt=173.0
  495. 903.62 s gammaloop-nextest-integration> [2026-09-06 07:16:27.915] @gammaloop_api::se... INFO : Running command set model aS=0.118
  496. 903.62 s gammaloop-nextest-integration> [2026-09-06 07:16:27.919] @gammaloop_api::se... INFO : Running command set model aEWM1=137.036
  497. 903.62 s gammaloop-nextest-integration> [2026-09-06 07:16:27.922] @gammaloop_api::se... INFO : Running command set model Gf=1.166390e-05
  498. 903.62 s gammaloop-nextest-integration> [2026-09-06 07:16:27.926] @gammaloop_api::se... INFO : Running command set model MZ=91.188
  499. 903.62 s gammaloop-nextest-integration> [2026-09-06 07:16:27.930] @gammaloop_api::se... INFO : Running command set global string '
  500. 903.62 s gammaloop-nextest-integration> [global.generation.compile]
  501. 903.62 s gammaloop-nextest-integration> compilation_mode = "symjit"
  502. 903.62 s gammaloop-nextest-integration> optimization_level = "O0"
  503. 903.62 s gammaloop-nextest-integration> fast_math = false
  504. 903.62 s gammaloop-nextest-integration> [...]
  505. 903.62 s gammaloop-nextest-integration> [2026-09-06 07:16:27.930] @gammaloop_api::se... INFO : Running command import graphs ./examples/cli/aa_aa/1L/aa_aa_1L.dot -p aa_aa_all_helicities -i 1L_ppmm -o
  506. 903.62 s gammaloop-nextest-integration> [2026-09-06 07:16:27.930] @commands::import INFO : Loading graphs from '/build/source/examples/cli/aa_aa/1L/aa_aa_1L.dot'
  507. 903.62 s gammaloop-nextest-integration> [2026-09-06 07:16:27.939] @gammaloop_api::se... INFO : Running command generate existing -p aa_aa_all_helicities
  508. 903.62 s gammaloop-nextest-integration> [2026-09-06 07:16:53.477] @commands::generate INFO :
  509. 903.62 s gammaloop-nextest-integration> Integrand generation summary
  510. 903.62 s gammaloop-nextest-integration> peak RAM 1.06 GiB | cores 1
  511. 903.62 s gammaloop-nextest-integration> ╭───────────┬───────┬─────────┬──────────────┬─────────────┬────────────────┬──────────────╮
  512. 903.62 s gammaloop-nextest-integration> │ integrand │ graph │ # evals │ expr build │ spenso │ symbolica eval │ compile │
  513. 903.62 s gammaloop-nextest-integration> ├───────────┼───────┼─────────┼──────────────┼─────────────┼────────────────┼──────────────┤
  514. 903.62 s gammaloop-nextest-integration> │ 1L_ppmm │ GL0 │ 13 │ 544ms (6.2%) │ 1.76s (20%) │ 5.63s (64%) │ 844ms (9.6%) │
  515. 903.62 s gammaloop-nextest-integration> │ 1L_ppmm │ GL2 │ 13 │ 545ms (6.4%) │ 1.46s (17%) │ 5.67s (67%) │ 802ms (9.5%) │
  516. 903.62 s gammaloop-nextest-integration> │ 1L_ppmm │ GL4 │ 11 │ 533ms (6.5%) │ 1.40s (17%) │ 5.49s (67%) │ 796ms (9.7%) │
  517. 903.62 s gammaloop-nextest-integration> ├───────────┼───────┼─────────┼──────────────┼─────────────┼────────────────┼──────────────┤
  518. 903.62 s gammaloop-nextest-integration> │ Total │ │ 37 │ 1.62s (6.4%) │ 4.62s (18%) │ 16.79s (66%) │ 2.44s (9.6%) │
  519. 903.62 s gammaloop-nextest-integration> ╰───────────┴───────┴─────────┴──────────────┴─────────────┴────────────────┴──────────────╯
  520. 903.62 s gammaloop-nextest-integration> [2026-09-06 07:16:54.136] @gammaloop_api::se... INFO : Running command import model sm-default.json
  521. 903.62 s gammaloop-nextest-integration> [2026-09-06 07:16:54.136] @import::model INFO : Loading built-in JSON model sm-default
  522. 903.62 s gammaloop-nextest-integration> [2026-09-06 07:16:54.155] @gammalooprs::model INFO : The following 11 external parameters were forced to zero by the restriction card:
  523. 903.62 s gammaloop-nextest-integration> lamWS, AWS, rhoWS, etaWS, ymc, yme, ymm, MC, Me, MM, WTau
  524. 903.62 s gammaloop-nextest-integration> [2026-09-06 07:16:54.155] @gammalooprs::model INFO : The following 34 vertex rules were removed by the restriction card:
  525. 903.62 s gammaloop-nextest-integration> V_82 -> (c~, d, G+) | V_83 -> (t~, d, G+) | V_84 -> (c~, s, G+) | V_85 -> (t~, s, G+) | V_86 -> (u~, b, G+) | V_87 -> (c~, b, G+) | V_90 -> (c~, d, W+) | V_91 -> (t~, d, W+) | V_92 -> (u~, s, W+) | V_94 -> (t~, s, W+) | V_95 -> (u~, b, W+) | V_96 -> (c~, b, W+) | V_101 -> (e+, e-, G0) | V_102 -> (mu+, mu-, G0) | V_104 -> (e+, e-, H) | V_105 -> (mu+, mu-, H) | V_110 -> (ve~, e-, G+) | V_111 -> (vm~, mu-, G+) | V_116 -> (b~, u, G-) | V_117 -> (d~, c, G-) | V_118 -> (s~, c, G-) | V_119 -> (b~, c, G-) | V_120 -> (d~, t, G-) | V_121 -> (s~, t, G-) | V_124 -> (s~, u, W-) | V_125 -> (b~, u, W-) | V_126 -> (d~, c, W-) | V_128 -> (b~, c, W-) | V_129 -> (d~, t, W-) | V_130 -> (s~, t, W-) | V_138 -> (c~, c, G0) | V_140 -> (c~, c, H) | V_145 -> (e+, ve, G-) | V_146 -> (mu+, vm, G-)
  526. 903.62 s gammaloop-nextest-integration> [2026-09-06 07:16:54.155] @gammalooprs::model INFO : The following 36 couplings were removed by the restriction card:
  527. 903.62 s gammaloop-nextest-integration> GC_13, GC_14, GC_16, GC_17, GC_18, GC_19, GC_20, GC_22, GC_23, GC_24, GC_25, GC_26, GC_28, GC_29, GC_42, GC_43, GC_44, GC_46, GC_47, GC_48, GC_84, GC_85, GC_86, GC_87, GC_88, GC_89, GC_90, GC_91, GC_92, GC_93, GC_101, GC_102, GC_103, GC_105, GC_106, GC_107
  528. 903.62 s gammaloop-nextest-integration> [2026-09-06 07:16:54.155] @gammaloop_api::se... INFO : Running command run set_model_parameters
  529. 903.62 s gammaloop-nextest-integration> [2026-09-06 07:16:54.155] @gammaloop_api::se... INFO : Starting command block set_model_parameters
  530. 903.62 s gammaloop-nextest-integration> [2026-09-06 07:16:54.156] @gammaloop_api::se... INFO : Running command set model MT=173.0
  531. 903.62 s gammaloop-nextest-integration> [2026-09-06 07:16:54.159] @gammaloop_api::se... INFO : Running command set model WT=0.0
  532. 903.62 s gammaloop-nextest-integration> [2026-09-06 07:16:54.162] @gammaloop_api::se... INFO : Running command set model ymt=173.0
  533. 903.62 s gammaloop-nextest-integration> [2026-09-06 07:16:54.165] @gammaloop_api::se... INFO : Running command set model aS=0.118
  534. 903.62 s gammaloop-nextest-integration> [2026-09-06 07:16:54.169] @gammaloop_api::se... INFO : Running command set model aEWM1=137.036
  535. 903.62 s gammaloop-nextest-integration> [2026-09-06 07:16:54.172] @gammaloop_api::se... INFO : Running command set model Gf=1.166390e-05
  536. 903.62 s gammaloop-nextest-integration> [2026-09-06 07:16:54.175] @gammaloop_api::se... INFO : Running command set model MZ=91.188
  537. 903.62 s gammaloop-nextest-integration> [2026-09-06 07:16:54.179] @gammaloop_api::se... INFO : Running command set global string '
  538. 903.62 s gammaloop-nextest-integration> [global.generation.compile]
  539. 903.62 s gammaloop-nextest-integration> compilation_mode = "assembly"
  540. 903.62 s gammaloop-nextest-integration> optimization_level = "O0"
  541. 903.62 s gammaloop-nextest-integration> fast_math = false
  542. 903.62 s gammaloop-nextest-integration> [...]
  543. 903.62 s gammaloop-nextest-integration> [2026-09-06 07:16:54.180] @gammaloop_api::se... INFO : Running command import graphs ./examples/cli/aa_aa/1L/aa_aa_1L.dot -p aa_aa_all_helicities_assembly -i 1L_ppmm -o
  544. 903.62 s gammaloop-nextest-integration> [2026-09-06 07:16:54.180] @commands::import INFO : Loading graphs from '/build/source/examples/cli/aa_aa/1L/aa_aa_1L.dot'
  545. 903.62 s gammaloop-nextest-integration> [2026-09-06 07:16:54.187] @gammaloop_api::se... INFO : Running command generate existing -p aa_aa_all_helicities_assembly
  546. 903.62 s gammaloop-nextest-integration> [2026-09-06 07:17:16.399] @processes::amplitude INFO : Compiling amplitude 1L_ppmm
  547. 903.62 s gammaloop-nextest-integration> [2026-09-06 07:17:35.501] @commands::generate INFO : Removed 34 generated C++ source file(s). Use '--keep-sources' to keep them.
  548. 903.62 s gammaloop-nextest-integration> [2026-09-06 07:17:35.501] @commands::generate INFO :
  549. 903.62 s gammaloop-nextest-integration> Integrand generation summary
  550. 903.62 s gammaloop-nextest-integration> peak RAM 2.20 GiB | cores 1
  551. 903.62 s gammaloop-nextest-integration> ╭───────────┬───────┬─────────┬──────────────┬──────────────┬────────────────┬──────────────╮
  552. 903.62 s gammaloop-nextest-integration> │ integrand │ graph │ # evals │ expr build │ spenso │ symbolica eval │ compile │
  553. 903.62 s gammaloop-nextest-integration> ├───────────┼───────┼─────────┼──────────────┼──────────────┼────────────────┼──────────────┤
  554. 903.62 s gammaloop-nextest-integration> │ 1L_ppmm │ GL0 │ 13 │ 500ms (3.6%) │ 1.39s (10%) │ 5.50s (40%) │ 6.41s (46%) │
  555. 903.62 s gammaloop-nextest-integration> │ 1L_ppmm │ GL2 │ 13 │ 493ms (3.5%) │ 1.41s (9.9%) │ 5.58s (39%) │ 6.80s (48%) │
  556. 903.62 s gammaloop-nextest-integration> │ 1L_ppmm │ GL4 │ 11 │ 485ms (3.7%) │ 1.40s (11%) │ 5.44s (41%) │ 5.88s (45%) │
  557. 903.62 s gammaloop-nextest-integration> ├───────────┼───────┼─────────┼──────────────┼──────────────┼────────────────┼──────────────┤
  558. 903.62 s gammaloop-nextest-integration> │ Total │ │ 37 │ 1.48s (3.6%) │ 4.20s (10%) │ 16.52s (40%) │ 19.09s (46%) │
  559. 903.62 s gammaloop-nextest-integration> ╰───────────┴───────┴─────────┴──────────────┴──────────────┴────────────────┴──────────────╯
  560. 903.62 s gammaloop-nextest-integration> [2026-09-06 07:17:36.385] @gammaloop_api::se... INFO : Running command set process -p aa_aa_all_helicities -i 1L_ppmm string '
  561. 903.62 s gammaloop-nextest-integration> [stability]
  562. 903.62 s gammaloop-nextest-integration> check_on_norm = true
  563. 903.62 s gammaloop-nextest-integration> escalate_if_exact_zero = false
  564. 903.62 s gammaloop-nextest-integration> loop_momenta_norm_escalation_factor = -1.0
  565. 903.62 s gammaloop-nextest-integration> [...]
  566. 903.62 s gammaloop-nextest-integration> [2026-09-06 07:17:36.386] @gammaloop_api::se... INFO : Running command set process -p aa_aa_all_helicities_assembly -i 1L_ppmm string '
  567. 903.62 s gammaloop-nextest-integration> [stability]
  568. 903.62 s gammaloop-nextest-integration> check_on_norm = true
  569. 903.62 s gammaloop-nextest-integration> escalate_if_exact_zero = false
  570. 903.62 s gammaloop-nextest-integration> loop_momenta_norm_escalation_factor = -1.0
  571. 903.62 s gammaloop-nextest-integration> [...]
  572. 903.62 s gammaloop-nextest-integration> [2026-09-06 07:17:36.387] @gammaloop_api::se... INFO : Running command set process -p aa_aa_all_helicities -i 1L_mpmm string '
  573. 903.62 s gammaloop-nextest-integration> [stability]
  574. 903.62 s gammaloop-nextest-integration> check_on_norm = true
  575. 903.62 s gammaloop-nextest-integration> escalate_if_exact_zero = false
  576. 903.62 s gammaloop-nextest-integration> loop_momenta_norm_escalation_factor = -1.0
  577. 903.62 s gammaloop-nextest-integration> [...]
  578. 903.62 s gammaloop-nextest-integration> [2026-09-06 07:17:36.388] @gammaloop_api::se... INFO : Running command set process -p aa_aa_all_helicities_assembly -i 1L_mpmm string '
  579. 903.62 s gammaloop-nextest-integration> [stability]
  580. 903.62 s gammaloop-nextest-integration> check_on_norm = true
  581. 903.62 s gammaloop-nextest-integration> escalate_if_exact_zero = false
  582. 903.62 s gammaloop-nextest-integration> loop_momenta_norm_escalation_factor = -1.0
  583. 903.62 s gammaloop-nextest-integration> [...]
  584. 903.62 s gammaloop-nextest-integration> [2026-09-06 07:17:36.389] @gammaloop_api::se... INFO : Running command set process -p aa_aa_all_helicities -i 1L_mmmm string '
  585. 903.62 s gammaloop-nextest-integration> [stability]
  586. 903.62 s gammaloop-nextest-integration> check_on_norm = true
  587. 903.62 s gammaloop-nextest-integration> escalate_if_exact_zero = false
  588. 903.62 s gammaloop-nextest-integration> loop_momenta_norm_escalation_factor = -1.0
  589. 903.62 s gammaloop-nextest-integration> [...]
  590. 903.62 s gammaloop-nextest-integration> [2026-09-06 07:17:36.390] @gammaloop_api::se... INFO : Running command set process -p aa_aa_all_helicities_assembly -i 1L_mmmm string '
  591. 903.62 s gammaloop-nextest-integration> [stability]
  592. 903.62 s gammaloop-nextest-integration> check_on_norm = true
  593. 903.62 s gammaloop-nextest-integration> escalate_if_exact_zero = false
  594. 903.62 s gammaloop-nextest-integration> loop_momenta_norm_escalation_factor = -1.0
  595. 903.62 s gammaloop-nextest-integration> [...]
  596. 903.62 s gammaloop-nextest-integration> [2026-09-06 07:17:36.391] @gammaloop_api::se... INFO : Running command set process -p aa_aa_all_helicities -i 1L_pmmp string '
  597. 903.62 s gammaloop-nextest-integration> [stability]
  598. 903.62 s gammaloop-nextest-integration> check_on_norm = true
  599. 903.62 s gammaloop-nextest-integration> escalate_if_exact_zero = false
  600. 903.62 s gammaloop-nextest-integration> loop_momenta_norm_escalation_factor = -1.0
  601. 903.62 s gammaloop-nextest-integration> ... omitted 84 more lines; see full nextest output above
  602. 903.62 s gammaloop-nextest-integration> =========================================
  603. 903.72 s error: Cannot build '/nix/store/3qpyi4i089mjhqx61pnq05lcl2pfrw3d-gammaloop-nextest-integration.drv'.
  604. 903.72 s Reason: builder failed with exit code 100.
  605. 903.72 s Output paths:
  606. 903.72 s /nix/store/qyb58cjmy2g43lf39wd171npb5v3mmpa-gammaloop-nextest-integration
  607. 903.72 s Last 586 log lines:
  608. 903.72 s > Extracting 13 binaries, 1 build script output directory, and 3 linked paths to /build/nextest-archive-NQT8UU
  609. 903.72 s > Extracted 30 files to /build/nextest-archive-NQT8UU in 4.02s
  610. 903.72 s > ------------
  611. 903.72 s > Nextest run ID 6aed0418-7abc-45b2-8ea8-4c0f1aa68250 with nextest profile: ci_gammaloop
  612. 903.72 s > Starting 152 tests across 13 binaries (208 tests skipped, including 207 tests via profile.ci_gammaloop.default-filter)
  613. 903.72 s > FAIL [ 69.376s] ( 54/152) gammaloop-integration-tests::test_runs aa_aa::important::aa_aa_local_inspect_backend_consistency
  614. 903.72 s > stdout ---
  615. 903.72 s >
  616. 903.72 s > running 1 test
  617. 903.72 s > test aa_aa::important::aa_aa_local_inspect_backend_consistency has been running for over 60 seconds
  618. 903.72 s > test aa_aa::important::aa_aa_local_inspect_backend_consistency ... FAILED
  619. 903.72 s >
  620. 903.72 s > failures:
  621. 903.72 s >
  622. 903.72 s > failures:
  623. 903.72 s > aa_aa::important::aa_aa_local_inspect_backend_consistency
  624. 903.72 s >
  625. 903.72 s > test result: FAILED. 0 passed; 1 failed; 0 ignored; 0 measured; 258 filtered out; finished in 69.15s
  626. 903.72 s >
  627. 903.72 s > stderr ---
  628. 903.72 s > [2026-09-06 07:16:27.882] @gammaloop_api::se... INFO : Running command import model sm-default.json
  629. 903.72 s > [2026-09-06 07:16:27.882] @import::model INFO : Loading built-in JSON model sm-default
  630. 903.72 s > [2026-09-06 07:16:27.903] @gammalooprs::model INFO : The following 11 external parameters were forced to zero by the restriction card:
  631. 903.72 s > lamWS, AWS, rhoWS, etaWS, ymc, yme, ymm, MC, Me, MM, WTau
  632. 903.72 s > [2026-09-06 07:16:27.903] @gammalooprs::model INFO : The following 34 vertex rules were removed by the restriction card:
  633. 903.72 s > V_82 -> (c~, d, G+) | V_83 -> (t~, d, G+) | V_84 -> (c~, s, G+) | V_85 -> (t~, s, G+) | V_86 -> (u~, b, G+) | V_87 -> (c~, b, G+) | V_90 -> (c~, d, W+) | V_91 -> (t~, d, W+) | V_92 -> (u~, s, W+) | V_94 -> (t~, s, W+) | V_95 -> (u~, b, W+) | V_96 -> (c~, b, W+) | V_101 -> (e+, e-, G0) | V_102 -> (mu+, mu-, G0) | V_104 -> (e+, e-, H) | V_105 -> (mu+, mu-, H) | V_110 -> (ve~, e-, G+) | V_111 -> (vm~, mu-, G+) | V_116 -> (b~, u, G-) | V_117 -> (d~, c, G-) | V_118 -> (s~, c, G-) | V_119 -> (b~, c, G-) | V_120 -> (d~, t, G-) | V_121 -> (s~, t, G-) | V_124 -> (s~, u, W-) | V_125 -> (b~, u, W-) | V_126 -> (d~, c, W-) | V_128 -> (b~, c, W-) | V_129 -> (d~, t, W-) | V_130 -> (s~, t, W-) | V_138 -> (c~, c, G0) | V_140 -> (c~, c, H) | V_145 -> (e+, ve, G-) | V_146 -> (mu+, vm, G-)
  634. 903.72 s > [2026-09-06 07:16:27.903] @gammalooprs::model INFO : The following 36 couplings were removed by the restriction card:
  635. 903.72 s > GC_13, GC_14, GC_16, GC_17, GC_18, GC_19, GC_20, GC_22, GC_23, GC_24, GC_25, GC_26, GC_28, GC_29, GC_42, GC_43, GC_44, GC_46, GC_47, GC_48, GC_84, GC_85, GC_86, GC_87, GC_88, GC_89, GC_90, GC_91, GC_92, GC_93, GC_101, GC_102, GC_103, GC_105, GC_106, GC_107
  636. 903.72 s > [2026-09-06 07:16:27.903] @gammaloop_api::se... INFO : Running command run set_model_parameters
  637. 903.72 s > [2026-09-06 07:16:27.903] @gammaloop_api::se... INFO : Starting command block set_model_parameters
  638. 903.72 s > [2026-09-06 07:16:27.904] @gammaloop_api::se... INFO : Running command set model MT=173.0
  639. 903.72 s > [2026-09-06 07:16:27.908] @gammaloop_api::se... INFO : Running command set model WT=0.0
  640. 903.72 s > [2026-09-06 07:16:27.911] @gammaloop_api::se... INFO : Running command set model ymt=173.0
  641. 903.72 s > [2026-09-06 07:16:27.915] @gammaloop_api::se... INFO : Running command set model aS=0.118
  642. 903.72 s > [2026-09-06 07:16:27.919] @gammaloop_api::se... INFO : Running command set model aEWM1=137.036
  643. 903.72 s > [2026-09-06 07:16:27.922] @gammaloop_api::se... INFO : Running command set model Gf=1.166390e-05
  644. 903.72 s > [2026-09-06 07:16:27.926] @gammaloop_api::se... INFO : Running command set model MZ=91.188
  645. 903.72 s > [2026-09-06 07:16:27.930] @gammaloop_api::se... INFO : Running command set global string '
  646. 903.72 s > [global.generation.compile]
  647. 903.72 s > compilation_mode = "symjit"
  648. 903.72 s > optimization_level = "O0"
  649. 903.72 s > fast_math = false
  650. 903.72 s > [...]
  651. 903.72 s > [2026-09-06 07:16:27.930] @gammaloop_api::se... INFO : Running command import graphs ./examples/cli/aa_aa/1L/aa_aa_1L.dot -p aa_aa_all_helicities -i 1L_ppmm -o
  652. 903.72 s > [2026-09-06 07:16:27.930] @commands::import INFO : Loading graphs from '/build/source/examples/cli/aa_aa/1L/aa_aa_1L.dot'
  653. 903.72 s > [2026-09-06 07:16:27.939] @gammaloop_api::se... INFO : Running command generate existing -p aa_aa_all_helicities
  654. 903.72 s > [2026-09-06 07:16:53.477] @commands::generate INFO :
  655. 903.72 s > Integrand generation summary
  656. 903.72 s > peak RAM 1.06 GiB | cores 1
  657. 903.72 s > ╭───────────┬───────┬─────────┬──────────────┬─────────────┬────────────────┬──────────────╮
  658. 903.72 s > │ integrand │ graph │ # evals │ expr build │ spenso │ symbolica eval │ compile │
  659. 903.72 s > ├───────────┼───────┼─────────┼──────────────┼─────────────┼────────────────┼──────────────┤
  660. 903.72 s > │ 1L_ppmm │ GL0 │ 13 │ 544ms (6.2%) │ 1.76s (20%) │ 5.63s (64%) │ 844ms (9.6%) │
  661. 903.72 s > │ 1L_ppmm │ GL2 │ 13 │ 545ms (6.4%) │ 1.46s (17%) │ 5.67s (67%) │ 802ms (9.5%) │
  662. 903.72 s > │ 1L_ppmm │ GL4 │ 11 │ 533ms (6.5%) │ 1.40s (17%) │ 5.49s (67%) │ 796ms (9.7%) │
  663. 903.72 s > ├───────────┼───────┼─────────┼──────────────┼─────────────┼────────────────┼──────────────┤
  664. 903.72 s > │ Total │ │ 37 │ 1.62s (6.4%) │ 4.62s (18%) │ 16.79s (66%) │ 2.44s (9.6%) │
  665. 903.72 s > ╰───────────┴───────┴─────────┴──────────────┴─────────────┴────────────────┴──────────────╯
  666. 903.72 s > [2026-09-06 07:16:54.136] @gammaloop_api::se... INFO : Running command import model sm-default.json
  667. 903.72 s > [2026-09-06 07:16:54.136] @import::model INFO : Loading built-in JSON model sm-default
  668. 903.72 s > [2026-09-06 07:16:54.155] @gammalooprs::model INFO : The following 11 external parameters were forced to zero by the restriction card:
  669. 903.72 s > lamWS, AWS, rhoWS, etaWS, ymc, yme, ymm, MC, Me, MM, WTau
  670. 903.72 s > [2026-09-06 07:16:54.155] @gammalooprs::model INFO : The following 34 vertex rules were removed by the restriction card:
  671. 903.72 s > V_82 -> (c~, d, G+) | V_83 -> (t~, d, G+) | V_84 -> (c~, s, G+) | V_85 -> (t~, s, G+) | V_86 -> (u~, b, G+) | V_87 -> (c~, b, G+) | V_90 -> (c~, d, W+) | V_91 -> (t~, d, W+) | V_92 -> (u~, s, W+) | V_94 -> (t~, s, W+) | V_95 -> (u~, b, W+) | V_96 -> (c~, b, W+) | V_101 -> (e+, e-, G0) | V_102 -> (mu+, mu-, G0) | V_104 -> (e+, e-, H) | V_105 -> (mu+, mu-, H) | V_110 -> (ve~, e-, G+) | V_111 -> (vm~, mu-, G+) | V_116 -> (b~, u, G-) | V_117 -> (d~, c, G-) | V_118 -> (s~, c, G-) | V_119 -> (b~, c, G-) | V_120 -> (d~, t, G-) | V_121 -> (s~, t, G-) | V_124 -> (s~, u, W-) | V_125 -> (b~, u, W-) | V_126 -> (d~, c, W-) | V_128 -> (b~, c, W-) | V_129 -> (d~, t, W-) | V_130 -> (s~, t, W-) | V_138 -> (c~, c, G0) | V_140 -> (c~, c, H) | V_145 -> (e+, ve, G-) | V_146 -> (mu+, vm, G-)
  672. 903.72 s > [2026-09-06 07:16:54.155] @gammalooprs::model INFO : The following 36 couplings were removed by the restriction card:
  673. 903.72 s > GC_13, GC_14, GC_16, GC_17, GC_18, GC_19, GC_20, GC_22, GC_23, GC_24, GC_25, GC_26, GC_28, GC_29, GC_42, GC_43, GC_44, GC_46, GC_47, GC_48, GC_84, GC_85, GC_86, GC_87, GC_88, GC_89, GC_90, GC_91, GC_92, GC_93, GC_101, GC_102, GC_103, GC_105, GC_106, GC_107
  674. 903.72 s > [2026-09-06 07:16:54.155] @gammaloop_api::se... INFO : Running command run set_model_parameters
  675. 903.72 s > [2026-09-06 07:16:54.155] @gammaloop_api::se... INFO : Starting command block set_model_parameters
  676. 903.72 s > [2026-09-06 07:16:54.156] @gammaloop_api::se... INFO : Running command set model MT=173.0
  677. 903.72 s > [2026-09-06 07:16:54.159] @gammaloop_api::se... INFO : Running command set model WT=0.0
  678. 903.72 s > [2026-09-06 07:16:54.162] @gammaloop_api::se... INFO : Running command set model ymt=173.0
  679. 903.72 s > [2026-09-06 07:16:54.165] @gammaloop_api::se... INFO : Running command set model aS=0.118
  680. 903.72 s > [2026-09-06 07:16:54.169] @gammaloop_api::se... INFO : Running command set model aEWM1=137.036
  681. 903.72 s > [2026-09-06 07:16:54.172] @gammaloop_api::se... INFO : Running command set model Gf=1.166390e-05
  682. 903.72 s > [2026-09-06 07:16:54.175] @gammaloop_api::se... INFO : Running command set model MZ=91.188
  683. 903.72 s > [2026-09-06 07:16:54.179] @gammaloop_api::se... INFO : Running command set global string '
  684. 903.72 s > [global.generation.compile]
  685. 903.72 s > compilation_mode = "assembly"
  686. 903.72 s > optimization_level = "O0"
  687. 903.72 s > fast_math = false
  688. 903.72 s > [...]
  689. 903.72 s > [2026-09-06 07:16:54.180] @gammaloop_api::se... INFO : Running command import graphs ./examples/cli/aa_aa/1L/aa_aa_1L.dot -p aa_aa_all_helicities_assembly -i 1L_ppmm -o
  690. 903.72 s > [2026-09-06 07:16:54.180] @commands::import INFO : Loading graphs from '/build/source/examples/cli/aa_aa/1L/aa_aa_1L.dot'
  691. 903.72 s > [2026-09-06 07:16:54.187] @gammaloop_api::se... INFO : Running command generate existing -p aa_aa_all_helicities_assembly
  692. 903.72 s > [2026-09-06 07:17:16.399] @processes::amplitude INFO : Compiling amplitude 1L_ppmm
  693. 903.72 s > [2026-09-06 07:17:35.501] @commands::generate INFO : Removed 34 generated C++ source file(s). Use '--keep-sources' to keep them.
  694. 903.72 s > [2026-09-06 07:17:35.501] @commands::generate INFO :
  695. 903.72 s > Integrand generation summary
  696. 903.72 s > peak RAM 2.20 GiB | cores 1
  697. 903.72 s > ╭───────────┬───────┬─────────┬──────────────┬──────────────┬────────────────┬──────────────╮
  698. 903.72 s > │ integrand │ graph │ # evals │ expr build │ spenso │ symbolica eval │ compile │
  699. 903.72 s > ├───────────┼───────┼─────────┼──────────────┼──────────────┼────────────────┼──────────────┤
  700. 903.72 s > │ 1L_ppmm │ GL0 │ 13 │ 500ms (3.6%) │ 1.39s (10%) │ 5.50s (40%) │ 6.41s (46%) │
  701. 903.72 s > │ 1L_ppmm │ GL2 │ 13 │ 493ms (3.5%) │ 1.41s (9.9%) │ 5.58s (39%) │ 6.80s (48%) │
  702. 903.72 s > │ 1L_ppmm │ GL4 │ 11 │ 485ms (3.7%) │ 1.40s (11%) │ 5.44s (41%) │ 5.88s (45%) │
  703. 903.72 s > ├───────────┼───────┼─────────┼──────────────┼──────────────┼────────────────┼──────────────┤
  704. 903.72 s > │ Total │ │ 37 │ 1.48s (3.6%) │ 4.20s (10%) │ 16.52s (40%) │ 19.09s (46%) │
  705. 903.72 s > ╰───────────┴───────┴─────────┴──────────────┴──────────────┴────────────────┴──────────────╯
  706. 903.72 s > [2026-09-06 07:17:36.385] @gammaloop_api::se... INFO : Running command set process -p aa_aa_all_helicities -i 1L_ppmm string '
  707. 903.72 s > [stability]
  708. 903.72 s > check_on_norm = true
  709. 903.72 s > escalate_if_exact_zero = false
  710. 903.72 s > loop_momenta_norm_escalation_factor = -1.0
  711. 903.72 s > [...]
  712. 903.72 s > [2026-09-06 07:17:36.386] @gammaloop_api::se... INFO : Running command set process -p aa_aa_all_helicities_assembly -i 1L_ppmm string '
  713. 903.72 s > [stability]
  714. 903.72 s > check_on_norm = true
  715. 903.72 s > escalate_if_exact_zero = false
  716. 903.72 s > loop_momenta_norm_escalation_factor = -1.0
  717. 903.72 s > [...]
  718. 903.72 s > [2026-09-06 07:17:36.387] @gammaloop_api::se... INFO : Running command set process -p aa_aa_all_helicities -i 1L_mpmm string '
  719. 903.72 s > [stability]
  720. 903.72 s > check_on_norm = true
  721. 903.72 s > escalate_if_exact_zero = false
  722. 903.72 s > loop_momenta_norm_escalation_factor = -1.0
  723. 903.72 s > [...]
  724. 903.72 s > [2026-09-06 07:17:36.388] @gammaloop_api::se... INFO : Running command set process -p aa_aa_all_helicities_assembly -i 1L_mpmm string '
  725. 903.72 s > [stability]
  726. 903.72 s > check_on_norm = true
  727. 903.72 s > escalate_if_exact_zero = false
  728. 903.72 s > loop_momenta_norm_escalation_factor = -1.0
  729. 903.72 s > [...]
  730. 903.72 s > [2026-09-06 07:17:36.389] @gammaloop_api::se... INFO : Running command set process -p aa_aa_all_helicities -i 1L_mmmm string '
  731. 903.72 s > [stability]
  732. 903.72 s > check_on_norm = true
  733. 903.72 s > escalate_if_exact_zero = false
  734. 903.72 s > loop_momenta_norm_escalation_factor = -1.0
  735. 903.72 s > [...]
  736. 903.72 s > [2026-09-06 07:17:36.390] @gammaloop_api::se... INFO : Running command set process -p aa_aa_all_helicities_assembly -i 1L_mmmm string '
  737. 903.72 s > [stability]
  738. 903.72 s > check_on_norm = true
  739. 903.72 s > escalate_if_exact_zero = false
  740. 903.72 s > loop_momenta_norm_escalation_factor = -1.0
  741. 903.72 s > [...]
  742. 903.72 s > [2026-09-06 07:17:36.391] @gammaloop_api::se... INFO : Running command set process -p aa_aa_all_helicities -i 1L_pmmp string '
  743. 903.72 s > [stability]
  744. 903.72 s > check_on_norm = true
  745. 903.72 s > escalate_if_exact_zero = false
  746. 903.72 s > loop_momenta_norm_escalation_factor = -1.0
  747. 903.72 s > [...]
  748. 903.72 s > [2026-09-06 07:17:36.392] @gammaloop_api::se... INFO : Running command set process -p aa_aa_all_helicities_assembly -i 1L_pmmp string '
  749. 903.72 s > [stability]
  750. 903.72 s > check_on_norm = true
  751. 903.72 s > escalate_if_exact_zero = false
  752. 903.72 s > loop_momenta_norm_escalation_factor = -1.0
  753. 903.72 s > [...]
  754. 903.72 s > [2026-09-06 07:17:36.393] @gammaloop_api::se... INFO : Running command set process -p aa_aa_all_helicities -i 1L_pmpm string '
  755. 903.72 s > [stability]
  756. 903.72 s > check_on_norm = true
  757. 903.72 s > escalate_if_exact_zero = false
  758. 903.72 s > loop_momenta_norm_escalation_factor = -1.0
  759. 903.72 s > [...]
  760. 903.72 s > [2026-09-06 07:17:36.394] @gammaloop_api::se... INFO : Running command set process -p aa_aa_all_helicities_assembly -i 1L_pmpm string '
  761. 903.72 s > [stability]
  762. 903.72 s > check_on_norm = true
  763. 903.72 s > escalate_if_exact_zero = false
  764. 903.72 s > loop_momenta_norm_escalation_factor = -1.0
  765. 903.72 s > [...]
  766. 903.72 s > [2026-09-06 07:17:36.402] @process::amplitude INFO : Input is below threshold: 0 existing threshold E-surfaces across 0/1 graph groups
  767. 903.72 s > [2026-09-06 07:17:36.402] @process::amplitude INFO : overlap structure of group 0: [0: []]
  768. 903.72 s > [2026-09-06 07:17:36.402] @integrands::process [{#im_is_nan, #re_is_nan}] WARNING : final process evaluation is nonfinite
  769. 903.72 s > [2026-09-06 07:17:36.402] @commands::inspect INFO :
  770. 903.72 s > Input point in momentum space:
  771. 903.72 s >
  772. 903.72 s > ( 0.1100000000000000, -0.0700000000000000, 0.1900000000000000 )
  773. 903.72 s >
  774. 903.72 s > The evaluation of integrand '1L_ppmm' is:
  775. 903.72 s >
  776. 903.72 s > ( +0.0000000000000000e0, +0.0000000000000000e0 i)
  777. 903.72 s >
  778. 903.72 s > [2026-09-06 07:17:36.408] @process::amplitude INFO : Input is below threshold: 0 existing threshold E-surfaces across 0/1 graph groups
  779. 903.72 s > [2026-09-06 07:17:36.408] @process::amplitude INFO : overlap structure of group 0: [0: []]
  780. 903.72 s > [2026-09-06 07:17:36.409] @commands::inspect INFO :
  781. 903.72 s > Input point in momentum space:
  782. 903.72 s >
  783. 903.72 s > ( 0.1100000000000000, -0.0700000000000000, 0.1900000000000000 )
  784. 903.72 s >
  785. 903.72 s > The evaluation of integrand '1L_ppmm' is:
  786. 903.72 s >
  787. 903.72 s > ( -1.7132462539328486e-28, -8.7105072229446864e-10 i)
  788. 903.72 s >
  789. 903.72 s > The application panicked (crashed).
  790. 903.72 s > Message: kinematics=a, integrand=1L_ppmm, graph_id=0: assembly vs symjit inspect: actual=(-0.00000000000000000000000000017132462539328486+-0.0000000008710507222944686i), expected=(0+0i), tolerance=0.0000000001
  791. 903.72 s > Location: tests/tests/test_runs/utils.rs:466
  792. 903.72 s >
  793. 903.72 s > ━━━━━━━━━━━━━━━━━━━━━━━━━━━━━━━━━━ BACKTRACE ━━━━━━━━━━━━━━━━━━━━━━━━━━━━━━━━━━━
  794. 903.72 s > 1: <color_eyre[51793ea62743adbd]::config::PanicHook>::panic_report<unknown>
  795. 903.72 s > at <unknown source file>:<unknown line>
  796. 903.72 s > 2: <color_eyre[51793ea62743adbd]::config::PanicHook>::into_panic_hook::{closure#0}<unknown>
  797. 903.72 s > at <unknown source file>:<unknown line>
  798. 903.72 s > 3: std[bcb96dfbba0ab899]::panicking::panic_with_hook<unknown>
  799. 903.72 s > at <unknown source file>:<unknown line>
  800. 903.72 s > 4: std[bcb96dfbba0ab899]::panicking::panic_handler::{closure#0}<unknown>
  801. 903.72 s > at <unknown source file>:<unknown line>
  802. 903.72 s > 5: std[bcb96dfbba0ab899]::sys::backtrace::__rust_end_short_backtrace::<std[bcb96dfbba0ab899]::panicking::panic_handler::{closure#0}, !><unknown>
  803. 903.72 s > at <unknown source file>:<unknown line>
  804. 903.72 s > 6: __rustc[6c289b9f9c454d21]::rust_begin_unwind<unknown>
  805. 903.72 s > at <unknown source file>:<unknown line>
  806. 903.72 s > 7: core[940e698046960fd5]::panicking::panic_fmt<unknown>
  807. 903.72 s > at <unknown source file>:<unknown line>
  808. 903.72 s > 8: <test_runs[66584badfeb6c7be]::aa_aa::important::aa_aa_local_inspect_backend_consistency::{closure#0} as core[940e698046960fd5]::ops::function::FnOnce<()>>::call_once<unknown>
  809. 903.72 s > at <unknown source file>:<unknown line>
  810. 903.72 s > 9: serial_test[cd99724524a2f1c0]::serial_code_lock::local_serial_core_with_return::<(), eyre[cb2fd339c0c40fca]::Report><unknown>
  811. 903.72 s > at <unknown source file>:<unknown line>
  812. 903.72 s > 10: <test_runs[66584badfeb6c7be]::aa_aa::important::aa_aa_local_inspect_backend_consistency::{closure#0} as core[940e698046960fd5]::ops::function::FnOnce<()>>::call_once<unknown>
  813. 903.72 s > at <unknown source file>:<unknown line>
  814. 903.72 s > 11: test[75d6903177b1d7e9]::__rust_begin_short_backtrace::<core[940e698046960fd5]::result::Result<(), alloc[2ea6bcb46fca0c42]::string::String>, fn() -> core[940e698046960fd5]::result::Result<(), alloc[2ea6bcb46fca0c42]::string::String>><unknown>
  815. 903.72 s > at <unknown source file>:<unknown line>
  816. 903.72 s > 12: test[75d6903177b1d7e9]::run_test::{closure#0}<unknown>
  817. 903.72 s > at <unknown source file>:<unknown line>
  818. 903.72 s > 13: std[bcb96dfbba0ab899]::sys::backtrace::__rust_begin_short_backtrace::<test[75d6903177b1d7e9]::run_test::{closure#1}, ()><unknown>
  819. 903.72 s > at <unknown source file>:<unknown line>
  820. 903.72 s > 14: <std[bcb96dfbba0ab899]::thread::lifecycle::spawn_unchecked<test[75d6903177b1d7e9]::run_test::{closure#1}, ()>::{closure#1} as core[940e698046960fd5]::ops::function::FnOnce<()>>::call_once::{shim:vtable#0}<unknown>
  821. 903.72 s > at <unknown source file>:<unknown line>
  822. 903.72 s > 15: <std[bcb96dfbba0ab899]::sys::thread::unix::Thread>::new::thread_start<unknown>
  823. 903.72 s > at <unknown source file>:<unknown line>
  824. 903.72 s > 16: start_thread<unknown>
  825. 903.72 s > at <unknown source file>:<unknown line>
  826. 903.72 s > 17: __clone3<unknown>
  827. 903.72 s > at <unknown source file>:<unknown line>
  828. 903.72 s >
  829. 903.72 s > Run with COLORBT_SHOW_HIDDEN=1 environment variable to disable frame filtering.
  830. 903.72 s > Run with RUST_BACKTRACE=full to include source snippets.
  831. 903.72 s >
  832. 903.72 s > ------------
  833. 903.72 s > Summary [ 875.579s] 152 tests run: 151 passed, 1 failed, 208 skipped
  834. 903.72 s > FAIL [ 69.376s] ( 54/152) gammaloop-integration-tests::test_runs aa_aa::important::aa_aa_local_inspect_backend_consistency
  835. 903.72 s > stdout ---
  836. 903.72 s >
  837. 903.72 s > running 1 test
  838. 903.72 s > test aa_aa::important::aa_aa_local_inspect_backend_consistency has been running for over 60 seconds
  839. 903.72 s > test aa_aa::important::aa_aa_local_inspect_backend_consistency ... FAILED
  840. 903.72 s >
  841. 903.72 s > failures:
  842. 903.72 s >
  843. 903.72 s > failures:
  844. 903.72 s > aa_aa::important::aa_aa_local_inspect_backend_consistency
  845. 903.72 s >
  846. 903.72 s > test result: FAILED. 0 passed; 1 failed; 0 ignored; 0 measured; 258 filtered out; finished in 69.15s
  847. 903.72 s >
  848. 903.72 s > stderr ---
  849. 903.72 s > [2026-09-06 07:16:27.882] @gammaloop_api::se... INFO : Running command import model sm-default.json
  850. 903.72 s > [2026-09-06 07:16:27.882] @import::model INFO : Loading built-in JSON model sm-default
  851. 903.72 s > [2026-09-06 07:16:27.903] @gammalooprs::model INFO : The following 11 external parameters were forced to zero by the restriction card:
  852. 903.72 s > lamWS, AWS, rhoWS, etaWS, ymc, yme, ymm, MC, Me, MM, WTau
  853. 903.72 s > [2026-09-06 07:16:27.903] @gammalooprs::model INFO : The following 34 vertex rules were removed by the restriction card:
  854. 903.72 s > V_82 -> (c~, d, G+) | V_83 -> (t~, d, G+) | V_84 -> (c~, s, G+) | V_85 -> (t~, s, G+) | V_86 -> (u~, b, G+) | V_87 -> (c~, b, G+) | V_90 -> (c~, d, W+) | V_91 -> (t~, d, W+) | V_92 -> (u~, s, W+) | V_94 -> (t~, s, W+) | V_95 -> (u~, b, W+) | V_96 -> (c~, b, W+) | V_101 -> (e+, e-, G0) | V_102 -> (mu+, mu-, G0) | V_104 -> (e+, e-, H) | V_105 -> (mu+, mu-, H) | V_110 -> (ve~, e-, G+) | V_111 -> (vm~, mu-, G+) | V_116 -> (b~, u, G-) | V_117 -> (d~, c, G-) | V_118 -> (s~, c, G-) | V_119 -> (b~, c, G-) | V_120 -> (d~, t, G-) | V_121 -> (s~, t, G-) | V_124 -> (s~, u, W-) | V_125 -> (b~, u, W-) | V_126 -> (d~, c, W-) | V_128 -> (b~, c, W-) | V_129 -> (d~, t, W-) | V_130 -> (s~, t, W-) | V_138 -> (c~, c, G0) | V_140 -> (c~, c, H) | V_145 -> (e+, ve, G-) | V_146 -> (mu+, vm, G-)
  855. 903.72 s > [2026-09-06 07:16:27.903] @gammalooprs::model INFO : The following 36 couplings were removed by the restriction card:
  856. 903.72 s > GC_13, GC_14, GC_16, GC_17, GC_18, GC_19, GC_20, GC_22, GC_23, GC_24, GC_25, GC_26, GC_28, GC_29, GC_42, GC_43, GC_44, GC_46, GC_47, GC_48, GC_84, GC_85, GC_86, GC_87, GC_88, GC_89, GC_90, GC_91, GC_92, GC_93, GC_101, GC_102, GC_103, GC_105, GC_106, GC_107
  857. 903.72 s > [2026-09-06 07:16:27.903] @gammaloop_api::se... INFO : Running command run set_model_parameters
  858. 903.72 s > [2026-09-06 07:16:27.903] @gammaloop_api::se... INFO : Starting command block set_model_parameters
  859. 903.72 s > [2026-09-06 07:16:27.904] @gammaloop_api::se... INFO : Running command set model MT=173.0
  860. 903.72 s > [2026-09-06 07:16:27.908] @gammaloop_api::se... INFO : Running command set model WT=0.0
  861. 903.72 s > [2026-09-06 07:16:27.911] @gammaloop_api::se... INFO : Running command set model ymt=173.0
  862. 903.72 s > [2026-09-06 07:16:27.915] @gammaloop_api::se... INFO : Running command set model aS=0.118
  863. 903.72 s > [2026-09-06 07:16:27.919] @gammaloop_api::se... INFO : Running command set model aEWM1=137.036
  864. 903.72 s > [2026-09-06 07:16:27.922] @gammaloop_api::se... INFO : Running command set model Gf=1.166390e-05
  865. 903.72 s > [2026-09-06 07:16:27.926] @gammaloop_api::se... INFO : Running command set model MZ=91.188
  866. 903.72 s > [2026-09-06 07:16:27.930] @gammaloop_api::se... INFO : Running command set global string '
  867. 903.72 s > [global.generation.compile]
  868. 903.72 s > compilation_mode = "symjit"
  869. 903.72 s > optimization_level = "O0"
  870. 903.72 s > fast_math = false
  871. 903.72 s > [...]
  872. 903.72 s > [2026-09-06 07:16:27.930] @gammaloop_api::se... INFO : Running command import graphs ./examples/cli/aa_aa/1L/aa_aa_1L.dot -p aa_aa_all_helicities -i 1L_ppmm -o
  873. 903.72 s > [2026-09-06 07:16:27.930] @commands::import INFO : Loading graphs from '/build/source/examples/cli/aa_aa/1L/aa_aa_1L.dot'
  874. 903.72 s > [2026-09-06 07:16:27.939] @gammaloop_api::se... INFO : Running command generate existing -p aa_aa_all_helicities
  875. 903.72 s > [2026-09-06 07:16:53.477] @commands::generate INFO :
  876. 903.72 s > Integrand generation summary
  877. 903.72 s > peak RAM 1.06 GiB | cores 1
  878. 903.72 s > ╭───────────┬───────┬─────────┬──────────────┬─────────────┬────────────────┬──────────────╮
  879. 903.72 s > │ integrand │ graph │ # evals │ expr build │ spenso │ symbolica eval │ compile │
  880. 903.72 s > ├───────────┼───────┼─────────┼──────────────┼─────────────┼────────────────┼──────────────┤
  881. 903.72 s > │ 1L_ppmm │ GL0 │ 13 │ 544ms (6.2%) │ 1.76s (20%) │ 5.63s (64%) │ 844ms (9.6%) │
  882. 903.72 s > │ 1L_ppmm │ GL2 │ 13 │ 545ms (6.4%) │ 1.46s (17%) │ 5.67s (67%) │ 802ms (9.5%) │
  883. 903.72 s > │ 1L_ppmm │ GL4 │ 11 │ 533ms (6.5%) │ 1.40s (17%) │ 5.49s (67%) │ 796ms (9.7%) │
  884. 903.72 s > ├───────────┼───────┼─────────┼──────────────┼─────────────┼────────────────┼──────────────┤
  885. 903.72 s > │ Total │ │ 37 │ 1.62s (6.4%) │ 4.62s (18%) │ 16.79s (66%) │ 2.44s (9.6%) │
  886. 903.72 s > ╰───────────┴───────┴─────────┴──────────────┴─────────────┴────────────────┴──────────────╯
  887. 903.72 s > [2026-09-06 07:16:54.136] @gammaloop_api::se... INFO : Running command import model sm-default.json
  888. 903.72 s > [2026-09-06 07:16:54.136] @import::model INFO : Loading built-in JSON model sm-default
  889. 903.72 s > [2026-09-06 07:16:54.155] @gammalooprs::model INFO : The following 11 external parameters were forced to zero by the restriction card:
  890. 903.72 s > lamWS, AWS, rhoWS, etaWS, ymc, yme, ymm, MC, Me, MM, WTau
  891. 903.72 s > [2026-09-06 07:16:54.155] @gammalooprs::model INFO : The following 34 vertex rules were removed by the restriction card:
  892. 903.72 s > V_82 -> (c~, d, G+) | V_83 -> (t~, d, G+) | V_84 -> (c~, s, G+) | V_85 -> (t~, s, G+) | V_86 -> (u~, b, G+) | V_87 -> (c~, b, G+) | V_90 -> (c~, d, W+) | V_91 -> (t~, d, W+) | V_92 -> (u~, s, W+) | V_94 -> (t~, s, W+) | V_95 -> (u~, b, W+) | V_96 -> (c~, b, W+) | V_101 -> (e+, e-, G0) | V_102 -> (mu+, mu-, G0) | V_104 -> (e+, e-, H) | V_105 -> (mu+, mu-, H) | V_110 -> (ve~, e-, G+) | V_111 -> (vm~, mu-, G+) | V_116 -> (b~, u, G-) | V_117 -> (d~, c, G-) | V_118 -> (s~, c, G-) | V_119 -> (b~, c, G-) | V_120 -> (d~, t, G-) | V_121 -> (s~, t, G-) | V_124 -> (s~, u, W-) | V_125 -> (b~, u, W-) | V_126 -> (d~, c, W-) | V_128 -> (b~, c, W-) | V_129 -> (d~, t, W-) | V_130 -> (s~, t, W-) | V_138 -> (c~, c, G0) | V_140 -> (c~, c, H) | V_145 -> (e+, ve, G-) | V_146 -> (mu+, vm, G-)
  893. 903.72 s > [2026-09-06 07:16:54.155] @gammalooprs::model INFO : The following 36 couplings were removed by the restriction card:
  894. 903.72 s > GC_13, GC_14, GC_16, GC_17, GC_18, GC_19, GC_20, GC_22, GC_23, GC_24, GC_25, GC_26, GC_28, GC_29, GC_42, GC_43, GC_44, GC_46, GC_47, GC_48, GC_84, GC_85, GC_86, GC_87, GC_88, GC_89, GC_90, GC_91, GC_92, GC_93, GC_101, GC_102, GC_103, GC_105, GC_106, GC_107
  895. 903.72 s > [2026-09-06 07:16:54.155] @gammaloop_api::se... INFO : Running command run set_model_parameters
  896. 903.72 s > [2026-09-06 07:16:54.155] @gammaloop_api::se... INFO : Starting command block set_model_parameters
  897. 903.72 s > [2026-09-06 07:16:54.156] @gammaloop_api::se... INFO : Running command set model MT=173.0
  898. 903.72 s > [2026-09-06 07:16:54.159] @gammaloop_api::se... INFO : Running command set model WT=0.0
  899. 903.72 s > [2026-09-06 07:16:54.162] @gammaloop_api::se... INFO : Running command set model ymt=173.0
  900. 903.72 s > [2026-09-06 07:16:54.165] @gammaloop_api::se... INFO : Running command set model aS=0.118
  901. 903.72 s > [2026-09-06 07:16:54.169] @gammaloop_api::se... INFO : Running command set model aEWM1=137.036
  902. 903.72 s > [2026-09-06 07:16:54.172] @gammaloop_api::se... INFO : Running command set model Gf=1.166390e-05
  903. 903.72 s > [2026-09-06 07:16:54.175] @gammaloop_api::se... INFO : Running command set model MZ=91.188
  904. 903.72 s > [2026-09-06 07:16:54.179] @gammaloop_api::se... INFO : Running command set global string '
  905. 903.72 s > [global.generation.compile]
  906. 903.72 s > compilation_mode = "assembly"
  907. 903.72 s > optimization_level = "O0"
  908. 903.72 s > fast_math = false
  909. 903.72 s > [...]
  910. 903.72 s > [2026-09-06 07:16:54.180] @gammaloop_api::se... INFO : Running command import graphs ./examples/cli/aa_aa/1L/aa_aa_1L.dot -p aa_aa_all_helicities_assembly -i 1L_ppmm -o
  911. 903.72 s > [2026-09-06 07:16:54.180] @commands::import INFO : Loading graphs from '/build/source/examples/cli/aa_aa/1L/aa_aa_1L.dot'
  912. 903.72 s > [2026-09-06 07:16:54.187] @gammaloop_api::se... INFO : Running command generate existing -p aa_aa_all_helicities_assembly
  913. 903.72 s > [2026-09-06 07:17:16.399] @processes::amplitude INFO : Compiling amplitude 1L_ppmm
  914. 903.72 s > [2026-09-06 07:17:35.501] @commands::generate INFO : Removed 34 generated C++ source file(s). Use '--keep-sources' to keep them.
  915. 903.72 s > [2026-09-06 07:17:35.501] @commands::generate INFO :
  916. 903.72 s > Integrand generation summary
  917. 903.72 s > peak RAM 2.20 GiB | cores 1
  918. 903.72 s > ╭───────────┬───────┬─────────┬──────────────┬──────────────┬────────────────┬──────────────╮
  919. 903.72 s > │ integrand │ graph │ # evals │ expr build │ spenso │ symbolica eval │ compile │
  920. 903.72 s > ├───────────┼───────┼─────────┼──────────────┼──────────────┼────────────────┼──────────────┤
  921. 903.72 s > │ 1L_ppmm │ GL0 │ 13 │ 500ms (3.6%) │ 1.39s (10%) │ 5.50s (40%) │ 6.41s (46%) │
  922. 903.72 s > │ 1L_ppmm │ GL2 │ 13 │ 493ms (3.5%) │ 1.41s (9.9%) │ 5.58s (39%) │ 6.80s (48%) │
  923. 903.72 s > │ 1L_ppmm │ GL4 │ 11 │ 485ms (3.7%) │ 1.40s (11%) │ 5.44s (41%) │ 5.88s (45%) │
  924. 903.72 s > ├───────────┼───────┼─────────┼──────────────┼──────────────┼────────────────┼──────────────┤
  925. 903.72 s > │ Total │ │ 37 │ 1.48s (3.6%) │ 4.20s (10%) │ 16.52s (40%) │ 19.09s (46%) │
  926. 903.72 s > ╰───────────┴───────┴─────────┴──────────────┴──────────────┴────────────────┴──────────────╯
  927. 903.72 s > [2026-09-06 07:17:36.385] @gammaloop_api::se... INFO : Running command set process -p aa_aa_all_helicities -i 1L_ppmm string '
  928. 903.72 s > [stability]
  929. 903.72 s > check_on_norm = true
  930. 903.72 s > escalate_if_exact_zero = false
  931. 903.72 s > loop_momenta_norm_escalation_factor = -1.0
  932. 903.72 s > [...]
  933. 903.72 s > [2026-09-06 07:17:36.386] @gammaloop_api::se... INFO : Running command set process -p aa_aa_all_helicities_assembly -i 1L_ppmm string '
  934. 903.72 s > [stability]
  935. 903.72 s > check_on_norm = true
  936. 903.72 s > escalate_if_exact_zero = false
  937. 903.72 s > loop_momenta_norm_escalation_factor = -1.0
  938. 903.72 s > [...]
  939. 903.72 s > [2026-09-06 07:17:36.387] @gammaloop_api::se... INFO : Running command set process -p aa_aa_all_helicities -i 1L_mpmm string '
  940. 903.72 s > [stability]
  941. 903.72 s > check_on_norm = true
  942. 903.72 s > escalate_if_exact_zero = false
  943. 903.72 s > loop_momenta_norm_escalation_factor = -1.0
  944. 903.72 s > [...]
  945. 903.72 s > [2026-09-06 07:17:36.388] @gammaloop_api::se... INFO : Running command set process -p aa_aa_all_helicities_assembly -i 1L_mpmm string '
  946. 903.72 s > [stability]
  947. 903.72 s > check_on_norm = true
  948. 903.72 s > escalate_if_exact_zero = false
  949. 903.72 s > loop_momenta_norm_escalation_factor = -1.0
  950. 903.72 s > [...]
  951. 903.72 s > [2026-09-06 07:17:36.389] @gammaloop_api::se... INFO : Running command set process -p aa_aa_all_helicities -i 1L_mmmm string '
  952. 903.72 s > [stability]
  953. 903.72 s > check_on_norm = true
  954. 903.72 s > escalate_if_exact_zero = false
  955. 903.72 s > loop_momenta_norm_escalation_factor = -1.0
  956. 903.72 s > [...]
  957. 903.72 s > [2026-09-06 07:17:36.390] @gammaloop_api::se... INFO : Running command set process -p aa_aa_all_helicities_assembly -i 1L_mmmm string '
  958. 903.72 s > [stability]
  959. 903.72 s > check_on_norm = true
  960. 903.72 s > escalate_if_exact_zero = false
  961. 903.72 s > loop_momenta_norm_escalation_factor = -1.0
  962. 903.72 s > [...]
  963. 903.72 s > [2026-09-06 07:17:36.391] @gammaloop_api::se... INFO : Running command set process -p aa_aa_all_helicities -i 1L_pmmp string '
  964. 903.72 s > [stability]
  965. 903.72 s > check_on_norm = true
  966. 903.72 s > escalate_if_exact_zero = false
  967. 903.72 s > loop_momenta_norm_escalation_factor = -1.0
  968. 903.72 s > [...]
  969. 903.72 s > [2026-09-06 07:17:36.392] @gammaloop_api::se... INFO : Running command set process -p aa_aa_all_helicities_assembly -i 1L_pmmp string '
  970. 903.72 s > [stability]
  971. 903.72 s > check_on_norm = true
  972. 903.72 s > escalate_if_exact_zero = false
  973. 903.72 s > loop_momenta_norm_escalation_factor = -1.0
  974. 903.72 s > [...]
  975. 903.72 s > [2026-09-06 07:17:36.393] @gammaloop_api::se... INFO : Running command set process -p aa_aa_all_helicities -i 1L_pmpm string '
  976. 903.72 s > [stability]
  977. 903.72 s > check_on_norm = true
  978. 903.72 s > escalate_if_exact_zero = false
  979. 903.72 s > loop_momenta_norm_escalation_factor = -1.0
  980. 903.72 s > [...]
  981. 903.72 s > [2026-09-06 07:17:36.394] @gammaloop_api::se... INFO : Running command set process -p aa_aa_all_helicities_assembly -i 1L_pmpm string '
  982. 903.72 s > [stability]
  983. 903.72 s > check_on_norm = true
  984. 903.72 s > escalate_if_exact_zero = false
  985. 903.72 s > loop_momenta_norm_escalation_factor = -1.0
  986. 903.72 s > [...]
  987. 903.72 s > [2026-09-06 07:17:36.402] @process::amplitude INFO : Input is below threshold: 0 existing threshold E-surfaces across 0/1 graph groups
  988. 903.72 s > [2026-09-06 07:17:36.402] @process::amplitude INFO : overlap structure of group 0: [0: []]
  989. 903.72 s > [2026-09-06 07:17:36.402] @integrands::process [{#im_is_nan, #re_is_nan}] WARNING : final process evaluation is nonfinite
  990. 903.72 s > [2026-09-06 07:17:36.402] @commands::inspect INFO :
  991. 903.72 s > Input point in momentum space:
  992. 903.72 s >
  993. 903.72 s > ( 0.1100000000000000, -0.0700000000000000, 0.1900000000000000 )
  994. 903.72 s >
  995. 903.72 s > The evaluation of integrand '1L_ppmm' is:
  996. 903.72 s >
  997. 903.72 s > ( +0.0000000000000000e0, +0.0000000000000000e0 i)
  998. 903.72 s >
  999. 903.72 s > [2026-09-06 07:17:36.408] @process::amplitude INFO : Input is below threshold: 0 existing threshold E-surfaces across 0/1 graph groups
  1000. 903.72 s > [2026-09-06 07:17:36.408] @process::amplitude INFO : overlap structure of group 0: [0: []]
  1001. 903.72 s > [2026-09-06 07:17:36.409] @commands::inspect INFO :
  1002. 903.72 s > Input point in momentum space:
  1003. 903.72 s >
  1004. 903.72 s > ( 0.1100000000000000, -0.0700000000000000, 0.1900000000000000 )
  1005. 903.72 s >
  1006. 903.72 s > The evaluation of integrand '1L_ppmm' is:
  1007. 903.72 s >
  1008. 903.72 s > ( -1.7132462539328486e-28, -8.7105072229446864e-10 i)
  1009. 903.72 s >
  1010. 903.72 s > The application panicked (crashed).
  1011. 903.72 s > Message: kinematics=a, integrand=1L_ppmm, graph_id=0: assembly vs symjit inspect: actual=(-0.00000000000000000000000000017132462539328486+-0.0000000008710507222944686i), expected=(0+0i), tolerance=0.0000000001
  1012. 903.72 s > Location: tests/tests/test_runs/utils.rs:466
  1013. 903.72 s >
  1014. 903.72 s > ━━━━━━━━━━━━━━━━━━━━━━━━━━━━━━━━━━ BACKTRACE ━━━━━━━━━━━━━━━━━━━━━━━━━━━━━━━━━━━
  1015. 903.72 s > 1: <color_eyre[51793ea62743adbd]::config::PanicHook>::panic_report<unknown>
  1016. 903.72 s > at <unknown source file>:<unknown line>
  1017. 903.72 s > 2: <color_eyre[51793ea62743adbd]::config::PanicHook>::into_panic_hook::{closure#0}<unknown>
  1018. 903.72 s > at <unknown source file>:<unknown line>
  1019. 903.72 s > 3: std[bcb96dfbba0ab899]::panicking::panic_with_hook<unknown>
  1020. 903.72 s > at <unknown source file>:<unknown line>
  1021. 903.72 s > 4: std[bcb96dfbba0ab899]::panicking::panic_handler::{closure#0}<unknown>
  1022. 903.72 s > at <unknown source file>:<unknown line>
  1023. 903.72 s > 5: std[bcb96dfbba0ab899]::sys::backtrace::__rust_end_short_backtrace::<std[bcb96dfbba0ab899]::panicking::panic_handler::{closure#0}, !><unknown>
  1024. 903.72 s > at <unknown source file>:<unknown line>
  1025. 903.72 s > 6: __rustc[6c289b9f9c454d21]::rust_begin_unwind<unknown>
  1026. 903.72 s > at <unknown source file>:<unknown line>
  1027. 903.72 s > 7: core[940e698046960fd5]::panicking::panic_fmt<unknown>
  1028. 903.72 s > at <unknown source file>:<unknown line>
  1029. 903.72 s > 8: <test_runs[66584badfeb6c7be]::aa_aa::important::aa_aa_local_inspect_backend_consistency::{closure#0} as core[940e698046960fd5]::ops::function::FnOnce<()>>::call_once<unknown>
  1030. 903.72 s > at <unknown source file>:<unknown line>
  1031. 903.72 s > 9: serial_test[cd99724524a2f1c0]::serial_code_lock::local_serial_core_with_return::<(), eyre[cb2fd339c0c40fca]::Report><unknown>
  1032. 903.72 s > at <unknown source file>:<unknown line>
  1033. 903.72 s > 10: <test_runs[66584badfeb6c7be]::aa_aa::important::aa_aa_local_inspect_backend_consistency::{closure#0} as core[940e698046960fd5]::ops::function::FnOnce<()>>::call_once<unknown>
  1034. 903.72 s > at <unknown source file>:<unknown line>
  1035. 903.72 s > 11: test[75d6903177b1d7e9]::__rust_begin_short_backtrace::<core[940e698046960fd5]::result::Result<(), alloc[2ea6bcb46fca0c42]::string::String>, fn() -> core[940e698046960fd5]::result::Result<(), alloc[2ea6bcb46fca0c42]::string::String>><unknown>
  1036. 903.72 s > at <unknown source file>:<unknown line>
  1037. 903.72 s > 12: test[75d6903177b1d7e9]::run_test::{closure#0}<unknown>
  1038. 903.72 s > at <unknown source file>:<unknown line>
  1039. 903.72 s > 13: std[bcb96dfbba0ab899]::sys::backtrace::__rust_begin_short_backtrace::<test[75d6903177b1d7e9]::run_test::{closure#1}, ()><unknown>
  1040. 903.72 s > at <unknown source file>:<unknown line>
  1041. 903.72 s > 14: <std[bcb96dfbba0ab899]::thread::lifecycle::spawn_unchecked<test[75d6903177b1d7e9]::run_test::{closure#1}, ()>::{closure#1} as core[940e698046960fd5]::ops::function::FnOnce<()>>::call_once::{shim:vtable#0}<unknown>
  1042. 903.72 s > at <unknown source file>:<unknown line>
  1043. 903.72 s > 15: <std[bcb96dfbba0ab899]::sys::thread::unix::Thread>::new::thread_start<unknown>
  1044. 903.72 s > at <unknown source file>:<unknown line>
  1045. 903.72 s > 16: start_thread<unknown>
  1046. 903.72 s > at <unknown source file>:<unknown line>
  1047. 903.72 s > 17: __clone3<unknown>
  1048. 903.72 s > at <unknown source file>:<unknown line>
  1049. 903.72 s >
  1050. 903.72 s > Run with COLORBT_SHOW_HIDDEN=1 environment variable to disable frame filtering.
  1051. 903.72 s > Run with RUST_BACKTRACE=full to include source snippets.
  1052. 903.72 s >
  1053. 903.72 s > error: test run failed
  1054. 903.72 s >
  1055. 903.72 s > ========== nextest test summary ==========
  1056. 903.72 s > report: target/nextest/ci_gammaloop/junit.xml
  1057. 903.72 s > tests: 152, failures: 1, errors: 0
  1058. 903.72 s >
  1059. 903.72 s > 1. gammaloop-integration-tests::test_runs::aa_aa::important::aa_aa_local_inspect_backend_consistency
  1060. 903.72 s > failure: test failure with exit code 101
  1061. 903.72 s > system-out
  1062. 903.72 s > running 1 test
  1063. 903.72 s > test aa_aa::important::aa_aa_local_inspect_backend_consistency has been running for over 60 seconds
  1064. 903.72 s > test aa_aa::important::aa_aa_local_inspect_backend_consistency ... FAILED
  1065. 903.72 s >
  1066. 903.72 s > failures:
  1067. 903.72 s >
  1068. 903.72 s > failures:
  1069. 903.72 s > aa_aa::important::aa_aa_local_inspect_backend_consistency
  1070. 903.72 s >
  1071. 903.72 s > test result: FAILED. 0 passed; 1 failed; 0 ignored; 0 measured; 258 filtered out; finished in 69.15s
  1072. 903.72 s > system-err
  1073. 903.72 s > [2026-09-06 07:16:27.882] @gammaloop_api::se... INFO : Running command import model sm-default.json
  1074. 903.72 s > [2026-09-06 07:16:27.882] @import::model INFO : Loading built-in JSON model sm-default
  1075. 903.72 s > [2026-09-06 07:16:27.903] @gammalooprs::model INFO : The following 11 external parameters were forced to zero by the restriction card:
  1076. 903.72 s > lamWS, AWS, rhoWS, etaWS, ymc, yme, ymm, MC, Me, MM, WTau
  1077. 903.72 s > [2026-09-06 07:16:27.903] @gammalooprs::model INFO : The following 34 vertex rules were removed by the restriction card:
  1078. 903.72 s > V_82 -> (c~, d, G+) | V_83 -> (t~, d, G+) | V_84 -> (c~, s, G+) | V_85 -> (t~, s, G+) | V_86 -> (u~, b, G+) | V_87 -> (c~, b, G+) | V_90 -> (c~, d, W+) | V_91 -> (t~, d, W+) | V_92 -> (u~, s, W+) | V_94 -> (t~, s, W+) | V_95 -> (u~, b, W+) | V_96 -> (c~, b, W+) | V_101 -> (e+, e-, G0) | V_102 -> (mu+, mu-, G0) | V_104 -> (e+, e-, H) | V_105 -> (mu+, mu-, H) | V_110 -> (ve~, e-, G+) | V_111 -> (vm~, mu-, G+) | V_116 -> (b~, u, G-) | V_117 -> (d~, c, G-) | V_118 -> (s~, c, G-) | V_119 -> (b~, c, G-) | V_120 -> (d~, t, G-) | V_121 -> (s~, t, G-) | V_124 -> (s~, u, W-) | V_125 -> (b~, u, W-) | V_126 -> (d~, c, W-) | V_128 -> (b~, c, W-) | V_129 -> (d~, t, W-) | V_130 -> (s~, t, W-) | V_138 -> (c~, c, G0) | V_140 -> (c~, c, H) | V_145 -> (e+, ve, G-) | V_146 -> (mu+, vm, G-)
  1079. 903.72 s > [2026-09-06 07:16:27.903] @gammalooprs::model INFO : The following 36 couplings were removed by the restriction card:
  1080. 903.72 s > GC_13, GC_14, GC_16, GC_17, GC_18, GC_19, GC_20, GC_22, GC_23, GC_24, GC_25, GC_26, GC_28, GC_29, GC_42, GC_43, GC_44, GC_46, GC_47, GC_48, GC_84, GC_85, GC_86, GC_87, GC_88, GC_89, GC_90, GC_91, GC_92, GC_93, GC_101, GC_102, GC_103, GC_105, GC_106, GC_107
  1081. 903.72 s > [2026-09-06 07:16:27.903] @gammaloop_api::se... INFO : Running command run set_model_parameters
  1082. 903.72 s > [2026-09-06 07:16:27.903] @gammaloop_api::se... INFO : Starting command block set_model_parameters
  1083. 903.72 s > [2026-09-06 07:16:27.904] @gammaloop_api::se... INFO : Running command set model MT=173.0
  1084. 903.72 s > [2026-09-06 07:16:27.908] @gammaloop_api::se... INFO : Running command set model WT=0.0
  1085. 903.72 s > [2026-09-06 07:16:27.911] @gammaloop_api::se... INFO : Running command set model ymt=173.0
  1086. 903.72 s > [2026-09-06 07:16:27.915] @gammaloop_api::se... INFO : Running command set model aS=0.118
  1087. 903.72 s > [2026-09-06 07:16:27.919] @gammaloop_api::se... INFO : Running command set model aEWM1=137.036
  1088. 903.72 s > [2026-09-06 07:16:27.922] @gammaloop_api::se... INFO : Running command set model Gf=1.166390e-05
  1089. 903.72 s > [2026-09-06 07:16:27.926] @gammaloop_api::se... INFO : Running command set model MZ=91.188
  1090. 903.72 s > [2026-09-06 07:16:27.930] @gammaloop_api::se... INFO : Running command set global string '
  1091. 903.72 s > [global.generation.compile]
  1092. 903.72 s > compilation_mode = "symjit"
  1093. 903.72 s > optimization_level = "O0"
  1094. 903.72 s > fast_math = false
  1095. 903.72 s > [...]
  1096. 903.72 s > [2026-09-06 07:16:27.930] @gammaloop_api::se... INFO : Running command import graphs ./examples/cli/aa_aa/1L/aa_aa_1L.dot -p aa_aa_all_helicities -i 1L_ppmm -o
  1097. 903.72 s > [2026-09-06 07:16:27.930] @commands::import INFO : Loading graphs from '/build/source/examples/cli/aa_aa/1L/aa_aa_1L.dot'
  1098. 903.72 s > [2026-09-06 07:16:27.939] @gammaloop_api::se... INFO : Running command generate existing -p aa_aa_all_helicities
  1099. 903.72 s > [2026-09-06 07:16:53.477] @commands::generate INFO :
  1100. 903.72 s > Integrand generation summary
  1101. 903.72 s > peak RAM 1.06 GiB | cores 1
  1102. 903.72 s > ╭───────────┬───────┬─────────┬──────────────┬─────────────┬────────────────┬──────────────╮
  1103. 903.72 s > │ integrand │ graph │ # evals │ expr build │ spenso │ symbolica eval │ compile │
  1104. 903.72 s > ├───────────┼───────┼─────────┼──────────────┼─────────────┼────────────────┼──────────────┤
  1105. 903.72 s > │ 1L_ppmm │ GL0 │ 13 │ 544ms (6.2%) │ 1.76s (20%) │ 5.63s (64%) │ 844ms (9.6%) │
  1106. 903.72 s > │ 1L_ppmm │ GL2 │ 13 │ 545ms (6.4%) │ 1.46s (17%) │ 5.67s (67%) │ 802ms (9.5%) │
  1107. 903.72 s > │ 1L_ppmm │ GL4 │ 11 │ 533ms (6.5%) │ 1.40s (17%) │ 5.49s (67%) │ 796ms (9.7%) │
  1108. 903.72 s > ├───────────┼───────┼─────────┼──────────────┼─────────────┼────────────────┼──────────────┤
  1109. 903.72 s > │ Total │ │ 37 │ 1.62s (6.4%) │ 4.62s (18%) │ 16.79s (66%) │ 2.44s (9.6%) │
  1110. 903.72 s > ╰───────────┴───────┴─────────┴──────────────┴─────────────┴────────────────┴──────────────╯
  1111. 903.72 s > [2026-09-06 07:16:54.136] @gammaloop_api::se... INFO : Running command import model sm-default.json
  1112. 903.72 s > [2026-09-06 07:16:54.136] @import::model INFO : Loading built-in JSON model sm-default
  1113. 903.72 s > [2026-09-06 07:16:54.155] @gammalooprs::model INFO : The following 11 external parameters were forced to zero by the restriction card:
  1114. 903.72 s > lamWS, AWS, rhoWS, etaWS, ymc, yme, ymm, MC, Me, MM, WTau
  1115. 903.72 s > [2026-09-06 07:16:54.155] @gammalooprs::model INFO : The following 34 vertex rules were removed by the restriction card:
  1116. 903.72 s > V_82 -> (c~, d, G+) | V_83 -> (t~, d, G+) | V_84 -> (c~, s, G+) | V_85 -> (t~, s, G+) | V_86 -> (u~, b, G+) | V_87 -> (c~, b, G+) | V_90 -> (c~, d, W+) | V_91 -> (t~, d, W+) | V_92 -> (u~, s, W+) | V_94 -> (t~, s, W+) | V_95 -> (u~, b, W+) | V_96 -> (c~, b, W+) | V_101 -> (e+, e-, G0) | V_102 -> (mu+, mu-, G0) | V_104 -> (e+, e-, H) | V_105 -> (mu+, mu-, H) | V_110 -> (ve~, e-, G+) | V_111 -> (vm~, mu-, G+) | V_116 -> (b~, u, G-) | V_117 -> (d~, c, G-) | V_118 -> (s~, c, G-) | V_119 -> (b~, c, G-) | V_120 -> (d~, t, G-) | V_121 -> (s~, t, G-) | V_124 -> (s~, u, W-) | V_125 -> (b~, u, W-) | V_126 -> (d~, c, W-) | V_128 -> (b~, c, W-) | V_129 -> (d~, t, W-) | V_130 -> (s~, t, W-) | V_138 -> (c~, c, G0) | V_140 -> (c~, c, H) | V_145 -> (e+, ve, G-) | V_146 -> (mu+, vm, G-)
  1117. 903.72 s > [2026-09-06 07:16:54.155] @gammalooprs::model INFO : The following 36 couplings were removed by the restriction card:
  1118. 903.72 s > GC_13, GC_14, GC_16, GC_17, GC_18, GC_19, GC_20, GC_22, GC_23, GC_24, GC_25, GC_26, GC_28, GC_29, GC_42, GC_43, GC_44, GC_46, GC_47, GC_48, GC_84, GC_85, GC_86, GC_87, GC_88, GC_89, GC_90, GC_91, GC_92, GC_93, GC_101, GC_102, GC_103, GC_105, GC_106, GC_107
  1119. 903.72 s > [2026-09-06 07:16:54.155] @gammaloop_api::se... INFO : Running command run set_model_parameters
  1120. 903.72 s > [2026-09-06 07:16:54.155] @gammaloop_api::se... INFO : Starting command block set_model_parameters
  1121. 903.72 s > [2026-09-06 07:16:54.156] @gammaloop_api::se... INFO : Running command set model MT=173.0
  1122. 903.72 s > [2026-09-06 07:16:54.159] @gammaloop_api::se... INFO : Running command set model WT=0.0
  1123. 903.72 s > [2026-09-06 07:16:54.162] @gammaloop_api::se... INFO : Running command set model ymt=173.0
  1124. 903.72 s > [2026-09-06 07:16:54.165] @gammaloop_api::se... INFO : Running command set model aS=0.118
  1125. 903.72 s > [2026-09-06 07:16:54.169] @gammaloop_api::se... INFO : Running command set model aEWM1=137.036
  1126. 903.72 s > [2026-09-06 07:16:54.172] @gammaloop_api::se... INFO : Running command set model Gf=1.166390e-05
  1127. 903.72 s > [2026-09-06 07:16:54.175] @gammaloop_api::se... INFO : Running command set model MZ=91.188
  1128. 903.72 s > [2026-09-06 07:16:54.179] @gammaloop_api::se... INFO : Running command set global string '
  1129. 903.72 s > [global.generation.compile]
  1130. 903.72 s > compilation_mode = "assembly"
  1131. 903.72 s > optimization_level = "O0"
  1132. 903.72 s > fast_math = false
  1133. 903.72 s > [...]
  1134. 903.72 s > [2026-09-06 07:16:54.180] @gammaloop_api::se... INFO : Running command import graphs ./examples/cli/aa_aa/1L/aa_aa_1L.dot -p aa_aa_all_helicities_assembly -i 1L_ppmm -o
  1135. 903.72 s > [2026-09-06 07:16:54.180] @commands::import INFO : Loading graphs from '/build/source/examples/cli/aa_aa/1L/aa_aa_1L.dot'
  1136. 903.72 s > [2026-09-06 07:16:54.187] @gammaloop_api::se... INFO : Running command generate existing -p aa_aa_all_helicities_assembly
  1137. 903.72 s > [2026-09-06 07:17:16.399] @processes::amplitude INFO : Compiling amplitude 1L_ppmm
  1138. 903.72 s > [2026-09-06 07:17:35.501] @commands::generate INFO : Removed 34 generated C++ source file(s). Use '--keep-sources' to keep them.
  1139. 903.72 s > [2026-09-06 07:17:35.501] @commands::generate INFO :
  1140. 903.72 s > Integrand generation summary
  1141. 903.72 s > peak RAM 2.20 GiB | cores 1
  1142. 903.72 s > ╭───────────┬───────┬─────────┬──────────────┬──────────────┬────────────────┬──────────────╮
  1143. 903.72 s > │ integrand │ graph │ # evals │ expr build │ spenso │ symbolica eval │ compile │
  1144. 903.72 s > ├───────────┼───────┼─────────┼──────────────┼──────────────┼────────────────┼──────────────┤
  1145. 903.72 s > │ 1L_ppmm │ GL0 │ 13 │ 500ms (3.6%) │ 1.39s (10%) │ 5.50s (40%) │ 6.41s (46%) │
  1146. 903.72 s > │ 1L_ppmm │ GL2 │ 13 │ 493ms (3.5%) │ 1.41s (9.9%) │ 5.58s (39%) │ 6.80s (48%) │
  1147. 903.72 s > │ 1L_ppmm │ GL4 │ 11 │ 485ms (3.7%) │ 1.40s (11%) │ 5.44s (41%) │ 5.88s (45%) │
  1148. 903.72 s > ├───────────┼───────┼─────────┼──────────────┼──────────────┼────────────────┼──────────────┤
  1149. 903.72 s > │ Total │ │ 37 │ 1.48s (3.6%) │ 4.20s (10%) │ 16.52s (40%) │ 19.09s (46%) │
  1150. 903.72 s > ╰───────────┴───────┴─────────┴──────────────┴──────────────┴────────────────┴──────────────╯
  1151. 903.72 s > [2026-09-06 07:17:36.385] @gammaloop_api::se... INFO : Running command set process -p aa_aa_all_helicities -i 1L_ppmm string '
  1152. 903.72 s > [stability]
  1153. 903.72 s > check_on_norm = true
  1154. 903.72 s > escalate_if_exact_zero = false
  1155. 903.72 s > loop_momenta_norm_escalation_factor = -1.0
  1156. 903.72 s > [...]
  1157. 903.72 s > [2026-09-06 07:17:36.386] @gammaloop_api::se... INFO : Running command set process -p aa_aa_all_helicities_assembly -i 1L_ppmm string '
  1158. 903.72 s > [stability]
  1159. 903.72 s > check_on_norm = true
  1160. 903.72 s > escalate_if_exact_zero = false
  1161. 903.72 s > loop_momenta_norm_escalation_factor = -1.0
  1162. 903.72 s > [...]
  1163. 903.72 s > [2026-09-06 07:17:36.387] @gammaloop_api::se... INFO : Running command set process -p aa_aa_all_helicities -i 1L_mpmm string '
  1164. 903.72 s > [stability]
  1165. 903.72 s > check_on_norm = true
  1166. 903.72 s > escalate_if_exact_zero = false
  1167. 903.72 s > loop_momenta_norm_escalation_factor = -1.0
  1168. 903.72 s > [...]
  1169. 903.72 s > [2026-09-06 07:17:36.388] @gammaloop_api::se... INFO : Running command set process -p aa_aa_all_helicities_assembly -i 1L_mpmm string '
  1170. 903.72 s > [stability]
  1171. 903.72 s > check_on_norm = true
  1172. 903.72 s > escalate_if_exact_zero = false
  1173. 903.72 s > loop_momenta_norm_escalation_factor = -1.0
  1174. 903.72 s > [...]
  1175. 903.72 s > [2026-09-06 07:17:36.389] @gammaloop_api::se... INFO : Running command set process -p aa_aa_all_helicities -i 1L_mmmm string '
  1176. 903.72 s > [stability]
  1177. 903.72 s > check_on_norm = true
  1178. 903.72 s > escalate_if_exact_zero = false
  1179. 903.72 s > loop_momenta_norm_escalation_factor = -1.0
  1180. 903.72 s > [...]
  1181. 903.72 s > [2026-09-06 07:17:36.390] @gammaloop_api::se... INFO : Running command set process -p aa_aa_all_helicities_assembly -i 1L_mmmm string '
  1182. 903.72 s > [stability]
  1183. 903.72 s > check_on_norm = true
  1184. 903.72 s > escalate_if_exact_zero = false
  1185. 903.72 s > loop_momenta_norm_escalation_factor = -1.0
  1186. 903.72 s > [...]
  1187. 903.72 s > [2026-09-06 07:17:36.391] @gammaloop_api::se... INFO : Running command set process -p aa_aa_all_helicities -i 1L_pmmp string '
  1188. 903.72 s > [stability]
  1189. 903.72 s > check_on_norm = true
  1190. 903.72 s > escalate_if_exact_zero = false
  1191. 903.72 s > loop_momenta_norm_escalation_factor = -1.0
  1192. 903.72 s > ... omitted 84 more lines; see full nextest output above
  1193. 903.72 s > =========================================
  1194. 903.72 s For full logs, run:
  1195. 903.72 s nix log /nix/store/3qpyi4i089mjhqx61pnq05lcl2pfrw3d-gammaloop-nextest-integration.drv
  1196. 903.84 s [0 built (1 failed), 0.0Run failed.