build packages.x86_64-linux.crate-test-binaries-three-dimensional-reps
0.20 s
$ /nix/store/9ypz3flqsrl5xl495mm8h645gadjsxi1-coreutils-9.11/bin/timeout --kill-after=15s 7200s /nix/store/23zk8sgzamrbmj1fday15szf7f2279s8-nix-2.34.7/bin/nix --extra-experimental-features nix-command --extra-experimental-features flakes --log-format internal-json build --no-link --print-out-paths git+https://github.com/alphal00p/gammaloop?ref=raised_energy_cff_wip&rev=d54de2049010ec51e52862d8052656b6d0001b94&shallow=1#packages.x86_64-linux.crate-test-binaries-three-dimensional-reps --print-build-logs
0.69 s
error (ignored): SQLite database '/var/cache/nix-ci-worker/eval-cache-v6/74052d84b10ac8d4aee75a1202a39e138924278afed3e223f271a3fb49945839.sqlite ' is busy
2.85 s
4.15 s
Building /nix/store/cv02k8axyaajy2wk22703viwwjkp6c9w-gammaloop-crate-test-binaries-three-dimensional-reps-50150770f831b638-deps-0.1.0.drv
4.36 s
[gammaloop-crate-test-binaries-three-dimensional-reps-50150770f831b638-deps] Phase: unpackPhase
4.37 s
[gammaloop-crate-test-binaries-three-dimensional-reps-50150770f831b638-deps] unpacking source archive /nix/store/cra0nlvfvsi0f5flhy40zq1fjvqjsqqk-source
4.40 s
[gammaloop-crate-test-binaries-three-dimensional-reps-50150770f831b638-deps] source root is source
4.44 s
[gammaloop-crate-test-binaries-three-dimensional-reps-50150770f831b638-deps] Phase: patchPhase
4.76 s
[gammaloop-crate-test-binaries-three-dimensional-reps-50150770f831b638-deps] Executing configureCargoCommonVars
4.76 s
[gammaloop-crate-test-binaries-three-dimensional-reps-50150770f831b638-deps] copying cargo artifacts from /nix/store/2ws3v62qqf2mmz5fp17kchi9n0k8vkxl-gammaloop-crate-test-binaries-three-dimensional-reps-50150770f831b638-inputs/target to target
4.76 s
[gammaloop-crate-test-binaries-three-dimensional-reps-50150770f831b638-deps] will deep copy artifacts (instead of symlinking) as requested
5.89 s
[gammaloop-crate-test-binaries-three-dimensional-reps-50150770f831b638-deps] Phase: updateAutotoolsGnuConfigScriptsPhase
5.92 s
[gammaloop-crate-test-binaries-three-dimensional-reps-50150770f831b638-deps] Phase: configurePhase
5.93 s
[gammaloop-crate-test-binaries-three-dimensional-reps-50150770f831b638-deps] will append /build/source/.cargo-home/config.toml with contents of /nix/store/1sigmg52bb61pfngmk9k8wq5fz9r7bf1-vendor-cargo-deps/config.toml
5.93 s
[gammaloop-crate-test-binaries-three-dimensional-reps-50150770f831b638-deps] default configurePhase, nothing to do
5.93 s
[gammaloop-crate-test-binaries-three-dimensional-reps-50150770f831b638-deps] Phase: buildPhase
5.93 s
[gammaloop-crate-test-binaries-three-dimensional-reps-50150770f831b638-deps] +++ command cargo --version
5.94 s
[gammaloop-crate-test-binaries-three-dimensional-reps-50150770f831b638-deps] cargo 1.97.0 (c980f4866 2026-06-30)
5.94 s
[gammaloop-crate-test-binaries-three-dimensional-reps-50150770f831b638-deps] +++ command cargo test --profile ci-optim --no-run --offline -p three-dimensional-reps --features three-dimensional-reps/serde
6.41 s
[gammaloop-crate-test-binaries-three-dimensional-reps-50150770f831b638-deps] Compiling three-dimensional-reps v0.1.0 (/build/source/crates/three-dimensional-reps)
6.70 s
[gammaloop-crate-test-binaries-three-dimensional-reps-50150770f831b638-deps] error[E0433] : cannot find `eval` in `crate`
6.70 s
[gammaloop-crate-test-binaries-three-dimensional-reps-50150770f831b638-deps] --> crates/three-dimensional-reps/src/generation.rs:6540:28
6.70 s
[gammaloop-crate-test-binaries-three-dimensional-reps-50150770f831b638-deps] |
6.70 s
[gammaloop-crate-test-binaries-three-dimensional-reps-50150770f831b638-deps] 6540 | let input = crate::eval::EvaluationInput {
6.70 s
[gammaloop-crate-test-binaries-three-dimensional-reps-50150770f831b638-deps] | ^^^^ could not find `eval` in the crate root
6.70 s
[gammaloop-crate-test-binaries-three-dimensional-reps-50150770f831b638-deps] |
6.70 s
[gammaloop-crate-test-binaries-three-dimensional-reps-50150770f831b638-deps] note : found an item that was configured out
6.70 s
[gammaloop-crate-test-binaries-three-dimensional-reps-50150770f831b638-deps] --> crates/three-dimensional-reps/src/lib.rs:7:9
6.70 s
[gammaloop-crate-test-binaries-three-dimensional-reps-50150770f831b638-deps] |
6.70 s
[gammaloop-crate-test-binaries-three-dimensional-reps-50150770f831b638-deps] 6 | #[cfg(feature = "eval")]
6.70 s
[gammaloop-crate-test-binaries-three-dimensional-reps-50150770f831b638-deps] | ---------------- the item is gated behind the `eval` feature
6.70 s
[gammaloop-crate-test-binaries-three-dimensional-reps-50150770f831b638-deps] 7 | pub mod eval;
6.70 s
[gammaloop-crate-test-binaries-three-dimensional-reps-50150770f831b638-deps] | ^^^^
6.70 s
[gammaloop-crate-test-binaries-three-dimensional-reps-50150770f831b638-deps]
6.71 s
[gammaloop-crate-test-binaries-three-dimensional-reps-50150770f831b638-deps] error[E0433] : cannot find `eval` in `crate`
6.71 s
[gammaloop-crate-test-binaries-three-dimensional-reps-50150770f831b638-deps] --> crates/three-dimensional-reps/src/generation.rs:6547:30
6.71 s
[gammaloop-crate-test-binaries-three-dimensional-reps-50150770f831b638-deps] |
6.71 s
[gammaloop-crate-test-binaries-three-dimensional-reps-50150770f831b638-deps] 6547 | let contact = crate::eval::evaluate_expression(
6.71 s
[gammaloop-crate-test-binaries-three-dimensional-reps-50150770f831b638-deps] | ^^^^ could not find `eval` in the crate root
6.71 s
[gammaloop-crate-test-binaries-three-dimensional-reps-50150770f831b638-deps] |
6.71 s
[gammaloop-crate-test-binaries-three-dimensional-reps-50150770f831b638-deps] note : found an item that was configured out
6.71 s
[gammaloop-crate-test-binaries-three-dimensional-reps-50150770f831b638-deps] --> crates/three-dimensional-reps/src/lib.rs:7:9
6.71 s
[gammaloop-crate-test-binaries-three-dimensional-reps-50150770f831b638-deps] |
6.71 s
[gammaloop-crate-test-binaries-three-dimensional-reps-50150770f831b638-deps] 6 | #[cfg(feature = "eval")]
6.71 s
[gammaloop-crate-test-binaries-three-dimensional-reps-50150770f831b638-deps] | ---------------- the item is gated behind the `eval` feature
6.71 s
[gammaloop-crate-test-binaries-three-dimensional-reps-50150770f831b638-deps] 7 | pub mod eval;
6.71 s
[gammaloop-crate-test-binaries-three-dimensional-reps-50150770f831b638-deps] | ^^^^
6.71 s
[gammaloop-crate-test-binaries-three-dimensional-reps-50150770f831b638-deps]
6.72 s
[gammaloop-crate-test-binaries-three-dimensional-reps-50150770f831b638-deps] error[E0433] : cannot find `eval` in `crate`
6.72 s
[gammaloop-crate-test-binaries-three-dimensional-reps-50150770f831b638-deps] --> crates/three-dimensional-reps/src/generation.rs:6555:32
6.72 s
[gammaloop-crate-test-binaries-three-dimensional-reps-50150770f831b638-deps] |
6.72 s
[gammaloop-crate-test-binaries-three-dimensional-reps-50150770f831b638-deps] 6555 | let remainder = crate::eval::evaluate_expression(
6.72 s
[gammaloop-crate-test-binaries-three-dimensional-reps-50150770f831b638-deps] | ^^^^ could not find `eval` in the crate root
6.72 s
[gammaloop-crate-test-binaries-three-dimensional-reps-50150770f831b638-deps] |
6.72 s
[gammaloop-crate-test-binaries-three-dimensional-reps-50150770f831b638-deps] note : found an item that was configured out
6.72 s
[gammaloop-crate-test-binaries-three-dimensional-reps-50150770f831b638-deps] --> crates/three-dimensional-reps/src/lib.rs:7:9
6.72 s
[gammaloop-crate-test-binaries-three-dimensional-reps-50150770f831b638-deps] |
6.72 s
[gammaloop-crate-test-binaries-three-dimensional-reps-50150770f831b638-deps] 6 | #[cfg(feature = "eval")]
6.72 s
[gammaloop-crate-test-binaries-three-dimensional-reps-50150770f831b638-deps] | ---------------- the item is gated behind the `eval` feature
6.72 s
[gammaloop-crate-test-binaries-three-dimensional-reps-50150770f831b638-deps] 7 | pub mod eval;
6.72 s
[gammaloop-crate-test-binaries-three-dimensional-reps-50150770f831b638-deps] | ^^^^
6.72 s
[gammaloop-crate-test-binaries-three-dimensional-reps-50150770f831b638-deps]
6.73 s
[gammaloop-crate-test-binaries-three-dimensional-reps-50150770f831b638-deps] error[E0433] : cannot find `eval` in `crate`
6.73 s
[gammaloop-crate-test-binaries-three-dimensional-reps-50150770f831b638-deps] --> crates/three-dimensional-reps/src/generation.rs:6563:28
6.73 s
[gammaloop-crate-test-binaries-three-dimensional-reps-50150770f831b638-deps] |
6.73 s
[gammaloop-crate-test-binaries-three-dimensional-reps-50150770f831b638-deps] 6563 | let total = crate::eval::evaluate_expression(&powered, &expression, numerator, &input)
6.73 s
[gammaloop-crate-test-binaries-three-dimensional-reps-50150770f831b638-deps] | ^^^^ could not find `eval` in the crate root
6.73 s
[gammaloop-crate-test-binaries-three-dimensional-reps-50150770f831b638-deps] |
6.73 s
[gammaloop-crate-test-binaries-three-dimensional-reps-50150770f831b638-deps] note : found an item that was configured out
6.73 s
[gammaloop-crate-test-binaries-three-dimensional-reps-50150770f831b638-deps] --> crates/three-dimensional-reps/src/lib.rs:7:9
6.73 s
[gammaloop-crate-test-binaries-three-dimensional-reps-50150770f831b638-deps] |
6.73 s
[gammaloop-crate-test-binaries-three-dimensional-reps-50150770f831b638-deps] 6 | #[cfg(feature = "eval")]
6.73 s
[gammaloop-crate-test-binaries-three-dimensional-reps-50150770f831b638-deps] | ---------------- the item is gated behind the `eval` feature
6.73 s
[gammaloop-crate-test-binaries-three-dimensional-reps-50150770f831b638-deps] 7 | pub mod eval;
6.73 s
[gammaloop-crate-test-binaries-three-dimensional-reps-50150770f831b638-deps] | ^^^^
6.73 s
[gammaloop-crate-test-binaries-three-dimensional-reps-50150770f831b638-deps]
9.07 s
[gammaloop-crate-test-binaries-three-dimensional-reps-50150770f831b638-deps] For more information about this error, try `rustc --explain E0433`.
9.09 s
[gammaloop-crate-test-binaries-three-dimensional-reps-50150770f831b638-deps] error : could not compile `three-dimensional-reps` (lib test) due to 4 previous errors
9.41 s
Progress: 0 of 2 built (1 failed)
9.41 s
Failed to build gammaloop-crate-test-binaries-three-dimensional-reps-50150770f831b638-deps after 5.2s
9.41 s
error: Cannot build '/nix/store/cv02k8axyaajy2wk22703viwwjkp6c9w-gammaloop-crate-test-binaries-three-dimensional-reps-50150770f831b638-deps-0.1.0.drv '.
9.41 s
Reason: builder failed with exit code 101 .
9.41 s
Output paths:
9.41 s
/nix/store/9c503a8m7ppz249bcgxs70380i2rli5i-gammaloop-crate-test-binaries-three-dimensional-reps-50150770f831b638-deps-0.1.0
9.41 s
Last 74 log lines:
9.41 s
> Running phase: unpackPhase
9.41 s
> unpacking source archive /nix/store/cra0nlvfvsi0f5flhy40zq1fjvqjsqqk-source
9.41 s
> source root is source
9.41 s
> Running phase: patchPhase
9.41 s
> Executing configureCargoCommonVars
9.41 s
> copying cargo artifacts from /nix/store/2ws3v62qqf2mmz5fp17kchi9n0k8vkxl-gammaloop-crate-test-binaries-three-dimensional-reps-50150770f831b638-inputs/target to target
9.41 s
> will deep copy artifacts (instead of symlinking) as requested
9.41 s
> Running phase: updateAutotoolsGnuConfigScriptsPhase
9.41 s
> Running phase: configurePhase
9.41 s
> will append /build/source/.cargo-home/config.toml with contents of /nix/store/1sigmg52bb61pfngmk9k8wq5fz9r7bf1-vendor-cargo-deps/config.toml
9.41 s
> default configurePhase, nothing to do
9.41 s
> Running phase: buildPhase
9.41 s
> +++ command cargo --version
9.41 s
> cargo 1.97.0 (c980f4866 2026-06-30)
9.41 s
> +++ command cargo test --profile ci-optim --no-run --offline -p three-dimensional-reps --features three-dimensional-reps/serde
9.41 s
> Compiling three-dimensional-reps v0.1.0 (/build/source/crates/three-dimensional-reps)
9.41 s
> error[E0433] : cannot find `eval` in `crate`
9.41 s
> --> crates/three-dimensional-reps/src/generation.rs:6540:28
9.41 s
> |
9.41 s
> 6540 | let input = crate::eval::EvaluationInput {
9.41 s
> | ^^^^ could not find `eval` in the crate root
9.41 s
> |
9.41 s
> note : found an item that was configured out
9.41 s
> --> crates/three-dimensional-reps/src/lib.rs:7:9
9.41 s
> |
9.41 s
> 6 | #[cfg(feature = "eval")]
9.41 s
> | ---------------- the item is gated behind the `eval` feature
9.41 s
> 7 | pub mod eval;
9.41 s
> | ^^^^
9.41 s
>
9.41 s
> error[E0433] : cannot find `eval` in `crate`
9.41 s
> --> crates/three-dimensional-reps/src/generation.rs:6547:30
9.41 s
> |
9.41 s
> 6547 | let contact = crate::eval::evaluate_expression(
9.41 s
> | ^^^^ could not find `eval` in the crate root
9.41 s
> |
9.41 s
> note : found an item that was configured out
9.41 s
> --> crates/three-dimensional-reps/src/lib.rs:7:9
9.41 s
> |
9.41 s
> 6 | #[cfg(feature = "eval")]
9.41 s
> | ---------------- the item is gated behind the `eval` feature
9.41 s
> 7 | pub mod eval;
9.41 s
> | ^^^^
9.41 s
>
9.41 s
> error[E0433] : cannot find `eval` in `crate`
9.41 s
> --> crates/three-dimensional-reps/src/generation.rs:6555:32
9.41 s
> |
9.41 s
> 6555 | let remainder = crate::eval::evaluate_expression(
9.41 s
> | ^^^^ could not find `eval` in the crate root
9.41 s
> |
9.41 s
> note : found an item that was configured out
9.41 s
> --> crates/three-dimensional-reps/src/lib.rs:7:9
9.41 s
> |
9.41 s
> 6 | #[cfg(feature = "eval")]
9.41 s
> | ---------------- the item is gated behind the `eval` feature
9.41 s
> 7 | pub mod eval;
9.41 s
> | ^^^^
9.41 s
>
9.41 s
> error[E0433] : cannot find `eval` in `crate`
9.41 s
> --> crates/three-dimensional-reps/src/generation.rs:6563:28
9.41 s
> |
9.41 s
> 6563 | let total = crate::eval::evaluate_expression(&powered, &expression, numerator, &input)
9.41 s
> | ^^^^ could not find `eval` in the crate root
9.41 s
> |
9.41 s
> note : found an item that was configured out
9.41 s
> --> crates/three-dimensional-reps/src/lib.rs:7:9
9.41 s
> |
9.41 s
> 6 | #[cfg(feature = "eval")]
9.41 s
> | ---------------- the item is gated behind the `eval` feature
9.41 s
> 7 | pub mod eval;
9.41 s
> | ^^^^
9.41 s
>
9.41 s
> For more information about this error, try `rustc --explain E0433`.
9.41 s
> error : could not compile `three-dimensional-reps` (lib test) due to 4 previous errors
9.41 s
For full logs, run:
9.41 s
nix log /nix/store/cv02k8axyaajy2wk22703viwwjkp6c9w-gammaloop-crate-test-binaries-three-dimensional-reps-50150770f831b638-deps-0.1.0.drv
9.41 s
error: Cannot build '/nix/store/8js6b2rp4pcpqybvs65jzsk3xgwzqr07-nix-ci-artifact-barrier-crate-test-binaries-three-dimensional-reps.drv '.
9.41 s
Reason: 1 dependency failed .
9.41 s
Output paths:
9.41 s
/nix/store/5n80xdb7j96d8ncq4r0ylsj9l2ygp6xy-nix-ci-artifact-barrier-crate-test-binaries-three-dimensional-reps
9.41 s
Build failed due to failed dependency
9.53 s
Build failed.