build packages.x86_64-linux.crate-test-binaries-three-dimensional-reps

Reproduce this run
Retry Run
  1. 1.45 s $ /nix/store/9ypz3flqsrl5xl495mm8h645gadjsxi1-coreutils-9.11/bin/timeout --kill-after=15s 7200s /nix/store/23zk8sgzamrbmj1fday15szf7f2279s8-nix-2.34.7/bin/nix --extra-experimental-features nix-command --extra-experimental-features flakes --log-format internal-json build --no-link --print-out-paths git+https://github.com/alphal00p/gammaloop?ref=raised_energy_cff_wip&rev=d54de2049010ec51e52862d8052656b6d0001b94&shallow=1#packages.x86_64-linux.crate-test-binaries-three-dimensional-reps --print-build-logs
  2. 1.51 s error (ignored): SQLite database '/var/cache/nix-ci-worker/eval-cache-v6/74052d84b10ac8d4aee75a1202a39e138924278afed3e223f271a3fb49945839.sqlite' is busy
  3. 3.15 s
  4. 5.57 s Downloading cached gammaloop-ci-test-binary-dependencies-50150770f831b638-Cargo.toml from https://cache.nix-ci.com
  5. 5.62 s Building /nix/store/620cg4lxjsln105525v3nij0sy75ni31-gammaloop-ci-test-binary-dependencies-50150770f831b638-three-dimensional-reps-dev-dependency.toml.drv
  6. 5.69 s Building /nix/store/l9q0g2wj2k0hkm28jgvw9p1nss6mgniv-vendor-cargo-deps.drv
  7. 5.74 s Building /nix/store/cchwg4xbwb5ih1v9qmv0f3f06i8ls9d9-gammaloop-ci-prebuild-Cargo.toml.drv
  8. 5.78 s Building /nix/store/jxvw34bgxdnn9bkva90k3g1kdb1h3z69-gammaloop-ci-test-dependencies-50150770f831b638-Cargo.toml.drv
  9. 5.78 s Downloading cached gammaloop-ci-test-binary-dependencies-78814cb8a1862b52-Cargo.toml from https://cache.nix-ci.com
  10. 5.82 s Building /nix/store/yilhlj16j6kgrr04dfbsvm0dwrqh02dx-gammaloop-ci-test-dependencies-78814cb8a1862b52-Cargo.toml.drv
  11. 5.83 s Downloading cached gammaloop-ci-test-binary-dependencies-2487cdc24b69b833-Cargo.toml from https://cache.nix-ci.com
  12. 5.84 s Downloaded cached gammaloop-ci-test-binary-dependencies-50150770f831b638-Cargo.toml (584 B) in 274ms
  13. 5.87 s Building /nix/store/jxdzj8d3qdg8x070lm5khrh3qk8j9wgq-gammaloop-ci-test-dependencies-2487cdc24b69b833-Cargo.toml.drv
  14. 5.88 s Progress: 0 of 22 built (6 building), 1 of 3 downloaded from cache (2 downloading)
  15. 5.90 s [gammaloop-ci-prebuild-Cargo.toml:post-build] Uploading to the NixCI cache: /nix/store/r52hvnwmgnacm8glrz32r5m4lqb0k79l-gammaloop-ci-prebuild-Cargo.toml
  16. 5.96 s [gammaloop-ci-prebuild-Cargo.toml:post-build] warning: 'warn-short-path-literals' is deprecated, use 'lint-short-path-literals = ignore' instead
  17. 6.06 s Downloaded cached gammaloop-ci-test-binary-dependencies-78814cb8a1862b52-Cargo.toml (848 B) in 278ms
  18. 6.11 s Downloaded cached gammaloop-ci-test-binary-dependencies-2487cdc24b69b833-Cargo.toml (424 B) in 283ms
  19. 6.14 s [gammaloop-ci-prebuild-Cargo.toml:post-build] copying 0 paths...
  20. 6.22 s [gammaloop-ci-prebuild-Cargo.toml:post-build] warning: 'warn-short-path-literals' is deprecated, use 'lint-short-path-literals = ignore' instead
  21. 6.30 s [gammaloop-ci-prebuild-Cargo.toml:post-build] copying 0 paths...
  22. 6.32 s Uploaded gammaloop-ci-prebuild-Cargo.toml in 434ms
  23. 6.32 s Progress: 1 of 23 built (5 building), 1 of 3 downloaded from cache (2 downloading)
  24. 6.32 s Built gammaloop-ci-prebuild-Cargo.toml in 571ms
  25. 6.34 s [gammaloop-ci-test-binary-dependencies-50150770f831b638-three-dimensional-reps-dev-dependency.toml:post-build] Uploading to the NixCI cache: /nix/store/nkd9p6h639pp1ya2nb2yngjw7qb80nfg-gammaloop-ci-test-binary-dependencies-50150770f831b638-three-dimensional-reps-dev-dependency.toml
  26. 6.41 s [gammaloop-ci-test-binary-dependencies-50150770f831b638-three-dimensional-reps-dev-dependency.toml:post-build] warning: 'warn-short-path-literals' is deprecated, use 'lint-short-path-literals = ignore' instead
  27. 6.45 s [gammaloop-ci-test-binary-dependencies-50150770f831b638-three-dimensional-reps-dev-dependency.toml:post-build] copying 0 paths...
  28. 6.98 s [gammaloop-ci-test-binary-dependencies-50150770f831b638-three-dimensional-reps-dev-dependency.toml:post-build] warning: 'warn-short-path-literals' is deprecated, use 'lint-short-path-literals = ignore' instead
  29. 6.98 s [gammaloop-ci-test-binary-dependencies-50150770f831b638-three-dimensional-reps-dev-dependency.toml:post-build] copying 0 paths...
  30. 6.99 s Uploaded gammaloop-ci-test-binary-dependencies-50150770f831b638-three-dimensional-reps-dev-dependency.toml in 662ms
  31. 6.99 s Progress: 2 of 24 built (4 building), 1 of 3 downloaded from cache (2 downloading)
  32. 6.99 s Built gammaloop-ci-test-binary-dependencies-50150770f831b638-three-dimensional-reps-dev-dependency.toml in 1.3s
  33. 6.99 s [gammaloop-ci-test-dependencies-50150770f831b638-Cargo.toml:post-build] Uploading to the NixCI cache: /nix/store/l910djsa81d33bspw74vkisyvzi8c7k4-gammaloop-ci-test-dependencies-50150770f831b638-Cargo.toml
  34. 6.99 s [gammaloop-ci-test-dependencies-50150770f831b638-Cargo.toml:post-build] warning: 'warn-short-path-literals' is deprecated, use 'lint-short-path-literals = ignore' instead
  35. 6.99 s [gammaloop-ci-test-dependencies-50150770f831b638-Cargo.toml:post-build] copying 0 paths...
  36. 6.99 s [gammaloop-ci-test-dependencies-50150770f831b638-Cargo.toml:post-build] warning: 'warn-short-path-literals' is deprecated, use 'lint-short-path-literals = ignore' instead
  37. 6.99 s [gammaloop-ci-test-dependencies-50150770f831b638-Cargo.toml:post-build] copying 0 paths...
  38. 6.99 s Uploaded gammaloop-ci-test-dependencies-50150770f831b638-Cargo.toml in 0ms
  39. 6.99 s Progress: 3 of 25 built (3 building), 1 of 3 downloaded from cache (2 downloading)
  40. 6.99 s Built gammaloop-ci-test-dependencies-50150770f831b638-Cargo.toml in 1.2s
  41. 6.99 s [gammaloop-ci-test-dependencies-78814cb8a1862b52-Cargo.toml:post-build] Uploading to the NixCI cache: /nix/store/b2x2yjjsjn0z6cz0rnyvf4nam1pcinw9-gammaloop-ci-test-dependencies-78814cb8a1862b52-Cargo.toml
  42. 6.99 s [gammaloop-ci-test-dependencies-78814cb8a1862b52-Cargo.toml:post-build] warning: 'warn-short-path-literals' is deprecated, use 'lint-short-path-literals = ignore' instead
  43. 7.04 s [gammaloop-ci-test-dependencies-78814cb8a1862b52-Cargo.toml:post-build] copying 0 paths...
  44. 7.11 s [gammaloop-ci-test-dependencies-78814cb8a1862b52-Cargo.toml:post-build] warning: 'warn-short-path-literals' is deprecated, use 'lint-short-path-literals = ignore' instead
  45. 7.19 s [gammaloop-ci-test-dependencies-78814cb8a1862b52-Cargo.toml:post-build] copying 0 paths...
  46. 7.22 s Uploaded gammaloop-ci-test-dependencies-78814cb8a1862b52-Cargo.toml in 229ms
  47. 7.22 s Progress: 4 of 26 built (2 building), 1 of 3 downloaded from cache (2 downloading)
  48. 7.22 s Built gammaloop-ci-test-dependencies-78814cb8a1862b52-Cargo.toml in 1.3s
  49. 7.27 s [vendor-cargo-deps:post-build] Uploading to the NixCI cache: /nix/store/1sigmg52bb61pfngmk9k8wq5fz9r7bf1-vendor-cargo-deps
  50. 7.34 s [vendor-cargo-deps:post-build] warning: 'warn-short-path-literals' is deprecated, use 'lint-short-path-literals = ignore' instead
  51. 7.40 s [vendor-cargo-deps:post-build] copying 0 paths...
  52. 7.53 s [vendor-cargo-deps:post-build] warning: 'warn-short-path-literals' is deprecated, use 'lint-short-path-literals = ignore' instead
  53. 7.72 s [vendor-cargo-deps:post-build] copying 0 paths...
  54. 7.80 s Uploaded vendor-cargo-deps in 550ms
  55. 7.81 s Progress: 5 of 27 built (1 building), 1 of 3 downloaded from cache (2 downloading)
  56. 7.81 s Built vendor-cargo-deps in 2.1s
  57. 8.09 s Building /nix/store/daca79fsd3vmqf7wrwvp2pydmaqlxw2b-gammaloop-crate-gammaloop-workspace-hack-deps-0.1.0.drv
  58. 8.12 s Building /nix/store/ds3dz7qlbpdqh6acmd3mz49rwi9imc2p-source.drv
  59. 8.12 s Progress: 5 of 21 built (3 building), 2 of 3 downloaded from cache (1 downloading)
  60. 8.12 s Progress: 5 of 21 built (3 building), 3 of 3 downloaded from cache
  61. 8.16 s [gammaloop-ci-test-dependencies-2487cdc24b69b833-Cargo.toml:post-build] Uploading to the NixCI cache: /nix/store/l1ylambkrws6lqkabrjfvkckjd7arvl1-gammaloop-ci-test-dependencies-2487cdc24b69b833-Cargo.toml
  62. 8.27 s [gammaloop-ci-test-dependencies-2487cdc24b69b833-Cargo.toml:post-build] warning: 'warn-short-path-literals' is deprecated, use 'lint-short-path-literals = ignore' instead
  63. 8.32 s [gammaloop-ci-test-dependencies-2487cdc24b69b833-Cargo.toml:post-build] copying 0 paths...
  64. 8.42 s [gammaloop-ci-test-dependencies-2487cdc24b69b833-Cargo.toml:post-build] warning: 'warn-short-path-literals' is deprecated, use 'lint-short-path-literals = ignore' instead
  65. 8.51 s [gammaloop-ci-test-dependencies-2487cdc24b69b833-Cargo.toml:post-build] copying 0 paths...
  66. 8.54 s Uploaded gammaloop-ci-test-dependencies-2487cdc24b69b833-Cargo.toml in 411ms
  67. 8.54 s Progress: 6 of 22 built (2 building), 3 of 3 downloaded from cache
  68. 8.54 s Built gammaloop-ci-test-dependencies-2487cdc24b69b833-Cargo.toml in 2.6s
  69. 8.54 s [gammaloop-crate-gammaloop-workspace-hack-deps] cargoArtifacts not set, will not reuse any cargo artifacts
  70. 8.54 s [gammaloop-crate-gammaloop-workspace-hack-deps] Phase: unpackPhase
  71. 8.54 s [gammaloop-crate-gammaloop-workspace-hack-deps] unpacking source archive /nix/store/nj2vajy9iqw9jw4cysjxi3h409vg0zxj-source
  72. 8.54 s [gammaloop-crate-gammaloop-workspace-hack-deps] source root is source
  73. 8.54 s [gammaloop-crate-gammaloop-workspace-hack-deps] Phase: patchPhase
  74. 8.54 s [gammaloop-crate-gammaloop-workspace-hack-deps] Executing configureCargoCommonVars
  75. 8.54 s [gammaloop-crate-gammaloop-workspace-hack-deps] Phase: updateAutotoolsGnuConfigScriptsPhase
  76. 8.54 s [gammaloop-crate-gammaloop-workspace-hack-deps] Phase: configurePhase
  77. 8.54 s [gammaloop-crate-gammaloop-workspace-hack-deps] will append /build/source/.cargo-home/config.toml with contents of /nix/store/1sigmg52bb61pfngmk9k8wq5fz9r7bf1-vendor-cargo-deps/config.toml
  78. 8.54 s [gammaloop-crate-gammaloop-workspace-hack-deps] default configurePhase, nothing to do
  79. 8.54 s [gammaloop-crate-gammaloop-workspace-hack-deps] Phase: buildPhase
  80. 8.54 s [gammaloop-crate-gammaloop-workspace-hack-deps] +++ command cargo --version
  81. 8.54 s [gammaloop-crate-gammaloop-workspace-hack-deps] cargo 1.97.0 (c980f4866 2026-06-30)
  82. 8.54 s [gammaloop-crate-gammaloop-workspace-hack-deps] +++ command cargo build --profile ci-optim --locked -p gammaloop-workspace-hack --features symbolica/tracing_max_level_info
  83. 8.60 s [source:post-build] Uploading to the NixCI cache: /nix/store/6vwa64l890xsp30166g0nsca8pm7qx90-source
  84. 8.70 s [source:post-build] warning: 'warn-short-path-literals' is deprecated, use 'lint-short-path-literals = ignore' instead
  85. 8.71 s [source:post-build] copying 1 paths...
  86. 8.71 s [source:post-build] copying path '/nix/store/6vwa64l890xsp30166g0nsca8pm7qx90-source' to 'https://cache.nix-ci.com'...
  87. 9.37 s [source:post-build] warning: 'warn-short-path-literals' is deprecated, use 'lint-short-path-literals = ignore' instead
  88. 9.66 s [source:post-build] copying 1 paths...
  89. 9.66 s [source:post-build] copying path '/nix/store/ds3dz7qlbpdqh6acmd3mz49rwi9imc2p-source.drv' to 'https://cache.nix-ci.com'...
  90. 9.93 s Uploaded source in 1.3s
  91. 9.93 s Progress: 7 of 20 built (1 building), 3 of 3 downloaded from cache
  92. 9.93 s Built source in 1.8s
  93. 9.93 s [gammaloop-crate-gammaloop-workspace-hack-deps] Compiling proc-macro2 v1.0.106
  94. 9.93 s [gammaloop-crate-gammaloop-workspace-hack-deps] Compiling unicode-ident v1.0.24
  95. 9.93 s [gammaloop-crate-gammaloop-workspace-hack-deps] Compiling quote v1.0.45
  96. 9.93 s [gammaloop-crate-gammaloop-workspace-hack-deps] Compiling serde_core v1.0.228
  97. 9.93 s [gammaloop-crate-gammaloop-workspace-hack-deps] Compiling libc v0.2.186
  98. 9.93 s [gammaloop-crate-gammaloop-workspace-hack-deps] Compiling serde v1.0.228
  99. 9.93 s [gammaloop-crate-gammaloop-workspace-hack-deps] Compiling cfg-if v1.0.4
  100. 9.93 s [gammaloop-crate-gammaloop-workspace-hack-deps] Compiling version_check v0.9.5
  101. 9.93 s [gammaloop-crate-gammaloop-workspace-hack-deps] Compiling autocfg v1.5.0
  102. 9.93 s [gammaloop-crate-gammaloop-workspace-hack-deps] Compiling memchr v2.8.0
  103. 9.93 s [gammaloop-crate-gammaloop-workspace-hack-deps] Compiling libm v0.2.16
  104. 9.93 s [gammaloop-crate-gammaloop-workspace-hack-deps] Compiling once_cell v1.21.4
  105. 9.93 s [gammaloop-crate-gammaloop-workspace-hack-deps] Compiling zerocopy v0.8.48
  106. 9.93 s [gammaloop-crate-gammaloop-workspace-hack-deps] Compiling crossbeam-utils v0.8.21
  107. 9.93 s [gammaloop-crate-gammaloop-workspace-hack-deps] Compiling bytemuck v1.25.0
  108. 9.94 s [gammaloop-crate-gammaloop-workspace-hack-deps] Compiling getrandom v0.3.4
  109. 9.94 s [gammaloop-crate-gammaloop-workspace-hack-deps] Compiling crunchy v0.2.4
  110. 9.94 s [gammaloop-crate-gammaloop-workspace-hack-deps] Compiling equivalent v1.0.2
  111. 9.94 s [gammaloop-crate-gammaloop-workspace-hack-deps] Compiling tiny-keccak v2.0.2
  112. 9.94 s [gammaloop-crate-gammaloop-workspace-hack-deps] Compiling either v1.15.0
  113. 9.94 s [gammaloop-crate-gammaloop-workspace-hack-deps] Compiling zmij v1.0.21
  114. 9.94 s [gammaloop-crate-gammaloop-workspace-hack-deps] Compiling rayon-core v1.13.0
  115. 9.94 s [gammaloop-crate-gammaloop-workspace-hack-deps] Compiling rustix v1.1.4
  116. 9.94 s [gammaloop-crate-gammaloop-workspace-hack-deps] Compiling regex-syntax v0.8.10
  117. 9.94 s [gammaloop-crate-gammaloop-workspace-hack-deps] Compiling itoa v1.0.18
  118. 9.94 s [gammaloop-crate-gammaloop-workspace-hack-deps] Compiling aho-corasick v1.1.4
  119. 9.94 s [gammaloop-crate-gammaloop-workspace-hack-deps] Compiling serde_json v1.0.149
  120. 9.94 s [gammaloop-crate-gammaloop-workspace-hack-deps] Compiling log v0.4.29
  121. 9.94 s [gammaloop-crate-gammaloop-workspace-hack-deps] Compiling unicode-width v0.2.2
  122. 9.96 s [gammaloop-crate-gammaloop-workspace-hack-deps] Compiling gmp-mpfr-sys v1.7.1
  123. 9.99 s [gammaloop-crate-gammaloop-workspace-hack-deps] Compiling linux-raw-sys v0.12.1
  124. 10.07 s [gammaloop-crate-gammaloop-workspace-hack-deps] Compiling crossbeam-epoch v0.9.18
  125. 10.11 s [gammaloop-crate-gammaloop-workspace-hack-deps] Compiling generic-array v0.14.7
  126. 10.14 s [gammaloop-crate-gammaloop-workspace-hack-deps] Compiling paste v1.0.15
  127. 10.38 s [gammaloop-crate-gammaloop-workspace-hack-deps] Compiling crossbeam-deque v0.8.6
  128. 10.45 s [gammaloop-crate-gammaloop-workspace-hack-deps] Compiling ahash v0.8.12
  129. 10.47 s [gammaloop-crate-gammaloop-workspace-hack-deps] Compiling num-traits v0.2.19
  130. 10.49 s [gammaloop-crate-gammaloop-workspace-hack-deps] Compiling safe_arch v0.7.4
  131. 10.50 s [gammaloop-crate-gammaloop-workspace-hack-deps] Compiling minimal-lexical v0.2.1
  132. 10.61 s [gammaloop-crate-gammaloop-workspace-hack-deps] Compiling hashbrown v0.17.0
  133. 10.70 s [gammaloop-crate-gammaloop-workspace-hack-deps] Compiling syn v2.0.117
  134. 10.85 s [gammaloop-crate-gammaloop-workspace-hack-deps] Compiling virtue v0.0.18
  135. 10.88 s [gammaloop-crate-gammaloop-workspace-hack-deps] Compiling arrayvec v0.7.6
  136. 10.92 s [gammaloop-crate-gammaloop-workspace-hack-deps] Compiling typenum v1.20.0
  137. 11.14 s [gammaloop-crate-gammaloop-workspace-hack-deps] Compiling winnow v1.0.2
  138. 11.40 s [gammaloop-crate-gammaloop-workspace-hack-deps] Compiling wide v0.7.33
  139. 11.60 s [gammaloop-crate-gammaloop-workspace-hack-deps] Compiling vte v0.14.1
  140. 11.82 s [gammaloop-crate-gammaloop-workspace-hack-deps] Compiling rayon v1.12.0
  141. 12.57 s [gammaloop-crate-gammaloop-workspace-hack-deps] Compiling regex-automata v0.4.14
  142. 13.13 s [gammaloop-crate-gammaloop-workspace-hack-deps] Compiling getrandom v0.2.17
  143. 13.16 s [gammaloop-crate-gammaloop-workspace-hack-deps] Compiling rand_core v0.9.5
  144. 13.18 s [gammaloop-crate-gammaloop-workspace-hack-deps] Compiling toml_parser v1.1.2+spec-1.1.0
  145. 13.32 s [gammaloop-crate-gammaloop-workspace-hack-deps] Compiling approx v0.5.1
  146. 13.41 s [gammaloop-crate-gammaloop-workspace-hack-deps] Compiling nom v7.1.3
  147. 13.47 s [gammaloop-crate-gammaloop-workspace-hack-deps] Compiling const-random-macro v0.1.16
  148. 13.51 s [gammaloop-crate-gammaloop-workspace-hack-deps] Compiling safe_arch v1.0.0
  149. 13.57 s [gammaloop-crate-gammaloop-workspace-hack-deps] Compiling tracing-core v0.1.36
  150. 13.94 s [gammaloop-crate-gammaloop-workspace-hack-deps] Compiling bitflags v2.11.1
  151. 14.64 s [gammaloop-crate-gammaloop-workspace-hack-deps] Compiling bincode_derive v2.0.1
  152. 14.78 s [gammaloop-crate-gammaloop-workspace-hack-deps] Compiling indexmap v2.14.0
  153. 15.04 s [gammaloop-crate-gammaloop-workspace-hack-deps] Compiling const-random v0.1.18
  154. 15.05 s [gammaloop-crate-gammaloop-workspace-hack-deps] Compiling serde_spanned v1.1.1
  155. 15.11 s [gammaloop-crate-gammaloop-workspace-hack-deps] Compiling toml_datetime v1.1.1+spec-1.1.0
  156. 15.22 s [gammaloop-crate-gammaloop-workspace-hack-deps] Compiling unty v0.0.4
  157. 15.32 s [gammaloop-crate-gammaloop-workspace-hack-deps] Compiling heck v0.5.0
  158. 15.64 s [gammaloop-crate-gammaloop-workspace-hack-deps] Compiling rug v1.30.0
  159. 15.85 s [gammaloop-crate-gammaloop-workspace-hack-deps] Compiling unicode-segmentation v1.13.2
  160. 15.90 s [gammaloop-crate-gammaloop-workspace-hack-deps] Compiling utf8parse v0.2.2
  161. 15.96 s [gammaloop-crate-gammaloop-workspace-hack-deps] Compiling anyhow v1.0.102
  162. 16.05 s [gammaloop-crate-gammaloop-workspace-hack-deps] Compiling toml_writer v1.1.1+spec-1.1.0
  163. 16.19 s [gammaloop-crate-gammaloop-workspace-hack-deps] Compiling anstyle-parse v1.0.0
  164. 16.29 s [gammaloop-crate-gammaloop-workspace-hack-deps] Compiling wide v1.3.0
  165. 16.38 s [gammaloop-crate-gammaloop-workspace-hack-deps] Compiling errno v0.3.14
  166. 16.52 s [gammaloop-crate-gammaloop-workspace-hack-deps] Compiling lazy_static v1.5.0
  167. 16.55 s [gammaloop-crate-gammaloop-workspace-hack-deps] Compiling powerfmt v0.2.0
  168. 16.60 s [gammaloop-crate-gammaloop-workspace-hack-deps] Compiling is_terminal_polyfill v1.70.2
  169. 16.73 s [gammaloop-crate-gammaloop-workspace-hack-deps] Compiling anstyle-query v1.1.5
  170. 16.73 s [gammaloop-crate-gammaloop-workspace-hack-deps] Compiling signal-hook v0.3.18
  171. 16.73 s [gammaloop-crate-gammaloop-workspace-hack-deps] Compiling colorchoice v1.0.5
  172. 16.78 s [gammaloop-crate-gammaloop-workspace-hack-deps] Compiling az v1.3.0
  173. 16.80 s [gammaloop-crate-gammaloop-workspace-hack-deps] Compiling alloc-no-stdlib v2.0.4
  174. 16.90 s [gammaloop-crate-gammaloop-workspace-hack-deps] Compiling ansitok v0.3.0
  175. 16.96 s [gammaloop-crate-gammaloop-workspace-hack-deps] Compiling getrandom v0.4.2
  176. 16.98 s [gammaloop-crate-gammaloop-workspace-hack-deps] Compiling parking_lot_core v0.9.12
  177. 17.15 s [gammaloop-crate-gammaloop-workspace-hack-deps] Compiling typeid v1.0.3
  178. 17.34 s [gammaloop-crate-gammaloop-workspace-hack-deps] Compiling anstyle v1.0.14
  179. 18.20 s [gammaloop-crate-gammaloop-workspace-hack-deps] Compiling anstream v1.0.0
  180. 18.32 s [gammaloop-crate-gammaloop-workspace-hack-deps] Compiling alloc-stdlib v0.2.2
  181. 18.36 s [gammaloop-crate-gammaloop-workspace-hack-deps] Compiling deranged v0.5.8
  182. 18.95 s [gammaloop-crate-gammaloop-workspace-hack-deps] Compiling signal-hook-registry v1.4.8
  183. 19.11 s [gammaloop-crate-gammaloop-workspace-hack-deps] Compiling terminal_size v0.4.4
  184. 19.64 s [gammaloop-crate-gammaloop-workspace-hack-deps] Compiling block-buffer v0.10.4
  185. 19.80 s [gammaloop-crate-gammaloop-workspace-hack-deps] Compiling crypto-common v0.1.7
  186. 19.87 s [gammaloop-crate-gammaloop-workspace-hack-deps] Compiling proc-macro-error-attr2 v2.0.0
  187. 20.17 s [gammaloop-crate-gammaloop-workspace-hack-deps] Compiling smartstring v1.0.1
  188. 20.34 s [gammaloop-crate-gammaloop-workspace-hack-deps] Compiling uncased v0.9.10
  189. 20.44 s [gammaloop-crate-gammaloop-workspace-hack-deps] Compiling itertools v0.14.0
  190. 20.81 s [gammaloop-crate-gammaloop-workspace-hack-deps] Compiling bitflags v1.3.2
  191. 20.93 s [gammaloop-crate-gammaloop-workspace-hack-deps] Compiling clap_lex v1.1.0
  192. 20.95 s [gammaloop-crate-gammaloop-workspace-hack-deps] Compiling allocator-api2 v0.2.21
  193. 22.01 s [gammaloop-crate-gammaloop-workspace-hack-deps] Compiling radium v0.7.0
  194. 22.14 s [gammaloop-crate-gammaloop-workspace-hack-deps] Compiling time-core v0.1.8
  195. 22.32 s [gammaloop-crate-gammaloop-workspace-hack-deps] Compiling foldhash v0.2.0
  196. 22.43 s [gammaloop-crate-gammaloop-workspace-hack-deps] Compiling strsim v0.11.1
  197. 22.47 s [gammaloop-crate-gammaloop-workspace-hack-deps] Compiling scopeguard v1.2.0
  198. 22.62 s [gammaloop-crate-gammaloop-workspace-hack-deps] Compiling same-file v1.0.6
  199. 22.86 s [gammaloop-crate-gammaloop-workspace-hack-deps] Compiling num-conv v0.2.1
  200. 22.90 s [gammaloop-crate-gammaloop-workspace-hack-deps] Compiling rustix v0.38.44
  201. 23.00 s [gammaloop-crate-gammaloop-workspace-hack-deps] Compiling ciborium-io v0.2.2
  202. 23.03 s [gammaloop-crate-gammaloop-workspace-hack-deps] Compiling winnow v0.7.15
  203. 23.08 s [gammaloop-crate-gammaloop-workspace-hack-deps] Compiling colored v3.1.1
  204. 23.12 s [gammaloop-crate-gammaloop-workspace-hack-deps] Compiling unicase v2.9.0
  205. 23.16 s [gammaloop-crate-gammaloop-workspace-hack-deps] Compiling pin-project-lite v0.2.17
  206. 23.30 s [gammaloop-crate-gammaloop-workspace-hack-deps] Compiling dyn-clone v1.0.20
  207. 23.56 s [gammaloop-crate-gammaloop-workspace-hack-deps] Compiling plotters-backend v0.3.7
  208. 23.59 s [gammaloop-crate-gammaloop-workspace-hack-deps] Compiling toml_write v0.1.2
  209. 23.76 s [gammaloop-crate-gammaloop-workspace-hack-deps] Compiling num_threads v0.1.7
  210. 23.87 s [gammaloop-crate-gammaloop-workspace-hack-deps] Compiling time v0.3.47
  211. 23.91 s [gammaloop-crate-gammaloop-workspace-hack-deps] Compiling plotters-svg v0.3.7
  212. 23.99 s [gammaloop-crate-gammaloop-workspace-hack-deps] Compiling clap_builder v4.6.0
  213. 24.04 s [gammaloop-crate-gammaloop-workspace-hack-deps] Compiling walkdir v2.5.0
  214. 24.09 s [gammaloop-crate-gammaloop-workspace-hack-deps] Compiling lock_api v0.4.14
  215. 24.21 s [gammaloop-crate-gammaloop-workspace-hack-deps] Compiling hashbrown v0.16.1
  216. 24.23 s [gammaloop-crate-gammaloop-workspace-hack-deps] Compiling proc-macro-error2 v2.0.1
  217. 24.31 s [gammaloop-crate-gammaloop-workspace-hack-deps] Compiling matchers v0.2.0
  218. 24.52 s [gammaloop-crate-gammaloop-workspace-hack-deps] Compiling region v3.0.2
  219. 24.56 s [gammaloop-crate-gammaloop-workspace-hack-deps] Compiling digest v0.10.7
  220. 24.84 s [gammaloop-crate-gammaloop-workspace-hack-deps] Compiling brotli-decompressor v5.0.0
  221. 24.99 s [gammaloop-crate-gammaloop-workspace-hack-deps] Compiling wasmtime-jit-icache-coherence v34.0.2
  222. 25.28 s [gammaloop-crate-gammaloop-workspace-hack-deps] Compiling ansi-str v0.9.0
  223. 25.29 s [gammaloop-crate-gammaloop-workspace-hack-deps] Compiling sharded-slab v0.1.7
  224. 25.60 s [gammaloop-crate-gammaloop-workspace-hack-deps] Compiling toml v1.1.2+spec-1.1.0
  225. 25.80 s [gammaloop-crate-gammaloop-workspace-hack-deps] Compiling convert_case v0.10.0
  226. 25.83 s [gammaloop-crate-gammaloop-workspace-hack-deps] Compiling tracing-log v0.2.0
  227. 26.21 s [gammaloop-crate-gammaloop-workspace-hack-deps] Compiling mio v1.2.0
  228. 26.32 s [gammaloop-crate-gammaloop-workspace-hack-deps] Compiling hugepage-rs v0.1.1
  229. 26.44 s [gammaloop-crate-gammaloop-workspace-hack-deps] Compiling matrixmultiply v0.3.10
  230. 26.86 s [gammaloop-crate-gammaloop-workspace-hack-deps] Compiling figment v0.10.19
  231. 26.91 s [gammaloop-crate-gammaloop-workspace-hack-deps] Compiling bstr v1.12.1
  232. 26.92 s [gammaloop-crate-gammaloop-workspace-hack-deps] Compiling itertools v0.10.5
  233. 26.95 s [gammaloop-crate-gammaloop-workspace-hack-deps] Compiling thread_local v1.1.9
  234. 27.01 s [gammaloop-crate-gammaloop-workspace-hack-deps] Compiling static_assertions v1.1.0
  235. 27.10 s [gammaloop-crate-gammaloop-workspace-hack-deps] Compiling nu-ansi-term v0.50.3
  236. 27.36 s [gammaloop-crate-gammaloop-workspace-hack-deps] Compiling bytecount v0.6.9
  237. 27.47 s [gammaloop-crate-gammaloop-workspace-hack-deps] Compiling cast v0.3.0
  238. 27.56 s [gammaloop-crate-gammaloop-workspace-hack-deps] Compiling tap v1.0.1
  239. 27.62 s [gammaloop-crate-gammaloop-workspace-hack-deps] Compiling fnv v1.0.7
  240. 27.64 s [gammaloop-crate-gammaloop-workspace-hack-deps] Compiling symbolica v2.2.0 (https://github.com/symbolica-dev/symbolica?branch=dev#0441bd7a)
  241. 27.68 s [gammaloop-crate-gammaloop-workspace-hack-deps] Compiling fastrand v2.4.1
  242. 27.70 s [gammaloop-crate-gammaloop-workspace-hack-deps] Compiling syn v1.0.109
  243. 27.72 s [gammaloop-crate-gammaloop-workspace-hack-deps] Compiling linux-raw-sys v0.4.15
  244. 27.81 s [gammaloop-crate-gammaloop-workspace-hack-deps] Compiling spec_math v0.1.6
  245. 28.05 s [gammaloop-crate-gammaloop-workspace-hack-deps] Compiling cpufeatures v0.2.17
  246. 28.14 s [gammaloop-crate-gammaloop-workspace-hack-deps] Compiling sha2 v0.10.9
  247. 28.16 s [gammaloop-crate-gammaloop-workspace-hack-deps] Compiling tempfile v3.27.0
  248. 28.21 s [gammaloop-crate-gammaloop-workspace-hack-deps] Compiling globset v0.4.18
  249. 28.23 s [gammaloop-crate-gammaloop-workspace-hack-deps] Compiling papergrid v0.17.0
  250. 28.23 s [gammaloop-crate-gammaloop-workspace-hack-deps] Compiling wyz v0.5.1
  251. 28.49 s [gammaloop-crate-gammaloop-workspace-hack-deps] Compiling signal-hook-mio v0.2.5
  252. 28.53 s [gammaloop-crate-gammaloop-workspace-hack-deps] Compiling brotli v8.0.2
  253. 28.90 s [gammaloop-crate-gammaloop-workspace-hack-deps] Compiling plotters v0.3.7
  254. 29.81 s [gammaloop-crate-gammaloop-workspace-hack-deps] Compiling criterion-plot v0.5.0
  255. 30.01 s [gammaloop-crate-gammaloop-workspace-hack-deps] Compiling regex v1.12.3
  256. 30.16 s [gammaloop-crate-gammaloop-workspace-hack-deps] Compiling testing_table v0.3.0
  257. 30.40 s [gammaloop-crate-gammaloop-workspace-hack-deps] Compiling toml_edit v0.25.11+spec-1.1.0
  258. 30.56 s [gammaloop-crate-gammaloop-workspace-hack-deps] Compiling similar v2.7.0
  259. 30.60 s [gammaloop-crate-gammaloop-workspace-hack-deps] Compiling console v0.16.3
  260. 30.67 s [gammaloop-crate-gammaloop-workspace-hack-deps] Compiling is-terminal v0.4.17
  261. 30.79 s [gammaloop-crate-gammaloop-workspace-hack-deps] Compiling num-integer v0.1.46
  262. 31.62 s [gammaloop-crate-gammaloop-workspace-hack-deps] Compiling libloading v0.9.0
  263. 32.04 s [gammaloop-crate-gammaloop-workspace-hack-deps] Compiling iana-time-zone v0.1.65
  264. 32.07 s [gammaloop-crate-gammaloop-workspace-hack-deps] Compiling bytes v1.11.1
  265. 32.20 s [gammaloop-crate-gammaloop-workspace-hack-deps] Compiling self_cell v1.2.2
  266. 32.38 s [gammaloop-crate-gammaloop-workspace-hack-deps] Compiling anes v0.1.6
  267. 32.60 s [gammaloop-crate-gammaloop-workspace-hack-deps] Compiling funty v2.0.0
  268. 33.25 s [gammaloop-crate-gammaloop-workspace-hack-deps] Compiling inventory v0.3.24
  269. 33.36 s [gammaloop-crate-gammaloop-workspace-hack-deps] Compiling oorandom v11.1.5
  270. 33.37 s [gammaloop-crate-gammaloop-workspace-hack-deps] Compiling byteorder v1.5.0
  271. 33.53 s [gammaloop-crate-gammaloop-workspace-hack-deps] Compiling rawpointer v0.2.1
  272. 33.60 s [gammaloop-crate-gammaloop-workspace-hack-deps] Compiling tinyjson v2.5.1
  273. 33.69 s [gammaloop-crate-gammaloop-workspace-hack-deps] Compiling append-only-vec v0.1.8
  274. 33.79 s [gammaloop-crate-gammaloop-workspace-hack-deps] Compiling rust-embed-utils v8.11.0
  275. 33.97 s [gammaloop-crate-gammaloop-workspace-hack-deps] Compiling indenter v0.3.4
  276. 44.40 s [gammaloop-crate-gammaloop-workspace-hack-deps] Compiling serde_derive v1.0.228
  277. 45.11 s [gammaloop-crate-gammaloop-workspace-hack-deps] Compiling zerocopy-derive v0.8.48
  278. 45.16 s [gammaloop-crate-gammaloop-workspace-hack-deps] Compiling tracing-attributes v0.1.31
  279. 45.37 s [gammaloop-crate-gammaloop-workspace-hack-deps] Compiling clap_derive v4.6.1
  280. 45.41 s [gammaloop-crate-gammaloop-workspace-hack-deps] Compiling tabled_derive v0.11.0
  281. 45.45 s [gammaloop-crate-gammaloop-workspace-hack-deps] Compiling derive_more-impl v2.1.1
  282. 51.20 s [gammaloop-crate-gammaloop-workspace-hack-deps] Compiling tabled v0.20.0
  283. 54.70 s [gammaloop-crate-gammaloop-workspace-hack-deps] Compiling tracing v0.1.44
  284. 55.53 s [gammaloop-crate-gammaloop-workspace-hack-deps] Compiling derive_more v2.1.1
  285. 56.06 s [gammaloop-crate-gammaloop-workspace-hack-deps] Compiling clap v4.6.1
  286. 58.33 s [gammaloop-crate-gammaloop-workspace-hack-deps] Compiling smallvec v1.15.1
  287. 58.35 s [gammaloop-crate-gammaloop-workspace-hack-deps] Compiling num-complex v0.4.6
  288. 58.35 s [gammaloop-crate-gammaloop-workspace-hack-deps] Compiling bincode v2.0.1
  289. 58.35 s [gammaloop-crate-gammaloop-workspace-hack-deps] Compiling toml_datetime v0.6.11
  290. 58.35 s [gammaloop-crate-gammaloop-workspace-hack-deps] Compiling serde_spanned v0.6.9
  291. 58.35 s [gammaloop-crate-gammaloop-workspace-hack-deps] Compiling tracing-serde v0.2.0
  292. 58.35 s [gammaloop-crate-gammaloop-workspace-hack-deps] Compiling tinytemplate v1.2.1
  293. 58.35 s [gammaloop-crate-gammaloop-workspace-hack-deps] Compiling ron v0.12.1
  294. 58.35 s [gammaloop-crate-gammaloop-workspace-hack-deps] Compiling bitvec v1.0.1
  295. 58.35 s [gammaloop-crate-gammaloop-workspace-hack-deps] Compiling num-bigint v0.4.6
  296. 58.35 s [gammaloop-crate-gammaloop-workspace-hack-deps] Compiling chrono v0.4.44
  297. 58.54 s [gammaloop-crate-gammaloop-workspace-hack-deps] Compiling toml_edit v0.22.27
  298. 58.58 s [gammaloop-crate-gammaloop-workspace-hack-deps] Compiling tracing-subscriber v0.3.23
  299. 58.88 s [gammaloop-crate-gammaloop-workspace-hack-deps] Compiling parking_lot v0.12.5
  300. 59.20 s [gammaloop-crate-gammaloop-workspace-hack-deps] Compiling simba v0.9.1
  301. 59.20 s [gammaloop-crate-gammaloop-workspace-hack-deps] Compiling crossterm v0.28.1
  302. 59.78 s [gammaloop-crate-gammaloop-workspace-hack-deps] Compiling bincode-trait-derive v0.1.1
  303. 60.29 s [gammaloop-crate-gammaloop-workspace-hack-deps] Compiling insta v1.47.2
  304. 61.30 s [gammaloop-crate-gammaloop-workspace-hack-deps] Compiling ppv-lite86 v0.2.21
  305. 61.75 s [gammaloop-crate-gammaloop-workspace-hack-deps] Compiling half v2.7.1
  306. 62.00 s [gammaloop-crate-gammaloop-workspace-hack-deps] Compiling rand_chacha v0.9.0
  307. 62.16 s [gammaloop-crate-gammaloop-workspace-hack-deps] Compiling toml v0.8.23
  308. 62.49 s [gammaloop-crate-gammaloop-workspace-hack-deps] Compiling rand v0.9.4
  309. 62.65 s [gammaloop-crate-gammaloop-workspace-hack-deps] Compiling ciborium-ll v0.2.2
  310. 62.99 s [gammaloop-crate-gammaloop-workspace-hack-deps] Compiling ciborium v0.2.2
  311. 63.51 s [gammaloop-crate-gammaloop-workspace-hack-deps] Compiling symjit v2.21.0
  312. 64.36 s [gammaloop-crate-gammaloop-workspace-hack-deps] Compiling criterion v0.5.1
  313. 66.59 s [gammaloop-crate-gammaloop-workspace-hack-deps] Compiling xprec v0.2.2
  314. 174.83 s [gammaloop-crate-gammaloop-workspace-hack-deps] Compiling numerica v2.2.0 (https://github.com/symbolica-dev/symbolica?branch=dev#0441bd7a)
  315. 177.11 s [gammaloop-crate-gammaloop-workspace-hack-deps] Compiling graphica v2.1.0 (https://github.com/symbolica-dev/symbolica?branch=dev#0441bd7a)
  316. 361.14 s [gammaloop-crate-gammaloop-workspace-hack-deps] Compiling gammaloop-workspace-hack v0.1.0 (/build/source/crates/gammaloop-workspace-hack)
  317. 361.35 s [gammaloop-crate-gammaloop-workspace-hack-deps] Finished `ci-optim` profile [optimized] target(s) in 5m 53s
  318. 361.49 s [gammaloop-crate-gammaloop-workspace-hack-deps] warning: the following packages contain code that will be rejected by a future version of Rust: proc-macro-error2 v2.0.1
  319. 361.49 s [gammaloop-crate-gammaloop-workspace-hack-deps] note: to see what the problems were, use the option `--future-incompat-report`, or run `cargo report future-incompatibilities --id 1`
  320. 362.01 s [gammaloop-crate-gammaloop-workspace-hack-deps] buildPhase completed in 5 minutes 54 seconds
  321. 362.01 s [gammaloop-crate-gammaloop-workspace-hack-deps] Phase: installPhase
  322. 362.02 s [gammaloop-crate-gammaloop-workspace-hack-deps] no previous artifacts found, compressing and installing full archive of target to /nix/store/r5nn944wylazj2ilzb80v0dganidd8qd-gammaloop-crate-gammaloop-workspace-hack-deps-0.1.0/target.tar.zst
  323. 362.78 s [gammaloop-crate-gammaloop-workspace-hack-deps] /*stdin*\ : 26.41% ( 705 MiB => 186 MiB, /nix/store/r5nn944wylazj2ilzb80v0dganidd8qd-gammaloop-crate-gammaloop-workspace-hack-deps-0.1.0/target.tar.zst)
  324. 362.81 s [gammaloop-crate-gammaloop-workspace-hack-deps] Phase: fixupPhase
  325. 362.83 s [gammaloop-crate-gammaloop-workspace-hack-deps] shrinking RPATHs of ELF executables and libraries in /nix/store/r5nn944wylazj2ilzb80v0dganidd8qd-gammaloop-crate-gammaloop-workspace-hack-deps-0.1.0
  326. 362.83 s [gammaloop-crate-gammaloop-workspace-hack-deps] checking for references to /build/ in /nix/store/r5nn944wylazj2ilzb80v0dganidd8qd-gammaloop-crate-gammaloop-workspace-hack-deps-0.1.0...
  327. 362.85 s [gammaloop-crate-gammaloop-workspace-hack-deps] patching script interpreter paths in /nix/store/r5nn944wylazj2ilzb80v0dganidd8qd-gammaloop-crate-gammaloop-workspace-hack-deps-0.1.0
  328. 363.30 s [gammaloop-crate-gammaloop-workspace-hack-deps:post-build] Uploading to the NixCI cache: /nix/store/r5nn944wylazj2ilzb80v0dganidd8qd-gammaloop-crate-gammaloop-workspace-hack-deps-0.1.0
  329. 363.37 s [gammaloop-crate-gammaloop-workspace-hack-deps:post-build] warning: 'warn-short-path-literals' is deprecated, use 'lint-short-path-literals = ignore' instead
  330. 363.41 s [gammaloop-crate-gammaloop-workspace-hack-deps:post-build] copying 1 paths...
  331. 363.41 s [gammaloop-crate-gammaloop-workspace-hack-deps:post-build] copying path '/nix/store/r5nn944wylazj2ilzb80v0dganidd8qd-gammaloop-crate-gammaloop-workspace-hack-deps-0.1.0' to 'https://cache.nix-ci.com'...
  332. 388.03 s [gammaloop-crate-gammaloop-workspace-hack-deps:post-build] warning: 'warn-short-path-literals' is deprecated, use 'lint-short-path-literals = ignore' instead
  333. 388.32 s [gammaloop-crate-gammaloop-workspace-hack-deps:post-build] copying 1 paths...
  334. 388.33 s [gammaloop-crate-gammaloop-workspace-hack-deps:post-build] copying path '/nix/store/daca79fsd3vmqf7wrwvp2pydmaqlxw2b-gammaloop-crate-gammaloop-workspace-hack-deps-0.1.0.drv' to 'https://cache.nix-ci.com'...
  335. 388.56 s Uploaded gammaloop-crate-gammaloop-workspace-hack-deps in 25.2s
  336. 388.56 s Progress: 8 of 20 built, 3 of 3 downloaded from cache
  337. 388.56 s Built gammaloop-crate-gammaloop-workspace-hack-deps in 6m20s
  338. 388.65 s Building /nix/store/z7k1har7di9k72324v33ga1vd8cbvw94-gammaloop-crate-gammaloop-workspace-hack-build-0.1.0.drv
  339. 388.74 s [gammaloop-crate-gammaloop-workspace-hack-build] Phase: unpackPhase
  340. 388.75 s [gammaloop-crate-gammaloop-workspace-hack-build] unpacking source archive /nix/store/vgc40rn50qp8w6a4x17k2hdd2c4hc1yy-source
  341. 388.76 s [gammaloop-crate-gammaloop-workspace-hack-build] source root is source
  342. 388.77 s [gammaloop-crate-gammaloop-workspace-hack-build] Phase: patchPhase
  343. 388.92 s [gammaloop-crate-gammaloop-workspace-hack-build] Executing configureCargoCommonVars
  344. 388.92 s [gammaloop-crate-gammaloop-workspace-hack-build] decompressing cargo artifacts from /nix/store/r5nn944wylazj2ilzb80v0dganidd8qd-gammaloop-crate-gammaloop-workspace-hack-deps-0.1.0/target.tar.zst to target
  345. 389.87 s [gammaloop-crate-gammaloop-workspace-hack-build] Phase: updateAutotoolsGnuConfigScriptsPhase
  346. 389.90 s [gammaloop-crate-gammaloop-workspace-hack-build] Phase: configurePhase
  347. 389.90 s [gammaloop-crate-gammaloop-workspace-hack-build] will append /build/source/.cargo-home/config.toml with contents of /nix/store/1sigmg52bb61pfngmk9k8wq5fz9r7bf1-vendor-cargo-deps/config.toml
  348. 389.90 s [gammaloop-crate-gammaloop-workspace-hack-build] default configurePhase, nothing to do
  349. 389.91 s [gammaloop-crate-gammaloop-workspace-hack-build] Phase: buildPhase
  350. 389.91 s [gammaloop-crate-gammaloop-workspace-hack-build] +++ command cargo --version
  351. 389.92 s [gammaloop-crate-gammaloop-workspace-hack-build] cargo 1.97.0 (c980f4866 2026-06-30)
  352. 389.92 s [gammaloop-crate-gammaloop-workspace-hack-build] +++ command cargo build --profile ci-optim --locked -p gammaloop-workspace-hack --features symbolica/tracing_max_level_info
  353. 390.20 s [gammaloop-crate-gammaloop-workspace-hack-build] Compiling gammaloop-workspace-hack v0.1.0 (/build/source/crates/gammaloop-workspace-hack)
  354. 390.42 s [gammaloop-crate-gammaloop-workspace-hack-build] Finished `ci-optim` profile [optimized] target(s) in 0.49s
  355. 390.59 s [gammaloop-crate-gammaloop-workspace-hack-build] warning: the following packages contain code that will be rejected by a future version of Rust: proc-macro-error2 v2.0.1
  356. 390.59 s [gammaloop-crate-gammaloop-workspace-hack-build] note: to see what the problems were, use the option `--future-incompat-report`, or run `cargo report future-incompatibilities --id 1`
  357. 390.66 s [gammaloop-crate-gammaloop-workspace-hack-build] Phase: installPhase
  358. 390.67 s [gammaloop-crate-gammaloop-workspace-hack-build] linking previous artifacts /nix/store/r5nn944wylazj2ilzb80v0dganidd8qd-gammaloop-crate-gammaloop-workspace-hack-deps-0.1.0/target.tar.zst to /nix/store/qqzj8xzi5zkyws9jrjncfjs01v6flg7j-gammaloop-crate-gammaloop-workspace-hack-build-0.1.0/target.tar.zst
  359. 390.69 s [gammaloop-crate-gammaloop-workspace-hack-build] /*stdin*\ : 41.48% ( 470 KiB => 195 KiB, /nix/store/qqzj8xzi5zkyws9jrjncfjs01v6flg7j-gammaloop-crate-gammaloop-workspace-hack-build-0.1.0/target.tar.zst)
  360. 390.70 s [gammaloop-crate-gammaloop-workspace-hack-build] Phase: fixupPhase
  361. 390.71 s [gammaloop-crate-gammaloop-workspace-hack-build] shrinking RPATHs of ELF executables and libraries in /nix/store/qqzj8xzi5zkyws9jrjncfjs01v6flg7j-gammaloop-crate-gammaloop-workspace-hack-build-0.1.0
  362. 390.72 s [gammaloop-crate-gammaloop-workspace-hack-build] checking for references to /build/ in /nix/store/qqzj8xzi5zkyws9jrjncfjs01v6flg7j-gammaloop-crate-gammaloop-workspace-hack-build-0.1.0...
  363. 390.73 s [gammaloop-crate-gammaloop-workspace-hack-build] patching script interpreter paths in /nix/store/qqzj8xzi5zkyws9jrjncfjs01v6flg7j-gammaloop-crate-gammaloop-workspace-hack-build-0.1.0
  364. 391.08 s [gammaloop-crate-gammaloop-workspace-hack-build:post-build] Uploading to the NixCI cache: /nix/store/qqzj8xzi5zkyws9jrjncfjs01v6flg7j-gammaloop-crate-gammaloop-workspace-hack-build-0.1.0
  365. 391.14 s [gammaloop-crate-gammaloop-workspace-hack-build:post-build] warning: 'warn-short-path-literals' is deprecated, use 'lint-short-path-literals = ignore' instead
  366. 391.18 s [gammaloop-crate-gammaloop-workspace-hack-build:post-build] copying 1 paths...
  367. 391.18 s [gammaloop-crate-gammaloop-workspace-hack-build:post-build] copying path '/nix/store/qqzj8xzi5zkyws9jrjncfjs01v6flg7j-gammaloop-crate-gammaloop-workspace-hack-build-0.1.0' to 'https://cache.nix-ci.com'...
  368. 391.52 s [gammaloop-crate-gammaloop-workspace-hack-build:post-build] warning: 'warn-short-path-literals' is deprecated, use 'lint-short-path-literals = ignore' instead
  369. 391.84 s [gammaloop-crate-gammaloop-workspace-hack-build:post-build] copying 1 paths...
  370. 391.84 s [gammaloop-crate-gammaloop-workspace-hack-build:post-build] copying path '/nix/store/z7k1har7di9k72324v33ga1vd8cbvw94-gammaloop-crate-gammaloop-workspace-hack-build-0.1.0.drv' to 'https://cache.nix-ci.com'...
  371. 392.04 s Uploaded gammaloop-crate-gammaloop-workspace-hack-build in 967ms
  372. 392.04 s Progress: 9 of 20 built, 3 of 3 downloaded from cache
  373. 392.04 s Built gammaloop-crate-gammaloop-workspace-hack-build in 3.3s
  374. 392.13 s Building /nix/store/p0r0ap1bhpj5158hdri51aijsls4xc7m-gammaloop-workspace-deps-deps-0.1.0.drv
  375. 392.24 s [gammaloop-workspace-deps-deps] Phase: unpackPhase
  376. 392.25 s [gammaloop-workspace-deps-deps] unpacking source archive /nix/store/6vwa64l890xsp30166g0nsca8pm7qx90-source
  377. 392.26 s [gammaloop-workspace-deps-deps] source root is source
  378. 392.28 s [gammaloop-workspace-deps-deps] Phase: patchPhase
  379. 392.29 s [gammaloop-workspace-deps-deps] Executing configureCargoCommonVars
  380. 392.30 s [gammaloop-workspace-deps-deps] decompressing cargo artifacts from /nix/store/r5nn944wylazj2ilzb80v0dganidd8qd-gammaloop-crate-gammaloop-workspace-hack-deps-0.1.0/target.tar.zst to target
  381. 393.36 s [gammaloop-workspace-deps-deps] decompressing cargo artifacts from /nix/store/qqzj8xzi5zkyws9jrjncfjs01v6flg7j-gammaloop-crate-gammaloop-workspace-hack-build-0.1.0/target.tar.zst to target
  382. 393.44 s [gammaloop-workspace-deps-deps] Phase: updateAutotoolsGnuConfigScriptsPhase
  383. 393.44 s [gammaloop-workspace-deps-deps] Phase: configurePhase
  384. 393.44 s [gammaloop-workspace-deps-deps] will append /build/source/.cargo-home/config.toml with contents of /nix/store/1sigmg52bb61pfngmk9k8wq5fz9r7bf1-vendor-cargo-deps/config.toml
  385. 393.44 s [gammaloop-workspace-deps-deps] default configurePhase, nothing to do
  386. 393.44 s [gammaloop-workspace-deps-deps] Phase: buildPhase
  387. 393.44 s [gammaloop-workspace-deps-deps] +++ command cargo --version
  388. 393.44 s [gammaloop-workspace-deps-deps] cargo 1.97.0 (c980f4866 2026-06-30)
  389. 393.44 s [gammaloop-workspace-deps-deps] +++ command cargo build --profile ci-optim --offline -p gammaloop-ci-prebuild -p gammaloop-workspace-hack --features gammaloop-tracing-filter/clap,gammaloop-tracing-filter/symbolica,idenso/bincode,idenso/reference-cases,linnet/bincode,linnet/drawing,linnet/rkyv,linnet/serde,linnet/symbolica,spenso-macros/shadowing,spenso/shadowing,symbolica/tracing_max_level_info,three-dimensional-reps/display,three-dimensional-reps/serde
  390. 393.86 s [gammaloop-workspace-deps-deps] Compiling thiserror v2.0.18
  391. 393.86 s [gammaloop-workspace-deps-deps] Compiling thiserror-impl v2.0.18
  392. 393.87 s [gammaloop-workspace-deps-deps] Compiling ident_case v1.0.1
  393. 393.88 s [gammaloop-workspace-deps-deps] Compiling rand_core v0.6.4
  394. 393.88 s [gammaloop-workspace-deps-deps] Compiling ucd-trie v0.1.7
  395. 393.89 s [gammaloop-workspace-deps-deps] Compiling ptr_meta_derive v0.1.4
  396. 393.89 s [gammaloop-workspace-deps-deps] Compiling ahash v0.7.8
  397. 393.89 s [gammaloop-workspace-deps-deps] Compiling rustversion v1.0.22
  398. 393.89 s [gammaloop-workspace-deps-deps] Compiling bytecheck v0.6.12
  399. 393.91 s [gammaloop-workspace-deps-deps] Compiling bytecheck_derive v0.6.12
  400. 393.91 s [gammaloop-workspace-deps-deps] Compiling proc-macro2-diagnostics v0.10.1
  401. 393.91 s [gammaloop-workspace-deps-deps] Compiling simdutf8 v0.1.5
  402. 393.91 s [gammaloop-workspace-deps-deps] Compiling rend v0.4.2
  403. 393.92 s [gammaloop-workspace-deps-deps] Compiling gammaloop-workspace-hack v0.1.0 (/build/source/crates/gammaloop-workspace-hack)
  404. 393.92 s [gammaloop-workspace-deps-deps] Compiling rkyv v0.7.46
  405. 393.92 s [gammaloop-workspace-deps-deps] Compiling cgmath v0.18.0
  406. 393.98 s [gammaloop-workspace-deps-deps] Compiling symbolica-utils v0.1.0 (/build/source/crates/symbolica-utils)
  407. 394.11 s [gammaloop-workspace-deps-deps] Compiling rand_chacha v0.3.1
  408. 394.21 s [gammaloop-workspace-deps-deps] Compiling pest v2.8.6
  409. 394.24 s [gammaloop-workspace-deps-deps] Compiling num-rational v0.4.2
  410. 394.27 s [gammaloop-workspace-deps-deps] Compiling rkyv_derive v0.7.46
  411. 394.32 s [gammaloop-workspace-deps-deps] Compiling approx v0.4.0
  412. 394.35 s [gammaloop-workspace-deps-deps] Compiling proc-macro-error-attr v1.0.4
  413. 394.36 s [gammaloop-workspace-deps-deps] Compiling rand v0.8.6
  414. 394.42 s [gammaloop-workspace-deps-deps] Compiling linnet v0.17.0 (/build/source/crates/linnet)
  415. 394.48 s [gammaloop-workspace-deps-deps] Compiling eyre v0.6.12
  416. 394.57 s [gammaloop-workspace-deps-deps] Compiling strsim v0.10.0
  417. 394.72 s [gammaloop-workspace-deps-deps] Compiling hashbrown v0.12.3
  418. 394.73 s [gammaloop-workspace-deps-deps] Compiling seahash v4.1.0
  419. 394.79 s [gammaloop-workspace-deps-deps] Compiling shlex v1.3.0
  420. 394.89 s [gammaloop-workspace-deps-deps] Compiling find-msvc-tools v0.1.9
  421. 395.11 s [gammaloop-workspace-deps-deps] Compiling darling_core v0.14.4
  422. 395.14 s [gammaloop-workspace-deps-deps] Compiling cc v1.2.61
  423. 395.34 s [gammaloop-workspace-deps-deps] Compiling duplicate v2.0.1
  424. 395.49 s [gammaloop-workspace-deps-deps] Compiling darling_core v0.23.0
  425. 395.52 s [gammaloop-workspace-deps-deps] Compiling serde_repr v0.1.20
  426. 395.52 s [gammaloop-workspace-deps-deps] Compiling proc-macro-error v1.0.4
  427. 395.53 s [gammaloop-workspace-deps-deps] Compiling ryu v1.0.23
  428. 395.90 s [gammaloop-workspace-deps-deps] Compiling strum_macros v0.27.2
  429. 395.97 s [gammaloop-workspace-deps-deps] Compiling pest_meta v2.8.6
  430. 396.12 s [gammaloop-workspace-deps-deps] Compiling instability v0.3.12
  431. 396.38 s [gammaloop-workspace-deps-deps] Compiling indoc v2.0.7
  432. 396.64 s [gammaloop-workspace-deps-deps] Compiling spenso-macros v0.3.2 (/build/source/crates/spenso-macros)
  433. 396.97 s [gammaloop-workspace-deps-deps] Compiling siphasher v1.0.2
  434. 397.01 s [gammaloop-workspace-deps-deps] Compiling pest_generator v2.8.6
  435. 397.05 s [gammaloop-workspace-deps-deps] Compiling castaway v0.2.4
  436. 397.23 s [gammaloop-workspace-deps-deps] Compiling heck v0.4.1
  437. 397.30 s [gammaloop-workspace-deps-deps] Compiling compact_str v0.9.0
  438. 398.15 s [gammaloop-workspace-deps-deps] Compiling env_filter v1.0.1
  439. 398.34 s [gammaloop-workspace-deps-deps] Compiling num-iter v0.1.45
  440. 398.45 s [gammaloop-workspace-deps-deps] Compiling lru v0.16.4
  441. 398.62 s [gammaloop-workspace-deps-deps] Compiling unicode-truncate v2.0.1
  442. 398.64 s [gammaloop-workspace-deps-deps] Compiling ptr_meta v0.1.4
  443. 398.77 s [gammaloop-workspace-deps-deps] Compiling option-ext v0.2.0
  444. 398.78 s [gammaloop-workspace-deps-deps] Compiling convert_case v0.4.0
  445. 398.83 s [gammaloop-workspace-deps-deps] Compiling spenso v0.6.0 (/build/source/crates/spenso)
  446. 398.87 s [gammaloop-workspace-deps-deps] Compiling ref-ops v0.2.5
  447. 398.94 s [gammaloop-workspace-deps-deps] Compiling jiff v0.2.24
  448. 399.00 s [gammaloop-workspace-deps-deps] Compiling duplicate v1.0.0
  449. 399.10 s [gammaloop-workspace-deps-deps] Compiling dirs-sys v0.5.0
  450. 399.35 s [gammaloop-workspace-deps-deps] Compiling num v0.4.3
  451. 399.41 s [gammaloop-workspace-deps-deps] Compiling enum-try-as-inner v0.1.1
  452. 399.93 s [gammaloop-workspace-deps-deps] Compiling phf_shared v0.13.1
  453. 400.08 s [gammaloop-workspace-deps-deps] Compiling derive_more v0.99.20
  454. 400.24 s [gammaloop-workspace-deps-deps] Compiling rand_xoshiro v0.6.0
  455. 400.47 s [gammaloop-workspace-deps-deps] Compiling features v0.10.0
  456. 400.51 s [gammaloop-workspace-deps-deps] Compiling delegate v0.12.0
  457. 401.01 s [gammaloop-workspace-deps-deps] Compiling colored v2.2.0
  458. 401.66 s [gammaloop-workspace-deps-deps] Compiling owo-colors v4.3.0
  459. 402.13 s [gammaloop-workspace-deps-deps] Compiling thiserror v1.0.69
  460. 402.20 s [gammaloop-workspace-deps-deps] Compiling portable-atomic v1.13.1
  461. 402.53 s [gammaloop-workspace-deps-deps] Compiling blake3 v1.8.5
  462. 402.57 s [gammaloop-workspace-deps-deps] Compiling litrs v1.0.0
  463. 403.09 s [gammaloop-workspace-deps-deps] Compiling env_logger v0.11.10
  464. 403.33 s [gammaloop-workspace-deps-deps] Compiling object v0.37.3
  465. 403.36 s [gammaloop-workspace-deps-deps] Compiling constcat v0.5.1
  466. 403.41 s [gammaloop-workspace-deps-deps] Compiling cfg_aliases v0.2.1
  467. 403.46 s [gammaloop-workspace-deps-deps] Compiling gat-lending-iterator v0.1.8
  468. 403.64 s [gammaloop-workspace-deps-deps] Compiling document-features v0.2.12
  469. 403.68 s [gammaloop-workspace-deps-deps] Compiling nix v0.31.2
  470. 403.93 s [gammaloop-workspace-deps-deps] Compiling phf_generator v0.13.1
  471. 403.94 s [gammaloop-workspace-deps-deps] Compiling dirs v6.0.0
  472. 404.00 s [gammaloop-workspace-deps-deps] Compiling rand_distr v0.4.3
  473. 404.03 s [gammaloop-workspace-deps-deps] Compiling simba v0.6.0
  474. 404.06 s [gammaloop-workspace-deps-deps] Compiling nalgebra-macros v0.1.0
  475. 404.30 s [gammaloop-workspace-deps-deps] Compiling line-clipping v0.3.7
  476. 404.41 s [gammaloop-workspace-deps-deps] Compiling thiserror-impl v1.0.69
  477. 404.44 s [gammaloop-workspace-deps-deps] Compiling pest_derive v2.8.6
  478. 404.50 s [gammaloop-workspace-deps-deps] Compiling vte v0.15.0
  479. 404.56 s [gammaloop-workspace-deps-deps] Compiling arrayref v0.3.9
  480. 404.60 s [gammaloop-workspace-deps-deps] Compiling adler2 v2.0.1
  481. 404.64 s [gammaloop-workspace-deps-deps] Compiling joinery v2.1.0
  482. 404.71 s [gammaloop-workspace-deps-deps] Compiling clarabel v0.11.1
  483. 404.73 s [gammaloop-workspace-deps-deps] Compiling cpufeatures v0.3.0
  484. 404.78 s [gammaloop-workspace-deps-deps] Compiling idenso v0.3.0 (/build/source/crates/idenso)
  485. 404.90 s [gammaloop-workspace-deps-deps] Compiling dot-parser v0.5.1
  486. 404.93 s [gammaloop-workspace-deps-deps] Compiling constant_time_eq v0.4.2
  487. 404.97 s [gammaloop-workspace-deps-deps] Compiling ref-cast v1.0.25
  488. 405.07 s [gammaloop-workspace-deps-deps] Compiling color-spantrace v0.3.0
  489. 405.15 s [gammaloop-workspace-deps-deps] Compiling gammaloop-tracing-filter-macros v0.1.0 (/build/source/crates/gammaloop-tracing-filter-macros)
  490. 405.31 s [gammaloop-workspace-deps-deps] Compiling gimli v0.32.3
  491. 405.51 s [gammaloop-workspace-deps-deps] Compiling crossterm v0.29.0
  492. 406.02 s [gammaloop-workspace-deps-deps] Compiling titlecase v2.2.1
  493. 406.22 s [gammaloop-workspace-deps-deps] Compiling miniz_oxide v0.8.9
  494. 406.77 s [gammaloop-workspace-deps-deps] Compiling vt100 v0.16.2
  495. 406.95 s [gammaloop-workspace-deps-deps] Compiling phf_macros v0.13.1
  496. 407.21 s [gammaloop-workspace-deps-deps] Compiling nalgebra v0.29.0
  497. 407.57 s [gammaloop-workspace-deps-deps] Compiling addr2line v0.25.1
  498. 408.21 s [gammaloop-workspace-deps-deps] Compiling tracing-error v0.2.1
  499. 408.39 s [gammaloop-workspace-deps-deps] Compiling serde-big-array v0.5.1
  500. 408.39 s [gammaloop-workspace-deps-deps] Compiling serde_derive_internals v0.29.1
  501. 408.42 s [gammaloop-workspace-deps-deps] Compiling delegate v0.13.5
  502. 408.48 s [gammaloop-workspace-deps-deps] Compiling ref-cast-impl v1.0.25
  503. 408.54 s [gammaloop-workspace-deps-deps] Compiling amd v0.2.2
  504. 408.57 s [gammaloop-workspace-deps-deps] Compiling enum_dispatch v0.3.13
  505. 408.65 s [gammaloop-workspace-deps-deps] Compiling kasuari v0.4.12
  506. 408.84 s [gammaloop-workspace-deps-deps] Compiling rust_lisp v0.18.0
  507. 410.23 s [gammaloop-workspace-deps-deps] Compiling subprocess v0.2.15
  508. 411.26 s [gammaloop-workspace-deps-deps] Compiling darling_macro v0.14.4
  509. 411.62 s [gammaloop-workspace-deps-deps] Compiling itertools v0.11.0
  510. 411.80 s [gammaloop-workspace-deps-deps] Compiling slotmap v1.1.1
  511. 412.05 s [gammaloop-workspace-deps-deps] Compiling strum v0.27.2
  512. 412.08 s [gammaloop-workspace-deps-deps] Compiling rustc-demangle v0.1.27
  513. 412.13 s [gammaloop-workspace-deps-deps] Compiling ratatui-core v0.1.0
  514. 412.55 s [gammaloop-workspace-deps-deps] Compiling three-dimensional-reps v0.1.0 (/build/source/crates/three-dimensional-reps)
  515. 412.64 s [gammaloop-workspace-deps-deps] Compiling gammaloop-tracing-filter v0.1.0 (/build/source/crates/gammaloop-tracing-filter)
  516. 412.78 s [gammaloop-workspace-deps-deps] Compiling base64 v0.22.1
  517. 412.87 s [gammaloop-workspace-deps-deps] Compiling semver v1.0.28
  518. 412.90 s [gammaloop-workspace-deps-deps] Compiling unit-prefix v0.5.2
  519. 413.00 s [gammaloop-workspace-deps-deps] Compiling vakint v0.1.2 (/build/source/crates/vakint)
  520. 413.05 s [gammaloop-workspace-deps-deps] Compiling spenso-hep-lib v0.1.7 (/build/source/crates/spenso-hep-lib)
  521. 413.21 s [gammaloop-workspace-deps-deps] Compiling indicatif v0.18.4
  522. 413.21 s [gammaloop-workspace-deps-deps] Compiling phf v0.13.1
  523. 413.31 s [gammaloop-workspace-deps-deps] Compiling backtrace v0.3.76
  524. 413.36 s [gammaloop-workspace-deps-deps] Compiling string-template-plus v0.4.3
  525. 413.44 s [gammaloop-workspace-deps-deps] Compiling deprecate-until v1.0.0
  526. 414.00 s [gammaloop-workspace-deps-deps] Compiling shellexpand v3.1.2
  527. 414.15 s [gammaloop-workspace-deps-deps] Compiling statrs v0.16.1
  528. 414.22 s [gammaloop-workspace-deps-deps] Compiling xpct v0.5.1
  529. 414.58 s [gammaloop-workspace-deps-deps] Compiling typed-index-collections v3.5.0
  530. 414.64 s [gammaloop-workspace-deps-deps] Compiling brotli-decompressor v4.0.3
  531. 414.76 s [gammaloop-workspace-deps-deps] Compiling crossbeam-channel v0.5.15
  532. 414.93 s [gammaloop-workspace-deps-deps] Compiling integer-sqrt v0.1.5
  533. 414.99 s [gammaloop-workspace-deps-deps] Compiling include_dir_macros v0.7.4
  534. 415.12 s [gammaloop-workspace-deps-deps] Compiling toml_datetime v0.7.5+spec-1.1.0
  535. 415.17 s [gammaloop-workspace-deps-deps] Compiling darling v0.14.4
  536. 415.24 s [gammaloop-workspace-deps-deps] Compiling derive_builder_core v0.11.2
  537. 415.52 s [gammaloop-workspace-deps-deps] Compiling itertools v0.12.1
  538. 415.57 s [gammaloop-workspace-deps-deps] Compiling gammalooprs v0.3.4 (/build/source/crates/gammalooprs)
  539. 415.81 s [gammaloop-workspace-deps-deps] Compiling futures-core v0.3.32
  540. 415.93 s [gammaloop-workspace-deps-deps] Compiling rustc-hash v2.1.2
  541. 416.03 s [gammaloop-workspace-deps-deps] Compiling slab v0.4.12
  542. 416.10 s [gammaloop-workspace-deps-deps] Compiling version-compare v0.2.1
  543. 416.22 s [gammaloop-workspace-deps-deps] Compiling symlink v0.1.0
  544. 416.30 s [gammaloop-workspace-deps-deps] Compiling unsafe-libyaml v0.2.11
  545. 416.50 s [gammaloop-workspace-deps-deps] Compiling futures-task v0.3.32
  546. 416.56 s [gammaloop-workspace-deps-deps] Compiling tracing-appender v0.2.5
  547. 416.66 s [gammaloop-workspace-deps-deps] Compiling futures-util v0.3.32
  548. 416.77 s [gammaloop-workspace-deps-deps] Compiling darling_macro v0.23.0
  549. 417.37 s [gammaloop-workspace-deps-deps] Compiling serde_yaml v0.9.34+deprecated
  550. 417.50 s [gammaloop-workspace-deps-deps] Compiling include_dir v0.7.4
  551. 417.63 s [gammaloop-workspace-deps-deps] Compiling pathfinding v4.15.0
  552. 417.70 s [gammaloop-workspace-deps-deps] Compiling brotli v7.0.0
  553. 417.98 s [gammaloop-workspace-deps-deps] Compiling toml v0.9.12+spec-1.1.0
  554. 418.76 s [gammaloop-workspace-deps-deps] Compiling rust-embed-impl v8.11.0
  555. 419.07 s [gammaloop-workspace-deps-deps] Compiling ctrlc v3.5.2
  556. 419.26 s [gammaloop-workspace-deps-deps] Compiling color-eyre v0.6.5
  557. 419.33 s [gammaloop-workspace-deps-deps] Compiling tracing-indicatif v0.3.14
  558. 419.81 s [gammaloop-workspace-deps-deps] Compiling json5 v0.4.1
  559. 419.95 s [gammaloop-workspace-deps-deps] Compiling strum_macros v0.26.4
  560. 420.35 s [gammaloop-workspace-deps-deps] Compiling clap_complete v4.6.3
  561. 420.52 s [gammaloop-workspace-deps-deps] Compiling strip-ansi-escapes v0.2.1
  562. 420.86 s [gammaloop-workspace-deps-deps] Compiling gammaloop-api v0.1.0 (/build/source/crates/gammaloop-api)
  563. 421.12 s [gammaloop-workspace-deps-deps] Compiling vectorize v0.2.0
  564. 421.14 s [gammaloop-workspace-deps-deps] Compiling darling v0.23.0
  565. 421.23 s [gammaloop-workspace-deps-deps] Compiling fd-lock v4.0.4
  566. 421.24 s [gammaloop-workspace-deps-deps] Compiling venial v0.5.0
  567. 421.40 s [gammaloop-workspace-deps-deps] Compiling itertools v0.13.0
  568. 421.67 s [gammaloop-workspace-deps-deps] Compiling base62 v2.2.4
  569. 422.00 s [gammaloop-workspace-deps-deps] Compiling strum v0.26.3
  570. 422.21 s [gammaloop-workspace-deps-deps] Compiling ringbuffer v0.16.0
  571. 422.59 s [gammaloop-workspace-deps-deps] Compiling sdd v3.0.10
  572. 422.90 s [gammaloop-workspace-deps-deps] Compiling schemars_derive v1.2.1
  573. 422.97 s [gammaloop-workspace-deps-deps] Compiling scc v2.4.0
  574. 423.20 s [gammaloop-workspace-deps-deps] Compiling clap_complete_nushell v4.6.0
  575. 423.25 s [gammaloop-workspace-deps-deps] Compiling futures-executor v0.3.32
  576. 423.48 s [gammaloop-workspace-deps-deps] Compiling gammaloop-integration-tests v0.1.0 (/build/source/tests)
  577. 423.75 s [gammaloop-workspace-deps-deps] Compiling ndarray v0.17.2
  578. 423.75 s [gammaloop-workspace-deps-deps] Compiling sysinfo v0.33.1
  579. 423.76 s [gammaloop-workspace-deps-deps] Compiling serial_test_derive v3.4.0
  580. 424.03 s [gammaloop-workspace-deps-deps] Compiling linnest v0.1.0 (/build/source/crates/linnest)
  581. 424.31 s [gammaloop-workspace-deps-deps] Compiling kurvst v0.1.0 (/build/source/crates/kurvst)
  582. 424.34 s [gammaloop-workspace-deps-deps] Compiling kurbo v0.13.0
  583. 424.35 s [gammaloop-workspace-deps-deps] Compiling which v8.0.2
  584. 424.81 s [gammaloop-workspace-deps-deps] Compiling rust-embed v8.11.0
  585. 425.64 s [gammaloop-workspace-deps-deps] Compiling wasm-minimal-protocol v0.2.0
  586. 426.22 s [gammaloop-workspace-deps-deps] Compiling derive_builder_macro v0.11.2
  587. 427.31 s [gammaloop-workspace-deps-deps] Compiling ratatui-widgets v0.3.0
  588. 427.63 s [gammaloop-workspace-deps-deps] Compiling ratatui-crossterm v0.1.0
  589. 428.37 s [gammaloop-workspace-deps-deps] Compiling serial_test v3.4.0
  590. 428.89 s [gammaloop-workspace-deps-deps] Compiling ratatui-macros v0.7.0
  591. 428.99 s [gammaloop-workspace-deps-deps] Compiling ratatui v0.30.0
  592. 429.07 s [gammaloop-workspace-deps-deps] Compiling derive_builder v0.11.2
  593. 429.76 s [gammaloop-workspace-deps-deps] Compiling reedline v0.42.0
  594. 431.14 s [gammaloop-workspace-deps-deps] Compiling schemars v1.2.1
  595. 431.69 s [gammaloop-workspace-deps-deps] Compiling momtrop v0.3.0
  596. 434.12 s [gammaloop-workspace-deps-deps] Compiling gammaloop-ci-prebuild v0.1.0 (/build/source/crates/gammaloop-ci-prebuild)
  597. 434.16 s [gammaloop-workspace-deps-deps] Finished `ci-optim` profile [optimized] target(s) in 40.73s
  598. 434.33 s [gammaloop-workspace-deps-deps] warning: the following packages contain code that will be rejected by a future version of Rust: proc-macro-error2 v2.0.1
  599. 434.33 s [gammaloop-workspace-deps-deps] note: to see what the problems were, use the option `--future-incompat-report`, or run `cargo report future-incompatibilities --id 1`
  600. 434.93 s [gammaloop-workspace-deps-deps] buildPhase completed in 42 seconds
  601. 436.02 s [gammaloop-workspace-deps-deps] Phase: installPhase
  602. 436.02 s [gammaloop-workspace-deps-deps] linking previous artifacts /nix/store/qqzj8xzi5zkyws9jrjncfjs01v6flg7j-gammaloop-crate-gammaloop-workspace-hack-build-0.1.0/target.tar.zst to /nix/store/b1j3qxqhjsi05lmyhgyz1rv0j0d3x9ql-gammaloop-workspace-deps-deps-0.1.0/target.tar.zst
  603. 436.02 s [gammaloop-workspace-deps-deps] /*stdin*\ : 31.07% ( 427 MiB => 133 MiB, /nix/store/b1j3qxqhjsi05lmyhgyz1rv0j0d3x9ql-gammaloop-workspace-deps-deps-0.1.0/target.tar.zst)
  604. 436.02 s [gammaloop-workspace-deps-deps] Phase: fixupPhase
  605. 441.16 s [gammaloop-workspace-deps-deps] shrinking RPATHs of ELF executables and libraries in /nix/store/b1j3qxqhjsi05lmyhgyz1rv0j0d3x9ql-gammaloop-workspace-deps-deps-0.1.0
  606. 441.16 s [gammaloop-workspace-deps-deps] checking for references to /build/ in /nix/store/b1j3qxqhjsi05lmyhgyz1rv0j0d3x9ql-gammaloop-workspace-deps-deps-0.1.0...
  607. 441.17 s [gammaloop-workspace-deps-deps] patching script interpreter paths in /nix/store/b1j3qxqhjsi05lmyhgyz1rv0j0d3x9ql-gammaloop-workspace-deps-deps-0.1.0
  608. 441.98 s [gammaloop-workspace-deps-deps:post-build] Uploading to the NixCI cache: /nix/store/b1j3qxqhjsi05lmyhgyz1rv0j0d3x9ql-gammaloop-workspace-deps-deps-0.1.0
  609. 442.04 s [gammaloop-workspace-deps-deps:post-build] warning: 'warn-short-path-literals' is deprecated, use 'lint-short-path-literals = ignore' instead
  610. 442.08 s [gammaloop-workspace-deps-deps:post-build] copying 1 paths...
  611. 442.08 s [gammaloop-workspace-deps-deps:post-build] copying path '/nix/store/b1j3qxqhjsi05lmyhgyz1rv0j0d3x9ql-gammaloop-workspace-deps-deps-0.1.0' to 'https://cache.nix-ci.com'...
  612. 468.35 s [gammaloop-workspace-deps-deps:post-build] warning: 'warn-short-path-literals' is deprecated, use 'lint-short-path-literals = ignore' instead
  613. 468.60 s [gammaloop-workspace-deps-deps:post-build] copying 1 paths...
  614. 468.60 s [gammaloop-workspace-deps-deps:post-build] copying path '/nix/store/p0r0ap1bhpj5158hdri51aijsls4xc7m-gammaloop-workspace-deps-deps-0.1.0.drv' to 'https://cache.nix-ci.com'...
  615. 468.78 s Uploaded gammaloop-workspace-deps-deps in 26.8s
  616. 468.78 s Progress: 10 of 20 built, 3 of 3 downloaded from cache
  617. 468.78 s Built gammaloop-workspace-deps-deps in 1m16s
  618. 468.85 s Building /nix/store/dmfgmx080n7kjrqczz9r06nd8chp9dfm-gammaloop-crate-test-dependencies-2487cdc24b69b833-inputs.drv
  619. 472.76 s [gammaloop-crate-test-dependencies-2487cdc24b69b833-inputs:post-build] Uploading to the NixCI cache: /nix/store/129f65xy7fsx3z853sbpsfapimnyx8ky-gammaloop-crate-test-dependencies-2487cdc24b69b833-inputs
  620. 472.81 s [gammaloop-crate-test-dependencies-2487cdc24b69b833-inputs:post-build] warning: 'warn-short-path-literals' is deprecated, use 'lint-short-path-literals = ignore' instead
  621. 472.85 s [gammaloop-crate-test-dependencies-2487cdc24b69b833-inputs:post-build] copying 1 paths...
  622. 472.85 s [gammaloop-crate-test-dependencies-2487cdc24b69b833-inputs:post-build] copying path '/nix/store/129f65xy7fsx3z853sbpsfapimnyx8ky-gammaloop-crate-test-dependencies-2487cdc24b69b833-inputs' to 'https://cache.nix-ci.com'...
  623. 545.17 s [gammaloop-crate-test-dependencies-2487cdc24b69b833-inputs:post-build] warning: 'warn-short-path-literals' is deprecated, use 'lint-short-path-literals = ignore' instead
  624. 545.62 s [gammaloop-crate-test-dependencies-2487cdc24b69b833-inputs:post-build] copying 1 paths...
  625. 545.63 s [gammaloop-crate-test-dependencies-2487cdc24b69b833-inputs:post-build] copying path '/nix/store/dmfgmx080n7kjrqczz9r06nd8chp9dfm-gammaloop-crate-test-dependencies-2487cdc24b69b833-inputs.drv' to 'https://cache.nix-ci.com'...
  626. 546.05 s Uploaded gammaloop-crate-test-dependencies-2487cdc24b69b833-inputs in 1m13s
  627. 546.06 s Progress: 11 of 20 built, 3 of 3 downloaded from cache
  628. 546.06 s Built gammaloop-crate-test-dependencies-2487cdc24b69b833-inputs in 1m17s
  629. 546.07 s Waiting for lock on gammaloop-crate-test-dependencies-2487cdc24b69b833-deps
  630. 586.26 s Building /nix/store/ddmi75w3948nwmgx82v8v5gh0sx0jp4k-gammaloop-crate-test-dependencies-78814cb8a1862b52-inputs.drv
  631. 598.74 s [gammaloop-crate-test-dependencies-78814cb8a1862b52-inputs:post-build] Uploading to the NixCI cache: /nix/store/82p3gkd8p50xhdd7c5a5rys9kn90aqc3-gammaloop-crate-test-dependencies-78814cb8a1862b52-inputs
  632. 598.87 s [gammaloop-crate-test-dependencies-78814cb8a1862b52-inputs:post-build] warning: 'warn-short-path-literals' is deprecated, use 'lint-short-path-literals = ignore' instead
  633. 598.92 s [gammaloop-crate-test-dependencies-78814cb8a1862b52-inputs:post-build] copying 1 paths...
  634. 598.92 s [gammaloop-crate-test-dependencies-78814cb8a1862b52-inputs:post-build] copying path '/nix/store/82p3gkd8p50xhdd7c5a5rys9kn90aqc3-gammaloop-crate-test-dependencies-78814cb8a1862b52-inputs' to 'https://cache.nix-ci.com'...
  635. 647.14 s [gammaloop-crate-test-dependencies-78814cb8a1862b52-inputs:post-build] warning: 'warn-short-path-literals' is deprecated, use 'lint-short-path-literals = ignore' instead
  636. 647.44 s [gammaloop-crate-test-dependencies-78814cb8a1862b52-inputs:post-build] copying 1 paths...
  637. 647.45 s [gammaloop-crate-test-dependencies-78814cb8a1862b52-inputs:post-build] copying path '/nix/store/ddmi75w3948nwmgx82v8v5gh0sx0jp4k-gammaloop-crate-test-dependencies-78814cb8a1862b52-inputs.drv' to 'https://cache.nix-ci.com'...
  638. 647.63 s Uploaded gammaloop-crate-test-dependencies-78814cb8a1862b52-inputs in 48.9s
  639. 647.63 s Progress: 12 of 19 built, 3 of 3 downloaded from cache
  640. 647.63 s Built gammaloop-crate-test-dependencies-78814cb8a1862b52-inputs in 1m01s
  641. 647.72 s Building /nix/store/a4fmcz7qk5m6klyh8mb52b9b16lnlzry-gammaloop-crate-test-dependencies-78814cb8a1862b52-deps-0.1.0.drv
  642. 647.81 s [gammaloop-crate-test-dependencies-78814cb8a1862b52-deps] Phase: unpackPhase
  643. 647.82 s [gammaloop-crate-test-dependencies-78814cb8a1862b52-deps] unpacking source archive /nix/store/mhrrwfdal80cdg1m20kdi6z4k5w3a0dh-source
  644. 647.83 s [gammaloop-crate-test-dependencies-78814cb8a1862b52-deps] source root is source
  645. 647.85 s [gammaloop-crate-test-dependencies-78814cb8a1862b52-deps] Phase: patchPhase
  646. 647.99 s [gammaloop-crate-test-dependencies-78814cb8a1862b52-deps] Executing configureCargoCommonVars
  647. 648.00 s [gammaloop-crate-test-dependencies-78814cb8a1862b52-deps] copying cargo artifacts from /nix/store/82p3gkd8p50xhdd7c5a5rys9kn90aqc3-gammaloop-crate-test-dependencies-78814cb8a1862b52-inputs/target to target
  648. 648.00 s [gammaloop-crate-test-dependencies-78814cb8a1862b52-deps] will deep copy artifacts (instead of symlinking) as requested
  649. 648.89 s [gammaloop-crate-test-dependencies-78814cb8a1862b52-deps] Phase: updateAutotoolsGnuConfigScriptsPhase
  650. 648.93 s [gammaloop-crate-test-dependencies-78814cb8a1862b52-deps] Phase: configurePhase
  651. 648.93 s [gammaloop-crate-test-dependencies-78814cb8a1862b52-deps] will append /build/source/.cargo-home/config.toml with contents of /nix/store/1sigmg52bb61pfngmk9k8wq5fz9r7bf1-vendor-cargo-deps/config.toml
  652. 648.93 s [gammaloop-crate-test-dependencies-78814cb8a1862b52-deps] default configurePhase, nothing to do
  653. 648.94 s [gammaloop-crate-test-dependencies-78814cb8a1862b52-deps] Phase: buildPhase
  654. 648.94 s [gammaloop-crate-test-dependencies-78814cb8a1862b52-deps] +++ command cargo --version
  655. 648.95 s [gammaloop-crate-test-dependencies-78814cb8a1862b52-deps] cargo 1.97.0 (c980f4866 2026-06-30)
  656. 648.95 s [gammaloop-crate-test-dependencies-78814cb8a1862b52-deps] +++ command cargo build --profile ci-optim --offline -p gammaloop-ci-test-dependencies-78814cb8a1862b52 -p gammaloop-workspace-hack --features linnet/bincode,linnet/drawing,linnet/rkyv,linnet/serde,linnet/symbolica,symbolica/tracing_max_level_info --lib
  657. 649.48 s [gammaloop-crate-test-dependencies-78814cb8a1862b52-deps] Compiling linnet v0.17.0 (/build/source/crates/linnet)
  658. 656.59 s [gammaloop-crate-test-dependencies-78814cb8a1862b52-deps] Compiling linnest v0.1.0 (/build/source/crates/linnest)
  659. 667.22 s [gammaloop-crate-test-dependencies-78814cb8a1862b52-deps] Compiling gammaloop-ci-test-dependencies-78814cb8a1862b52 v0.1.0 (/build/source/crates/gammaloop-ci-test-dependencies-78814cb8a1862b52)
  660. 667.25 s [gammaloop-crate-test-dependencies-78814cb8a1862b52-deps] Finished `ci-optim` profile [optimized] target(s) in 18.30s
  661. 667.47 s [gammaloop-crate-test-dependencies-78814cb8a1862b52-deps] warning: the following packages contain code that will be rejected by a future version of Rust: proc-macro-error2 v2.0.1
  662. 667.47 s [gammaloop-crate-test-dependencies-78814cb8a1862b52-deps] note: to see what the problems were, use the option `--future-incompat-report`, or run `cargo report future-incompatibilities --id 1`
  663. 667.54 s [gammaloop-crate-test-dependencies-78814cb8a1862b52-deps] +++ command cargo build --profile ci-optim --offline -p gammaloop-ci-test-binary-dependencies-78814cb8a1862b52 -p linnest -p linnet --features linnet/bincode,linnet/drawing,linnet/rkyv,linnet/serde,linnet/symbolica,symbolica/tracing_max_level_info --lib
  664. 667.93 s [gammaloop-crate-test-dependencies-78814cb8a1862b52-deps] Compiling symbolica v2.2.0 (https://github.com/symbolica-dev/symbolica?branch=dev#0441bd7a)
  665. 667.94 s [gammaloop-crate-test-dependencies-78814cb8a1862b52-deps] Compiling iai-callgrind-runner v0.14.2
  666. 667.94 s [gammaloop-crate-test-dependencies-78814cb8a1862b52-deps] Compiling wait-timeout v0.2.1
  667. 667.95 s [gammaloop-crate-test-dependencies-78814cb8a1862b52-deps] Compiling iai-callgrind v0.14.2
  668. 667.95 s [gammaloop-crate-test-dependencies-78814cb8a1862b52-deps] Compiling bit-vec v0.8.0
  669. 667.95 s [gammaloop-crate-test-dependencies-78814cb8a1862b52-deps] Compiling quick-error v1.2.3
  670. 667.95 s [gammaloop-crate-test-dependencies-78814cb8a1862b52-deps] Compiling iai-callgrind-macros v0.5.1
  671. 667.95 s [gammaloop-crate-test-dependencies-78814cb8a1862b52-deps] Compiling bincode v1.3.3
  672. 667.95 s [gammaloop-crate-test-dependencies-78814cb8a1862b52-deps] Compiling rand_xorshift v0.4.0
  673. 667.96 s [gammaloop-crate-test-dependencies-78814cb8a1862b52-deps] Compiling console v0.15.11
  674. 667.96 s [gammaloop-crate-test-dependencies-78814cb8a1862b52-deps] Compiling unarray v0.1.4
  675. 668.07 s [gammaloop-crate-test-dependencies-78814cb8a1862b52-deps] Compiling rusty-fork v0.3.1
  676. 668.15 s [gammaloop-crate-test-dependencies-78814cb8a1862b52-deps] Compiling bit-set v0.8.0
  677. 668.28 s [gammaloop-crate-test-dependencies-78814cb8a1862b52-deps] Compiling proptest v1.11.0
  678. 668.34 s [gammaloop-crate-test-dependencies-78814cb8a1862b52-deps] Compiling similar-asserts v1.7.0
  679. 991.24 s [gammaloop-crate-test-dependencies-78814cb8a1862b52-deps] Compiling gammaloop-workspace-hack v0.1.0 (/build/source/crates/gammaloop-workspace-hack)
  680. 991.81 s [gammaloop-crate-test-dependencies-78814cb8a1862b52-deps] Compiling linnet v0.17.0 (/build/source/crates/linnet)
  681. 991.81 s [gammaloop-crate-test-dependencies-78814cb8a1862b52-deps] Compiling gammaloop-ci-test-binary-dependencies-78814cb8a1862b52 v0.1.0 (/build/source/crates/gammaloop-ci-test-binary-dependencies-78814cb8a1862b52)
  682. 1002.09 s [gammaloop-crate-test-dependencies-78814cb8a1862b52-deps] Compiling linnest v0.1.0 (/build/source/crates/linnest)
  683. 1011.91 s [gammaloop-crate-test-dependencies-78814cb8a1862b52-deps] Finished `ci-optim` profile [optimized] target(s) in 5m 44s
  684. 1012.10 s [gammaloop-crate-test-dependencies-78814cb8a1862b52-deps] warning: the following packages contain code that will be rejected by a future version of Rust: proc-macro-error2 v2.0.1
  685. 1012.10 s [gammaloop-crate-test-dependencies-78814cb8a1862b52-deps] note: to see what the problems were, use the option `--future-incompat-report`, or run `cargo report future-incompatibilities --id 1`
  686. 1012.15 s [gammaloop-crate-test-dependencies-78814cb8a1862b52-deps] buildPhase completed in 6 minutes 3 seconds
  687. 1012.16 s [gammaloop-crate-test-dependencies-78814cb8a1862b52-deps] Phase: installPhase
  688. 1012.17 s [gammaloop-crate-test-dependencies-78814cb8a1862b52-deps] linking previous artifacts /nix/store/82p3gkd8p50xhdd7c5a5rys9kn90aqc3-gammaloop-crate-test-dependencies-78814cb8a1862b52-inputs to /nix/store/2p40n3716clc0saapkmqmx8jx4c2326w-gammaloop-crate-test-dependencies-78814cb8a1862b52-deps-0.1.0/target.tar.zst
  689. 1012.50 s [gammaloop-crate-test-dependencies-78814cb8a1862b52-deps] /*stdin*\ : 27.09% ( 224 MiB => 60.8 MiB, /nix/store/2p40n3716clc0saapkmqmx8jx4c2326w-gammaloop-crate-test-dependencies-78814cb8a1862b52-deps-0.1.0/target.tar.zst)
  690. 1012.54 s [gammaloop-crate-test-dependencies-78814cb8a1862b52-deps] Phase: fixupPhase
  691. 1012.56 s [gammaloop-crate-test-dependencies-78814cb8a1862b52-deps] shrinking RPATHs of ELF executables and libraries in /nix/store/2p40n3716clc0saapkmqmx8jx4c2326w-gammaloop-crate-test-dependencies-78814cb8a1862b52-deps-0.1.0
  692. 1012.56 s [gammaloop-crate-test-dependencies-78814cb8a1862b52-deps] checking for references to /build/ in /nix/store/2p40n3716clc0saapkmqmx8jx4c2326w-gammaloop-crate-test-dependencies-78814cb8a1862b52-deps-0.1.0...
  693. 1012.58 s [gammaloop-crate-test-dependencies-78814cb8a1862b52-deps] patching script interpreter paths in /nix/store/2p40n3716clc0saapkmqmx8jx4c2326w-gammaloop-crate-test-dependencies-78814cb8a1862b52-deps-0.1.0
  694. 1013.15 s [gammaloop-crate-test-dependencies-78814cb8a1862b52-deps:post-build] Uploading to the NixCI cache: /nix/store/2p40n3716clc0saapkmqmx8jx4c2326w-gammaloop-crate-test-dependencies-78814cb8a1862b52-deps-0.1.0
  695. 1013.42 s [gammaloop-crate-test-dependencies-78814cb8a1862b52-deps:post-build] warning: 'warn-short-path-literals' is deprecated, use 'lint-short-path-literals = ignore' instead
  696. 1013.48 s [gammaloop-crate-test-dependencies-78814cb8a1862b52-deps:post-build] copying 1 paths...
  697. 1013.48 s [gammaloop-crate-test-dependencies-78814cb8a1862b52-deps:post-build] copying path '/nix/store/2p40n3716clc0saapkmqmx8jx4c2326w-gammaloop-crate-test-dependencies-78814cb8a1862b52-deps-0.1.0' to 'https://cache.nix-ci.com'...
  698. 1035.62 s [gammaloop-crate-test-dependencies-78814cb8a1862b52-deps:post-build] warning: 'warn-short-path-literals' is deprecated, use 'lint-short-path-literals = ignore' instead
  699. 1036.05 s [gammaloop-crate-test-dependencies-78814cb8a1862b52-deps:post-build] copying 2 paths...
  700. 1036.06 s [gammaloop-crate-test-dependencies-78814cb8a1862b52-deps:post-build] copying path '/nix/store/mhrrwfdal80cdg1m20kdi6z4k5w3a0dh-source' to 'https://cache.nix-ci.com'...
  701. 1036.92 s [gammaloop-crate-test-dependencies-78814cb8a1862b52-deps:post-build] copying path '/nix/store/a4fmcz7qk5m6klyh8mb52b9b16lnlzry-gammaloop-crate-test-dependencies-78814cb8a1862b52-deps-0.1.0.drv' to 'https://cache.nix-ci.com'...
  702. 1037.35 s Uploaded gammaloop-crate-test-dependencies-78814cb8a1862b52-deps in 24.2s
  703. 1037.36 s Progress: 13 of 19 built, 3 of 3 downloaded from cache
  704. 1037.36 s Built gammaloop-crate-test-dependencies-78814cb8a1862b52-deps in 6m29s
  705. 1037.47 s Building /nix/store/h5pxbw6p101nvpfz47d71mgr9cyf81gg-gammaloop-crate-test-dependencies-50150770f831b638-inputs.drv
  706. 1046.90 s [gammaloop-crate-test-dependencies-50150770f831b638-inputs:post-build] Uploading to the NixCI cache: /nix/store/5gj697jm6yvaw1hf5bgq663azg3kafrr-gammaloop-crate-test-dependencies-50150770f831b638-inputs
  707. 1046.95 s [gammaloop-crate-test-dependencies-50150770f831b638-inputs:post-build] warning: 'warn-short-path-literals' is deprecated, use 'lint-short-path-literals = ignore' instead
  708. 1046.98 s [gammaloop-crate-test-dependencies-50150770f831b638-inputs:post-build] copying 1 paths...
  709. 1046.98 s [gammaloop-crate-test-dependencies-50150770f831b638-inputs:post-build] copying path '/nix/store/5gj697jm6yvaw1hf5bgq663azg3kafrr-gammaloop-crate-test-dependencies-50150770f831b638-inputs' to 'https://cache.nix-ci.com'...
  710. 1185.83 s [gammaloop-crate-test-dependencies-50150770f831b638-inputs:post-build] warning: 'warn-short-path-literals' is deprecated, use 'lint-short-path-literals = ignore' instead
  711. 1186.21 s [gammaloop-crate-test-dependencies-50150770f831b638-inputs:post-build] copying 1 paths...
  712. 1186.21 s [gammaloop-crate-test-dependencies-50150770f831b638-inputs:post-build] copying path '/nix/store/h5pxbw6p101nvpfz47d71mgr9cyf81gg-gammaloop-crate-test-dependencies-50150770f831b638-inputs.drv' to 'https://cache.nix-ci.com'...
  713. 1186.67 s Uploaded gammaloop-crate-test-dependencies-50150770f831b638-inputs in 2m19s
  714. 1186.68 s Progress: 14 of 19 built, 3 of 3 downloaded from cache
  715. 1186.68 s Built gammaloop-crate-test-dependencies-50150770f831b638-inputs in 2m29s
  716. 1186.82 s Building /nix/store/n39rs4931vfi6mhs8g2bi57kymndcmnr-gammaloop-crate-test-dependencies-50150770f831b638-deps-0.1.0.drv
  717. 1187.01 s [gammaloop-crate-test-dependencies-50150770f831b638-deps] Phase: unpackPhase
  718. 1187.03 s [gammaloop-crate-test-dependencies-50150770f831b638-deps] unpacking source archive /nix/store/cra0nlvfvsi0f5flhy40zq1fjvqjsqqk-source
  719. 1187.08 s [gammaloop-crate-test-dependencies-50150770f831b638-deps] source root is source
  720. 1187.15 s [gammaloop-crate-test-dependencies-50150770f831b638-deps] Phase: patchPhase
  721. 1187.64 s [gammaloop-crate-test-dependencies-50150770f831b638-deps] Executing configureCargoCommonVars
  722. 1187.66 s [gammaloop-crate-test-dependencies-50150770f831b638-deps] copying cargo artifacts from /nix/store/5gj697jm6yvaw1hf5bgq663azg3kafrr-gammaloop-crate-test-dependencies-50150770f831b638-inputs/target to target
  723. 1187.66 s [gammaloop-crate-test-dependencies-50150770f831b638-deps] will deep copy artifacts (instead of symlinking) as requested
  724. 1190.61 s [gammaloop-crate-test-dependencies-50150770f831b638-deps] Phase: updateAutotoolsGnuConfigScriptsPhase
  725. 1190.68 s [gammaloop-crate-test-dependencies-50150770f831b638-deps] Phase: configurePhase
  726. 1190.69 s [gammaloop-crate-test-dependencies-50150770f831b638-deps] will append /build/source/.cargo-home/config.toml with contents of /nix/store/1sigmg52bb61pfngmk9k8wq5fz9r7bf1-vendor-cargo-deps/config.toml
  727. 1190.70 s [gammaloop-crate-test-dependencies-50150770f831b638-deps] default configurePhase, nothing to do
  728. 1190.70 s [gammaloop-crate-test-dependencies-50150770f831b638-deps] Phase: buildPhase
  729. 1190.71 s [gammaloop-crate-test-dependencies-50150770f831b638-deps] +++ command cargo --version
  730. 1190.72 s [gammaloop-crate-test-dependencies-50150770f831b638-deps] cargo 1.97.0 (c980f4866 2026-06-30)
  731. 1190.72 s [gammaloop-crate-test-dependencies-50150770f831b638-deps] +++ command cargo build --profile ci-optim --offline -p gammaloop-ci-test-dependencies-50150770f831b638 -p gammaloop-workspace-hack --features linnet/bincode,linnet/drawing,linnet/serde,linnet/symbolica,symbolica/tracing_max_level_info,three-dimensional-reps/serde --lib
  732. 1191.30 s [gammaloop-crate-test-dependencies-50150770f831b638-deps] Compiling three-dimensional-reps v0.1.0 (/build/source/crates/three-dimensional-reps)
  733. 1191.33 s [gammaloop-crate-test-dependencies-50150770f831b638-deps] Compiling linnet v0.17.0 (/build/source/crates/linnet)
  734. 1204.46 s [gammaloop-crate-test-dependencies-50150770f831b638-deps] Compiling gammaloop-ci-test-dependencies-50150770f831b638 v0.1.0 (/build/source/crates/gammaloop-ci-test-dependencies-50150770f831b638)
  735. 1216.41 s [gammaloop-crate-test-dependencies-50150770f831b638-deps] Finished `ci-optim` profile [optimized] target(s) in 25.68s
  736. 1216.63 s [gammaloop-crate-test-dependencies-50150770f831b638-deps] warning: the following packages contain code that will be rejected by a future version of Rust: proc-macro-error2 v2.0.1
  737. 1216.63 s [gammaloop-crate-test-dependencies-50150770f831b638-deps] note: to see what the problems were, use the option `--future-incompat-report`, or run `cargo report future-incompatibilities --id 1`
  738. 1216.73 s [gammaloop-crate-test-dependencies-50150770f831b638-deps] +++ command cargo build --profile ci-optim --offline -p gammaloop-ci-test-binary-dependencies-50150770f831b638 -p three-dimensional-reps --features linnet/bincode,linnet/drawing,linnet/serde,linnet/symbolica,symbolica/tracing_max_level_info,three-dimensional-reps/serde --lib
  739. 1217.12 s [gammaloop-crate-test-dependencies-50150770f831b638-deps] Compiling linnet v0.17.0 (/build/source/crates/linnet)
  740. 1224.09 s [gammaloop-crate-test-dependencies-50150770f831b638-deps] Compiling gammaloop-ci-test-binary-dependencies-50150770f831b638 v0.1.0 (/build/source/crates/gammaloop-ci-test-binary-dependencies-50150770f831b638)
  741. 1224.10 s [gammaloop-crate-test-dependencies-50150770f831b638-deps] Compiling three-dimensional-reps v0.1.0 (/build/source/crates/three-dimensional-reps)
  742. 1240.23 s [gammaloop-crate-test-dependencies-50150770f831b638-deps] Finished `ci-optim` profile [optimized] target(s) in 23.49s
  743. 1240.44 s [gammaloop-crate-test-dependencies-50150770f831b638-deps] warning: the following packages contain code that will be rejected by a future version of Rust: proc-macro-error2 v2.0.1
  744. 1240.44 s [gammaloop-crate-test-dependencies-50150770f831b638-deps] note: to see what the problems were, use the option `--future-incompat-report`, or run `cargo report future-incompatibilities --id 1`
  745. 1240.55 s [gammaloop-crate-test-dependencies-50150770f831b638-deps] buildPhase completed in 50 seconds
  746. 1240.55 s [gammaloop-crate-test-dependencies-50150770f831b638-deps] Phase: installPhase
  747. 1240.58 s [gammaloop-crate-test-dependencies-50150770f831b638-deps] linking previous artifacts /nix/store/5gj697jm6yvaw1hf5bgq663azg3kafrr-gammaloop-crate-test-dependencies-50150770f831b638-inputs to /nix/store/yyhk2yhmsmmlrirr67chmyrdsql5ma9p-gammaloop-crate-test-dependencies-50150770f831b638-deps-0.1.0/target.tar.zst
  748. 1240.85 s [gammaloop-crate-test-dependencies-50150770f831b638-deps] /*stdin*\ : 30.93% ( 66.1 MiB => 20.5 MiB, /nix/store/yyhk2yhmsmmlrirr67chmyrdsql5ma9p-gammaloop-crate-test-dependencies-50150770f831b638-deps-0.1.0/target.tar.zst)
  749. 1240.88 s [gammaloop-crate-test-dependencies-50150770f831b638-deps] Phase: fixupPhase
  750. 1240.94 s [gammaloop-crate-test-dependencies-50150770f831b638-deps] shrinking RPATHs of ELF executables and libraries in /nix/store/yyhk2yhmsmmlrirr67chmyrdsql5ma9p-gammaloop-crate-test-dependencies-50150770f831b638-deps-0.1.0
  751. 1240.95 s [gammaloop-crate-test-dependencies-50150770f831b638-deps] checking for references to /build/ in /nix/store/yyhk2yhmsmmlrirr67chmyrdsql5ma9p-gammaloop-crate-test-dependencies-50150770f831b638-deps-0.1.0...
  752. 1240.98 s [gammaloop-crate-test-dependencies-50150770f831b638-deps] patching script interpreter paths in /nix/store/yyhk2yhmsmmlrirr67chmyrdsql5ma9p-gammaloop-crate-test-dependencies-50150770f831b638-deps-0.1.0
  753. 1241.54 s [gammaloop-crate-test-dependencies-50150770f831b638-deps:post-build] Uploading to the NixCI cache: /nix/store/yyhk2yhmsmmlrirr67chmyrdsql5ma9p-gammaloop-crate-test-dependencies-50150770f831b638-deps-0.1.0
  754. 1242.26 s [gammaloop-crate-test-dependencies-50150770f831b638-deps:post-build] warning: 'warn-short-path-literals' is deprecated, use 'lint-short-path-literals = ignore' instead
  755. 1242.35 s [gammaloop-crate-test-dependencies-50150770f831b638-deps:post-build] copying 1 paths...
  756. 1242.35 s [gammaloop-crate-test-dependencies-50150770f831b638-deps:post-build] copying path '/nix/store/yyhk2yhmsmmlrirr67chmyrdsql5ma9p-gammaloop-crate-test-dependencies-50150770f831b638-deps-0.1.0' to 'https://cache.nix-ci.com'...
  757. 1257.47 s [gammaloop-crate-test-dependencies-50150770f831b638-deps:post-build] warning: 'warn-short-path-literals' is deprecated, use 'lint-short-path-literals = ignore' instead
  758. 1258.02 s [gammaloop-crate-test-dependencies-50150770f831b638-deps:post-build] copying 2 paths...
  759. 1258.02 s [gammaloop-crate-test-dependencies-50150770f831b638-deps:post-build] copying path '/nix/store/cra0nlvfvsi0f5flhy40zq1fjvqjsqqk-source' to 'https://cache.nix-ci.com'...
  760. 1258.99 s [gammaloop-crate-test-dependencies-50150770f831b638-deps:post-build] copying path '/nix/store/n39rs4931vfi6mhs8g2bi57kymndcmnr-gammaloop-crate-test-dependencies-50150770f831b638-deps-0.1.0.drv' to 'https://cache.nix-ci.com'...
  761. 1259.51 s Uploaded gammaloop-crate-test-dependencies-50150770f831b638-deps in 18.1s
  762. 1259.51 s Progress: 15 of 19 built, 3 of 3 downloaded from cache
  763. 1259.51 s Built gammaloop-crate-test-dependencies-50150770f831b638-deps in 1m12s
  764. 1259.70 s Building /nix/store/d91n8zakpbd8vm1p2n97bswpx39i2na1-gammaloop-crate-test-binaries-three-dimensional-reps-50150770f831b638-inputs.drv
  765. 1268.40 s [gammaloop-crate-test-binaries-three-dimensional-reps-50150770f831b638-inputs:post-build] Uploading to the NixCI cache: /nix/store/2ws3v62qqf2mmz5fp17kchi9n0k8vkxl-gammaloop-crate-test-binaries-three-dimensional-reps-50150770f831b638-inputs
  766. 1269.11 s [gammaloop-crate-test-binaries-three-dimensional-reps-50150770f831b638-inputs:post-build] warning: 'warn-short-path-literals' is deprecated, use 'lint-short-path-literals = ignore' instead
  767. 1269.25 s [gammaloop-crate-test-binaries-three-dimensional-reps-50150770f831b638-inputs:post-build] copying 1 paths...
  768. 1269.25 s [gammaloop-crate-test-binaries-three-dimensional-reps-50150770f831b638-inputs:post-build] copying path '/nix/store/2ws3v62qqf2mmz5fp17kchi9n0k8vkxl-gammaloop-crate-test-binaries-three-dimensional-reps-50150770f831b638-inputs' to 'https://cache.nix-ci.com'...
  769. 1356.08 s [gammaloop-crate-test-binaries-three-dimensional-reps-50150770f831b638-inputs:post-build] warning: 'warn-short-path-literals' is deprecated, use 'lint-short-path-literals = ignore' instead
  770. 1356.55 s [gammaloop-crate-test-binaries-three-dimensional-reps-50150770f831b638-inputs:post-build] copying 1 paths...
  771. 1356.56 s [gammaloop-crate-test-binaries-three-dimensional-reps-50150770f831b638-inputs:post-build] copying path '/nix/store/d91n8zakpbd8vm1p2n97bswpx39i2na1-gammaloop-crate-test-binaries-three-dimensional-reps-50150770f831b638-inputs.drv' to 'https://cache.nix-ci.com'...
  772. 1358.20 s Uploaded gammaloop-crate-test-binaries-three-dimensional-reps-50150770f831b638-inputs in 1m29s
  773. 1358.21 s Progress: 16 of 19 built, 3 of 3 downloaded from cache
  774. 1358.21 s Built gammaloop-crate-test-binaries-three-dimensional-reps-50150770f831b638-inputs in 1m38s
  775. 1358.34 s Building /nix/store/cv02k8axyaajy2wk22703viwwjkp6c9w-gammaloop-crate-test-binaries-three-dimensional-reps-50150770f831b638-deps-0.1.0.drv
  776. 1358.55 s [gammaloop-crate-test-binaries-three-dimensional-reps-50150770f831b638-deps] Phase: unpackPhase
  777. 1358.57 s [gammaloop-crate-test-binaries-three-dimensional-reps-50150770f831b638-deps] unpacking source archive /nix/store/cra0nlvfvsi0f5flhy40zq1fjvqjsqqk-source
  778. 1358.60 s [gammaloop-crate-test-binaries-three-dimensional-reps-50150770f831b638-deps] source root is source
  779. 1358.64 s [gammaloop-crate-test-binaries-three-dimensional-reps-50150770f831b638-deps] Phase: patchPhase
  780. 1359.06 s [gammaloop-crate-test-binaries-three-dimensional-reps-50150770f831b638-deps] Executing configureCargoCommonVars
  781. 1359.06 s [gammaloop-crate-test-binaries-three-dimensional-reps-50150770f831b638-deps] copying cargo artifacts from /nix/store/2ws3v62qqf2mmz5fp17kchi9n0k8vkxl-gammaloop-crate-test-binaries-three-dimensional-reps-50150770f831b638-inputs/target to target
  782. 1359.06 s [gammaloop-crate-test-binaries-three-dimensional-reps-50150770f831b638-deps] will deep copy artifacts (instead of symlinking) as requested
  783. 1361.22 s [gammaloop-crate-test-binaries-three-dimensional-reps-50150770f831b638-deps] Phase: updateAutotoolsGnuConfigScriptsPhase
  784. 1361.32 s [gammaloop-crate-test-binaries-three-dimensional-reps-50150770f831b638-deps] Phase: configurePhase
  785. 1361.36 s [gammaloop-crate-test-binaries-three-dimensional-reps-50150770f831b638-deps] will append /build/source/.cargo-home/config.toml with contents of /nix/store/1sigmg52bb61pfngmk9k8wq5fz9r7bf1-vendor-cargo-deps/config.toml
  786. 1361.37 s [gammaloop-crate-test-binaries-three-dimensional-reps-50150770f831b638-deps] default configurePhase, nothing to do
  787. 1361.38 s [gammaloop-crate-test-binaries-three-dimensional-reps-50150770f831b638-deps] Phase: buildPhase
  788. 1361.40 s [gammaloop-crate-test-binaries-three-dimensional-reps-50150770f831b638-deps] +++ command cargo --version
  789. 1361.41 s [gammaloop-crate-test-binaries-three-dimensional-reps-50150770f831b638-deps] cargo 1.97.0 (c980f4866 2026-06-30)
  790. 1361.42 s [gammaloop-crate-test-binaries-three-dimensional-reps-50150770f831b638-deps] +++ command cargo test --profile ci-optim --no-run --offline -p three-dimensional-reps --features three-dimensional-reps/serde
  791. 1362.09 s [gammaloop-crate-test-binaries-three-dimensional-reps-50150770f831b638-deps] Compiling three-dimensional-reps v0.1.0 (/build/source/crates/three-dimensional-reps)
  792. 1362.34 s [gammaloop-crate-test-binaries-three-dimensional-reps-50150770f831b638-deps] error[E0433]: cannot find `eval` in `crate`
  793. 1362.34 s [gammaloop-crate-test-binaries-three-dimensional-reps-50150770f831b638-deps] --> crates/three-dimensional-reps/src/generation.rs:6540:28
  794. 1362.34 s [gammaloop-crate-test-binaries-three-dimensional-reps-50150770f831b638-deps] |
  795. 1362.34 s [gammaloop-crate-test-binaries-three-dimensional-reps-50150770f831b638-deps] 6540 | let input = crate::eval::EvaluationInput {
  796. 1362.34 s [gammaloop-crate-test-binaries-three-dimensional-reps-50150770f831b638-deps] | ^^^^ could not find `eval` in the crate root
  797. 1362.34 s [gammaloop-crate-test-binaries-three-dimensional-reps-50150770f831b638-deps] |
  798. 1362.34 s [gammaloop-crate-test-binaries-three-dimensional-reps-50150770f831b638-deps] note: found an item that was configured out
  799. 1362.34 s [gammaloop-crate-test-binaries-three-dimensional-reps-50150770f831b638-deps] --> crates/three-dimensional-reps/src/lib.rs:7:9
  800. 1362.34 s [gammaloop-crate-test-binaries-three-dimensional-reps-50150770f831b638-deps] |
  801. 1362.34 s [gammaloop-crate-test-binaries-three-dimensional-reps-50150770f831b638-deps] 6 | #[cfg(feature = "eval")]
  802. 1362.34 s [gammaloop-crate-test-binaries-three-dimensional-reps-50150770f831b638-deps] | ---------------- the item is gated behind the `eval` feature
  803. 1362.34 s [gammaloop-crate-test-binaries-three-dimensional-reps-50150770f831b638-deps] 7 | pub mod eval;
  804. 1362.34 s [gammaloop-crate-test-binaries-three-dimensional-reps-50150770f831b638-deps] | ^^^^
  805. 1362.34 s [gammaloop-crate-test-binaries-three-dimensional-reps-50150770f831b638-deps]
  806. 1362.35 s [gammaloop-crate-test-binaries-three-dimensional-reps-50150770f831b638-deps] error[E0433]: cannot find `eval` in `crate`
  807. 1362.35 s [gammaloop-crate-test-binaries-three-dimensional-reps-50150770f831b638-deps] --> crates/three-dimensional-reps/src/generation.rs:6547:30
  808. 1362.35 s [gammaloop-crate-test-binaries-three-dimensional-reps-50150770f831b638-deps] |
  809. 1362.35 s [gammaloop-crate-test-binaries-three-dimensional-reps-50150770f831b638-deps] 6547 | let contact = crate::eval::evaluate_expression(
  810. 1362.35 s [gammaloop-crate-test-binaries-three-dimensional-reps-50150770f831b638-deps] | ^^^^ could not find `eval` in the crate root
  811. 1362.35 s [gammaloop-crate-test-binaries-three-dimensional-reps-50150770f831b638-deps] |
  812. 1362.35 s [gammaloop-crate-test-binaries-three-dimensional-reps-50150770f831b638-deps] note: found an item that was configured out
  813. 1362.35 s [gammaloop-crate-test-binaries-three-dimensional-reps-50150770f831b638-deps] --> crates/three-dimensional-reps/src/lib.rs:7:9
  814. 1362.35 s [gammaloop-crate-test-binaries-three-dimensional-reps-50150770f831b638-deps] |
  815. 1362.35 s [gammaloop-crate-test-binaries-three-dimensional-reps-50150770f831b638-deps] 6 | #[cfg(feature = "eval")]
  816. 1362.35 s [gammaloop-crate-test-binaries-three-dimensional-reps-50150770f831b638-deps] | ---------------- the item is gated behind the `eval` feature
  817. 1362.35 s [gammaloop-crate-test-binaries-three-dimensional-reps-50150770f831b638-deps] 7 | pub mod eval;
  818. 1362.35 s [gammaloop-crate-test-binaries-three-dimensional-reps-50150770f831b638-deps] | ^^^^
  819. 1362.35 s [gammaloop-crate-test-binaries-three-dimensional-reps-50150770f831b638-deps]
  820. 1362.35 s [gammaloop-crate-test-binaries-three-dimensional-reps-50150770f831b638-deps] error[E0433]: cannot find `eval` in `crate`
  821. 1362.35 s [gammaloop-crate-test-binaries-three-dimensional-reps-50150770f831b638-deps] --> crates/three-dimensional-reps/src/generation.rs:6555:32
  822. 1362.35 s [gammaloop-crate-test-binaries-three-dimensional-reps-50150770f831b638-deps] |
  823. 1362.35 s [gammaloop-crate-test-binaries-three-dimensional-reps-50150770f831b638-deps] 6555 | let remainder = crate::eval::evaluate_expression(
  824. 1362.35 s [gammaloop-crate-test-binaries-three-dimensional-reps-50150770f831b638-deps] | ^^^^ could not find `eval` in the crate root
  825. 1362.35 s [gammaloop-crate-test-binaries-three-dimensional-reps-50150770f831b638-deps] |
  826. 1362.35 s [gammaloop-crate-test-binaries-three-dimensional-reps-50150770f831b638-deps] note: found an item that was configured out
  827. 1362.35 s [gammaloop-crate-test-binaries-three-dimensional-reps-50150770f831b638-deps] --> crates/three-dimensional-reps/src/lib.rs:7:9
  828. 1362.35 s [gammaloop-crate-test-binaries-three-dimensional-reps-50150770f831b638-deps] |
  829. 1362.35 s [gammaloop-crate-test-binaries-three-dimensional-reps-50150770f831b638-deps] 6 | #[cfg(feature = "eval")]
  830. 1362.35 s [gammaloop-crate-test-binaries-three-dimensional-reps-50150770f831b638-deps] | ---------------- the item is gated behind the `eval` feature
  831. 1362.35 s [gammaloop-crate-test-binaries-three-dimensional-reps-50150770f831b638-deps] 7 | pub mod eval;
  832. 1362.35 s [gammaloop-crate-test-binaries-three-dimensional-reps-50150770f831b638-deps] | ^^^^
  833. 1362.35 s [gammaloop-crate-test-binaries-three-dimensional-reps-50150770f831b638-deps]
  834. 1362.36 s [gammaloop-crate-test-binaries-three-dimensional-reps-50150770f831b638-deps] error[E0433]: cannot find `eval` in `crate`
  835. 1362.36 s [gammaloop-crate-test-binaries-three-dimensional-reps-50150770f831b638-deps] --> crates/three-dimensional-reps/src/generation.rs:6563:28
  836. 1362.36 s [gammaloop-crate-test-binaries-three-dimensional-reps-50150770f831b638-deps] |
  837. 1362.36 s [gammaloop-crate-test-binaries-three-dimensional-reps-50150770f831b638-deps] 6563 | let total = crate::eval::evaluate_expression(&powered, &expression, numerator, &input)
  838. 1362.36 s [gammaloop-crate-test-binaries-three-dimensional-reps-50150770f831b638-deps] | ^^^^ could not find `eval` in the crate root
  839. 1362.36 s [gammaloop-crate-test-binaries-three-dimensional-reps-50150770f831b638-deps] |
  840. 1362.36 s [gammaloop-crate-test-binaries-three-dimensional-reps-50150770f831b638-deps] note: found an item that was configured out
  841. 1362.36 s [gammaloop-crate-test-binaries-three-dimensional-reps-50150770f831b638-deps] --> crates/three-dimensional-reps/src/lib.rs:7:9
  842. 1362.36 s [gammaloop-crate-test-binaries-three-dimensional-reps-50150770f831b638-deps] |
  843. 1362.36 s [gammaloop-crate-test-binaries-three-dimensional-reps-50150770f831b638-deps] 6 | #[cfg(feature = "eval")]
  844. 1362.36 s [gammaloop-crate-test-binaries-three-dimensional-reps-50150770f831b638-deps] | ---------------- the item is gated behind the `eval` feature
  845. 1362.36 s [gammaloop-crate-test-binaries-three-dimensional-reps-50150770f831b638-deps] 7 | pub mod eval;
  846. 1362.36 s [gammaloop-crate-test-binaries-three-dimensional-reps-50150770f831b638-deps] | ^^^^
  847. 1362.36 s [gammaloop-crate-test-binaries-three-dimensional-reps-50150770f831b638-deps]
  848. 1364.12 s [gammaloop-crate-test-binaries-three-dimensional-reps-50150770f831b638-deps] For more information about this error, try `rustc --explain E0433`.
  849. 1364.14 s [gammaloop-crate-test-binaries-three-dimensional-reps-50150770f831b638-deps] error: could not compile `three-dimensional-reps` (lib test) due to 4 previous errors
  850. 1364.52 s Progress: 16 of 18 built (1 failed), 3 of 3 downloaded from cache
  851. 1364.52 s Failed to build gammaloop-crate-test-binaries-three-dimensional-reps-50150770f831b638-deps after 6.1s
  852. 1364.52 s error: Cannot build '/nix/store/cv02k8axyaajy2wk22703viwwjkp6c9w-gammaloop-crate-test-binaries-three-dimensional-reps-50150770f831b638-deps-0.1.0.drv'.
  853. 1364.52 s Reason: builder failed with exit code 101.
  854. 1364.52 s Output paths:
  855. 1364.52 s /nix/store/9c503a8m7ppz249bcgxs70380i2rli5i-gammaloop-crate-test-binaries-three-dimensional-reps-50150770f831b638-deps-0.1.0
  856. 1364.52 s Last 74 log lines:
  857. 1364.52 s > Running phase: unpackPhase
  858. 1364.52 s > unpacking source archive /nix/store/cra0nlvfvsi0f5flhy40zq1fjvqjsqqk-source
  859. 1364.52 s > source root is source
  860. 1364.52 s > Running phase: patchPhase
  861. 1364.52 s > Executing configureCargoCommonVars
  862. 1364.52 s > copying cargo artifacts from /nix/store/2ws3v62qqf2mmz5fp17kchi9n0k8vkxl-gammaloop-crate-test-binaries-three-dimensional-reps-50150770f831b638-inputs/target to target
  863. 1364.52 s > will deep copy artifacts (instead of symlinking) as requested
  864. 1364.52 s > Running phase: updateAutotoolsGnuConfigScriptsPhase
  865. 1364.52 s > Running phase: configurePhase
  866. 1364.52 s > will append /build/source/.cargo-home/config.toml with contents of /nix/store/1sigmg52bb61pfngmk9k8wq5fz9r7bf1-vendor-cargo-deps/config.toml
  867. 1364.52 s > default configurePhase, nothing to do
  868. 1364.52 s > Running phase: buildPhase
  869. 1364.52 s > +++ command cargo --version
  870. 1364.52 s > cargo 1.97.0 (c980f4866 2026-06-30)
  871. 1364.52 s > +++ command cargo test --profile ci-optim --no-run --offline -p three-dimensional-reps --features three-dimensional-reps/serde
  872. 1364.52 s > Compiling three-dimensional-reps v0.1.0 (/build/source/crates/three-dimensional-reps)
  873. 1364.52 s > error[E0433]: cannot find `eval` in `crate`
  874. 1364.52 s > --> crates/three-dimensional-reps/src/generation.rs:6540:28
  875. 1364.52 s > |
  876. 1364.52 s > 6540 | let input = crate::eval::EvaluationInput {
  877. 1364.52 s > | ^^^^ could not find `eval` in the crate root
  878. 1364.52 s > |
  879. 1364.52 s > note: found an item that was configured out
  880. 1364.52 s > --> crates/three-dimensional-reps/src/lib.rs:7:9
  881. 1364.52 s > |
  882. 1364.52 s > 6 | #[cfg(feature = "eval")]
  883. 1364.52 s > | ---------------- the item is gated behind the `eval` feature
  884. 1364.52 s > 7 | pub mod eval;
  885. 1364.52 s > | ^^^^
  886. 1364.52 s >
  887. 1364.52 s > error[E0433]: cannot find `eval` in `crate`
  888. 1364.52 s > --> crates/three-dimensional-reps/src/generation.rs:6547:30
  889. 1364.52 s > |
  890. 1364.52 s > 6547 | let contact = crate::eval::evaluate_expression(
  891. 1364.52 s > | ^^^^ could not find `eval` in the crate root
  892. 1364.52 s > |
  893. 1364.52 s > note: found an item that was configured out
  894. 1364.52 s > --> crates/three-dimensional-reps/src/lib.rs:7:9
  895. 1364.52 s > |
  896. 1364.52 s > 6 | #[cfg(feature = "eval")]
  897. 1364.52 s > | ---------------- the item is gated behind the `eval` feature
  898. 1364.52 s > 7 | pub mod eval;
  899. 1364.52 s > | ^^^^
  900. 1364.52 s >
  901. 1364.52 s > error[E0433]: cannot find `eval` in `crate`
  902. 1364.52 s > --> crates/three-dimensional-reps/src/generation.rs:6555:32
  903. 1364.52 s > |
  904. 1364.52 s > 6555 | let remainder = crate::eval::evaluate_expression(
  905. 1364.52 s > | ^^^^ could not find `eval` in the crate root
  906. 1364.52 s > |
  907. 1364.52 s > note: found an item that was configured out
  908. 1364.52 s > --> crates/three-dimensional-reps/src/lib.rs:7:9
  909. 1364.52 s > |
  910. 1364.52 s > 6 | #[cfg(feature = "eval")]
  911. 1364.52 s > | ---------------- the item is gated behind the `eval` feature
  912. 1364.52 s > 7 | pub mod eval;
  913. 1364.52 s > | ^^^^
  914. 1364.52 s >
  915. 1364.52 s > error[E0433]: cannot find `eval` in `crate`
  916. 1364.52 s > --> crates/three-dimensional-reps/src/generation.rs:6563:28
  917. 1364.52 s > |
  918. 1364.52 s > 6563 | let total = crate::eval::evaluate_expression(&powered, &expression, numerator, &input)
  919. 1364.52 s > | ^^^^ could not find `eval` in the crate root
  920. 1364.52 s > |
  921. 1364.52 s > note: found an item that was configured out
  922. 1364.52 s > --> crates/three-dimensional-reps/src/lib.rs:7:9
  923. 1364.52 s > |
  924. 1364.52 s > 6 | #[cfg(feature = "eval")]
  925. 1364.52 s > | ---------------- the item is gated behind the `eval` feature
  926. 1364.52 s > 7 | pub mod eval;
  927. 1364.52 s > | ^^^^
  928. 1364.52 s >
  929. 1364.52 s > For more information about this error, try `rustc --explain E0433`.
  930. 1364.52 s > error: could not compile `three-dimensional-reps` (lib test) due to 4 previous errors
  931. 1364.52 s For full logs, run:
  932. 1364.52 s nix log /nix/store/cv02k8axyaajy2wk22703viwwjkp6c9w-gammaloop-crate-test-binaries-three-dimensional-reps-50150770f831b638-deps-0.1.0.drv
  933. 1364.52 s error: Cannot build '/nix/store/8js6b2rp4pcpqybvs65jzsk3xgwzqr07-nix-ci-artifact-barrier-crate-test-binaries-three-dimensional-reps.drv'.
  934. 1364.52 s Reason: 1 dependency failed.
  935. 1364.52 s Output paths:
  936. 1364.52 s /nix/store/5n80xdb7j96d8ncq4r0ylsj9l2ygp6xy-nix-ci-artifact-barrier-crate-test-binaries-three-dimensional-reps
  937. 1364.52 s Build failed due to failed dependency
  938. 1364.59 s Build failed.