build packages.x86_64-linux.crate-test-binaries-three-dimensional-reps
0.00 s
$ /nix/store/9ypz3flqsrl5xl495mm8h645gadjsxi1-coreutils-9.11/bin/timeout --kill-after=15s 7200s /nix/store/23zk8sgzamrbmj1fday15szf7f2279s8-nix-2.34.7/bin/nix --extra-experimental-features nix-command --extra-experimental-features flakes --log-format internal-json build --no-link --print-out-paths git+https://github.com/alphal00p/gammaloop?ref=raised_energy_cff_wip&rev=e30d799ef8733d35777ff9aa076aeb12e74ee256&shallow=1#packages.x86_64-linux.crate-test-binaries-three-dimensional-reps --print-build-logs
0.12 s
error (ignored): SQLite database '/var/cache/nix-ci-worker/eval-cache-v6/1af7ce54381e008e1ba25632c4b8b432a9dc7753e12ebe47f32e96c35358ea75.sqlite ' is busy
2.41 s
3.91 s
Building /nix/store/ywxzn52yxgg4zzwxzxlhm4cl8g4bll9a-gammaloop-crate-test-dependencies-50150770f831b638-deps-0.1.0.drv
3.98 s
[gammaloop-crate-test-dependencies-50150770f831b638-deps] Phase: unpackPhase
3.98 s
[gammaloop-crate-test-dependencies-50150770f831b638-deps] unpacking source archive /nix/store/s1ajjdsb6bzj5dvvg360rj0kxnvgb27s-source
3.99 s
[gammaloop-crate-test-dependencies-50150770f831b638-deps] source root is source
4.01 s
[gammaloop-crate-test-dependencies-50150770f831b638-deps] Phase: patchPhase
4.13 s
[gammaloop-crate-test-dependencies-50150770f831b638-deps] Executing configureCargoCommonVars
4.13 s
[gammaloop-crate-test-dependencies-50150770f831b638-deps] copying cargo artifacts from /nix/store/f2rkqh3q0lxip9bacx3qjgahcv40f7v1-gammaloop-crate-test-dependencies-50150770f831b638-inputs/target to target
4.13 s
[gammaloop-crate-test-dependencies-50150770f831b638-deps] will deep copy artifacts (instead of symlinking) as requested
6.23 s
[gammaloop-crate-test-dependencies-50150770f831b638-deps] Phase: updateAutotoolsGnuConfigScriptsPhase
6.26 s
[gammaloop-crate-test-dependencies-50150770f831b638-deps] Phase: configurePhase
6.26 s
[gammaloop-crate-test-dependencies-50150770f831b638-deps] will append /build/source/.cargo-home/config.toml with contents of /nix/store/1sigmg52bb61pfngmk9k8wq5fz9r7bf1-vendor-cargo-deps/config.toml
6.26 s
[gammaloop-crate-test-dependencies-50150770f831b638-deps] default configurePhase, nothing to do
6.26 s
[gammaloop-crate-test-dependencies-50150770f831b638-deps] Phase: buildPhase
6.27 s
[gammaloop-crate-test-dependencies-50150770f831b638-deps] +++ command cargo --version
6.27 s
[gammaloop-crate-test-dependencies-50150770f831b638-deps] cargo 1.97.0 (c980f4866 2026-06-30)
6.27 s
[gammaloop-crate-test-dependencies-50150770f831b638-deps] +++ command cargo build --profile ci-optim --offline -p gammaloop-ci-test-dependencies-50150770f831b638 -p gammaloop-workspace-hack --features linnet/bincode,linnet/drawing,linnet/serde,linnet/symbolica,symbolica/tracing_max_level_info,three-dimensional-reps/serde --lib
6.77 s
[gammaloop-crate-test-dependencies-50150770f831b638-deps] Compiling three-dimensional-reps v0.1.0 (/build/source/crates/three-dimensional-reps)
6.78 s
[gammaloop-crate-test-dependencies-50150770f831b638-deps] Compiling linnet v0.17.0 (/build/source/crates/linnet)
13.11 s
[gammaloop-crate-test-dependencies-50150770f831b638-deps] Compiling gammaloop-ci-test-dependencies-50150770f831b638 v0.1.0 (/build/source/crates/gammaloop-ci-test-dependencies-50150770f831b638)
17.43 s
[gammaloop-crate-test-dependencies-50150770f831b638-deps] Finished `ci-optim` profile [optimized] target(s) in 11.15s
17.55 s
[gammaloop-crate-test-dependencies-50150770f831b638-deps] warning : the following packages contain code that will be rejected by a future version of Rust: proc-macro-error2 v2.0.1
17.55 s
[gammaloop-crate-test-dependencies-50150770f831b638-deps] note : to see what the problems were, use the option `--future-incompat-report`, or run `cargo report future-incompatibilities --id 1`
17.59 s
[gammaloop-crate-test-dependencies-50150770f831b638-deps] +++ command cargo build --profile ci-optim --offline -p gammaloop-ci-test-binary-dependencies-50150770f831b638 -p three-dimensional-reps --features linnet/bincode,linnet/drawing,linnet/serde,linnet/symbolica,symbolica/tracing_max_level_info,three-dimensional-reps/serde --lib
17.85 s
[gammaloop-crate-test-dependencies-50150770f831b638-deps] Compiling linnet v0.17.0 (/build/source/crates/linnet)
21.12 s
[gammaloop-crate-test-dependencies-50150770f831b638-deps] Compiling three-dimensional-reps v0.1.0 (/build/source/crates/three-dimensional-reps)
21.12 s
[gammaloop-crate-test-dependencies-50150770f831b638-deps] Compiling gammaloop-ci-test-binary-dependencies-50150770f831b638 v0.1.0 (/build/source/crates/gammaloop-ci-test-binary-dependencies-50150770f831b638)
27.58 s
[gammaloop-crate-test-dependencies-50150770f831b638-deps] Finished `ci-optim` profile [optimized] target(s) in 9.98s
27.70 s
[gammaloop-crate-test-dependencies-50150770f831b638-deps] warning : the following packages contain code that will be rejected by a future version of Rust: proc-macro-error2 v2.0.1
27.70 s
[gammaloop-crate-test-dependencies-50150770f831b638-deps] note : to see what the problems were, use the option `--future-incompat-report`, or run `cargo report future-incompatibilities --id 1`
27.73 s
[gammaloop-crate-test-dependencies-50150770f831b638-deps] Phase: installPhase
27.74 s
[gammaloop-crate-test-dependencies-50150770f831b638-deps] linking previous artifacts /nix/store/f2rkqh3q0lxip9bacx3qjgahcv40f7v1-gammaloop-crate-test-dependencies-50150770f831b638-inputs to /nix/store/fhgzyc1g11kv4xgb0qrldyd80rvxykz2-gammaloop-crate-test-dependencies-50150770f831b638-deps-0.1.0/target.tar.zst
27.84 s
[gammaloop-crate-test-dependencies-50150770f831b638-deps] /*stdin*\ : 30.99% ( 66.3 MiB => 20.6 MiB, /nix/store/fhgzyc1g11kv4xgb0qrldyd80rvxykz2-gammaloop-crate-test-dependencies-50150770f831b638-deps-0.1.0/target.tar.zst)
27.85 s
[gammaloop-crate-test-dependencies-50150770f831b638-deps] Phase: fixupPhase
27.86 s
[gammaloop-crate-test-dependencies-50150770f831b638-deps] shrinking RPATHs of ELF executables and libraries in /nix/store/fhgzyc1g11kv4xgb0qrldyd80rvxykz2-gammaloop-crate-test-dependencies-50150770f831b638-deps-0.1.0
27.86 s
[gammaloop-crate-test-dependencies-50150770f831b638-deps] checking for references to /build/ in /nix/store/fhgzyc1g11kv4xgb0qrldyd80rvxykz2-gammaloop-crate-test-dependencies-50150770f831b638-deps-0.1.0...
27.87 s
[gammaloop-crate-test-dependencies-50150770f831b638-deps] patching script interpreter paths in /nix/store/fhgzyc1g11kv4xgb0qrldyd80rvxykz2-gammaloop-crate-test-dependencies-50150770f831b638-deps-0.1.0
28.08 s
[gammaloop-crate-test-dependencies-50150770f831b638-deps:post-build] Uploading to the NixCI cache: /nix/store/fhgzyc1g11kv4xgb0qrldyd80rvxykz2-gammaloop-crate-test-dependencies-50150770f831b638-deps-0.1.0
28.14 s
[gammaloop-crate-test-dependencies-50150770f831b638-deps:post-build] warning: 'warn-short-path-literals' is deprecated, use 'lint-short-path-literals = ignore' instead
28.20 s
[gammaloop-crate-test-dependencies-50150770f831b638-deps:post-build] copying 1 paths...
28.20 s
[gammaloop-crate-test-dependencies-50150770f831b638-deps:post-build] copying path '/nix/store/fhgzyc1g11kv4xgb0qrldyd80rvxykz2-gammaloop-crate-test-dependencies-50150770f831b638-deps-0.1.0' to 'https://cache.nix-ci.com'...
39.08 s
[gammaloop-crate-test-dependencies-50150770f831b638-deps:post-build] warning: 'warn-short-path-literals' is deprecated, use 'lint-short-path-literals = ignore' instead
39.46 s
[gammaloop-crate-test-dependencies-50150770f831b638-deps:post-build] copying 2 paths...
39.46 s
[gammaloop-crate-test-dependencies-50150770f831b638-deps:post-build] copying path '/nix/store/s1ajjdsb6bzj5dvvg360rj0kxnvgb27s-source' to 'https://cache.nix-ci.com'...
40.55 s
[gammaloop-crate-test-dependencies-50150770f831b638-deps:post-build] copying path '/nix/store/ywxzn52yxgg4zzwxzxlhm4cl8g4bll9a-gammaloop-crate-test-dependencies-50150770f831b638-deps-0.1.0.drv' to 'https://cache.nix-ci.com'...
40.85 s
Uploaded gammaloop-crate-test-dependencies-50150770f831b638-deps in 12.7s
40.85 s
Progress: 1 of 5 built
40.85 s
Built gammaloop-crate-test-dependencies-50150770f831b638-deps in 36.9s
41.34 s
Building /nix/store/hfhr1vnsz0zwj9xfb244lm3kzkl3ndib-gammaloop-crate-test-binaries-three-dimensional-reps-50150770f831b638-inputs.drv
45.93 s
[gammaloop-crate-test-binaries-three-dimensional-reps-50150770f831b638-inputs:post-build] Uploading to the NixCI cache: /nix/store/71lg5z9qr6b69cp7v2y427r8blvhr0lh-gammaloop-crate-test-binaries-three-dimensional-reps-50150770f831b638-inputs
45.97 s
[gammaloop-crate-test-binaries-three-dimensional-reps-50150770f831b638-inputs:post-build] warning: 'warn-short-path-literals' is deprecated, use 'lint-short-path-literals = ignore' instead
46.01 s
[gammaloop-crate-test-binaries-three-dimensional-reps-50150770f831b638-inputs:post-build] copying 1 paths...
46.01 s
[gammaloop-crate-test-binaries-three-dimensional-reps-50150770f831b638-inputs:post-build] copying path '/nix/store/71lg5z9qr6b69cp7v2y427r8blvhr0lh-gammaloop-crate-test-binaries-three-dimensional-reps-50150770f831b638-inputs' to 'https://cache.nix-ci.com'...
99.69 s
[gammaloop-crate-test-binaries-three-dimensional-reps-50150770f831b638-inputs:post-build] warning: 'warn-short-path-literals' is deprecated, use 'lint-short-path-literals = ignore' instead
100.10 s
[gammaloop-crate-test-binaries-three-dimensional-reps-50150770f831b638-inputs:post-build] copying 1 paths...
100.10 s
[gammaloop-crate-test-binaries-three-dimensional-reps-50150770f831b638-inputs:post-build] copying path '/nix/store/hfhr1vnsz0zwj9xfb244lm3kzkl3ndib-gammaloop-crate-test-binaries-three-dimensional-reps-50150770f831b638-inputs.drv' to 'https://cache.nix-ci.com'...
100.55 s
Uploaded gammaloop-crate-test-binaries-three-dimensional-reps-50150770f831b638-inputs in 54.6s
100.55 s
Progress: 2 of 5 built
100.55 s
Built gammaloop-crate-test-binaries-three-dimensional-reps-50150770f831b638-inputs in 59.2s
100.65 s
Building /nix/store/jw4czjjdv1cc9jr1gsiygk91yx66v8ip-gammaloop-crate-test-binaries-three-dimensional-reps-50150770f831b638-deps-0.1.0.drv
100.72 s
[gammaloop-crate-test-binaries-three-dimensional-reps-50150770f831b638-deps] Phase: unpackPhase
100.72 s
[gammaloop-crate-test-binaries-three-dimensional-reps-50150770f831b638-deps] unpacking source archive /nix/store/s1ajjdsb6bzj5dvvg360rj0kxnvgb27s-source
100.96 s
[gammaloop-crate-test-binaries-three-dimensional-reps-50150770f831b638-deps] source root is source
100.99 s
[gammaloop-crate-test-binaries-three-dimensional-reps-50150770f831b638-deps] Phase: patchPhase
101.42 s
[gammaloop-crate-test-binaries-three-dimensional-reps-50150770f831b638-deps] Executing configureCargoCommonVars
101.43 s
[gammaloop-crate-test-binaries-three-dimensional-reps-50150770f831b638-deps] copying cargo artifacts from /nix/store/71lg5z9qr6b69cp7v2y427r8blvhr0lh-gammaloop-crate-test-binaries-three-dimensional-reps-50150770f831b638-inputs/target to target
101.43 s
[gammaloop-crate-test-binaries-three-dimensional-reps-50150770f831b638-deps] will deep copy artifacts (instead of symlinking) as requested
102.93 s
[gammaloop-crate-test-binaries-three-dimensional-reps-50150770f831b638-deps] Phase: updateAutotoolsGnuConfigScriptsPhase
102.99 s
[gammaloop-crate-test-binaries-three-dimensional-reps-50150770f831b638-deps] Phase: configurePhase
102.99 s
[gammaloop-crate-test-binaries-three-dimensional-reps-50150770f831b638-deps] will append /build/source/.cargo-home/config.toml with contents of /nix/store/1sigmg52bb61pfngmk9k8wq5fz9r7bf1-vendor-cargo-deps/config.toml
103.00 s
[gammaloop-crate-test-binaries-three-dimensional-reps-50150770f831b638-deps] default configurePhase, nothing to do
103.00 s
[gammaloop-crate-test-binaries-three-dimensional-reps-50150770f831b638-deps] Phase: buildPhase
103.22 s
[gammaloop-crate-test-binaries-three-dimensional-reps-50150770f831b638-deps] +++ command cargo --version
103.23 s
[gammaloop-crate-test-binaries-three-dimensional-reps-50150770f831b638-deps] cargo 1.97.0 (c980f4866 2026-06-30)
103.23 s
[gammaloop-crate-test-binaries-three-dimensional-reps-50150770f831b638-deps] +++ command cargo test --profile ci-optim --no-run --offline -p three-dimensional-reps --features three-dimensional-reps/serde
104.13 s
[gammaloop-crate-test-binaries-three-dimensional-reps-50150770f831b638-deps] Compiling three-dimensional-reps v0.1.0 (/build/source/crates/three-dimensional-reps)
104.47 s
[gammaloop-crate-test-binaries-three-dimensional-reps-50150770f831b638-deps] error[E0433] : cannot find `eval` in `crate`
104.47 s
[gammaloop-crate-test-binaries-three-dimensional-reps-50150770f831b638-deps] --> crates/three-dimensional-reps/src/generation.rs:8045:28
104.47 s
[gammaloop-crate-test-binaries-three-dimensional-reps-50150770f831b638-deps] |
104.47 s
[gammaloop-crate-test-binaries-three-dimensional-reps-50150770f831b638-deps] 8045 | let input = crate::eval::EvaluationInput {
104.47 s
[gammaloop-crate-test-binaries-three-dimensional-reps-50150770f831b638-deps] | ^^^^ could not find `eval` in the crate root
104.47 s
[gammaloop-crate-test-binaries-three-dimensional-reps-50150770f831b638-deps] |
104.47 s
[gammaloop-crate-test-binaries-three-dimensional-reps-50150770f831b638-deps] note : found an item that was configured out
104.47 s
[gammaloop-crate-test-binaries-three-dimensional-reps-50150770f831b638-deps] --> crates/three-dimensional-reps/src/lib.rs:7:9
104.47 s
[gammaloop-crate-test-binaries-three-dimensional-reps-50150770f831b638-deps] |
104.47 s
[gammaloop-crate-test-binaries-three-dimensional-reps-50150770f831b638-deps] 6 | #[cfg(feature = "eval")]
104.47 s
[gammaloop-crate-test-binaries-three-dimensional-reps-50150770f831b638-deps] | ---------------- the item is gated behind the `eval` feature
104.47 s
[gammaloop-crate-test-binaries-three-dimensional-reps-50150770f831b638-deps] 7 | pub mod eval;
104.47 s
[gammaloop-crate-test-binaries-three-dimensional-reps-50150770f831b638-deps] | ^^^^
104.47 s
[gammaloop-crate-test-binaries-three-dimensional-reps-50150770f831b638-deps]
104.47 s
[gammaloop-crate-test-binaries-three-dimensional-reps-50150770f831b638-deps] error[E0433] : cannot find `eval` in `crate`
104.47 s
[gammaloop-crate-test-binaries-three-dimensional-reps-50150770f831b638-deps] --> crates/three-dimensional-reps/src/generation.rs:8052:30
104.47 s
[gammaloop-crate-test-binaries-three-dimensional-reps-50150770f831b638-deps] |
104.47 s
[gammaloop-crate-test-binaries-three-dimensional-reps-50150770f831b638-deps] 8052 | let contact = crate::eval::evaluate_expression(
104.47 s
[gammaloop-crate-test-binaries-three-dimensional-reps-50150770f831b638-deps] | ^^^^ could not find `eval` in the crate root
104.47 s
[gammaloop-crate-test-binaries-three-dimensional-reps-50150770f831b638-deps] |
104.47 s
[gammaloop-crate-test-binaries-three-dimensional-reps-50150770f831b638-deps] note : found an item that was configured out
104.47 s
[gammaloop-crate-test-binaries-three-dimensional-reps-50150770f831b638-deps] --> crates/three-dimensional-reps/src/lib.rs:7:9
104.47 s
[gammaloop-crate-test-binaries-three-dimensional-reps-50150770f831b638-deps] |
104.47 s
[gammaloop-crate-test-binaries-three-dimensional-reps-50150770f831b638-deps] 6 | #[cfg(feature = "eval")]
104.47 s
[gammaloop-crate-test-binaries-three-dimensional-reps-50150770f831b638-deps] | ---------------- the item is gated behind the `eval` feature
104.47 s
[gammaloop-crate-test-binaries-three-dimensional-reps-50150770f831b638-deps] 7 | pub mod eval;
104.47 s
[gammaloop-crate-test-binaries-three-dimensional-reps-50150770f831b638-deps] | ^^^^
104.47 s
[gammaloop-crate-test-binaries-three-dimensional-reps-50150770f831b638-deps]
104.48 s
[gammaloop-crate-test-binaries-three-dimensional-reps-50150770f831b638-deps] error[E0433] : cannot find `eval` in `crate`
104.48 s
[gammaloop-crate-test-binaries-three-dimensional-reps-50150770f831b638-deps] --> crates/three-dimensional-reps/src/generation.rs:8060:32
104.48 s
[gammaloop-crate-test-binaries-three-dimensional-reps-50150770f831b638-deps] |
104.48 s
[gammaloop-crate-test-binaries-three-dimensional-reps-50150770f831b638-deps] 8060 | let remainder = crate::eval::evaluate_expression(
104.48 s
[gammaloop-crate-test-binaries-three-dimensional-reps-50150770f831b638-deps] | ^^^^ could not find `eval` in the crate root
104.48 s
[gammaloop-crate-test-binaries-three-dimensional-reps-50150770f831b638-deps] |
104.48 s
[gammaloop-crate-test-binaries-three-dimensional-reps-50150770f831b638-deps] note : found an item that was configured out
104.48 s
[gammaloop-crate-test-binaries-three-dimensional-reps-50150770f831b638-deps] --> crates/three-dimensional-reps/src/lib.rs:7:9
104.48 s
[gammaloop-crate-test-binaries-three-dimensional-reps-50150770f831b638-deps] |
104.48 s
[gammaloop-crate-test-binaries-three-dimensional-reps-50150770f831b638-deps] 6 | #[cfg(feature = "eval")]
104.48 s
[gammaloop-crate-test-binaries-three-dimensional-reps-50150770f831b638-deps] | ---------------- the item is gated behind the `eval` feature
104.48 s
[gammaloop-crate-test-binaries-three-dimensional-reps-50150770f831b638-deps] 7 | pub mod eval;
104.48 s
[gammaloop-crate-test-binaries-three-dimensional-reps-50150770f831b638-deps] | ^^^^
104.48 s
[gammaloop-crate-test-binaries-three-dimensional-reps-50150770f831b638-deps]
104.48 s
[gammaloop-crate-test-binaries-three-dimensional-reps-50150770f831b638-deps] error[E0433] : cannot find `eval` in `crate`
104.48 s
[gammaloop-crate-test-binaries-three-dimensional-reps-50150770f831b638-deps] --> crates/three-dimensional-reps/src/generation.rs:8068:28
104.48 s
[gammaloop-crate-test-binaries-three-dimensional-reps-50150770f831b638-deps] |
104.48 s
[gammaloop-crate-test-binaries-three-dimensional-reps-50150770f831b638-deps] 8068 | let total = crate::eval::evaluate_expression(&powered, &expression, numerator, &input)
104.48 s
[gammaloop-crate-test-binaries-three-dimensional-reps-50150770f831b638-deps] | ^^^^ could not find `eval` in the crate root
104.48 s
[gammaloop-crate-test-binaries-three-dimensional-reps-50150770f831b638-deps] |
104.48 s
[gammaloop-crate-test-binaries-three-dimensional-reps-50150770f831b638-deps] note : found an item that was configured out
104.48 s
[gammaloop-crate-test-binaries-three-dimensional-reps-50150770f831b638-deps] --> crates/three-dimensional-reps/src/lib.rs:7:9
104.48 s
[gammaloop-crate-test-binaries-three-dimensional-reps-50150770f831b638-deps] |
104.48 s
[gammaloop-crate-test-binaries-three-dimensional-reps-50150770f831b638-deps] 6 | #[cfg(feature = "eval")]
104.48 s
[gammaloop-crate-test-binaries-three-dimensional-reps-50150770f831b638-deps] | ---------------- the item is gated behind the `eval` feature
104.48 s
[gammaloop-crate-test-binaries-three-dimensional-reps-50150770f831b638-deps] 7 | pub mod eval;
104.48 s
[gammaloop-crate-test-binaries-three-dimensional-reps-50150770f831b638-deps] | ^^^^
104.48 s
[gammaloop-crate-test-binaries-three-dimensional-reps-50150770f831b638-deps]
106.45 s
[gammaloop-crate-test-binaries-three-dimensional-reps-50150770f831b638-deps] For more information about this error, try `rustc --explain E0433`.
106.46 s
[gammaloop-crate-test-binaries-three-dimensional-reps-50150770f831b638-deps] error : could not compile `three-dimensional-reps` (lib test) due to 4 previous errors
107.00 s
Progress: 2 of 4 built (1 failed)
107.00 s
Failed to build gammaloop-crate-test-binaries-three-dimensional-reps-50150770f831b638-deps after 6.3s
107.00 s
error: Cannot build '/nix/store/jw4czjjdv1cc9jr1gsiygk91yx66v8ip-gammaloop-crate-test-binaries-three-dimensional-reps-50150770f831b638-deps-0.1.0.drv '.
107.00 s
Reason: builder failed with exit code 101 .
107.00 s
Output paths:
107.00 s
/nix/store/vf8ksab94faladqcwqcly6amf5fvpg1h-gammaloop-crate-test-binaries-three-dimensional-reps-50150770f831b638-deps-0.1.0
107.00 s
Last 74 log lines:
107.00 s
> Running phase: unpackPhase
107.00 s
> unpacking source archive /nix/store/s1ajjdsb6bzj5dvvg360rj0kxnvgb27s-source
107.00 s
> source root is source
107.00 s
> Running phase: patchPhase
107.00 s
> Executing configureCargoCommonVars
107.00 s
> copying cargo artifacts from /nix/store/71lg5z9qr6b69cp7v2y427r8blvhr0lh-gammaloop-crate-test-binaries-three-dimensional-reps-50150770f831b638-inputs/target to target
107.00 s
> will deep copy artifacts (instead of symlinking) as requested
107.00 s
> Running phase: updateAutotoolsGnuConfigScriptsPhase
107.00 s
> Running phase: configurePhase
107.00 s
> will append /build/source/.cargo-home/config.toml with contents of /nix/store/1sigmg52bb61pfngmk9k8wq5fz9r7bf1-vendor-cargo-deps/config.toml
107.00 s
> default configurePhase, nothing to do
107.00 s
> Running phase: buildPhase
107.00 s
> +++ command cargo --version
107.00 s
> cargo 1.97.0 (c980f4866 2026-06-30)
107.00 s
> +++ command cargo test --profile ci-optim --no-run --offline -p three-dimensional-reps --features three-dimensional-reps/serde
107.00 s
> Compiling three-dimensional-reps v0.1.0 (/build/source/crates/three-dimensional-reps)
107.00 s
> error[E0433] : cannot find `eval` in `crate`
107.00 s
> --> crates/three-dimensional-reps/src/generation.rs:8045:28
107.00 s
> |
107.00 s
> 8045 | let input = crate::eval::EvaluationInput {
107.00 s
> | ^^^^ could not find `eval` in the crate root
107.00 s
> |
107.00 s
> note : found an item that was configured out
107.00 s
> --> crates/three-dimensional-reps/src/lib.rs:7:9
107.00 s
> |
107.00 s
> 6 | #[cfg(feature = "eval")]
107.00 s
> | ---------------- the item is gated behind the `eval` feature
107.00 s
> 7 | pub mod eval;
107.00 s
> | ^^^^
107.00 s
>
107.00 s
> error[E0433] : cannot find `eval` in `crate`
107.00 s
> --> crates/three-dimensional-reps/src/generation.rs:8052:30
107.00 s
> |
107.00 s
> 8052 | let contact = crate::eval::evaluate_expression(
107.00 s
> | ^^^^ could not find `eval` in the crate root
107.00 s
> |
107.00 s
> note : found an item that was configured out
107.00 s
> --> crates/three-dimensional-reps/src/lib.rs:7:9
107.00 s
> |
107.00 s
> 6 | #[cfg(feature = "eval")]
107.00 s
> | ---------------- the item is gated behind the `eval` feature
107.00 s
> 7 | pub mod eval;
107.00 s
> | ^^^^
107.00 s
>
107.00 s
> error[E0433] : cannot find `eval` in `crate`
107.00 s
> --> crates/three-dimensional-reps/src/generation.rs:8060:32
107.00 s
> |
107.00 s
> 8060 | let remainder = crate::eval::evaluate_expression(
107.00 s
> | ^^^^ could not find `eval` in the crate root
107.00 s
> |
107.00 s
> note : found an item that was configured out
107.00 s
> --> crates/three-dimensional-reps/src/lib.rs:7:9
107.00 s
> |
107.00 s
> 6 | #[cfg(feature = "eval")]
107.00 s
> | ---------------- the item is gated behind the `eval` feature
107.00 s
> 7 | pub mod eval;
107.00 s
> | ^^^^
107.00 s
>
107.00 s
> error[E0433] : cannot find `eval` in `crate`
107.00 s
> --> crates/three-dimensional-reps/src/generation.rs:8068:28
107.00 s
> |
107.00 s
> 8068 | let total = crate::eval::evaluate_expression(&powered, &expression, numerator, &input)
107.00 s
> | ^^^^ could not find `eval` in the crate root
107.00 s
> |
107.00 s
> note : found an item that was configured out
107.00 s
> --> crates/three-dimensional-reps/src/lib.rs:7:9
107.00 s
> |
107.00 s
> 6 | #[cfg(feature = "eval")]
107.00 s
> | ---------------- the item is gated behind the `eval` feature
107.00 s
> 7 | pub mod eval;
107.00 s
> | ^^^^
107.00 s
>
107.00 s
> For more information about this error, try `rustc --explain E0433`.
107.00 s
> error : could not compile `three-dimensional-reps` (lib test) due to 4 previous errors
107.00 s
For full logs, run:
107.00 s
nix log /nix/store/jw4czjjdv1cc9jr1gsiygk91yx66v8ip-gammaloop-crate-test-binaries-three-dimensional-reps-50150770f831b638-deps-0.1.0.drv
107.00 s
error: Cannot build '/nix/store/0v0ynicwgs72f23jc7ac86j9bhgkb5nf-nix-ci-artifact-barrier-crate-test-binaries-three-dimensional-reps.drv '.
107.00 s
Reason: 1 dependency failed .
107.00 s
Output paths:
107.00 s
/nix/store/gpmdw08idkj46pzbyx297378ck2pswym-nix-ci-artifact-barrier-crate-test-binaries-three-dimensional-reps
107.00 s
Build failed due to failed dependency
107.12 s
Build failed.