1. 0.00 s $ /nix/store/9ypz3flqsrl5xl495mm8h645gadjsxi1-coreutils-9.11/bin/timeout --kill-after=15s 7200s /nix/store/23zk8sgzamrbmj1fday15szf7f2279s8-nix-2.34.7/bin/nix --extra-experimental-features nix-command --extra-experimental-features flakes --log-format internal-json build --no-link --print-out-paths git+https://github.com/alphal00p/gammaloop?ref=raised_energy_cff_wip&rev=e30d799ef8733d35777ff9aa076aeb12e74ee256&shallow=1#packages.x86_64-linux.crate-test-binaries-three-dimensional-reps --print-build-logs
  2. 0.12 s error (ignored): SQLite database '/var/cache/nix-ci-worker/eval-cache-v6/1af7ce54381e008e1ba25632c4b8b432a9dc7753e12ebe47f32e96c35358ea75.sqlite' is busy
  3. 2.41 s
  4. 3.91 s Building /nix/store/ywxzn52yxgg4zzwxzxlhm4cl8g4bll9a-gammaloop-crate-test-dependencies-50150770f831b638-deps-0.1.0.drv
  5. 3.98 s [gammaloop-crate-test-dependencies-50150770f831b638-deps] Phase: unpackPhase
  6. 3.98 s [gammaloop-crate-test-dependencies-50150770f831b638-deps] unpacking source archive /nix/store/s1ajjdsb6bzj5dvvg360rj0kxnvgb27s-source
  7. 3.99 s [gammaloop-crate-test-dependencies-50150770f831b638-deps] source root is source
  8. 4.01 s [gammaloop-crate-test-dependencies-50150770f831b638-deps] Phase: patchPhase
  9. 4.13 s [gammaloop-crate-test-dependencies-50150770f831b638-deps] Executing configureCargoCommonVars
  10. 4.13 s [gammaloop-crate-test-dependencies-50150770f831b638-deps] copying cargo artifacts from /nix/store/f2rkqh3q0lxip9bacx3qjgahcv40f7v1-gammaloop-crate-test-dependencies-50150770f831b638-inputs/target to target
  11. 4.13 s [gammaloop-crate-test-dependencies-50150770f831b638-deps] will deep copy artifacts (instead of symlinking) as requested
  12. 6.23 s [gammaloop-crate-test-dependencies-50150770f831b638-deps] Phase: updateAutotoolsGnuConfigScriptsPhase
  13. 6.26 s [gammaloop-crate-test-dependencies-50150770f831b638-deps] Phase: configurePhase
  14. 6.26 s [gammaloop-crate-test-dependencies-50150770f831b638-deps] will append /build/source/.cargo-home/config.toml with contents of /nix/store/1sigmg52bb61pfngmk9k8wq5fz9r7bf1-vendor-cargo-deps/config.toml
  15. 6.26 s [gammaloop-crate-test-dependencies-50150770f831b638-deps] default configurePhase, nothing to do
  16. 6.26 s [gammaloop-crate-test-dependencies-50150770f831b638-deps] Phase: buildPhase
  17. 6.27 s [gammaloop-crate-test-dependencies-50150770f831b638-deps] +++ command cargo --version
  18. 6.27 s [gammaloop-crate-test-dependencies-50150770f831b638-deps] cargo 1.97.0 (c980f4866 2026-06-30)
  19. 6.27 s [gammaloop-crate-test-dependencies-50150770f831b638-deps] +++ command cargo build --profile ci-optim --offline -p gammaloop-ci-test-dependencies-50150770f831b638 -p gammaloop-workspace-hack --features linnet/bincode,linnet/drawing,linnet/serde,linnet/symbolica,symbolica/tracing_max_level_info,three-dimensional-reps/serde --lib
  20. 6.77 s [gammaloop-crate-test-dependencies-50150770f831b638-deps] Compiling three-dimensional-reps v0.1.0 (/build/source/crates/three-dimensional-reps)
  21. 6.78 s [gammaloop-crate-test-dependencies-50150770f831b638-deps] Compiling linnet v0.17.0 (/build/source/crates/linnet)
  22. 13.11 s [gammaloop-crate-test-dependencies-50150770f831b638-deps] Compiling gammaloop-ci-test-dependencies-50150770f831b638 v0.1.0 (/build/source/crates/gammaloop-ci-test-dependencies-50150770f831b638)
  23. 17.43 s [gammaloop-crate-test-dependencies-50150770f831b638-deps] Finished `ci-optim` profile [optimized] target(s) in 11.15s
  24. 17.55 s [gammaloop-crate-test-dependencies-50150770f831b638-deps] warning: the following packages contain code that will be rejected by a future version of Rust: proc-macro-error2 v2.0.1
  25. 17.55 s [gammaloop-crate-test-dependencies-50150770f831b638-deps] note: to see what the problems were, use the option `--future-incompat-report`, or run `cargo report future-incompatibilities --id 1`
  26. 17.59 s [gammaloop-crate-test-dependencies-50150770f831b638-deps] +++ command cargo build --profile ci-optim --offline -p gammaloop-ci-test-binary-dependencies-50150770f831b638 -p three-dimensional-reps --features linnet/bincode,linnet/drawing,linnet/serde,linnet/symbolica,symbolica/tracing_max_level_info,three-dimensional-reps/serde --lib
  27. 17.85 s [gammaloop-crate-test-dependencies-50150770f831b638-deps] Compiling linnet v0.17.0 (/build/source/crates/linnet)
  28. 21.12 s [gammaloop-crate-test-dependencies-50150770f831b638-deps] Compiling three-dimensional-reps v0.1.0 (/build/source/crates/three-dimensional-reps)
  29. 21.12 s [gammaloop-crate-test-dependencies-50150770f831b638-deps] Compiling gammaloop-ci-test-binary-dependencies-50150770f831b638 v0.1.0 (/build/source/crates/gammaloop-ci-test-binary-dependencies-50150770f831b638)
  30. 27.58 s [gammaloop-crate-test-dependencies-50150770f831b638-deps] Finished `ci-optim` profile [optimized] target(s) in 9.98s
  31. 27.70 s [gammaloop-crate-test-dependencies-50150770f831b638-deps] warning: the following packages contain code that will be rejected by a future version of Rust: proc-macro-error2 v2.0.1
  32. 27.70 s [gammaloop-crate-test-dependencies-50150770f831b638-deps] note: to see what the problems were, use the option `--future-incompat-report`, or run `cargo report future-incompatibilities --id 1`
  33. 27.73 s [gammaloop-crate-test-dependencies-50150770f831b638-deps] Phase: installPhase
  34. 27.74 s [gammaloop-crate-test-dependencies-50150770f831b638-deps] linking previous artifacts /nix/store/f2rkqh3q0lxip9bacx3qjgahcv40f7v1-gammaloop-crate-test-dependencies-50150770f831b638-inputs to /nix/store/fhgzyc1g11kv4xgb0qrldyd80rvxykz2-gammaloop-crate-test-dependencies-50150770f831b638-deps-0.1.0/target.tar.zst
  35. 27.84 s [gammaloop-crate-test-dependencies-50150770f831b638-deps] /*stdin*\ : 30.99% ( 66.3 MiB => 20.6 MiB, /nix/store/fhgzyc1g11kv4xgb0qrldyd80rvxykz2-gammaloop-crate-test-dependencies-50150770f831b638-deps-0.1.0/target.tar.zst)
  36. 27.85 s [gammaloop-crate-test-dependencies-50150770f831b638-deps] Phase: fixupPhase
  37. 27.86 s [gammaloop-crate-test-dependencies-50150770f831b638-deps] shrinking RPATHs of ELF executables and libraries in /nix/store/fhgzyc1g11kv4xgb0qrldyd80rvxykz2-gammaloop-crate-test-dependencies-50150770f831b638-deps-0.1.0
  38. 27.86 s [gammaloop-crate-test-dependencies-50150770f831b638-deps] checking for references to /build/ in /nix/store/fhgzyc1g11kv4xgb0qrldyd80rvxykz2-gammaloop-crate-test-dependencies-50150770f831b638-deps-0.1.0...
  39. 27.87 s [gammaloop-crate-test-dependencies-50150770f831b638-deps] patching script interpreter paths in /nix/store/fhgzyc1g11kv4xgb0qrldyd80rvxykz2-gammaloop-crate-test-dependencies-50150770f831b638-deps-0.1.0
  40. 28.08 s [gammaloop-crate-test-dependencies-50150770f831b638-deps:post-build] Uploading to the NixCI cache: /nix/store/fhgzyc1g11kv4xgb0qrldyd80rvxykz2-gammaloop-crate-test-dependencies-50150770f831b638-deps-0.1.0
  41. 28.14 s [gammaloop-crate-test-dependencies-50150770f831b638-deps:post-build] warning: 'warn-short-path-literals' is deprecated, use 'lint-short-path-literals = ignore' instead
  42. 28.20 s [gammaloop-crate-test-dependencies-50150770f831b638-deps:post-build] copying 1 paths...
  43. 28.20 s [gammaloop-crate-test-dependencies-50150770f831b638-deps:post-build] copying path '/nix/store/fhgzyc1g11kv4xgb0qrldyd80rvxykz2-gammaloop-crate-test-dependencies-50150770f831b638-deps-0.1.0' to 'https://cache.nix-ci.com'...
  44. 39.08 s [gammaloop-crate-test-dependencies-50150770f831b638-deps:post-build] warning: 'warn-short-path-literals' is deprecated, use 'lint-short-path-literals = ignore' instead
  45. 39.46 s [gammaloop-crate-test-dependencies-50150770f831b638-deps:post-build] copying 2 paths...
  46. 39.46 s [gammaloop-crate-test-dependencies-50150770f831b638-deps:post-build] copying path '/nix/store/s1ajjdsb6bzj5dvvg360rj0kxnvgb27s-source' to 'https://cache.nix-ci.com'...
  47. 40.55 s [gammaloop-crate-test-dependencies-50150770f831b638-deps:post-build] copying path '/nix/store/ywxzn52yxgg4zzwxzxlhm4cl8g4bll9a-gammaloop-crate-test-dependencies-50150770f831b638-deps-0.1.0.drv' to 'https://cache.nix-ci.com'...
  48. 40.85 s Uploaded gammaloop-crate-test-dependencies-50150770f831b638-deps in 12.7s
  49. 40.85 s Progress: 1 of 5 built
  50. 40.85 s Built gammaloop-crate-test-dependencies-50150770f831b638-deps in 36.9s
  51. 41.34 s Building /nix/store/hfhr1vnsz0zwj9xfb244lm3kzkl3ndib-gammaloop-crate-test-binaries-three-dimensional-reps-50150770f831b638-inputs.drv
  52. 45.93 s [gammaloop-crate-test-binaries-three-dimensional-reps-50150770f831b638-inputs:post-build] Uploading to the NixCI cache: /nix/store/71lg5z9qr6b69cp7v2y427r8blvhr0lh-gammaloop-crate-test-binaries-three-dimensional-reps-50150770f831b638-inputs
  53. 45.97 s [gammaloop-crate-test-binaries-three-dimensional-reps-50150770f831b638-inputs:post-build] warning: 'warn-short-path-literals' is deprecated, use 'lint-short-path-literals = ignore' instead
  54. 46.01 s [gammaloop-crate-test-binaries-three-dimensional-reps-50150770f831b638-inputs:post-build] copying 1 paths...
  55. 46.01 s [gammaloop-crate-test-binaries-three-dimensional-reps-50150770f831b638-inputs:post-build] copying path '/nix/store/71lg5z9qr6b69cp7v2y427r8blvhr0lh-gammaloop-crate-test-binaries-three-dimensional-reps-50150770f831b638-inputs' to 'https://cache.nix-ci.com'...
  56. 99.69 s [gammaloop-crate-test-binaries-three-dimensional-reps-50150770f831b638-inputs:post-build] warning: 'warn-short-path-literals' is deprecated, use 'lint-short-path-literals = ignore' instead
  57. 100.10 s [gammaloop-crate-test-binaries-three-dimensional-reps-50150770f831b638-inputs:post-build] copying 1 paths...
  58. 100.10 s [gammaloop-crate-test-binaries-three-dimensional-reps-50150770f831b638-inputs:post-build] copying path '/nix/store/hfhr1vnsz0zwj9xfb244lm3kzkl3ndib-gammaloop-crate-test-binaries-three-dimensional-reps-50150770f831b638-inputs.drv' to 'https://cache.nix-ci.com'...
  59. 100.55 s Uploaded gammaloop-crate-test-binaries-three-dimensional-reps-50150770f831b638-inputs in 54.6s
  60. 100.55 s Progress: 2 of 5 built
  61. 100.55 s Built gammaloop-crate-test-binaries-three-dimensional-reps-50150770f831b638-inputs in 59.2s
  62. 100.65 s Building /nix/store/jw4czjjdv1cc9jr1gsiygk91yx66v8ip-gammaloop-crate-test-binaries-three-dimensional-reps-50150770f831b638-deps-0.1.0.drv
  63. 100.72 s [gammaloop-crate-test-binaries-three-dimensional-reps-50150770f831b638-deps] Phase: unpackPhase
  64. 100.72 s [gammaloop-crate-test-binaries-three-dimensional-reps-50150770f831b638-deps] unpacking source archive /nix/store/s1ajjdsb6bzj5dvvg360rj0kxnvgb27s-source
  65. 100.96 s [gammaloop-crate-test-binaries-three-dimensional-reps-50150770f831b638-deps] source root is source
  66. 100.99 s [gammaloop-crate-test-binaries-three-dimensional-reps-50150770f831b638-deps] Phase: patchPhase
  67. 101.42 s [gammaloop-crate-test-binaries-three-dimensional-reps-50150770f831b638-deps] Executing configureCargoCommonVars
  68. 101.43 s [gammaloop-crate-test-binaries-three-dimensional-reps-50150770f831b638-deps] copying cargo artifacts from /nix/store/71lg5z9qr6b69cp7v2y427r8blvhr0lh-gammaloop-crate-test-binaries-three-dimensional-reps-50150770f831b638-inputs/target to target
  69. 101.43 s [gammaloop-crate-test-binaries-three-dimensional-reps-50150770f831b638-deps] will deep copy artifacts (instead of symlinking) as requested
  70. 102.93 s [gammaloop-crate-test-binaries-three-dimensional-reps-50150770f831b638-deps] Phase: updateAutotoolsGnuConfigScriptsPhase
  71. 102.99 s [gammaloop-crate-test-binaries-three-dimensional-reps-50150770f831b638-deps] Phase: configurePhase
  72. 102.99 s [gammaloop-crate-test-binaries-three-dimensional-reps-50150770f831b638-deps] will append /build/source/.cargo-home/config.toml with contents of /nix/store/1sigmg52bb61pfngmk9k8wq5fz9r7bf1-vendor-cargo-deps/config.toml
  73. 103.00 s [gammaloop-crate-test-binaries-three-dimensional-reps-50150770f831b638-deps] default configurePhase, nothing to do
  74. 103.00 s [gammaloop-crate-test-binaries-three-dimensional-reps-50150770f831b638-deps] Phase: buildPhase
  75. 103.22 s [gammaloop-crate-test-binaries-three-dimensional-reps-50150770f831b638-deps] +++ command cargo --version
  76. 103.23 s [gammaloop-crate-test-binaries-three-dimensional-reps-50150770f831b638-deps] cargo 1.97.0 (c980f4866 2026-06-30)
  77. 103.23 s [gammaloop-crate-test-binaries-three-dimensional-reps-50150770f831b638-deps] +++ command cargo test --profile ci-optim --no-run --offline -p three-dimensional-reps --features three-dimensional-reps/serde
  78. 104.13 s [gammaloop-crate-test-binaries-three-dimensional-reps-50150770f831b638-deps] Compiling three-dimensional-reps v0.1.0 (/build/source/crates/three-dimensional-reps)
  79. 104.47 s [gammaloop-crate-test-binaries-three-dimensional-reps-50150770f831b638-deps] error[E0433]: cannot find `eval` in `crate`
  80. 104.47 s [gammaloop-crate-test-binaries-three-dimensional-reps-50150770f831b638-deps] --> crates/three-dimensional-reps/src/generation.rs:8045:28
  81. 104.47 s [gammaloop-crate-test-binaries-three-dimensional-reps-50150770f831b638-deps] |
  82. 104.47 s [gammaloop-crate-test-binaries-three-dimensional-reps-50150770f831b638-deps] 8045 | let input = crate::eval::EvaluationInput {
  83. 104.47 s [gammaloop-crate-test-binaries-three-dimensional-reps-50150770f831b638-deps] | ^^^^ could not find `eval` in the crate root
  84. 104.47 s [gammaloop-crate-test-binaries-three-dimensional-reps-50150770f831b638-deps] |
  85. 104.47 s [gammaloop-crate-test-binaries-three-dimensional-reps-50150770f831b638-deps] note: found an item that was configured out
  86. 104.47 s [gammaloop-crate-test-binaries-three-dimensional-reps-50150770f831b638-deps] --> crates/three-dimensional-reps/src/lib.rs:7:9
  87. 104.47 s [gammaloop-crate-test-binaries-three-dimensional-reps-50150770f831b638-deps] |
  88. 104.47 s [gammaloop-crate-test-binaries-three-dimensional-reps-50150770f831b638-deps] 6 | #[cfg(feature = "eval")]
  89. 104.47 s [gammaloop-crate-test-binaries-three-dimensional-reps-50150770f831b638-deps] | ---------------- the item is gated behind the `eval` feature
  90. 104.47 s [gammaloop-crate-test-binaries-three-dimensional-reps-50150770f831b638-deps] 7 | pub mod eval;
  91. 104.47 s [gammaloop-crate-test-binaries-three-dimensional-reps-50150770f831b638-deps] | ^^^^
  92. 104.47 s [gammaloop-crate-test-binaries-three-dimensional-reps-50150770f831b638-deps]
  93. 104.47 s [gammaloop-crate-test-binaries-three-dimensional-reps-50150770f831b638-deps] error[E0433]: cannot find `eval` in `crate`
  94. 104.47 s [gammaloop-crate-test-binaries-three-dimensional-reps-50150770f831b638-deps] --> crates/three-dimensional-reps/src/generation.rs:8052:30
  95. 104.47 s [gammaloop-crate-test-binaries-three-dimensional-reps-50150770f831b638-deps] |
  96. 104.47 s [gammaloop-crate-test-binaries-three-dimensional-reps-50150770f831b638-deps] 8052 | let contact = crate::eval::evaluate_expression(
  97. 104.47 s [gammaloop-crate-test-binaries-three-dimensional-reps-50150770f831b638-deps] | ^^^^ could not find `eval` in the crate root
  98. 104.47 s [gammaloop-crate-test-binaries-three-dimensional-reps-50150770f831b638-deps] |
  99. 104.47 s [gammaloop-crate-test-binaries-three-dimensional-reps-50150770f831b638-deps] note: found an item that was configured out
  100. 104.47 s [gammaloop-crate-test-binaries-three-dimensional-reps-50150770f831b638-deps] --> crates/three-dimensional-reps/src/lib.rs:7:9
  101. 104.47 s [gammaloop-crate-test-binaries-three-dimensional-reps-50150770f831b638-deps] |
  102. 104.47 s [gammaloop-crate-test-binaries-three-dimensional-reps-50150770f831b638-deps] 6 | #[cfg(feature = "eval")]
  103. 104.47 s [gammaloop-crate-test-binaries-three-dimensional-reps-50150770f831b638-deps] | ---------------- the item is gated behind the `eval` feature
  104. 104.47 s [gammaloop-crate-test-binaries-three-dimensional-reps-50150770f831b638-deps] 7 | pub mod eval;
  105. 104.47 s [gammaloop-crate-test-binaries-three-dimensional-reps-50150770f831b638-deps] | ^^^^
  106. 104.47 s [gammaloop-crate-test-binaries-three-dimensional-reps-50150770f831b638-deps]
  107. 104.48 s [gammaloop-crate-test-binaries-three-dimensional-reps-50150770f831b638-deps] error[E0433]: cannot find `eval` in `crate`
  108. 104.48 s [gammaloop-crate-test-binaries-three-dimensional-reps-50150770f831b638-deps] --> crates/three-dimensional-reps/src/generation.rs:8060:32
  109. 104.48 s [gammaloop-crate-test-binaries-three-dimensional-reps-50150770f831b638-deps] |
  110. 104.48 s [gammaloop-crate-test-binaries-three-dimensional-reps-50150770f831b638-deps] 8060 | let remainder = crate::eval::evaluate_expression(
  111. 104.48 s [gammaloop-crate-test-binaries-three-dimensional-reps-50150770f831b638-deps] | ^^^^ could not find `eval` in the crate root
  112. 104.48 s [gammaloop-crate-test-binaries-three-dimensional-reps-50150770f831b638-deps] |
  113. 104.48 s [gammaloop-crate-test-binaries-three-dimensional-reps-50150770f831b638-deps] note: found an item that was configured out
  114. 104.48 s [gammaloop-crate-test-binaries-three-dimensional-reps-50150770f831b638-deps] --> crates/three-dimensional-reps/src/lib.rs:7:9
  115. 104.48 s [gammaloop-crate-test-binaries-three-dimensional-reps-50150770f831b638-deps] |
  116. 104.48 s [gammaloop-crate-test-binaries-three-dimensional-reps-50150770f831b638-deps] 6 | #[cfg(feature = "eval")]
  117. 104.48 s [gammaloop-crate-test-binaries-three-dimensional-reps-50150770f831b638-deps] | ---------------- the item is gated behind the `eval` feature
  118. 104.48 s [gammaloop-crate-test-binaries-three-dimensional-reps-50150770f831b638-deps] 7 | pub mod eval;
  119. 104.48 s [gammaloop-crate-test-binaries-three-dimensional-reps-50150770f831b638-deps] | ^^^^
  120. 104.48 s [gammaloop-crate-test-binaries-three-dimensional-reps-50150770f831b638-deps]
  121. 104.48 s [gammaloop-crate-test-binaries-three-dimensional-reps-50150770f831b638-deps] error[E0433]: cannot find `eval` in `crate`
  122. 104.48 s [gammaloop-crate-test-binaries-three-dimensional-reps-50150770f831b638-deps] --> crates/three-dimensional-reps/src/generation.rs:8068:28
  123. 104.48 s [gammaloop-crate-test-binaries-three-dimensional-reps-50150770f831b638-deps] |
  124. 104.48 s [gammaloop-crate-test-binaries-three-dimensional-reps-50150770f831b638-deps] 8068 | let total = crate::eval::evaluate_expression(&powered, &expression, numerator, &input)
  125. 104.48 s [gammaloop-crate-test-binaries-three-dimensional-reps-50150770f831b638-deps] | ^^^^ could not find `eval` in the crate root
  126. 104.48 s [gammaloop-crate-test-binaries-three-dimensional-reps-50150770f831b638-deps] |
  127. 104.48 s [gammaloop-crate-test-binaries-three-dimensional-reps-50150770f831b638-deps] note: found an item that was configured out
  128. 104.48 s [gammaloop-crate-test-binaries-three-dimensional-reps-50150770f831b638-deps] --> crates/three-dimensional-reps/src/lib.rs:7:9
  129. 104.48 s [gammaloop-crate-test-binaries-three-dimensional-reps-50150770f831b638-deps] |
  130. 104.48 s [gammaloop-crate-test-binaries-three-dimensional-reps-50150770f831b638-deps] 6 | #[cfg(feature = "eval")]
  131. 104.48 s [gammaloop-crate-test-binaries-three-dimensional-reps-50150770f831b638-deps] | ---------------- the item is gated behind the `eval` feature
  132. 104.48 s [gammaloop-crate-test-binaries-three-dimensional-reps-50150770f831b638-deps] 7 | pub mod eval;
  133. 104.48 s [gammaloop-crate-test-binaries-three-dimensional-reps-50150770f831b638-deps] | ^^^^
  134. 104.48 s [gammaloop-crate-test-binaries-three-dimensional-reps-50150770f831b638-deps]
  135. 106.45 s [gammaloop-crate-test-binaries-three-dimensional-reps-50150770f831b638-deps] For more information about this error, try `rustc --explain E0433`.
  136. 106.46 s [gammaloop-crate-test-binaries-three-dimensional-reps-50150770f831b638-deps] error: could not compile `three-dimensional-reps` (lib test) due to 4 previous errors
  137. 107.00 s Progress: 2 of 4 built (1 failed)
  138. 107.00 s Failed to build gammaloop-crate-test-binaries-three-dimensional-reps-50150770f831b638-deps after 6.3s
  139. 107.00 s error: Cannot build '/nix/store/jw4czjjdv1cc9jr1gsiygk91yx66v8ip-gammaloop-crate-test-binaries-three-dimensional-reps-50150770f831b638-deps-0.1.0.drv'.
  140. 107.00 s Reason: builder failed with exit code 101.
  141. 107.00 s Output paths:
  142. 107.00 s /nix/store/vf8ksab94faladqcwqcly6amf5fvpg1h-gammaloop-crate-test-binaries-three-dimensional-reps-50150770f831b638-deps-0.1.0
  143. 107.00 s Last 74 log lines:
  144. 107.00 s > Running phase: unpackPhase
  145. 107.00 s > unpacking source archive /nix/store/s1ajjdsb6bzj5dvvg360rj0kxnvgb27s-source
  146. 107.00 s > source root is source
  147. 107.00 s > Running phase: patchPhase
  148. 107.00 s > Executing configureCargoCommonVars
  149. 107.00 s > copying cargo artifacts from /nix/store/71lg5z9qr6b69cp7v2y427r8blvhr0lh-gammaloop-crate-test-binaries-three-dimensional-reps-50150770f831b638-inputs/target to target
  150. 107.00 s > will deep copy artifacts (instead of symlinking) as requested
  151. 107.00 s > Running phase: updateAutotoolsGnuConfigScriptsPhase
  152. 107.00 s > Running phase: configurePhase
  153. 107.00 s > will append /build/source/.cargo-home/config.toml with contents of /nix/store/1sigmg52bb61pfngmk9k8wq5fz9r7bf1-vendor-cargo-deps/config.toml
  154. 107.00 s > default configurePhase, nothing to do
  155. 107.00 s > Running phase: buildPhase
  156. 107.00 s > +++ command cargo --version
  157. 107.00 s > cargo 1.97.0 (c980f4866 2026-06-30)
  158. 107.00 s > +++ command cargo test --profile ci-optim --no-run --offline -p three-dimensional-reps --features three-dimensional-reps/serde
  159. 107.00 s > Compiling three-dimensional-reps v0.1.0 (/build/source/crates/three-dimensional-reps)
  160. 107.00 s > error[E0433]: cannot find `eval` in `crate`
  161. 107.00 s > --> crates/three-dimensional-reps/src/generation.rs:8045:28
  162. 107.00 s > |
  163. 107.00 s > 8045 | let input = crate::eval::EvaluationInput {
  164. 107.00 s > | ^^^^ could not find `eval` in the crate root
  165. 107.00 s > |
  166. 107.00 s > note: found an item that was configured out
  167. 107.00 s > --> crates/three-dimensional-reps/src/lib.rs:7:9
  168. 107.00 s > |
  169. 107.00 s > 6 | #[cfg(feature = "eval")]
  170. 107.00 s > | ---------------- the item is gated behind the `eval` feature
  171. 107.00 s > 7 | pub mod eval;
  172. 107.00 s > | ^^^^
  173. 107.00 s >
  174. 107.00 s > error[E0433]: cannot find `eval` in `crate`
  175. 107.00 s > --> crates/three-dimensional-reps/src/generation.rs:8052:30
  176. 107.00 s > |
  177. 107.00 s > 8052 | let contact = crate::eval::evaluate_expression(
  178. 107.00 s > | ^^^^ could not find `eval` in the crate root
  179. 107.00 s > |
  180. 107.00 s > note: found an item that was configured out
  181. 107.00 s > --> crates/three-dimensional-reps/src/lib.rs:7:9
  182. 107.00 s > |
  183. 107.00 s > 6 | #[cfg(feature = "eval")]
  184. 107.00 s > | ---------------- the item is gated behind the `eval` feature
  185. 107.00 s > 7 | pub mod eval;
  186. 107.00 s > | ^^^^
  187. 107.00 s >
  188. 107.00 s > error[E0433]: cannot find `eval` in `crate`
  189. 107.00 s > --> crates/three-dimensional-reps/src/generation.rs:8060:32
  190. 107.00 s > |
  191. 107.00 s > 8060 | let remainder = crate::eval::evaluate_expression(
  192. 107.00 s > | ^^^^ could not find `eval` in the crate root
  193. 107.00 s > |
  194. 107.00 s > note: found an item that was configured out
  195. 107.00 s > --> crates/three-dimensional-reps/src/lib.rs:7:9
  196. 107.00 s > |
  197. 107.00 s > 6 | #[cfg(feature = "eval")]
  198. 107.00 s > | ---------------- the item is gated behind the `eval` feature
  199. 107.00 s > 7 | pub mod eval;
  200. 107.00 s > | ^^^^
  201. 107.00 s >
  202. 107.00 s > error[E0433]: cannot find `eval` in `crate`
  203. 107.00 s > --> crates/three-dimensional-reps/src/generation.rs:8068:28
  204. 107.00 s > |
  205. 107.00 s > 8068 | let total = crate::eval::evaluate_expression(&powered, &expression, numerator, &input)
  206. 107.00 s > | ^^^^ could not find `eval` in the crate root
  207. 107.00 s > |
  208. 107.00 s > note: found an item that was configured out
  209. 107.00 s > --> crates/three-dimensional-reps/src/lib.rs:7:9
  210. 107.00 s > |
  211. 107.00 s > 6 | #[cfg(feature = "eval")]
  212. 107.00 s > | ---------------- the item is gated behind the `eval` feature
  213. 107.00 s > 7 | pub mod eval;
  214. 107.00 s > | ^^^^
  215. 107.00 s >
  216. 107.00 s > For more information about this error, try `rustc --explain E0433`.
  217. 107.00 s > error: could not compile `three-dimensional-reps` (lib test) due to 4 previous errors
  218. 107.00 s For full logs, run:
  219. 107.00 s nix log /nix/store/jw4czjjdv1cc9jr1gsiygk91yx66v8ip-gammaloop-crate-test-binaries-three-dimensional-reps-50150770f831b638-deps-0.1.0.drv
  220. 107.00 s error: Cannot build '/nix/store/0v0ynicwgs72f23jc7ac86j9bhgkb5nf-nix-ci-artifact-barrier-crate-test-binaries-three-dimensional-reps.drv'.
  221. 107.00 s Reason: 1 dependency failed.
  222. 107.00 s Output paths:
  223. 107.00 s /nix/store/gpmdw08idkj46pzbyx297378ck2pswym-nix-ci-artifact-barrier-crate-test-binaries-three-dimensional-reps
  224. 107.00 s Build failed due to failed dependency
  225. 107.12 s Build failed.