build packages.x86_64-linux.alphal00p-docs-cargo-artifacts
0.00 s
$ /nix/store/9ypz3flqsrl5xl495mm8h645gadjsxi1-coreutils-9.11/bin/timeout --kill-after=15s 7200s /nix/store/23zk8sgzamrbmj1fday15szf7f2279s8-nix-2.34.7/bin/nix --extra-experimental-features nix-command --extra-experimental-features flakes --log-format internal-json build --no-link --print-out-paths git+https://github.com/alphal00p/gammaloop?ref=simplify-spenso-api&rev=43649e2ed5bc140b6fa2364e5e528f13134be9f5&shallow=1#packages.x86_64-linux.alphal00p-docs-cargo-artifacts --print-build-logs
0.08 s
fetching Git repository 'https://github.com/alphal00p/gammaloop'
0.84 s
remote: Enumerating objects: 2201, done.
0.93 s
remote: Counting objects: 0% (1/2201)
remote: Counting objects: 1% (23/2201)
remote: Counting objects: 2% (45/2201)
remote: Counting objects: 3% (67/2201)
remote: Counting objects: 4% (89/2201)
remote: Counting objects: 5% (111/2201)
remote: Counting objects: 6% (133/2201)
remote: Counting objects: 7% (155/2201)
remote: Counting objects: 8% (177/2201)
remote: Counting objects: 9% (199/2201)
remote: Counting objects: 10% (221/2201)
remote: Counting objects: 11% (243/2201)
remote: Counting objects: 12% (265/2201)
remote: Counting objects: 13% (287/2201)
remote: Counting objects: 14% (309/2201)
remote: Counting objects: 15% (331/2201)
remote: Counting objects: 16% (353/2201)
remote: Counting objects: 17% (375/2201)
remote: Counting objects: 18% (397/2201)
remote: Counting objects: 19% (419/2201)
remote: Counting objects: 20% (441/2201)
remote: Counting objects: 21% (463/2201)
remote: Counting objects: 22% (485/2201)
remote: Counting objects: 23% (507/2201)
remote: Counting objects: 24% (529/2201)
remote: Counting objects: 25% (551/2201)
remote: Counting objects: 26% (573/2201)
remote: Counting objects: 27% (595/2201)
remote: Counting objects: 28% (617/2201)
remote: Counting objects: 29% (639/2201)
remote: Counting objects: 30% (661/2201)
remote: Counting objects: 31% (683/2201)
remote: Counting objects: 32% (705/2201)
remote: Counting objects: 33% (727/2201)
remote: Counting objects: 34% (749/2201)
remote: Counting objects: 35% (771/2201)
remote: Counting objects: 36% (793/2201)
remote: Counting objects: 37% (815/2201)
remote: Counting objects: 38% (837/2201)
remote: Counting objects: 39% (859/2201)
remote: Counting objects: 40% (881/2201)
remote: Counting objects: 41% (903/2201)
remote: Counting objects: 42% (925/2201)
remote: Counting objects: 43% (947/2201)
remote: Counting objects: 44% (969/2201)
remote: Counting objects: 45% (991/2201)
remote: Counting objects: 46% (1013/2201)
remote: Counting objects: 47% (1035/2201)
remote: Counting objects: 48% (1057/2201)
remote: Counting objects: 49% (1079/2201)
remote: Counting objects: 50% (1101/2201)
remote: Counting objects: 51% (1123/2201)
remote: Counting objects: 52% (1145/2201)
remote: Counting objects: 53% (1167/2201)
remote: Counting objects: 54% (1189/2201)
remote: Counting objects: 55% (1211/2201)
remote: Counting objects: 56% (1233/2201)
remote: Counting objects: 57% (1255/2201)
remote: Counting objects: 58% (1277/2201)
remote: Counting objects: 59% (1299/2201)
remote: Counting objects: 60% (1321/2201)
remote: Counting objects: 61% (1343/2201)
remote: Counting objects: 62% (1365/2201)
remote: Counting objects: 63% (1387/2201)
remote: Counting objects: 64% (1409/2201)
remote: Counting objects: 65% (1431/2201)
remote: Counting objects: 66% (1453/2201)
remote: Counting objects: 67% (1475/2201)
remote: Counting objects: 68% (1497/2201)
remote: Counting objects: 69% (1519/2201)
remote: Counting objects: 70% (1541/2201)
remote: Counting objects: 71% (1563/2201)
remote: Counting objects: 72% (1585/2201)
remote: Counting objects: 73% (1607/2201)
remote: Counting objects: 74% (1629/2201)
remote: Counting objects: 75% (1651/2201)
remote: Counting objects: 76% (1673/2201)
remote: Counting objects: 77% (1695/2201)
remote: Counting objects: 78% (1717/2201)
remote: Counting objects: 79% (1739/2201)
remote: Counting objects: 80% (1761/2201)
remote: Counting objects: 81% (1783/2201)
remote: Counting objects: 82% (1805/2201)
remote: Counting objects: 83% (1827/2201)
remote: Counting objects: 84% (1849/2201)
remote: Counting objects: 85% (1871/2201)
remote: Counting objects: 86% (1893/2201)
remote: Counting objects: 87% (1915/2201)
remote: Counting objects: 88% (1937/2201)
remote: Counting objects: 89% (1959/2201)
remote: Counting objects: 90% (1981/2201)
remote: Counting objects: 91% (2003/2201)
remote: Counting objects: 92% (2025/2201)
remote: Counting objects: 93% (2047/2201)
remote: Counting objects: 94% (2069/2201)
remote: Counting objects: 95% (2091/2201)
remote: Counting objects: 96% (2113/2201)
remote: Counting objects: 97% (2135/2201)
remote: Counting objects: 98% (2157/2201)
remote: Counting objects: 99% (2179/2201)
remote: Counting objects: 100% (2201/2201)
remote: Counting objects: 100% (2201/2201), done.
1.59 s
remote: Compressing objects: 0% (1/1512)
remote: Compressing objects: 1% (16/1512)
remote: Compressing objects: 2% (31/1512)
remote: Compressing objects: 3% (46/1512)
remote: Compressing objects: 4% (61/1512)
remote: Compressing objects: 5% (76/1512)
remote: Compressing objects: 6% (91/1512)
remote: Compressing objects: 7% (106/1512)
remote: Compressing objects: 8% (121/1512)
remote: Compressing objects: 9% (137/1512)
remote: Compressing objects: 10% (152/1512)
remote: Compressing objects: 11% (167/1512)
remote: Compressing objects: 12% (182/1512)
remote: Compressing objects: 13% (197/1512)
remote: Compressing objects: 14% (212/1512)
remote: Compressing objects: 15% (227/1512)
remote: Compressing objects: 16% (242/1512)
remote: Compressing objects: 17% (258/1512)
remote: Compressing objects: 18% (273/1512)
remote: Compressing objects: 19% (288/1512)
remote: Compressing objects: 20% (303/1512)
remote: Compressing objects: 21% (318/1512)
remote: Compressing objects: 22% (333/1512)
remote: Compressing objects: 23% (348/1512)
remote: Compressing objects: 24% (363/1512)
remote: Compressing objects: 25% (378/1512)
remote: Compressing objects: 26% (394/1512)
remote: Compressing objects: 27% (409/1512)
remote: Compressing objects: 28% (424/1512)
remote: Compressing objects: 29% (439/1512)
remote: Compressing objects: 30% (454/1512)
remote: Compressing objects: 31% (469/1512)
remote: Compressing objects: 32% (484/1512)
remote: Compressing objects: 33% (499/1512)
remote: Compressing objects: 34% (515/1512)
remote: Compressing objects: 35% (530/1512)
remote: Compressing objects: 36% (545/1512)
remote: Compressing objects: 37% (560/1512)
remote: Compressing objects: 38% (575/1512)
remote: Compressing objects: 39% (590/1512)
remote: Compressing objects: 40% (605/1512)
remote: Compressing objects: 41% (620/1512)
remote: Compressing objects: 42% (636/1512)
remote: Compressing objects: 43% (651/1512)
remote: Compressing objects: 44% (666/1512)
remote: Compressing objects: 45% (681/1512)
remote: Compressing objects: 46% (696/1512)
remote: Compressing objects: 47% (711/1512)
remote: Compressing objects: 48% (726/1512)
remote: Compressing objects: 49% (741/1512)
remote: Compressing objects: 50% (756/1512)
remote: Compressing objects: 51% (772/1512)
remote: Compressing objects: 52% (787/1512)
remote: Compressing objects: 53% (802/1512)
remote: Compressing objects: 54% (817/1512)
remote: Compressing objects: 55% (832/1512)
remote: Compressing objects: 56% (847/1512)
remote: Compressing objects: 57% (862/1512)
remote: Compressing objects: 58% (877/1512)
remote: Compressing objects: 59% (893/1512)
remote: Compressing objects: 60% (908/1512)
remote: Compressing objects: 61% (923/1512)
remote: Compressing objects: 62% (938/1512)
remote: Compressing objects: 63% (953/1512)
remote: Compressing objects: 64% (968/1512)
remote: Compressing objects: 65% (983/1512)
remote: Compressing objects: 66% (998/1512)
remote: Compressing objects: 67% (1014/1512)
remote: Compressing objects: 68% (1029/1512)
remote: Compressing objects: 69% (1044/1512)
remote: Compressing objects: 70% (1059/1512)
remote: Compressing objects: 71% (1074/1512)
remote: Compressing objects: 72% (1089/1512)
remote: Compressing objects: 73% (1104/1512)
remote: Compressing objects: 74% (1119/1512)
remote: Compressing objects: 75% (1134/1512)
remote: Compressing objects: 76% (1150/1512)
remote: Compressing objects: 77% (1165/1512)
remote: Compressing objects: 78% (1180/1512)
remote: Compressing objects: 79% (1195/1512)
remote: Compressing objects: 80% (1210/1512)
remote: Compressing objects: 81% (1225/1512)
remote: Compressing objects: 82% (1240/1512)
remote: Compressing objects: 83% (1255/1512)
remote: Compressing objects: 84% (1271/1512)
remote: Compressing objects: 85% (1286/1512)
remote: Compressing objects: 86% (1301/1512)
remote: Compressing objects: 87% (1316/1512)
remote: Compressing objects: 88% (1331/1512)
remote: Compressing objects: 89% (1346/1512)
remote: Compressing objects: 90% (1361/1512)
remote: Compressing objects: 91% (1376/1512)
remote: Compressing objects: 92% (1392/1512)
remote: Compressing objects: 93% (1407/1512)
remote: Compressing objects: 94% (1422/1512)
remote: Compressing objects: 95% (1437/1512)
remote: Compressing objects: 96% (1452/1512)
remote: Compressing objects: 97% (1467/1512)
remote: Compressing objects: 98% (1482/1512)
remote: Compressing objects: 99% (1497/1512)
remote: Compressing objects: 100% (1512/1512)
remote: Compressing objects: 100% (1512/1512), done.
2.42 s
Receiving objects: 0% (1/2201)
Receiving objects: 1% (23/2201)
Receiving objects: 2% (45/2201)
Receiving objects: 3% (67/2201)
Receiving objects: 4% (89/2201)
Receiving objects: 5% (111/2201)
Receiving objects: 6% (133/2201)
Receiving objects: 7% (155/2201)
Receiving objects: 8% (177/2201)
Receiving objects: 9% (199/2201)
Receiving objects: 10% (221/2201)
Receiving objects: 11% (243/2201)
Receiving objects: 12% (265/2201)
Receiving objects: 13% (287/2201)
Receiving objects: 14% (309/2201)
Receiving objects: 15% (331/2201)
Receiving objects: 16% (353/2201)
Receiving objects: 17% (375/2201)
Receiving objects: 18% (397/2201)
Receiving objects: 19% (419/2201)
Receiving objects: 20% (441/2201)
Receiving objects: 21% (463/2201)
Receiving objects: 22% (485/2201)
Receiving objects: 23% (507/2201)
Receiving objects: 24% (529/2201)
Receiving objects: 25% (551/2201)
Receiving objects: 26% (573/2201)
Receiving objects: 27% (595/2201)
Receiving objects: 28% (617/2201)
Receiving objects: 29% (639/2201)
Receiving objects: 30% (661/2201)
Receiving objects: 31% (683/2201)
Receiving objects: 32% (705/2201)
Receiving objects: 33% (727/2201)
Receiving objects: 34% (749/2201)
Receiving objects: 35% (771/2201)
Receiving objects: 36% (793/2201)
Receiving objects: 37% (815/2201)
Receiving objects: 38% (837/2201)
Receiving objects: 39% (859/2201)
Receiving objects: 40% (881/2201)
Receiving objects: 41% (903/2201)
Receiving objects: 42% (925/2201)
Receiving objects: 43% (947/2201)
Receiving objects: 44% (969/2201)
Receiving objects: 45% (991/2201)
Receiving objects: 46% (1013/2201)
Receiving objects: 47% (1035/2201)
Receiving objects: 48% (1057/2201)
Receiving objects: 49% (1079/2201)
Receiving objects: 50% (1101/2201)
Receiving objects: 51% (1123/2201)
Receiving objects: 52% (1145/2201)
Receiving objects: 53% (1167/2201), 10.80 MiB | 21.60 MiB/s
Receiving objects: 54% (1189/2201), 10.80 MiB | 21.60 MiB/s
Receiving objects: 55% (1211/2201), 10.80 MiB | 21.60 MiB/s
Receiving objects: 56% (1233/2201), 10.80 MiB | 21.60 MiB/s
Receiving objects: 57% (1255/2201), 10.80 MiB | 21.60 MiB/s
Receiving objects: 58% (1277/2201), 10.80 MiB | 21.60 MiB/s
Receiving objects: 59% (1299/2201), 10.80 MiB | 21.60 MiB/s
Receiving objects: 60% (1321/2201), 10.80 MiB | 21.60 MiB/s
Receiving objects: 61% (1343/2201), 10.80 MiB | 21.60 MiB/s
Receiving objects: 62% (1365/2201), 10.80 MiB | 21.60 MiB/s
Receiving objects: 63% (1387/2201), 10.80 MiB | 21.60 MiB/s
Receiving objects: 64% (1409/2201), 10.80 MiB | 21.60 MiB/s
Receiving objects: 65% (1431/2201), 10.80 MiB | 21.60 MiB/s
Receiving objects: 66% (1453/2201), 10.80 MiB | 21.60 MiB/s
Receiving objects: 67% (1475/2201), 10.80 MiB | 21.60 MiB/s
Receiving objects: 68% (1497/2201), 10.80 MiB | 21.60 MiB/s
Receiving objects: 69% (1519/2201), 10.80 MiB | 21.60 MiB/s
Receiving objects: 70% (1541/2201), 10.80 MiB | 21.60 MiB/s
Receiving objects: 71% (1563/2201), 10.80 MiB | 21.60 MiB/s
Receiving objects: 72% (1585/2201), 10.80 MiB | 21.60 MiB/s
Receiving objects: 73% (1607/2201), 10.80 MiB | 21.60 MiB/s
Receiving objects: 74% (1629/2201), 10.80 MiB | 21.60 MiB/s
Receiving objects: 75% (1651/2201), 10.80 MiB | 21.60 MiB/s
Receiving objects: 76% (1673/2201), 10.80 MiB | 21.60 MiB/s
Receiving objects: 77% (1695/2201), 10.80 MiB | 21.60 MiB/s
Receiving objects: 78% (1717/2201), 10.80 MiB | 21.60 MiB/s
Receiving objects: 79% (1739/2201), 10.80 MiB | 21.60 MiB/s
Receiving objects: 80% (1761/2201), 10.80 MiB | 21.60 MiB/s
Receiving objects: 81% (1783/2201), 10.80 MiB | 21.60 MiB/s
Receiving objects: 82% (1805/2201), 10.80 MiB | 21.60 MiB/s
Receiving objects: 83% (1827/2201), 10.80 MiB | 21.60 MiB/s
Receiving objects: 84% (1849/2201), 10.80 MiB | 21.60 MiB/s
Receiving objects: 85% (1871/2201), 10.80 MiB | 21.60 MiB/s
Receiving objects: 86% (1893/2201), 10.80 MiB | 21.60 MiB/s
Receiving objects: 87% (1915/2201), 10.80 MiB | 21.60 MiB/s
Receiving objects: 88% (1937/2201), 10.80 MiB | 21.60 MiB/s
Receiving objects: 89% (1959/2201), 10.80 MiB | 21.60 MiB/s
Receiving objects: 90% (1981/2201), 10.80 MiB | 21.60 MiB/s
Receiving objects: 91% (2003/2201), 10.80 MiB | 21.60 MiB/s
Receiving objects: 92% (2025/2201), 10.80 MiB | 21.60 MiB/s
Receiving objects: 93% (2047/2201), 10.80 MiB | 21.60 MiB/s
Receiving objects: 94% (2069/2201), 10.80 MiB | 21.60 MiB/s
Receiving objects: 95% (2091/2201), 10.80 MiB | 21.60 MiB/s
Receiving objects: 96% (2113/2201), 10.80 MiB | 21.60 MiB/s
Receiving objects: 97% (2135/2201), 10.80 MiB | 21.60 MiB/s
Receiving objects: 98% (2157/2201), 10.80 MiB | 21.60 MiB/s
Receiving objects: 99% (2179/2201), 10.80 MiB | 21.60 MiB/s
remote: Total 2201 (delta 678), reused 1557 (delta 608), pack-reused 0 (from 0)
2.42 s
Receiving objects: 100% (2201/2201), 10.80 MiB | 21.60 MiB/s
Receiving objects: 100% (2201/2201), 20.59 MiB | 25.10 MiB/s, done.
2.43 s
Resolving deltas: 0% (0/678)
Resolving deltas: 1% (8/678)
Resolving deltas: 2% (14/678)
Resolving deltas: 3% (21/678)
Resolving deltas: 4% (28/678)
Resolving deltas: 5% (34/678)
Resolving deltas: 6% (41/678)
Resolving deltas: 7% (48/678)
Resolving deltas: 8% (55/678)
Resolving deltas: 9% (62/678)
Resolving deltas: 10% (69/678)
Resolving deltas: 11% (75/678)
Resolving deltas: 12% (82/678)
Resolving deltas: 13% (89/678)
Resolving deltas: 14% (95/678)
Resolving deltas: 15% (102/678)
Resolving deltas: 16% (109/678)
Resolving deltas: 17% (116/678)
Resolving deltas: 18% (123/678)
Resolving deltas: 19% (129/678)
Resolving deltas: 20% (136/678)
Resolving deltas: 21% (143/678)
Resolving deltas: 22% (150/678)
Resolving deltas: 23% (156/678)
Resolving deltas: 24% (163/678)
Resolving deltas: 25% (170/678)
Resolving deltas: 26% (177/678)
Resolving deltas: 27% (184/678)
Resolving deltas: 28% (190/678)
Resolving deltas: 29% (197/678)
Resolving deltas: 30% (204/678)
Resolving deltas: 31% (211/678)
Resolving deltas: 32% (217/678)
Resolving deltas: 33% (224/678)
Resolving deltas: 34% (231/678)
Resolving deltas: 35% (238/678)
Resolving deltas: 36% (245/678)
Resolving deltas: 37% (251/678)
Resolving deltas: 38% (258/678)
Resolving deltas: 39% (265/678)
Resolving deltas: 40% (272/678)
Resolving deltas: 41% (278/678)
Resolving deltas: 42% (285/678)
Resolving deltas: 43% (292/678)
Resolving deltas: 44% (300/678)
Resolving deltas: 45% (306/678)
Resolving deltas: 46% (312/678)
Resolving deltas: 47% (319/678)
Resolving deltas: 48% (326/678)
Resolving deltas: 49% (333/678)
Resolving deltas: 50% (339/678)
Resolving deltas: 51% (346/678)
Resolving deltas: 52% (353/678)
Resolving deltas: 53% (360/678)
Resolving deltas: 54% (367/678)
Resolving deltas: 55% (373/678)
Resolving deltas: 56% (380/678)
Resolving deltas: 57% (387/678)
Resolving deltas: 58% (394/678)
Resolving deltas: 59% (401/678)
Resolving deltas: 60% (407/678)
Resolving deltas: 61% (414/678)
Resolving deltas: 62% (421/678)
Resolving deltas: 63% (428/678)
Resolving deltas: 64% (434/678)
Resolving deltas: 65% (441/678)
Resolving deltas: 66% (448/678)
Resolving deltas: 67% (455/678)
Resolving deltas: 68% (462/678)
Resolving deltas: 69% (468/678)
Resolving deltas: 70% (475/678)
Resolving deltas: 71% (482/678)
Resolving deltas: 72% (489/678)
Resolving deltas: 73% (495/678)
Resolving deltas: 74% (502/678)
Resolving deltas: 75% (509/678)
Resolving deltas: 76% (516/678)
Resolving deltas: 77% (523/678)
Resolving deltas: 78% (529/678)
Resolving deltas: 79% (536/678)
Resolving deltas: 80% (543/678)
Resolving deltas: 81% (550/678)
Resolving deltas: 82% (556/678)
Resolving deltas: 83% (563/678)
Resolving deltas: 84% (570/678)
Resolving deltas: 85% (577/678)
Resolving deltas: 86% (584/678)
Resolving deltas: 87% (590/678)
Resolving deltas: 88% (597/678)
Resolving deltas: 89% (604/678)
Resolving deltas: 90% (612/678)
Resolving deltas: 91% (617/678)
Resolving deltas: 92% (624/678)
Resolving deltas: 93% (631/678)
Resolving deltas: 94% (638/678)
Resolving deltas: 95% (645/678)
Resolving deltas: 96% (651/678)
Resolving deltas: 97% (658/678)
Resolving deltas: 98% (665/678)
Resolving deltas: 99% (672/678)
Resolving deltas: 100% (678/678)
Resolving deltas: 100% (678/678), done.
2.46 s
From https://github.com/alphal00p/gammaloop
2.46 s
* branch 43649e2ed5bc140b6fa2364e5e528f13134be9f5 -> FETCH_HEAD
4.19 s
fetching Git repository 'https://github.com/lcnbr/tymbolica'
4.87 s
remote: Enumerating objects: 33, done.
5.00 s
remote: Counting objects: 3% (1/33)
remote: Counting objects: 6% (2/33)
remote: Counting objects: 9% (3/33)
remote: Counting objects: 12% (4/33)
remote: Counting objects: 15% (5/33)
remote: Counting objects: 18% (6/33)
remote: Counting objects: 21% (7/33)
remote: Counting objects: 24% (8/33)
remote: Counting objects: 27% (9/33)
remote: Counting objects: 30% (10/33)
remote: Counting objects: 33% (11/33)
remote: Counting objects: 36% (12/33)
remote: Counting objects: 39% (13/33)
remote: Counting objects: 42% (14/33)
remote: Counting objects: 45% (15/33)
remote: Counting objects: 48% (16/33)
remote: Counting objects: 51% (17/33)
remote: Counting objects: 54% (18/33)
remote: Counting objects: 57% (19/33)
remote: Counting objects: 60% (20/33)
remote: Counting objects: 63% (21/33)
remote: Counting objects: 66% (22/33)
remote: Counting objects: 69% (23/33)
remote: Counting objects: 72% (24/33)
remote: Counting objects: 75% (25/33)
remote: Counting objects: 78% (26/33)
remote: Counting objects: 81% (27/33)
remote: Counting objects: 84% (28/33)
remote: Counting objects: 87% (29/33)
remote: Counting objects: 90% (30/33)
remote: Counting objects: 93% (31/33)
remote: Counting objects: 96% (32/33)
remote: Counting objects: 100% (33/33)
remote: Counting objects: 100% (33/33), done.
5.18 s
remote: Compressing objects: 20% (1/5)
remote: Compressing objects: 40% (2/5)
remote: Compressing objects: 60% (3/5)
remote: Compressing objects: 80% (4/5)
remote: Compressing objects: 100% (5/5)
remote: Compressing objects: 100% (5/5), done.
5.69 s
Unpacking objects: 5% (1/17)
Unpacking objects: 11% (2/17)
Unpacking objects: 17% (3/17)
Unpacking objects: 23% (4/17)
Unpacking objects: 29% (5/17)
Unpacking objects: 35% (6/17)
Unpacking objects: 41% (7/17)
Unpacking objects: 47% (8/17)
Unpacking objects: 52% (9/17)
Unpacking objects: 58% (10/17)
Unpacking objects: 64% (11/17)
Unpacking objects: 70% (12/17)
Unpacking objects: 76% (13/17)
Unpacking objects: 82% (14/17)
Unpacking objects: 88% (15/17)
Unpacking objects: 94% (16/17)
remote: Total 17 (delta 12), reused 16 (delta 11), pack-reused 0 (from 0)
5.74 s
Unpacking objects: 100% (17/17)
Unpacking objects: 100% (17/17), 12.12 MiB | 22.70 MiB/s, done.
5.75 s
From https://github.com/lcnbr/tymbolica
5.75 s
f8b08db..32ae004 main -> main
6.33 s
7.52 s
Downloading cached oniguruma-6.9.10-lib from https://cache.nix-ci.com
7.52 s
Downloading cached cargo-install-hook.sh from https://cache.nix-ci.com
7.52 s
Downloading cached writable-tmpdir-as-home-hook from https://cache.nix-ci.com
7.52 s
Downloading cached anyhow from https://cache.nix-ci.com
7.52 s
Downloading cached diff from https://cache.nix-ci.com
7.52 s
Downloading cached equivalent from https://cache.nix-ci.com
7.52 s
Downloading cached hashbrown from https://cache.nix-ci.com
7.52 s
Downloading cached indexmap from https://cache.nix-ci.com
7.52 s
Downloading cached itoa from https://cache.nix-ci.com
7.52 s
Downloading cached memchr from https://cache.nix-ci.com
7.52 s
Downloading cached pretty_assertions from https://cache.nix-ci.com
7.52 s
Downloading cached proc-macro2 from https://cache.nix-ci.com
7.52 s
Downloading cached quote from https://cache.nix-ci.com
7.52 s
Downloading cached serde from https://cache.nix-ci.com
7.52 s
Downloading cached serde_core from https://cache.nix-ci.com
7.52 s
Downloading cached serde_derive from https://cache.nix-ci.com
7.57 s
Downloaded cached cargo-install-hook.sh (2008 B) in 50ms
7.57 s
Progress: 0 of 17 built, 1 of 42 downloaded from cache (15 downloading)
7.57 s
Downloading cached cargo-auditable from https://cache.nix-ci.com
7.57 s
Downloaded cached writable-tmpdir-as-home-hook (760 B) in 49ms
7.57 s
Progress: 0 of 16 built, 2 of 42 downloaded from cache (15 downloading)
7.57 s
Downloading cached cargo-build-hook.sh from https://cache.nix-ci.com
7.58 s
Downloaded cached indexmap (530 KiB) in 60ms
7.58 s
Progress: 0 of 15 built, 3 of 42 downloaded from cache (15 downloading)
7.58 s
Downloading cached cargo-check-hook.sh from https://cache.nix-ci.com
7.59 s
Downloaded cached itoa (53 KiB) in 67ms
7.59 s
Progress: 0 of 15 built, 4 of 42 downloaded from cache (15 downloading)
7.59 s
Downloading cached diffutils from https://cache.nix-ci.com
7.59 s
Downloaded cached anyhow (240 KiB) in 68ms
7.59 s
Progress: 0 of 15 built, 5 of 42 downloaded from cache (15 downloading)
7.59 s
Downloading cached llvm-21.1.8-lib from https://cache.nix-ci.com
7.60 s
Downloaded cached hashbrown (876 KiB) in 75ms
7.60 s
Progress: 0 of 15 built, 6 of 42 downloaded from cache (15 downloading)
7.60 s
Downloaded cached equivalent (21 KiB) in 75ms
7.60 s
Downloading cached serde_json from https://cache.nix-ci.com
7.60 s
Progress: 0 of 15 built, 7 of 42 downloaded from cache (15 downloading)
7.60 s
Downloading cached serde_spanned from https://cache.nix-ci.com
7.60 s
Downloaded cached quote (142 KiB) in 77ms
7.60 s
Progress: 0 of 15 built, 8 of 42 downloaded from cache (15 downloading)
7.60 s
Downloading cached syn from https://cache.nix-ci.com
7.60 s
Downloaded cached memchr (585 KiB) in 78ms
7.60 s
Progress: 0 of 15 built, 9 of 42 downloaded from cache (15 downloading)
7.60 s
Downloaded cached diff (933 KiB) in 79ms
7.60 s
Downloading cached toml-1.1.4+spec from https://cache.nix-ci.com
7.60 s
Progress: 0 of 15 built, 10 of 42 downloaded from cache (15 downloading)
7.60 s
Downloaded cached serde_core (389 KiB) in 78ms
7.60 s
Downloading cached toml_datetime-1.1.1+spec from https://cache.nix-ci.com
7.60 s
Progress: 0 of 15 built, 11 of 42 downloaded from cache (15 downloading)
7.60 s
Downloading cached toml_edit-0.25.13+spec from https://cache.nix-ci.com
7.60 s
Downloaded cached proc-macro2 (271 KiB) in 80ms
7.60 s
Progress: 0 of 15 built, 12 of 42 downloaded from cache (15 downloading)
7.60 s
Downloading cached toml_parser-1.1.3+spec from https://cache.nix-ci.com
7.60 s
Downloaded cached pretty_assertions (127 KiB) in 81ms
7.60 s
Progress: 0 of 15 built, 13 of 42 downloaded from cache (15 downloading)
7.60 s
Downloading cached toml_writer-1.1.2+spec from https://cache.nix-ci.com
7.60 s
Downloaded cached serde (555 KiB) in 82ms
7.60 s
Progress: 0 of 15 built, 14 of 42 downloaded from cache (15 downloading)
7.60 s
Downloading cached unicode-ident from https://cache.nix-ci.com
7.63 s
Downloaded cached cargo-build-hook.sh (2688 B) in 55ms
7.63 s
Progress: 0 of 15 built, 15 of 42 downloaded from cache (15 downloading)
7.63 s
Downloading cached winnow from https://cache.nix-ci.com
7.63 s
Downloaded cached cargo-auditable (2.7 MiB) in 62ms
7.63 s
Progress: 0 of 14 built, 16 of 42 downloaded from cache (15 downloading)
7.63 s
Downloading cached yansi from https://cache.nix-ci.com
7.63 s
Downloaded cached cargo-check-hook.sh (2608 B) in 51ms
7.63 s
Progress: 0 of 14 built, 17 of 42 downloaded from cache (15 downloading)
7.64 s
Downloading cached zmij from https://cache.nix-ci.com
7.65 s
Downloaded cached serde_spanned (35 KiB) in 54ms
7.65 s
Progress: 0 of 13 built, 18 of 42 downloaded from cache (15 downloading)
7.66 s
Downloaded cached diffutils (1.5 MiB) in 69ms
7.66 s
Progress: 0 of 13 built, 19 of 42 downloaded from cache (14 downloading)
7.66 s
Downloading cached cargo-setup-hook.sh from https://cache.nix-ci.com
7.66 s
Downloaded cached toml-1.1.4+spec (326 KiB) in 60ms
7.66 s
Progress: 0 of 13 built, 20 of 42 downloaded from cache (14 downloading)
7.67 s
Downloaded cached syn (2.3 MiB) in 65ms
7.67 s
Progress: 0 of 13 built, 21 of 42 downloaded from cache (13 downloading)
7.67 s
Downloaded cached toml_edit-0.25.13+spec (359 KiB) in 70ms
7.67 s
Progress: 0 of 13 built, 22 of 42 downloaded from cache (12 downloading)
7.67 s
Downloaded cached toml_datetime-1.1.1+spec (71 KiB) in 71ms
7.67 s
Progress: 0 of 13 built, 23 of 42 downloaded from cache (11 downloading)
7.68 s
Downloaded cached toml_parser-1.1.3+spec (241 KiB) in 78ms
7.68 s
Progress: 0 of 13 built, 24 of 42 downloaded from cache (10 downloading)
7.69 s
Downloaded cached toml_writer-1.1.2+spec (74 KiB) in 82ms
7.69 s
Progress: 0 of 13 built, 25 of 42 downloaded from cache (9 downloading)
7.70 s
Downloaded cached unicode-ident (335 KiB) in 94ms
7.70 s
Progress: 0 of 13 built, 26 of 42 downloaded from cache (8 downloading)
7.71 s
Downloaded cached oniguruma-6.9.10-lib (692 KiB) in 189ms
7.71 s
Progress: 0 of 13 built, 27 of 42 downloaded from cache (7 downloading)
7.71 s
Downloading cached jq from https://cache.nix-ci.com
7.72 s
Downloaded cached yansi (168 KiB) in 86ms
7.72 s
Progress: 0 of 13 built, 28 of 42 downloaded from cache (7 downloading)
7.72 s
Downloaded cached serde_derive (333 KiB) in 197ms
7.72 s
Progress: 0 of 13 built, 29 of 42 downloaded from cache (6 downloading)
7.72 s
Downloaded cached zmij (95 KiB) in 85ms
7.72 s
Progress: 0 of 13 built, 30 of 42 downloaded from cache (5 downloading)
7.73 s
Downloaded cached cargo-setup-hook.sh (3896 B) in 71ms
7.73 s
Progress: 0 of 13 built, 31 of 42 downloaded from cache (4 downloading)
7.73 s
Downloaded cached winnow (1.3 MiB) in 105ms
7.73 s
Progress: 0 of 12 built, 32 of 42 downloaded from cache (3 downloading)
7.79 s
Downloaded cached serde_json (751 KiB) in 187ms
7.79 s
Progress: 0 of 12 built, 33 of 42 downloaded from cache (2 downloading)
7.79 s
Downloading cached cargo-vendor-dir from https://cache.nix-ci.com
7.79 s
Downloaded cached jq (440 KiB) in 79ms
7.79 s
Progress: 0 of 12 built, 34 of 42 downloaded from cache (2 downloading)
7.79 s
Downloading cached jq-1.8.2-bin from https://cache.nix-ci.com
7.83 s
Downloaded cached cargo-vendor-dir (7336 B) in 48ms
7.83 s
Progress: 0 of 12 built, 35 of 42 downloaded from cache (2 downloading)
7.88 s
Downloaded cached jq-1.8.2-bin (34 KiB) in 89ms
7.88 s
Progress: 0 of 11 built, 36 of 42 downloaded from cache (1 downloading)
7.88 s
Downloading cached jq-1.8.2-dev from https://cache.nix-ci.com
7.96 s
Downloaded cached jq-1.8.2-dev (14 KiB) in 77ms
7.96 s
Progress: 0 of 11 built, 37 of 42 downloaded from cache (1 downloading)
9.28 s
Downloaded cached llvm-21.1.8-lib (540.2 MiB) in 1.6s
9.28 s
Progress: 0 of 10 built, 38 of 42 downloaded from cache
9.28 s
Downloading cached rustc from https://cache.nix-ci.com
12.63 s
Downloaded cached rustc (1 GiB) in 3.3s
12.63 s
Progress: 0 of 10 built, 39 of 42 downloaded from cache
12.63 s
Downloading cached rustc-wrapper from https://cache.nix-ci.com
12.68 s
Downloaded cached rustc-wrapper (3368 B) in 49ms
12.68 s
Progress: 0 of 10 built, 40 of 42 downloaded from cache
12.68 s
Downloading cached cargo from https://cache.nix-ci.com
12.85 s
Downloaded cached cargo (38.1 MiB) in 171ms
12.85 s
Progress: 0 of 9 built, 41 of 42 downloaded from cache
12.85 s
Downloading cached auditable-cargo from https://cache.nix-ci.com
12.90 s
Downloaded cached auditable-cargo (16 KiB) in 48ms
12.90 s
Progress: 0 of 8 built, 42 of 42 downloaded from cache
13.00 s
Building /nix/store/mgnhvgks1lcy7dp8bxxhmqkm331x87cy-crane-utils-0.0.1.drv
13.04 s
[crane-utils] Phase: unpackPhase
13.05 s
[crane-utils] unpacking source archive /nix/store/0j28arwrbgjrf5z45dcz8xv1krkazjp6-source
13.05 s
[crane-utils] source root is source
13.05 s
[crane-utils] Executing cargoSetupPostUnpackHook
13.14 s
[crane-utils] Finished cargoSetupPostUnpackHook
13.14 s
[crane-utils] Phase: patchPhase
13.15 s
[crane-utils] Executing cargoSetupPostPatchHook
13.15 s
[crane-utils] Validating consistency between /build/source/Cargo.lock and /build/cargo-vendor-dir/Cargo.lock
13.15 s
[crane-utils] Finished cargoSetupPostPatchHook
13.15 s
[crane-utils] Phase: updateAutotoolsGnuConfigScriptsPhase
13.16 s
[crane-utils] Phase: configurePhase
13.16 s
[crane-utils] Phase: buildPhase
13.16 s
[crane-utils] Executing cargoBuildHook
13.16 s
[crane-utils] cargoBuildHook flags: -j 16 --target x86_64-unknown-linux-gnu --offline --profile release
13.28 s
[crane-utils] Compiling serde_core v1.0.229
13.28 s
[crane-utils] Compiling proc-macro2 v1.0.106
13.29 s
[crane-utils] Compiling quote v1.0.45
13.29 s
[crane-utils] Compiling unicode-ident v1.0.24
13.29 s
[crane-utils] Compiling equivalent v1.0.2
13.29 s
[crane-utils] Compiling zmij v1.0.21
13.29 s
[crane-utils] Compiling winnow v1.0.1
13.29 s
[crane-utils] Compiling hashbrown v0.17.0
13.29 s
[crane-utils] Compiling toml_writer v1.1.2+spec-1.1.0
13.29 s
[crane-utils] Compiling serde_json v1.0.151
13.29 s
[crane-utils] Compiling serde v1.0.229
13.29 s
[crane-utils] Compiling anyhow v1.0.104
13.29 s
[crane-utils] Compiling memchr v2.8.0
13.29 s
[crane-utils] Compiling itoa v1.0.18
14.06 s
[crane-utils] Compiling indexmap v2.14.0
14.16 s
[crane-utils] Compiling syn v3.0.3
14.60 s
[crane-utils] Compiling toml_parser v1.1.3+spec-1.1.0
15.74 s
[crane-utils] Compiling serde_derive v1.0.229
15.89 s
[crane-utils] Compiling toml_datetime v1.1.1+spec-1.1.0
15.89 s
[crane-utils] Compiling serde_spanned v1.1.1
16.06 s
[crane-utils] Compiling toml v1.1.4+spec-1.1.0
16.06 s
[crane-utils] Compiling toml_edit v0.25.13+spec-1.1.0
18.91 s
[crane-utils] Compiling crane-utils v0.1.0 (/build/source)
19.79 s
[crane-utils] Finished `release` profile [optimized] target(s) in 6.59s
19.79 s
[crane-utils] Executing cargoInstallPostBuildHook
19.82 s
[crane-utils] Finished cargoInstallPostBuildHook
19.82 s
[crane-utils] Finished cargoBuildHook
19.82 s
[crane-utils] Phase: checkPhase
19.82 s
[crane-utils] Executing cargoCheckHook
19.83 s
[crane-utils] cargoCheckHook flags: -j 16 --profile release --target x86_64-unknown-linux-gnu --offline --
19.86 s
[crane-utils] Compiling yansi v1.0.1
19.86 s
[crane-utils] Compiling diff v0.1.13
20.11 s
[crane-utils] Compiling pretty_assertions v1.4.1
20.48 s
[crane-utils] Compiling crane-utils v0.1.0 (/build/source)
21.10 s
[crane-utils] Finished `release` profile [optimized] target(s) in 1.25s
21.10 s
[crane-utils] Running unittests src/bin/crane-json2toml.rs (target/x86_64-unknown-linux-gnu/release/deps/crane_json2toml-81e0493385ff602f)
21.10 s
[crane-utils]
21.10 s
[crane-utils] running 0 tests
21.10 s
[crane-utils]
21.10 s
[crane-utils] test result: ok. 0 passed; 0 failed; 0 ignored; 0 measured; 0 filtered out; finished in 0.00s
21.10 s
[crane-utils]
21.10 s
[crane-utils] Running unittests src/bin/crane-resolve-workspace-inheritance.rs (target/x86_64-unknown-linux-gnu/release/deps/crane_resolve_workspace_inheritance-17631877c58153a5)
21.10 s
[crane-utils]
21.10 s
[crane-utils] running 2 tests
21.10 s
[crane-utils] test tests::dependency_comments_ignored ... ok
21.10 s
[crane-utils] test tests::smoke ... ok
21.10 s
[crane-utils]
21.10 s
[crane-utils] test result: ok. 2 passed; 0 failed; 0 ignored; 0 measured; 0 filtered out; finished in 0.00s
21.10 s
[crane-utils]
21.10 s
[crane-utils] Finished cargoCheckHook
21.11 s
[crane-utils] Phase: installPhase
21.11 s
[crane-utils] Executing cargoInstallHook
21.13 s
[crane-utils] Finished cargoInstallHook
21.13 s
[crane-utils] Phase: fixupPhase
21.14 s
[crane-utils] shrinking RPATHs of ELF executables and libraries in /nix/store/carsnga6bh1ilqhsm8dx0h5zk0y8xwyn-crane-utils-0.0.1
21.15 s
[crane-utils] shrinking /nix/store/carsnga6bh1ilqhsm8dx0h5zk0y8xwyn-crane-utils-0.0.1/bin/crane-json2toml
21.15 s
[crane-utils] shrinking /nix/store/carsnga6bh1ilqhsm8dx0h5zk0y8xwyn-crane-utils-0.0.1/bin/crane-resolve-workspace-inheritance
21.15 s
[crane-utils] checking for references to /build/ in /nix/store/carsnga6bh1ilqhsm8dx0h5zk0y8xwyn-crane-utils-0.0.1...
21.16 s
[crane-utils] patching script interpreter paths in /nix/store/carsnga6bh1ilqhsm8dx0h5zk0y8xwyn-crane-utils-0.0.1
21.17 s
[crane-utils] stripping (with command strip and flags -S -p) in /nix/store/carsnga6bh1ilqhsm8dx0h5zk0y8xwyn-crane-utils-0.0.1/bin
21.25 s
[crane-utils:post-build] Uploading to the NixCI cache: /nix/store/carsnga6bh1ilqhsm8dx0h5zk0y8xwyn-crane-utils-0.0.1
21.30 s
[crane-utils:post-build] warning: 'warn-short-path-literals' is deprecated, use 'lint-short-path-literals = ignore' instead
21.31 s
[crane-utils:post-build] copying 1 paths...
21.31 s
[crane-utils:post-build] copying path '/nix/store/carsnga6bh1ilqhsm8dx0h5zk0y8xwyn-crane-utils-0.0.1' to 'https://cache.nix-ci.com'...
21.96 s
[crane-utils:post-build] warning: 'warn-short-path-literals' is deprecated, use 'lint-short-path-literals = ignore' instead
22.02 s
[crane-utils:post-build] copying 0 paths...
22.03 s
Uploaded crane-utils in 800ms
22.04 s
Progress: 1 of 8 built, 42 of 42 downloaded from cache
22.04 s
Built crane-utils in 9.0s
22.06 s
Building /nix/store/z3anfm6g8wivqivwhmz1i5ba17i9bsnz-cargo-git-https-github.com-lcnbr-tymbolica-32ae00483b4845161401afac8be755cc336cb2bb.drv
22.09 s
Building /nix/store/1bwb620m37xdacivng364zxcllmi8bi0-cargo-git-https-github.com-symbolica-dev-symbolica-4f1323185fe5e0c0f8c864ab89edd1905e7adef1.drv
22.13 s
[cargo-git-https-github.com-lcnbr-tymbolica] Phase: unpackPhase
22.14 s
[cargo-git-https-github.com-lcnbr-tymbolica] unpacking source archive /nix/store/hghi51iby4jnwnp3w20ll6irxli6yw9l-source
22.17 s
[cargo-git-https-github.com-lcnbr-tymbolica] source root is source
22.17 s
[cargo-git-https-github.com-symbolica-dev-symbolica] Phase: unpackPhase
22.17 s
[cargo-git-https-github.com-symbolica-dev-symbolica] unpacking source archive /nix/store/20yn9jfx1dr8sydak881lh263db95i1s-source
22.17 s
[cargo-git-https-github.com-lcnbr-tymbolica] Phase: patchPhase
22.18 s
[cargo-git-https-github.com-lcnbr-tymbolica] Phase: updateAutotoolsGnuConfigScriptsPhase
22.19 s
[cargo-git-https-github.com-lcnbr-tymbolica] Phase: installPhase
22.21 s
[cargo-git-https-github.com-symbolica-dev-symbolica] source root is source
22.22 s
[cargo-git-https-github.com-symbolica-dev-symbolica] Phase: patchPhase
22.23 s
[cargo-git-https-github.com-symbolica-dev-symbolica] Phase: updateAutotoolsGnuConfigScriptsPhase
22.24 s
[cargo-git-https-github.com-symbolica-dev-symbolica] Phase: installPhase
22.26 s
[cargo-git-https-github.com-symbolica-dev-symbolica] warning : manifest has no description, license, license-file, documentation, homepage or repository
22.26 s
[cargo-git-https-github.com-symbolica-dev-symbolica] |
22.26 s
[cargo-git-https-github.com-symbolica-dev-symbolica] = note : see https://doc.rust-lang.org/cargo/reference/manifest.html#package-metadata for more info
22.30 s
[cargo-git-https-github.com-symbolica-dev-symbolica] warning : manifest has no description, license, license-file, documentation, homepage or repository
22.30 s
[cargo-git-https-github.com-symbolica-dev-symbolica] |
22.30 s
[cargo-git-https-github.com-symbolica-dev-symbolica] = note : see https://doc.rust-lang.org/cargo/reference/manifest.html#package-metadata for more info
22.51 s
[cargo-git-https-github.com-lcnbr-tymbolica] warning : manifest has no description, documentation, homepage or repository
22.51 s
[cargo-git-https-github.com-lcnbr-tymbolica] |
22.51 s
[cargo-git-https-github.com-lcnbr-tymbolica] = note : see https://doc.rust-lang.org/cargo/reference/manifest.html#package-metadata for more info
22.55 s
[cargo-git-https-github.com-lcnbr-tymbolica] warning : manifest has no description, documentation, homepage or repository
22.55 s
[cargo-git-https-github.com-lcnbr-tymbolica] |
22.55 s
[cargo-git-https-github.com-lcnbr-tymbolica] = note : see https://doc.rust-lang.org/cargo/reference/manifest.html#package-metadata for more info
22.59 s
[cargo-git-https-github.com-lcnbr-tymbolica] warning : manifest has no description, documentation, homepage or repository
22.59 s
[cargo-git-https-github.com-lcnbr-tymbolica] |
22.59 s
[cargo-git-https-github.com-lcnbr-tymbolica] = note : see https://doc.rust-lang.org/cargo/reference/manifest.html#package-metadata for more info
22.62 s
[cargo-git-https-github.com-lcnbr-tymbolica] warning : manifest has no description, documentation, homepage or repository
22.62 s
[cargo-git-https-github.com-lcnbr-tymbolica] |
22.62 s
[cargo-git-https-github.com-lcnbr-tymbolica] = note : see https://doc.rust-lang.org/cargo/reference/manifest.html#package-metadata for more info
22.71 s
[cargo-git-https-github.com-lcnbr-tymbolica] warning : manifest has no description, documentation, homepage or repository
22.71 s
[cargo-git-https-github.com-lcnbr-tymbolica] |
22.71 s
[cargo-git-https-github.com-lcnbr-tymbolica] = note : see https://doc.rust-lang.org/cargo/reference/manifest.html#package-metadata for more info
22.80 s
[cargo-git-https-github.com-lcnbr-tymbolica:post-build] Uploading to the NixCI cache: /nix/store/2hrk5r35kdv4hcjg0hyifjznri2xvd0g-cargo-git-https-github.com-lcnbr-tymbolica-32ae00483b4845161401afac8be755cc336cb2bb
22.85 s
[cargo-git-https-github.com-lcnbr-tymbolica:post-build] warning: 'warn-short-path-literals' is deprecated, use 'lint-short-path-literals = ignore' instead
22.86 s
[cargo-git-https-github.com-lcnbr-tymbolica:post-build] copying 1 paths...
22.86 s
[cargo-git-https-github.com-lcnbr-tymbolica:post-build] copying path '/nix/store/2hrk5r35kdv4hcjg0hyifjznri2xvd0g-cargo-git-https-github.com-lcnbr-tymbolica-32ae00483b4845161401afac8be755cc336cb2bb' to 'https://cache.nix-ci.com'...
29.02 s
[cargo-git-https-github.com-lcnbr-tymbolica:post-build] warning: 'warn-short-path-literals' is deprecated, use 'lint-short-path-literals = ignore' instead
29.33 s
[cargo-git-https-github.com-lcnbr-tymbolica:post-build] copying 2 paths...
29.33 s
[cargo-git-https-github.com-lcnbr-tymbolica:post-build] copying path '/nix/store/hghi51iby4jnwnp3w20ll6irxli6yw9l-source' to 'https://cache.nix-ci.com'...
35.65 s
[cargo-git-https-github.com-lcnbr-tymbolica:post-build] copying path '/nix/store/z3anfm6g8wivqivwhmz1i5ba17i9bsnz-cargo-git-https-github.com-lcnbr-tymbolica-32ae00483b4845161401afac8be755cc336cb2bb.drv' to 'https://cache.nix-ci.com'...
35.75 s
Uploaded cargo-git-https-github.com-lcnbr-tymbolica in 12.9s
35.75 s
Progress: 2 of 8 built (1 building), 42 of 42 downloaded from cache
35.75 s
Built cargo-git-https-github.com-lcnbr-tymbolica in 13.6s
35.75 s
Waiting for lock on linkLockedDeps
35.83 s
[cargo-git-https-github.com-symbolica-dev-symbolica:post-build] Uploading to the NixCI cache: /nix/store/0d9skqfjp0i0kc3239p7dnsdbsggczv9-cargo-git-https-github.com-symbolica-dev-symbolica-4f1323185fe5e0c0f8c864ab89edd1905e7adef1
35.88 s
[cargo-git-https-github.com-symbolica-dev-symbolica:post-build] warning: 'warn-short-path-literals' is deprecated, use 'lint-short-path-literals = ignore' instead
35.88 s
[cargo-git-https-github.com-symbolica-dev-symbolica:post-build] copying 1 paths...
35.88 s
[cargo-git-https-github.com-symbolica-dev-symbolica:post-build] copying path '/nix/store/0d9skqfjp0i0kc3239p7dnsdbsggczv9-cargo-git-https-github.com-symbolica-dev-symbolica-4f1323185fe5e0c0f8c864ab89edd1905e7adef1' to 'https://cache.nix-ci.com'...
43.18 s
[cargo-git-https-github.com-symbolica-dev-symbolica:post-build] warning: 'warn-short-path-literals' is deprecated, use 'lint-short-path-literals = ignore' instead
43.43 s
[cargo-git-https-github.com-symbolica-dev-symbolica:post-build] copying 2 paths...
43.43 s
[cargo-git-https-github.com-symbolica-dev-symbolica:post-build] copying path '/nix/store/20yn9jfx1dr8sydak881lh263db95i1s-source' to 'https://cache.nix-ci.com'...
51.74 s
[cargo-git-https-github.com-symbolica-dev-symbolica:post-build] copying path '/nix/store/1bwb620m37xdacivng364zxcllmi8bi0-cargo-git-https-github.com-symbolica-dev-symbolica-4f1323185fe5e0c0f8c864ab89edd1905e7adef1.drv' to 'https://cache.nix-ci.com'...
51.83 s
Uploaded cargo-git-https-github.com-symbolica-dev-symbolica in 16.0s
51.83 s
Progress: 3 of 8 built, 42 of 42 downloaded from cache
51.83 s
Built cargo-git-https-github.com-symbolica-dev-symbolica in 29.7s
51.86 s
Building /nix/store/1ixf4sgajw8k33bfzwnwsqzqj0bacw0b-linkLockedDeps.drv
51.90 s
[linkLockedDeps:post-build] Uploading to the NixCI cache: /nix/store/adqvrk6shrff39zzq2zmcgmv7d0823qz-linkLockedDeps
51.94 s
[linkLockedDeps:post-build] warning: 'warn-short-path-literals' is deprecated, use 'lint-short-path-literals = ignore' instead
52.06 s
[linkLockedDeps:post-build] copying 0 paths...
52.10 s
[linkLockedDeps:post-build] warning: 'warn-short-path-literals' is deprecated, use 'lint-short-path-literals = ignore' instead
52.24 s
[linkLockedDeps:post-build] copying 0 paths...
52.26 s
Uploaded linkLockedDeps in 362ms
52.26 s
Progress: 4 of 8 built, 42 of 42 downloaded from cache
52.26 s
Built linkLockedDeps in 400ms
52.39 s
Building /nix/store/kgm57dlvnvvicjlrbbjbs98r4ypa3qyx-vendor-cargo-deps.drv
52.47 s
[vendor-cargo-deps:post-build] Uploading to the NixCI cache: /nix/store/9rqk4093qnvgswmdk1pbxk9najcrjn7a-vendor-cargo-deps
52.51 s
[vendor-cargo-deps:post-build] warning: 'warn-short-path-literals' is deprecated, use 'lint-short-path-literals = ignore' instead
52.64 s
[vendor-cargo-deps:post-build] copying 0 paths...
52.69 s
[vendor-cargo-deps:post-build] warning: 'warn-short-path-literals' is deprecated, use 'lint-short-path-literals = ignore' instead
52.89 s
[vendor-cargo-deps:post-build] copying 0 paths...
52.91 s
Uploaded vendor-cargo-deps in 449ms
52.91 s
Progress: 5 of 7 built, 42 of 42 downloaded from cache
52.91 s
Built vendor-cargo-deps in 511ms
52.99 s
Building /nix/store/8y99gpj1qs95jysr3c6kccvh7lrd78i4-alphal00p-docs-cargo-0.1.0.drv
53.03 s
[alphal00p-docs-cargo] cargoArtifacts not set, will not reuse any cargo artifacts
53.05 s
[alphal00p-docs-cargo] Phase: unpackPhase
53.05 s
[alphal00p-docs-cargo] unpacking source archive /nix/store/4pklqwhrgb01wfp3djh4jb2wr4xr9ila-source
53.11 s
[alphal00p-docs-cargo] source root is source
53.12 s
[alphal00p-docs-cargo] Phase: patchPhase
53.13 s
[alphal00p-docs-cargo] Executing configureCargoCommonVars
53.14 s
[alphal00p-docs-cargo] Phase: updateAutotoolsGnuConfigScriptsPhase
53.15 s
[alphal00p-docs-cargo] Phase: configurePhase
53.15 s
[alphal00p-docs-cargo] will append /build/source/.cargo-home/config.toml with contents of /nix/store/9rqk4093qnvgswmdk1pbxk9najcrjn7a-vendor-cargo-deps/config.toml
53.15 s
[alphal00p-docs-cargo] default configurePhase, nothing to do
53.15 s
[alphal00p-docs-cargo] Phase: buildPhase
53.16 s
[alphal00p-docs-cargo] +++ command cargo --version
53.16 s
[alphal00p-docs-cargo] cargo 1.98.1 (797e8a9bc 2026-08-05)
53.16 s
[alphal00p-docs-cargo] +++ command cargo build --profile docs --locked -p alphal00p-docs-catalogs --bin alphal00p-docs-catalogs
53.44 s
[alphal00p-docs-cargo] Compiling proc-macro2 v1.0.106
53.44 s
[alphal00p-docs-cargo] Compiling unicode-ident v1.0.24
53.44 s
[alphal00p-docs-cargo] Compiling quote v1.0.45
53.44 s
[alphal00p-docs-cargo] Compiling serde_core v1.0.228
53.44 s
[alphal00p-docs-cargo] Compiling memchr v2.8.0
53.44 s
[alphal00p-docs-cargo] Compiling utf8parse v0.2.2
53.44 s
[alphal00p-docs-cargo] Compiling zmij v1.0.21
53.44 s
[alphal00p-docs-cargo] Compiling serde v1.0.228
53.45 s
[alphal00p-docs-cargo] Compiling anstyle-query v1.1.5
53.45 s
[alphal00p-docs-cargo] Compiling colorchoice v1.0.5
53.45 s
[alphal00p-docs-cargo] Compiling is_terminal_polyfill v1.70.2
53.46 s
[alphal00p-docs-cargo] Compiling serde_json v1.0.149
53.47 s
[alphal00p-docs-cargo] Compiling anstyle v1.0.14
53.47 s
[alphal00p-docs-cargo] Compiling thiserror v2.0.18
53.47 s
[alphal00p-docs-cargo] Compiling equivalent v1.0.2
53.47 s
[alphal00p-docs-cargo] Compiling eyre v0.6.12
53.57 s
[alphal00p-docs-cargo] Compiling anstyle-parse v1.0.0
53.57 s
[alphal00p-docs-cargo] Compiling itoa v1.0.18
53.58 s
[alphal00p-docs-cargo] Compiling heck v0.5.0
53.58 s
[alphal00p-docs-cargo] Compiling hashbrown v0.17.1
53.58 s
[alphal00p-docs-cargo] Compiling clap_lex v1.1.0
53.59 s
[alphal00p-docs-cargo] Compiling regex-syntax v0.8.10
53.66 s
[alphal00p-docs-cargo] Compiling anstream v1.0.0
53.67 s
[alphal00p-docs-cargo] Compiling strsim v0.11.1
53.68 s
[alphal00p-docs-cargo] Compiling indenter v0.3.4
53.70 s
[alphal00p-docs-cargo] Compiling once_cell v1.21.4
53.81 s
[alphal00p-docs-cargo] Compiling clap_builder v4.6.0
53.84 s
[alphal00p-docs-cargo] Compiling aho-corasick v1.1.4
54.18 s
[alphal00p-docs-cargo] Compiling syn v2.0.117
54.61 s
[alphal00p-docs-cargo] Compiling regex-automata v0.4.14
55.01 s
[alphal00p-docs-cargo] Compiling indexmap v2.14.0
55.78 s
[alphal00p-docs-cargo] Compiling serde_derive v1.0.228
55.78 s
[alphal00p-docs-cargo] Compiling thiserror-impl v2.0.18
55.78 s
[alphal00p-docs-cargo] Compiling clap_derive v4.6.1
55.78 s
[alphal00p-docs-cargo] Compiling alphal00p-docs-macros v0.1.0 (/build/source/crates/alphal00p-docs-macros)
55.94 s
[alphal00p-docs-cargo] Compiling regex v1.12.3
56.97 s
[alphal00p-docs-cargo] Compiling clap v4.6.1
57.83 s
[alphal00p-docs-cargo] Compiling alphal00p-docs-schema v0.1.0 (/build/source/crates/alphal00p-docs-schema)
58.37 s
[alphal00p-docs-cargo] Compiling alphal00p-docs-catalogs v0.1.0 (/build/source/crates/alphal00p-docs-catalogs)
62.92 s
[alphal00p-docs-cargo] Finished `docs` profile [unoptimized] target(s) in 9.75s
62.98 s
[alphal00p-docs-cargo] +++ command cargo build --profile docs --locked -p alphal00p-docs-python-exporter --features gammaloop
63.39 s
[alphal00p-docs-cargo] Compiling serde_core v1.0.228
63.39 s
[alphal00p-docs-cargo] Compiling libc v0.2.186
63.39 s
[alphal00p-docs-cargo] Compiling cfg-if v1.0.4
63.39 s
[alphal00p-docs-cargo] Compiling serde v1.0.228
63.39 s
[alphal00p-docs-cargo] Compiling memchr v2.8.0
63.39 s
[alphal00p-docs-cargo] Compiling autocfg v1.5.0
63.39 s
[alphal00p-docs-cargo] Compiling libm v0.2.16
63.39 s
[alphal00p-docs-cargo] Compiling version_check v0.9.5
63.40 s
[alphal00p-docs-cargo] Compiling either v1.15.0
63.41 s
[alphal00p-docs-cargo] Compiling zerocopy v0.8.48
63.42 s
[alphal00p-docs-cargo] Compiling crossbeam-utils v0.8.21
63.42 s
[alphal00p-docs-cargo] Compiling log v0.4.29
63.43 s
[alphal00p-docs-cargo] Compiling rayon-core v1.13.0
63.43 s
[alphal00p-docs-cargo] Compiling unicode-width v0.2.2
63.43 s
[alphal00p-docs-cargo] Compiling foldhash v0.2.0
63.43 s
[alphal00p-docs-cargo] Compiling target-lexicon v0.13.5
63.43 s
[alphal00p-docs-cargo] Compiling syn v2.0.117
63.57 s
[alphal00p-docs-cargo] Compiling syn v3.0.4
63.58 s
[alphal00p-docs-cargo] Compiling serde_json v1.0.149
63.60 s
[alphal00p-docs-cargo] Compiling lazy_static v1.5.0
63.64 s
[alphal00p-docs-cargo] Compiling crunchy v0.2.4
63.64 s
[alphal00p-docs-cargo] Compiling getrandom v0.3.4
63.69 s
[alphal00p-docs-cargo] Compiling paste v1.0.15
63.69 s
[alphal00p-docs-cargo] Compiling siphasher v1.0.2
63.81 s
[alphal00p-docs-cargo] Compiling aho-corasick v1.1.4
63.86 s
[alphal00p-docs-cargo] Compiling num-traits v0.2.19
63.89 s
[alphal00p-docs-cargo] Compiling tiny-keccak v2.0.2
63.91 s
[alphal00p-docs-cargo] Compiling anyhow v1.0.102
63.92 s
[alphal00p-docs-cargo] Compiling itertools v0.14.0
64.02 s
[alphal00p-docs-cargo] Compiling static_assertions v1.1.0
64.05 s
[alphal00p-docs-cargo] Compiling num-conv v0.2.1
64.11 s
[alphal00p-docs-cargo] Compiling powerfmt v0.2.0
64.14 s
[alphal00p-docs-cargo] Compiling rustix v1.1.4
64.18 s
[alphal00p-docs-cargo] Compiling time-core v0.1.8
64.28 s
[alphal00p-docs-cargo] Compiling time-macros v0.2.27
64.37 s
[alphal00p-docs-cargo] Compiling crossbeam-epoch v0.9.18
64.38 s
[alphal00p-docs-cargo] Compiling deranged v0.5.8
64.45 s
[alphal00p-docs-cargo] Compiling linux-raw-sys v0.12.1
64.49 s
[alphal00p-docs-cargo] Compiling allocator-api2 v0.2.21
64.55 s
[alphal00p-docs-cargo] Compiling pyo3-build-config v0.28.3
64.88 s
[alphal00p-docs-cargo] Compiling crossbeam-deque v0.8.6
64.93 s
[alphal00p-docs-cargo] Compiling num_threads v0.1.7
64.94 s
[alphal00p-docs-cargo] Compiling hashbrown v0.16.1
64.94 s
[alphal00p-docs-cargo] Compiling tracing-core v0.1.36
64.95 s
[alphal00p-docs-cargo] Compiling virtue v0.0.18
64.97 s
[alphal00p-docs-cargo] Compiling winnow v1.0.2
65.02 s
[alphal00p-docs-cargo] Compiling arrayvec v0.7.6
65.29 s
[alphal00p-docs-cargo] Compiling regex-automata v0.4.14
65.46 s
[alphal00p-docs-cargo] Compiling rayon v1.12.0
65.60 s
[alphal00p-docs-cargo] Compiling phf_shared v0.11.3
65.62 s
[alphal00p-docs-cargo] Compiling bincode_derive v2.0.1
65.66 s
[alphal00p-docs-cargo] Compiling unty v0.0.4
65.70 s
[alphal00p-docs-cargo] Compiling toml_writer v1.1.1+spec-1.1.0
65.72 s
[alphal00p-docs-cargo] Compiling gmp-mpfr-sys v1.7.1
65.78 s
[alphal00p-docs-cargo] Compiling getrandom v0.2.17
65.82 s
[alphal00p-docs-cargo] Compiling bitflags v2.11.1
65.88 s
[alphal00p-docs-cargo] Compiling time v0.3.47
65.95 s
[alphal00p-docs-cargo] Compiling rand_core v0.6.4
65.95 s
[alphal00p-docs-cargo] Compiling serde_spanned v1.1.1
66.00 s
[alphal00p-docs-cargo] Compiling rand_core v0.9.5
66.05 s
[alphal00p-docs-cargo] Compiling pin-project-lite v0.2.17
66.09 s
[alphal00p-docs-cargo] Compiling nu-ansi-term v0.50.3
66.16 s
[alphal00p-docs-cargo] Compiling num-integer v0.1.46
66.18 s
[alphal00p-docs-cargo] Compiling approx v0.5.1
66.19 s
[alphal00p-docs-cargo] Compiling bytemuck_derive v1.12.0
66.20 s
[alphal00p-docs-cargo] Compiling toml_parser v1.1.2+spec-1.1.0
66.20 s
[alphal00p-docs-cargo] Compiling tracing-log v0.2.0
66.26 s
[alphal00p-docs-cargo] Compiling matrixmultiply v0.3.10
66.30 s
[alphal00p-docs-cargo] Compiling sharded-slab v0.1.7
66.35 s
[alphal00p-docs-cargo] Compiling hashbrown v0.17.1
66.37 s
[alphal00p-docs-cargo] Compiling thread_local v1.1.9
66.38 s
[alphal00p-docs-cargo] Compiling syn v1.0.109
66.45 s
[alphal00p-docs-cargo] Compiling typenum v1.20.0
66.47 s
[alphal00p-docs-cargo] Compiling rug v1.30.0
66.48 s
[alphal00p-docs-cargo] Compiling option-ext v0.2.0
66.52 s
[alphal00p-docs-cargo] Compiling dirs-sys v0.5.0
66.54 s
[alphal00p-docs-cargo] Compiling pyo3-ffi v0.28.3
66.68 s
[alphal00p-docs-cargo] Compiling num-complex v0.4.6
66.70 s
[alphal00p-docs-cargo] Compiling toml_datetime v1.1.1+spec-1.1.0
66.71 s
[alphal00p-docs-cargo] Compiling dyn-clone v1.0.20
66.71 s
[alphal00p-docs-cargo] Compiling az v1.3.0
66.73 s
[alphal00p-docs-cargo] Compiling rawpointer v0.2.1
66.78 s
[alphal00p-docs-cargo] Compiling fnv v1.0.7
66.78 s
[alphal00p-docs-cargo] Compiling alloc-no-stdlib v2.0.4
66.85 s
[alphal00p-docs-cargo] Compiling alloc-stdlib v0.2.2
66.86 s
[alphal00p-docs-cargo] Compiling num-bigint v0.4.6
66.90 s
[alphal00p-docs-cargo] Compiling pyo3-macros-backend v0.28.3
66.91 s
[alphal00p-docs-cargo] Compiling generic-array v0.14.7
66.93 s
[alphal00p-docs-cargo] Compiling colored v3.1.1
67.06 s
[alphal00p-docs-cargo] Compiling bitflags v1.3.2
67.06 s
[alphal00p-docs-cargo] Compiling errno v0.3.14
67.11 s
[alphal00p-docs-cargo] Compiling getopts v0.2.24
67.14 s
[alphal00p-docs-cargo] Compiling ident_case v1.0.1
67.15 s
[alphal00p-docs-cargo] Compiling same-file v1.0.6
67.17 s
[alphal00p-docs-cargo] Compiling parking_lot_core v0.9.12
67.17 s
[alphal00p-docs-cargo] Compiling signal-hook v0.3.18
67.24 s
[alphal00p-docs-cargo] Compiling walkdir v2.5.0
67.27 s
[alphal00p-docs-cargo] Compiling bytemuck v1.25.0
67.28 s
[alphal00p-docs-cargo] Compiling signal-hook-registry v1.4.8
67.36 s
[alphal00p-docs-cargo] Compiling indexmap v2.14.0
67.40 s
[alphal00p-docs-cargo] Compiling region v3.0.2
67.41 s
[alphal00p-docs-cargo] Compiling toml v1.1.2+spec-1.1.0
67.42 s
[alphal00p-docs-cargo] Compiling safe_arch v0.7.4
67.43 s
[alphal00p-docs-cargo] Compiling safe_arch v1.2.0
67.44 s
[alphal00p-docs-cargo] Compiling matchers v0.2.0
67.45 s
[alphal00p-docs-cargo] Compiling regex v1.12.3
67.48 s
[alphal00p-docs-cargo] Compiling synstructure v0.13.2
67.49 s
[alphal00p-docs-cargo] Compiling const-random-macro v0.1.16
67.51 s
[alphal00p-docs-cargo] Compiling hugepage-rs v0.1.1
67.56 s
[alphal00p-docs-cargo] Compiling wasmtime-jit-icache-coherence v34.0.2
67.60 s
[alphal00p-docs-cargo] Compiling vte v0.14.1
67.64 s
[alphal00p-docs-cargo] Compiling wide v0.7.33
67.67 s
[alphal00p-docs-cargo] Compiling smartstring v1.0.1
67.70 s
[alphal00p-docs-cargo] Compiling wide v1.7.0
67.71 s
[alphal00p-docs-cargo] Compiling ahash v0.8.12
67.76 s
[alphal00p-docs-cargo] Compiling scopeguard v1.2.0
67.78 s
[alphal00p-docs-cargo] Compiling unic-common v0.9.0
67.80 s
[alphal00p-docs-cargo] Compiling spec_math v0.1.6
67.82 s
[alphal00p-docs-cargo] Compiling unic-char-range v0.9.0
67.89 s
[alphal00p-docs-cargo] Compiling inventory v0.3.24
67.90 s
[alphal00p-docs-cargo] Compiling unic-char-property v0.9.0
67.92 s
[alphal00p-docs-cargo] Compiling serde_derive v1.0.228
67.92 s
[alphal00p-docs-cargo] Compiling zerocopy-derive v0.8.48
67.93 s
[alphal00p-docs-cargo] Compiling tracing-attributes v0.1.31
67.93 s
[alphal00p-docs-cargo] Compiling thiserror-impl v2.0.18
67.96 s
[alphal00p-docs-cargo] Compiling strum_macros v0.27.2
67.98 s
[alphal00p-docs-cargo] Compiling is-macro v0.3.7
68.03 s
[alphal00p-docs-cargo] Compiling unic-ucd-version v0.9.0
68.08 s
[alphal00p-docs-cargo] Compiling lock_api v0.4.14
68.10 s
[alphal00p-docs-cargo] Compiling const-random v0.1.18
68.27 s
[alphal00p-docs-cargo] Compiling terminal_size v0.4.4
68.28 s
[alphal00p-docs-cargo] Compiling brotli-decompressor v5.0.0
68.40 s
[alphal00p-docs-cargo] Compiling mio v1.2.0
68.74 s
[alphal00p-docs-cargo] Compiling rustpython-parser-vendored v0.4.0
68.76 s
[alphal00p-docs-cargo] Compiling itertools v0.11.0
68.88 s
[alphal00p-docs-cargo] Compiling iana-time-zone v0.1.65
68.90 s
[alphal00p-docs-cargo] Compiling fastrand v2.4.1
68.92 s
[alphal00p-docs-cargo] Compiling winnow v0.7.15
68.98 s
[alphal00p-docs-cargo] Compiling minimal-lexical v0.2.1
69.03 s
[alphal00p-docs-cargo] Compiling unicase v2.9.0
69.07 s
[alphal00p-docs-cargo] Compiling rustix v0.38.44
69.11 s
[alphal00p-docs-cargo] Compiling indenter v0.3.4
69.18 s
[alphal00p-docs-cargo] Compiling brotli v8.0.2
69.19 s
[alphal00p-docs-cargo] Compiling nom v7.1.3
69.19 s
[alphal00p-docs-cargo] Compiling clap_builder v4.6.0
69.34 s
[alphal00p-docs-cargo] Compiling thiserror v2.0.18
69.35 s
[alphal00p-docs-cargo] Compiling tracing v0.1.44
69.37 s
[alphal00p-docs-cargo] Compiling simba v0.9.1
69.41 s
[alphal00p-docs-cargo] Compiling rustpython-parser-core v0.4.0
69.47 s
[alphal00p-docs-cargo] Compiling signal-hook-mio v0.2.5
69.58 s
[alphal00p-docs-cargo] Compiling zerofrom-derive v0.1.7
69.61 s
[alphal00p-docs-cargo] Compiling clap_derive v4.6.1
69.80 s
[alphal00p-docs-cargo] Compiling crypto-common v0.1.7
69.82 s
[alphal00p-docs-cargo] Compiling block-buffer v0.10.4
69.90 s
[alphal00p-docs-cargo] Compiling directories v6.0.0
69.91 s
[alphal00p-docs-cargo] Compiling numpy v0.28.0
70.01 s
[alphal00p-docs-cargo] Compiling strum v0.27.2
70.04 s
[alphal00p-docs-cargo] Compiling phf v0.11.3
70.08 s
[alphal00p-docs-cargo] Compiling libloading v0.9.0
70.16 s
[alphal00p-docs-cargo] Compiling self_cell v1.2.2
70.21 s
[alphal00p-docs-cargo] Compiling tinyjson v2.5.1
70.24 s
[alphal00p-docs-cargo] Compiling ed25519-compact v2.4.2
70.25 s
[alphal00p-docs-cargo] Compiling bytes v1.11.1
70.49 s
[alphal00p-docs-cargo] Compiling append-only-vec v0.1.8
70.53 s
[alphal00p-docs-cargo] Compiling linux-raw-sys v0.4.15
70.57 s
[alphal00p-docs-cargo] Compiling byteorder v1.5.0
70.60 s
[alphal00p-docs-cargo] Compiling unicode-segmentation v1.13.2
70.61 s
[alphal00p-docs-cargo] Compiling rustc-hash v2.1.2
70.70 s
[alphal00p-docs-cargo] Compiling data-encoding v2.11.1
70.77 s
[alphal00p-docs-cargo] Compiling ansitok v0.3.0
70.82 s
[alphal00p-docs-cargo] Compiling digest v0.10.7
70.83 s
[alphal00p-docs-cargo] Compiling rustpython-ast v0.4.0
70.85 s
[alphal00p-docs-cargo] Compiling zerofrom v0.1.8
70.97 s
[alphal00p-docs-cargo] Compiling unic-ucd-ident v0.9.0
70.99 s
[alphal00p-docs-cargo] Compiling pyo3-macros v0.28.3
71.01 s
[alphal00p-docs-cargo] Compiling unic-emoji-char v0.9.0
71.10 s
[alphal00p-docs-cargo] Compiling yoke-derive v0.8.2
71.14 s
[alphal00p-docs-cargo] Compiling pyo3 v0.28.3
71.19 s
[alphal00p-docs-cargo] Compiling phf_shared v0.13.1
71.34 s
[alphal00p-docs-cargo] Compiling smallvec v1.15.1
71.37 s
[alphal00p-docs-cargo] Compiling bincode v2.0.1
71.39 s
[alphal00p-docs-cargo] Compiling tracing-serde v0.2.0
71.49 s
[alphal00p-docs-cargo] Compiling chrono v0.4.44
71.61 s
[alphal00p-docs-cargo] Compiling tracing-subscriber v0.3.23
71.68 s
[alphal00p-docs-cargo] Compiling clap v4.6.1
71.78 s
[alphal00p-docs-cargo] Compiling bstr v1.12.1
71.86 s
[alphal00p-docs-cargo] Compiling parking_lot v0.12.5
71.87 s
[alphal00p-docs-cargo] Compiling lalrpop-util v0.20.2
72.04 s
[alphal00p-docs-cargo] Compiling typeid v1.0.3
72.05 s
[alphal00p-docs-cargo] Compiling bincode-trait-derive v0.1.1
72.19 s
[alphal00p-docs-cargo] Compiling stable_deref_trait v1.2.1
72.19 s
[alphal00p-docs-cargo] Compiling getrandom v0.4.2
72.20 s
[alphal00p-docs-cargo] Compiling cpufeatures v0.2.17
72.24 s
[alphal00p-docs-cargo] Compiling rustc-hash v1.1.0
72.24 s
[alphal00p-docs-cargo] Compiling ciborium-io v0.2.2
72.28 s
[alphal00p-docs-cargo] Compiling plotters-backend v0.3.7
72.29 s
[alphal00p-docs-cargo] Compiling sha2 v0.10.9
72.33 s
[alphal00p-docs-cargo] Compiling num-rational v0.4.2
72.43 s
[alphal00p-docs-cargo] Compiling plotters-svg v0.3.7
72.44 s
[alphal00p-docs-cargo] Compiling globset v0.4.18
72.47 s
[alphal00p-docs-cargo] Compiling crossterm v0.28.1
72.56 s
[alphal00p-docs-cargo] Compiling toml_datetime v0.6.11
72.57 s
[alphal00p-docs-cargo] Compiling yoke v0.8.3
72.58 s
[alphal00p-docs-cargo] Compiling serde_spanned v0.6.9
72.60 s
[alphal00p-docs-cargo] Compiling xprec v0.2.2
72.60 s
[alphal00p-docs-cargo] Compiling eyre v0.6.12
72.76 s
[alphal00p-docs-cargo] Compiling ppv-lite86 v0.2.21
72.79 s
[alphal00p-docs-cargo] Compiling half v2.7.1
72.80 s
[alphal00p-docs-cargo] Compiling zerovec-derive v0.11.6
72.83 s
[alphal00p-docs-cargo] Compiling console v0.16.3
72.83 s
[alphal00p-docs-cargo] Compiling toml_datetime v0.7.5+spec-1.1.0
72.86 s
[alphal00p-docs-cargo] Compiling itertools v0.10.5
72.89 s
[alphal00p-docs-cargo] Compiling ucd-trie v0.1.7
72.96 s
[alphal00p-docs-cargo] Compiling adler2 v2.0.1
72.98 s
[alphal00p-docs-cargo] Compiling ciborium-ll v0.2.2
73.00 s
[alphal00p-docs-cargo] Compiling cast v0.3.0
73.00 s
[alphal00p-docs-cargo] Compiling toml_write v0.1.2
73.02 s
[alphal00p-docs-cargo] Compiling rand_chacha v0.3.1
73.03 s
[alphal00p-docs-cargo] Compiling rand_chacha v0.9.0
73.06 s
[alphal00p-docs-cargo] Compiling symbolica v2.2.0 (https://github.com/symbolica-dev/symbolica?rev=4f1323185fe5e0c0f8c864ab89edd1905e7adef1#4f132318)
73.07 s
[alphal00p-docs-cargo] Compiling rustversion v1.0.22
73.10 s
[alphal00p-docs-cargo] Compiling simd-adler32 v0.3.10
73.14 s
[alphal00p-docs-cargo] Compiling toml_edit v0.22.27
73.20 s
[alphal00p-docs-cargo] Compiling rand v0.8.6
73.26 s
[alphal00p-docs-cargo] Compiling rand v0.9.4
73.32 s
[alphal00p-docs-cargo] Compiling miniz_oxide v0.8.9
73.33 s
[alphal00p-docs-cargo] Compiling ciborium v0.2.2
73.37 s
[alphal00p-docs-cargo] Compiling pest v2.8.6
73.40 s
[alphal00p-docs-cargo] Compiling toml v0.9.12+spec-1.1.0
73.42 s
[alphal00p-docs-cargo] Compiling rust-embed-utils v8.11.0
73.59 s
[alphal00p-docs-cargo] Compiling plotters v0.3.7
73.70 s
[alphal00p-docs-cargo] Compiling symjit v2.25.6
73.78 s
[alphal00p-docs-cargo] Compiling phf_generator v0.11.3
73.79 s
[alphal00p-docs-cargo] Compiling tinytemplate v1.2.1
73.79 s
[alphal00p-docs-cargo] Compiling zerovec v0.11.8
73.81 s
[alphal00p-docs-cargo] Compiling ansi-str v0.9.0
73.81 s
[alphal00p-docs-cargo] Compiling ndarray v0.17.2
73.90 s
[alphal00p-docs-cargo] Compiling phf_codegen v0.11.3
73.92 s
[alphal00p-docs-cargo] Compiling criterion-plot v0.5.0
73.97 s
[alphal00p-docs-cargo] Compiling displaydoc v0.2.7
74.02 s
[alphal00p-docs-cargo] Compiling unicode_names2_generator v1.3.0
74.10 s
[alphal00p-docs-cargo] Compiling rustpython-parser v0.4.0
74.13 s
[alphal00p-docs-cargo] Compiling is-terminal v0.4.17
74.15 s
[alphal00p-docs-cargo] Compiling slotmap v1.1.1
74.24 s
[alphal00p-docs-cargo] Compiling maplit v1.0.2
74.30 s
[alphal00p-docs-cargo] Compiling oorandom v11.1.5
74.40 s
[alphal00p-docs-cargo] Compiling bytecount v0.6.9
74.41 s
[alphal00p-docs-cargo] Compiling anes v0.1.6
74.45 s
[alphal00p-docs-cargo] Compiling pest_meta v2.8.6
74.50 s
[alphal00p-docs-cargo] Compiling papergrid v0.18.0
74.54 s
[alphal00p-docs-cargo] Compiling ron v0.12.1
74.55 s
[alphal00p-docs-cargo] Compiling criterion v0.5.1
74.57 s
[alphal00p-docs-cargo] Compiling tempfile v3.27.0
74.64 s
[alphal00p-docs-cargo] Compiling testing_table v0.3.0
74.69 s
[alphal00p-docs-cargo] Compiling unicode_names2 v1.3.0
74.73 s
[alphal00p-docs-cargo] Compiling toml v0.8.23
74.81 s
[alphal00p-docs-cargo] Compiling tinystr v0.8.4
75.14 s
[alphal00p-docs-cargo] Compiling toml_edit v0.25.11+spec-1.1.0
75.18 s
[alphal00p-docs-cargo] Compiling tabled_derive v0.12.0
75.20 s
[alphal00p-docs-cargo] Compiling similar v2.7.0
75.28 s
[alphal00p-docs-cargo] Compiling unic-langid-impl v0.9.6
75.30 s
[alphal00p-docs-cargo] Compiling pest_generator v2.8.6
75.94 s
[alphal00p-docs-cargo] Compiling insta v1.47.2
76.08 s
[alphal00p-docs-cargo] Compiling proc-macro2-diagnostics v0.10.1
76.10 s
[alphal00p-docs-cargo] Compiling proc-macro-error-attr v1.0.4
76.27 s
[alphal00p-docs-cargo] Compiling uncased v0.9.10
76.29 s
[alphal00p-docs-cargo] Compiling slab v0.4.12
76.35 s
[alphal00p-docs-cargo] Compiling strsim v0.10.0
76.36 s
[alphal00p-docs-cargo] Compiling radium v0.7.0
76.44 s
[alphal00p-docs-cargo] Compiling pest_derive v2.8.6
76.55 s
[alphal00p-docs-cargo] Compiling darling_core v0.23.0
76.59 s
[alphal00p-docs-cargo] Compiling darling_core v0.14.4
76.60 s
[alphal00p-docs-cargo] Compiling tabled v0.22.0
76.68 s
[alphal00p-docs-cargo] Compiling figment v0.10.19
76.68 s
[alphal00p-docs-cargo] Compiling proc-macro-error v1.0.4
76.93 s
[alphal00p-docs-cargo] Compiling tap v1.0.1
76.98 s
[alphal00p-docs-cargo] Compiling ryu v1.0.23
77.00 s
[alphal00p-docs-cargo] Compiling wyz v0.5.1
77.33 s
[alphal00p-docs-cargo] Compiling castaway v0.2.4
77.34 s
[alphal00p-docs-cargo] Compiling find-msvc-tools v0.1.9
77.39 s
[alphal00p-docs-cargo] Compiling indoc v2.0.7
77.48 s
[alphal00p-docs-cargo] Compiling instability v0.3.12
77.57 s
[alphal00p-docs-cargo] Compiling shlex v1.3.0
77.65 s
[alphal00p-docs-cargo] Compiling heck v0.4.1
77.83 s
[alphal00p-docs-cargo] Compiling funty v2.0.0
77.96 s
[alphal00p-docs-cargo] Compiling cc v1.2.61
77.97 s
[alphal00p-docs-cargo] Compiling duplicate v2.0.1
78.08 s
[alphal00p-docs-cargo] Compiling compact_str v0.9.0
78.41 s
[alphal00p-docs-cargo] Compiling bitvec v1.0.1
78.48 s
[alphal00p-docs-cargo] Compiling dot-parser v0.5.1
78.60 s
[alphal00p-docs-cargo] Compiling unicode-truncate v2.0.1
78.64 s
[alphal00p-docs-cargo] Compiling convert_case v0.10.0
78.82 s
[alphal00p-docs-cargo] Compiling kasuari v0.4.12
78.93 s
[alphal00p-docs-cargo] Compiling darling_macro v0.14.4
78.95 s
[alphal00p-docs-cargo] Compiling serde_repr v0.1.20
79.07 s
[alphal00p-docs-cargo] Compiling env_filter v1.0.1
79.48 s
[alphal00p-docs-cargo] Compiling num-iter v0.1.45
79.49 s
[alphal00p-docs-cargo] Compiling lru v0.16.4
79.51 s
[alphal00p-docs-cargo] Compiling ref-ops v0.2.5
79.57 s
[alphal00p-docs-cargo] Compiling darling_macro v0.23.0
79.62 s
[alphal00p-docs-cargo] Compiling convert_case v0.4.0
79.64 s
[alphal00p-docs-cargo] Compiling jiff v0.2.24
79.65 s
[alphal00p-docs-cargo] Compiling ratatui-core v0.1.0
79.67 s
[alphal00p-docs-cargo] Compiling num v0.4.3
79.69 s
[alphal00p-docs-cargo] Compiling derive_more-impl v2.1.1
79.71 s
[alphal00p-docs-cargo] Compiling duplicate v1.0.0
79.75 s
[alphal00p-docs-cargo] Compiling enum-try-as-inner v0.1.1
79.76 s
[alphal00p-docs-cargo] Compiling darling v0.14.4
79.84 s
[alphal00p-docs-cargo] Compiling derive_builder_core v0.11.2
79.90 s
[alphal00p-docs-cargo] Compiling blake3 v1.8.5
79.92 s
[alphal00p-docs-cargo] Compiling derive_more v0.99.20
79.94 s
[alphal00p-docs-cargo] Compiling rand_xoshiro v0.6.0
80.00 s
[alphal00p-docs-cargo] Compiling delegate v0.12.0
80.09 s
[alphal00p-docs-cargo] Compiling features v0.10.0
80.15 s
[alphal00p-docs-cargo] Compiling colored v2.2.0
80.22 s
[alphal00p-docs-cargo] Compiling object v0.37.3
80.40 s
[alphal00p-docs-cargo] Compiling darling v0.23.0
80.41 s
[alphal00p-docs-cargo] Compiling constcat v0.5.1
80.45 s
[alphal00p-docs-cargo] Compiling thiserror v1.0.69
80.54 s
[alphal00p-docs-cargo] Compiling portable-atomic v1.13.1
80.58 s
[alphal00p-docs-cargo] Compiling owo-colors v4.3.0
80.67 s
[alphal00p-docs-cargo] Compiling gat-lending-iterator v0.1.8
80.70 s
[alphal00p-docs-cargo] Compiling litrs v1.0.0
80.71 s
[alphal00p-docs-cargo] Compiling cfg_aliases v0.2.1
80.78 s
[alphal00p-docs-cargo] Compiling nix v0.31.2
80.79 s
[alphal00p-docs-cargo] Compiling derive_more v2.1.1
80.84 s
[alphal00p-docs-cargo] Compiling derive_builder_macro v0.11.2
80.93 s
[alphal00p-docs-cargo] Compiling rand_distr v0.4.3
80.94 s
[alphal00p-docs-cargo] Compiling simba v0.6.0
80.94 s
[alphal00p-docs-cargo] Compiling phf_generator v0.13.1
80.97 s
[alphal00p-docs-cargo] Compiling nalgebra-macros v0.1.0
81.01 s
[alphal00p-docs-cargo] Compiling thiserror-impl v1.0.69
81.10 s
[alphal00p-docs-cargo] Compiling dirs v6.0.0
81.11 s
[alphal00p-docs-cargo] Compiling line-clipping v0.3.7
81.13 s
[alphal00p-docs-cargo] Compiling vte v0.15.0
81.20 s
[alphal00p-docs-cargo] Compiling document-features v0.2.12
81.21 s
[alphal00p-docs-cargo] Compiling joinery v2.1.0
81.28 s
[alphal00p-docs-cargo] Compiling constant_time_eq v0.4.2
81.32 s
[alphal00p-docs-cargo] Compiling cpufeatures v0.3.0
81.32 s
[alphal00p-docs-cargo] Compiling gimli v0.32.3
81.33 s
[alphal00p-docs-cargo] Compiling ref-cast v1.0.25
81.35 s
[alphal00p-docs-cargo] Compiling color-spantrace v0.3.0
81.38 s
[alphal00p-docs-cargo] Compiling arrayref v0.3.9
81.42 s
[alphal00p-docs-cargo] Compiling clarabel v0.11.1
81.45 s
[alphal00p-docs-cargo] Compiling ratatui-widgets v0.3.0
81.49 s
[alphal00p-docs-cargo] Compiling vt100 v0.16.2
81.68 s
[alphal00p-docs-cargo] Compiling derive_builder v0.11.2
81.74 s
[alphal00p-docs-cargo] Compiling titlecase v2.2.1
81.75 s
[alphal00p-docs-cargo] Compiling phf_macros v0.13.1
81.90 s
[alphal00p-docs-cargo] Compiling crossterm v0.29.0
82.01 s
[alphal00p-docs-cargo] Compiling tracing-error v0.2.1
82.03 s
[alphal00p-docs-cargo] Compiling serde-big-array v0.5.1
82.06 s
[alphal00p-docs-cargo] Compiling ref-cast-impl v1.0.25
82.16 s
[alphal00p-docs-cargo] Compiling enum_dispatch v0.3.13
82.17 s
[alphal00p-docs-cargo] Compiling delegate v0.13.5
82.39 s
[alphal00p-docs-cargo] Compiling serde_derive_internals v0.29.1
82.80 s
[alphal00p-docs-cargo] Compiling env_logger v0.11.10
82.89 s
[alphal00p-docs-cargo] Compiling amd v0.2.2
82.98 s
[alphal00p-docs-cargo] Compiling subprocess v0.2.15
83.01 s
[alphal00p-docs-cargo] Compiling rust_lisp v0.18.0
83.06 s
[alphal00p-docs-cargo] Compiling semver v1.0.28
83.14 s
[alphal00p-docs-cargo] Compiling rustc-demangle v0.1.27
83.22 s
[alphal00p-docs-cargo] Compiling vakint v0.1.2 (/build/source/crates/vakint)
83.25 s
[alphal00p-docs-cargo] Compiling unit-prefix v0.5.2
83.36 s
[alphal00p-docs-cargo] Compiling base64 v0.22.1
83.38 s
[alphal00p-docs-cargo] Compiling indicatif v0.18.4
83.41 s
[alphal00p-docs-cargo] Compiling deprecate-until v1.0.0
83.52 s
[alphal00p-docs-cargo] Compiling string-template-plus v0.4.3
83.53 s
[alphal00p-docs-cargo] Compiling schemars_derive v1.2.1
83.62 s
[alphal00p-docs-cargo] Compiling phf v0.13.1
83.63 s
[alphal00p-docs-cargo] Compiling ratatui-crossterm v0.1.0
83.73 s
[alphal00p-docs-cargo] Compiling ratatui-macros v0.7.0
83.82 s
[alphal00p-docs-cargo] Compiling shellexpand v3.1.2
83.85 s
[alphal00p-docs-cargo] Compiling xpct v0.5.1
83.98 s
[alphal00p-docs-cargo] Compiling brotli-decompressor v4.0.3
84.00 s
[alphal00p-docs-cargo] Compiling integer-sqrt v0.1.5
84.01 s
[alphal00p-docs-cargo] Compiling addr2line v0.25.1
84.06 s
[alphal00p-docs-cargo] Compiling crossbeam-channel v0.5.15
84.07 s
[alphal00p-docs-cargo] Compiling itertools v0.12.1
84.10 s
[alphal00p-docs-cargo] Compiling include_dir_macros v0.7.4
84.26 s
[alphal00p-docs-cargo] Compiling gammaloop-tracing-filter-macros v0.1.0 (/build/source/crates/gammaloop-tracing-filter-macros)
84.31 s
[alphal00p-docs-cargo] Compiling pyo3-stub-gen-derive v0.17.2
84.33 s
[alphal00p-docs-cargo] Compiling unsafe-libyaml v0.2.11
84.45 s
[alphal00p-docs-cargo] Compiling version-compare v0.2.1
84.56 s
[alphal00p-docs-cargo] Compiling gammalooprs v0.3.4 (/build/source/crates/gammalooprs)
84.61 s
[alphal00p-docs-cargo] Compiling symlink v0.1.0
84.62 s
[alphal00p-docs-cargo] Compiling ctrlc v3.5.2
84.67 s
[alphal00p-docs-cargo] Compiling tracing-appender v0.2.5
84.67 s
[alphal00p-docs-cargo] Compiling include_dir v0.7.4
84.69 s
[alphal00p-docs-cargo] Compiling pathfinding v4.15.0
84.76 s
[alphal00p-docs-cargo] Compiling tracing-indicatif v0.3.14
84.77 s
[alphal00p-docs-cargo] Compiling rust-embed-impl v8.11.0
84.81 s
[alphal00p-docs-cargo] Compiling ratatui v0.30.0
84.85 s
[alphal00p-docs-cargo] Compiling json5 v0.4.1
84.87 s
[alphal00p-docs-cargo] Compiling strum_macros v0.26.4
85.01 s
[alphal00p-docs-cargo] Compiling typed-index-collections v3.5.0
85.09 s
[alphal00p-docs-cargo] Compiling brotli v7.0.0
85.29 s
[alphal00p-docs-cargo] Compiling serde_yaml v0.9.34+deprecated
85.33 s
[alphal00p-docs-cargo] Compiling clap_complete v4.6.3
85.40 s
[alphal00p-docs-cargo] Compiling vectorize v0.2.0
85.43 s
[alphal00p-docs-cargo] Compiling strip-ansi-escapes v0.2.1
85.49 s
[alphal00p-docs-cargo] Compiling gammaloop-api v0.1.0 (/build/source/crates/gammaloop-api)
85.63 s
[alphal00p-docs-cargo] Compiling fd-lock v4.0.4
85.65 s
[alphal00p-docs-cargo] Compiling itertools v0.13.0
85.75 s
[alphal00p-docs-cargo] Compiling base62 v2.2.4
85.84 s
[alphal00p-docs-cargo] Compiling strum v0.26.3
85.86 s
[alphal00p-docs-cargo] Compiling ringbuffer v0.16.0
85.88 s
[alphal00p-docs-cargo] Compiling nalgebra v0.29.0
85.95 s
[alphal00p-docs-cargo] Compiling schemars v1.2.1
85.99 s
[alphal00p-docs-cargo] Compiling clap_complete_nushell v4.6.0
86.04 s
[alphal00p-docs-cargo] Compiling sysinfo v0.33.1
86.19 s
[alphal00p-docs-cargo] Compiling backtrace v0.3.76
86.53 s
[alphal00p-docs-cargo] Compiling rust-embed v8.11.0
86.80 s
[alphal00p-docs-cargo] Compiling color-eyre v0.6.5
87.27 s
[alphal00p-docs-cargo] Compiling pyo3-stub-gen v0.17.2
87.55 s
[alphal00p-docs-cargo] Compiling reedline v0.42.0
91.80 s
[alphal00p-docs-cargo] Compiling statrs v0.16.1
92.35 s
[alphal00p-docs-cargo] Compiling momtrop v0.3.0
185.63 s
[alphal00p-docs-cargo] Compiling numerica v3.0.0 (https://github.com/symbolica-dev/symbolica?rev=4f1323185fe5e0c0f8c864ab89edd1905e7adef1#4f132318)
188.44 s
[alphal00p-docs-cargo] Compiling graphica v3.0.0 (https://github.com/symbolica-dev/symbolica?rev=4f1323185fe5e0c0f8c864ab89edd1905e7adef1#4f132318)
209.18 s
[alphal00p-docs-cargo] Compiling symbolica-utils v0.1.0 (/build/source/crates/symbolica-utils)
222.76 s
[alphal00p-docs-cargo] Compiling gammaloop-workspace-hack v0.1.0 (/build/source/crates/gammaloop-workspace-hack)
222.76 s
[alphal00p-docs-cargo] Compiling spenso-macros v0.3.2 (/build/source/crates/spenso-macros)
222.98 s
[alphal00p-docs-cargo] Compiling linnet v0.17.0 (/build/source/crates/linnet)
225.72 s
[alphal00p-docs-cargo] Compiling spenso v0.6.0 (/build/source/crates/spenso)
230.34 s
[alphal00p-docs-cargo] Compiling idenso v0.3.0 (/build/source/crates/idenso)
230.34 s
[alphal00p-docs-cargo] Compiling gammaloop-tracing-filter v0.1.0 (/build/source/crates/gammaloop-tracing-filter)
232.31 s
[alphal00p-docs-cargo] Compiling spenso-hep-lib v0.1.7 (/build/source/crates/spenso-hep-lib)
285.81 s
[alphal00p-docs-cargo] Compiling alphal00p-docs-python-exporter v0.1.0 (/build/source/crates/alphal00p-docs-python-exporter)
297.34 s
[alphal00p-docs-cargo] Finished `docs` profile [unoptimized] target(s) in 3m 54s
297.39 s
[alphal00p-docs-cargo] +++ command cargo build --profile docs --locked -p alphal00p-docs-python-exporter --features linnet
297.63 s
[alphal00p-docs-cargo] Compiling libc v0.2.186
297.63 s
[alphal00p-docs-cargo] Compiling serde_core v1.0.228
297.63 s
[alphal00p-docs-cargo] Compiling zerocopy v0.8.48
297.63 s
[alphal00p-docs-cargo] Compiling log v0.4.29
297.64 s
[alphal00p-docs-cargo] Compiling num-traits v0.2.19
297.64 s
[alphal00p-docs-cargo] Compiling syn v1.0.109
297.65 s
[alphal00p-docs-cargo] Compiling syn v2.0.117
297.65 s
[alphal00p-docs-cargo] Compiling ahash v0.7.8
297.65 s
[alphal00p-docs-cargo] Compiling bytecheck v0.6.12
297.65 s
[alphal00p-docs-cargo] Compiling regex-syntax v0.8.10
297.66 s
[alphal00p-docs-cargo] Compiling rend v0.4.2
297.66 s
[alphal00p-docs-cargo] Compiling simdutf8 v0.1.5
297.66 s
[alphal00p-docs-cargo] Compiling indexmap v2.14.0
297.67 s
[alphal00p-docs-cargo] Compiling ahash v0.8.12
297.67 s
[alphal00p-docs-cargo] Compiling figment v0.10.19
297.67 s
[alphal00p-docs-cargo] Compiling either v1.15.0
297.75 s
[alphal00p-docs-cargo] Compiling rkyv v0.7.46
297.79 s
[alphal00p-docs-cargo] Compiling cgmath v0.18.0
297.80 s
[alphal00p-docs-cargo] Compiling bincode v2.0.1
297.86 s
[alphal00p-docs-cargo] Compiling itertools v0.11.0
297.86 s
[alphal00p-docs-cargo] Compiling pyo3 v0.28.3
297.87 s
[alphal00p-docs-cargo] Compiling venial v0.5.0
297.89 s
[alphal00p-docs-cargo] Compiling seahash v4.1.0
297.90 s
[alphal00p-docs-cargo] Compiling winnow v1.0.2
297.92 s
[alphal00p-docs-cargo] Compiling arrayvec v0.7.6
297.96 s
[alphal00p-docs-cargo] Compiling rustix v1.1.4
297.98 s
[alphal00p-docs-cargo] Compiling smallvec v1.15.1
298.03 s
[alphal00p-docs-cargo] Compiling polycool v0.4.0
298.08 s
[alphal00p-docs-cargo] Compiling winnow v0.7.15
298.09 s
[alphal00p-docs-cargo] Compiling bitflags v2.11.1
298.10 s
[alphal00p-docs-cargo] Compiling toml_parser v1.1.2+spec-1.1.0
298.13 s
[alphal00p-docs-cargo] Compiling toml_writer v1.1.1+spec-1.1.0
298.22 s
[alphal00p-docs-cargo] Compiling kurbo v0.13.1
298.24 s
[alphal00p-docs-cargo] Compiling linnet-py v0.1.0 (/build/source/crates/linnet-py)
298.31 s
[alphal00p-docs-cargo] Compiling num-integer v0.1.46
298.31 s
[alphal00p-docs-cargo] Compiling approx v0.4.0
298.32 s
[alphal00p-docs-cargo] Compiling wasm-minimal-protocol v0.2.0
298.34 s
[alphal00p-docs-cargo] Compiling num-complex v0.4.6
298.40 s
[alphal00p-docs-cargo] Compiling regex-automata v0.4.14
298.45 s
[alphal00p-docs-cargo] Compiling num-bigint v0.4.6
298.49 s
[alphal00p-docs-cargo] Compiling chrono v0.4.44
298.56 s
[alphal00p-docs-cargo] Compiling getrandom v0.2.17
298.59 s
[alphal00p-docs-cargo] Compiling dirs-sys v0.5.0
298.65 s
[alphal00p-docs-cargo] Compiling rand_core v0.6.4
298.66 s
[alphal00p-docs-cargo] Compiling const-random-macro v0.1.16
298.66 s
[alphal00p-docs-cargo] Compiling pyo3-ffi v0.28.3
298.76 s
[alphal00p-docs-cargo] Compiling dirs v6.0.0
298.80 s
[alphal00p-docs-cargo] Compiling hashbrown v0.12.3
298.81 s
[alphal00p-docs-cargo] Compiling shellexpand v3.1.2
298.83 s
[alphal00p-docs-cargo] Compiling getrandom v0.4.2
298.89 s
[alphal00p-docs-cargo] Compiling const-random v0.1.18
299.23 s
[alphal00p-docs-cargo] Compiling tempfile v3.27.0
299.24 s
[alphal00p-docs-cargo] Compiling toml_datetime v0.7.5+spec-1.1.0
299.24 s
[alphal00p-docs-cargo] Compiling serde_spanned v1.1.1
299.26 s
[alphal00p-docs-cargo] Compiling serde_json v1.0.149
299.35 s
[alphal00p-docs-cargo] Compiling toml v0.9.12+spec-1.1.0
299.38 s
[alphal00p-docs-cargo] Compiling ptr_meta_derive v0.1.4
299.38 s
[alphal00p-docs-cargo] Compiling bytecheck_derive v0.6.12
299.38 s
[alphal00p-docs-cargo] Compiling rkyv_derive v0.7.46
299.56 s
[alphal00p-docs-cargo] Compiling globset v0.4.18
299.67 s
[alphal00p-docs-cargo] Compiling ptr_meta v0.1.4
299.76 s
[alphal00p-docs-cargo] Compiling pest_generator v2.8.6
299.76 s
[alphal00p-docs-cargo] Compiling pyo3-macros-backend v0.28.3
299.76 s
[alphal00p-docs-cargo] Compiling proc-macro2-diagnostics v0.10.1
299.76 s
[alphal00p-docs-cargo] Compiling rust-embed-utils v8.11.0
300.07 s
[alphal00p-docs-cargo] Compiling zerocopy-derive v0.8.48
300.07 s
[alphal00p-docs-cargo] Compiling serde_derive v1.0.228
300.07 s
[alphal00p-docs-cargo] Compiling is-macro v0.3.7
300.07 s
[alphal00p-docs-cargo] Compiling thiserror-impl v2.0.18
300.07 s
[alphal00p-docs-cargo] Compiling bincode-trait-derive v0.1.1
300.07 s
[alphal00p-docs-cargo] Compiling duplicate v2.0.1
300.07 s
[alphal00p-docs-cargo] Compiling serde_repr v0.1.20
300.08 s
[alphal00p-docs-cargo] Compiling rust-embed-impl v8.11.0
300.10 s
[alphal00p-docs-cargo] Compiling pest_derive v2.8.6
300.35 s
[alphal00p-docs-cargo] Compiling ppv-lite86 v0.2.21
300.54 s
[alphal00p-docs-cargo] Compiling rand_chacha v0.3.1
300.54 s
[alphal00p-docs-cargo] Compiling dot-parser v0.5.1
300.57 s
[alphal00p-docs-cargo] Compiling rustpython-parser-core v0.4.0
300.63 s
[alphal00p-docs-cargo] Compiling rustpython-ast v0.4.0
300.67 s
[alphal00p-docs-cargo] Compiling rand v0.8.6
300.82 s
[alphal00p-docs-cargo] Compiling thiserror v2.0.18
300.85 s
[alphal00p-docs-cargo] Compiling rust-embed v8.11.0
301.01 s
[alphal00p-docs-cargo] Compiling phf_generator v0.11.3
301.06 s
[alphal00p-docs-cargo] Compiling phf_codegen v0.11.3
301.10 s
[alphal00p-docs-cargo] Compiling unicode_names2_generator v1.3.0
301.11 s
[alphal00p-docs-cargo] Compiling rustpython-parser v0.4.0
301.34 s
[alphal00p-docs-cargo] Compiling unicode_names2 v1.3.0
301.52 s
[alphal00p-docs-cargo] Compiling pyo3-macros v0.28.3
301.62 s
[alphal00p-docs-cargo] Compiling serde v1.0.228
301.88 s
[alphal00p-docs-cargo] Compiling bitvec v1.0.1
303.05 s
[alphal00p-docs-cargo] Compiling half v2.7.1
303.18 s
[alphal00p-docs-cargo] Compiling ciborium-ll v0.2.2
303.25 s
[alphal00p-docs-cargo] Compiling ciborium v0.2.2
303.55 s
[alphal00p-docs-cargo] Compiling kurvst v0.1.0 (/build/source/crates/kurvst)
304.24 s
[alphal00p-docs-cargo] Compiling linnet v0.17.0 (/build/source/crates/linnet)
305.43 s
[alphal00p-docs-cargo] Compiling pyo3-stub-gen-derive v0.17.2
306.33 s
[alphal00p-docs-cargo] Compiling pyo3-stub-gen v0.17.2
307.17 s
[alphal00p-docs-cargo] Compiling linnest v0.1.0 (/build/source/crates/linnest)
315.86 s
[alphal00p-docs-cargo] Compiling alphal00p-docs-python-exporter v0.1.0 (/build/source/crates/alphal00p-docs-python-exporter)
316.73 s
[alphal00p-docs-cargo] Finished `docs` profile [unoptimized] target(s) in 19.34s
316.77 s
[alphal00p-docs-cargo] +++ command cargo build --profile docs --locked -p alphal00p-docs-python-exporter --features spenso
317.05 s
[alphal00p-docs-cargo] Compiling pyo3-build-config v0.28.3
317.05 s
[alphal00p-docs-cargo] Compiling symbolica v2.2.0 (https://github.com/symbolica-dev/symbolica?rev=4f1323185fe5e0c0f8c864ab89edd1905e7adef1#4f132318)
317.06 s
[alphal00p-docs-cargo] Compiling syn v1.0.109
317.06 s
[alphal00p-docs-cargo] Compiling figment v0.10.19
317.42 s
[alphal00p-docs-cargo] Compiling proc-macro-error v1.0.4
317.53 s
[alphal00p-docs-cargo] Compiling duplicate v1.0.0
317.69 s
[alphal00p-docs-cargo] Compiling pyo3-macros-backend v0.28.3
317.69 s
[alphal00p-docs-cargo] Compiling numpy v0.28.0
317.69 s
[alphal00p-docs-cargo] Compiling pyo3-ffi v0.28.3
317.69 s
[alphal00p-docs-cargo] Compiling pyo3 v0.28.3
319.23 s
[alphal00p-docs-cargo] Compiling pyo3-macros v0.28.3
321.62 s
[alphal00p-docs-cargo] Compiling pyo3-stub-gen v0.17.2
322.09 s
[alphal00p-docs-cargo] Compiling numerica v3.0.0 (https://github.com/symbolica-dev/symbolica?rev=4f1323185fe5e0c0f8c864ab89edd1905e7adef1#4f132318)
322.20 s
[alphal00p-docs-cargo] Compiling gammaloop-workspace-hack v0.1.0 (/build/source/crates/gammaloop-workspace-hack)
324.52 s
[alphal00p-docs-cargo] Compiling graphica v3.0.0 (https://github.com/symbolica-dev/symbolica?rev=4f1323185fe5e0c0f8c864ab89edd1905e7adef1#4f132318)
346.24 s
[alphal00p-docs-cargo] Compiling symbolica-utils v0.1.0 (/build/source/crates/symbolica-utils)
346.24 s
[alphal00p-docs-cargo] Compiling tymbolica-atom-payload v0.1.0 (https://github.com/lcnbr/tymbolica?rev=32ae00483b4845161401afac8be755cc336cb2bb#32ae0048)
346.40 s
[alphal00p-docs-cargo] Compiling linnet v0.17.0 (/build/source/crates/linnet)
348.56 s
[alphal00p-docs-cargo] Compiling spenso v0.6.0 (/build/source/crates/spenso)
353.09 s
[alphal00p-docs-cargo] Compiling idenso v0.3.0 (/build/source/crates/idenso)
356.03 s
[alphal00p-docs-cargo] Compiling spenso-hep-lib v0.1.7 (/build/source/crates/spenso-hep-lib)
356.26 s
[alphal00p-docs-cargo] Compiling spynso3 v0.1.2 (/build/source/crates/spynso3)
360.03 s
[alphal00p-docs-cargo] Compiling alphal00p-docs-python-exporter v0.1.0 (/build/source/crates/alphal00p-docs-python-exporter)
365.92 s
[alphal00p-docs-cargo] Finished `docs` profile [unoptimized] target(s) in 49.14s
365.97 s
[alphal00p-docs-cargo] +++ command cargo build --profile docs --locked -p alphal00p-docs-python-exporter --features idenso
366.24 s
[alphal00p-docs-cargo] Compiling pyo3 v0.28.3
367.76 s
[alphal00p-docs-cargo] Compiling numpy v0.28.0
368.15 s
[alphal00p-docs-cargo] Compiling pyo3-stub-gen v0.17.2
368.57 s
[alphal00p-docs-cargo] Compiling numerica v3.0.0 (https://github.com/symbolica-dev/symbolica?rev=4f1323185fe5e0c0f8c864ab89edd1905e7adef1#4f132318)
370.96 s
[alphal00p-docs-cargo] Compiling graphica v3.0.0 (https://github.com/symbolica-dev/symbolica?rev=4f1323185fe5e0c0f8c864ab89edd1905e7adef1#4f132318)
371.15 s
[alphal00p-docs-cargo] Compiling symbolica v2.2.0 (https://github.com/symbolica-dev/symbolica?rev=4f1323185fe5e0c0f8c864ab89edd1905e7adef1#4f132318)
392.63 s
[alphal00p-docs-cargo] Compiling symbolica-utils v0.1.0 (/build/source/crates/symbolica-utils)
392.63 s
[alphal00p-docs-cargo] Compiling gammaloop-workspace-hack v0.1.0 (/build/source/crates/gammaloop-workspace-hack)
392.79 s
[alphal00p-docs-cargo] Compiling linnet v0.17.0 (/build/source/crates/linnet)
394.99 s
[alphal00p-docs-cargo] Compiling spenso v0.6.0 (/build/source/crates/spenso)
399.34 s
[alphal00p-docs-cargo] Compiling idenso v0.3.0 (/build/source/crates/idenso)
404.61 s
[alphal00p-docs-cargo] Compiling alphal00p-docs-python-exporter v0.1.0 (/build/source/crates/alphal00p-docs-python-exporter)
410.57 s
[alphal00p-docs-cargo] Finished `docs` profile [unoptimized] target(s) in 44.60s
410.62 s
[alphal00p-docs-cargo] +++ command cargo build --profile docs --locked -p alphal00p-docs-python-exporter --features vakint
410.85 s
[alphal00p-docs-cargo] Compiling libc v0.2.186
410.85 s
[alphal00p-docs-cargo] Compiling tiny-keccak v2.0.2
410.86 s
[alphal00p-docs-cargo] Compiling bytemuck v1.25.0
410.86 s
[alphal00p-docs-cargo] Compiling matrixmultiply v0.3.10
410.86 s
[alphal00p-docs-cargo] Compiling getrandom v0.3.4
410.87 s
[alphal00p-docs-cargo] Compiling num-integer v0.1.46
410.87 s
[alphal00p-docs-cargo] Compiling pyo3 v0.28.3
410.87 s
[alphal00p-docs-cargo] Compiling regex-automata v0.4.14
410.88 s
[alphal00p-docs-cargo] Compiling pyo3-macros-backend v0.28.3
410.88 s
[alphal00p-docs-cargo] Compiling pyo3-ffi v0.28.3
410.88 s
[alphal00p-docs-cargo] Compiling ahash v0.8.12
410.88 s
[alphal00p-docs-cargo] Compiling approx v0.5.1
410.89 s
[alphal00p-docs-cargo] Compiling serde v1.0.228
410.89 s
[alphal00p-docs-cargo] Compiling itertools v0.14.0
410.89 s
[alphal00p-docs-cargo] Compiling smallvec v1.15.1
410.90 s
[alphal00p-docs-cargo] Compiling gmp-mpfr-sys v1.7.1
410.96 s
[alphal00p-docs-cargo] Compiling safe_arch v0.7.4
410.97 s
[alphal00p-docs-cargo] Compiling rand_core v0.9.5
410.98 s
[alphal00p-docs-cargo] Compiling safe_arch v1.2.0
411.02 s
[alphal00p-docs-cargo] Compiling rayon v1.12.0
411.04 s
[alphal00p-docs-cargo] Compiling tracing-attributes v0.1.31
411.07 s
[alphal00p-docs-cargo] Compiling rand_chacha v0.9.0
411.09 s
[alphal00p-docs-cargo] Compiling smartstring v1.0.1
411.10 s
[alphal00p-docs-cargo] Compiling phf_shared v0.13.1
411.16 s
[alphal00p-docs-cargo] Compiling wide v0.7.33
411.19 s
[alphal00p-docs-cargo] Compiling fastrand v2.4.1
411.22 s
[alphal00p-docs-cargo] Compiling rug v1.30.0
411.24 s
[alphal00p-docs-cargo] Compiling wide v1.7.0
411.25 s
[alphal00p-docs-cargo] Compiling rand v0.9.4
411.27 s
[alphal00p-docs-cargo] Compiling phf_generator v0.13.1
411.28 s
[alphal00p-docs-cargo] Compiling symbolica v2.2.0 (https://github.com/symbolica-dev/symbolica?rev=4f1323185fe5e0c0f8c864ab89edd1905e7adef1#4f132318)
411.37 s
[alphal00p-docs-cargo] Compiling ndarray v0.17.2
411.38 s
[alphal00p-docs-cargo] Compiling phf_macros v0.13.1
411.42 s
[alphal00p-docs-cargo] Compiling directories v6.0.0
411.46 s
[alphal00p-docs-cargo] Compiling subprocess v0.2.15
411.51 s
[alphal00p-docs-cargo] Compiling vakint v0.1.2 (/build/source/crates/vakint)
411.73 s
[alphal00p-docs-cargo] Compiling getrandom v0.2.17
411.80 s
[alphal00p-docs-cargo] Compiling rand_core v0.6.4
411.89 s
[alphal00p-docs-cargo] Compiling rand_chacha v0.3.1
411.93 s
[alphal00p-docs-cargo] Compiling phf v0.13.1
411.98 s
[alphal00p-docs-cargo] Compiling tracing v0.1.44
412.00 s
[alphal00p-docs-cargo] Compiling rand v0.8.6
412.03 s
[alphal00p-docs-cargo] Compiling simba v0.9.1
412.37 s
[alphal00p-docs-cargo] Compiling phf_generator v0.11.3
412.43 s
[alphal00p-docs-cargo] Compiling phf_codegen v0.11.3
412.47 s
[alphal00p-docs-cargo] Compiling unicode_names2_generator v1.3.0
412.48 s
[alphal00p-docs-cargo] Compiling rustpython-parser v0.4.0
412.64 s
[alphal00p-docs-cargo] Compiling regex v1.12.3
412.64 s
[alphal00p-docs-cargo] Compiling matchers v0.2.0
412.70 s
[alphal00p-docs-cargo] Compiling tracing-subscriber v0.3.23
412.76 s
[alphal00p-docs-cargo] Compiling unicode_names2 v1.3.0
412.82 s
[alphal00p-docs-cargo] Compiling titlecase v2.2.1
412.85 s
[alphal00p-docs-cargo] Compiling pyo3-macros v0.28.3
412.91 s
[alphal00p-docs-cargo] Compiling string-template-plus v0.4.3
414.26 s
[alphal00p-docs-cargo] Compiling xprec v0.2.2
415.16 s
[alphal00p-docs-cargo] Compiling numpy v0.28.0
416.91 s
[alphal00p-docs-cargo] Compiling pyo3-stub-gen-derive v0.17.2
417.82 s
[alphal00p-docs-cargo] Compiling pyo3-stub-gen v0.17.2
418.28 s
[alphal00p-docs-cargo] Compiling numerica v3.0.0 (https://github.com/symbolica-dev/symbolica?rev=4f1323185fe5e0c0f8c864ab89edd1905e7adef1#4f132318)
418.37 s
[alphal00p-docs-cargo] error : select an integer backend: `integer-gmp` or `integer-malachite`
418.37 s
[alphal00p-docs-cargo] --> /nix/store/9rqk4093qnvgswmdk1pbxk9najcrjn7a-vendor-cargo-deps/bc87b2b0f37b9a43ffdd82e8f11f3e864d9447ccd53a9a964250c3414c3656d9/numerica-3.0.0/src/lib.rs:40:1
418.37 s
[alphal00p-docs-cargo] |
418.37 s
[alphal00p-docs-cargo] 40 | compile_error!("select an integer backend: `integer-gmp` or `integer-malachite`");
418.37 s
[alphal00p-docs-cargo] | ^^^^^^^^^^^^^^^^^^^^^^^^^^^^^^^^^^^^^^^^^^^^^^^^^^^^^^^^^^^^^^^^^^^^^^^^^^^^^^^^^
418.37 s
[alphal00p-docs-cargo]
418.37 s
[alphal00p-docs-cargo] error : select a float backend: `float-mpfr` or `float-astro`
418.37 s
[alphal00p-docs-cargo] --> /nix/store/9rqk4093qnvgswmdk1pbxk9najcrjn7a-vendor-cargo-deps/bc87b2b0f37b9a43ffdd82e8f11f3e864d9447ccd53a9a964250c3414c3656d9/numerica-3.0.0/src/lib.rs:44:1
418.37 s
[alphal00p-docs-cargo] |
418.37 s
[alphal00p-docs-cargo] 44 | compile_error!("select a float backend: `float-mpfr` or `float-astro`");
418.37 s
[alphal00p-docs-cargo] | ^^^^^^^^^^^^^^^^^^^^^^^^^^^^^^^^^^^^^^^^^^^^^^^^^^^^^^^^^^^^^^^^^^^^^^^
418.37 s
[alphal00p-docs-cargo]
418.52 s
[alphal00p-docs-cargo] error[E0432] : unresolved import `implementation::BackendRandState`
418.52 s
[alphal00p-docs-cargo] --> /nix/store/9rqk4093qnvgswmdk1pbxk9najcrjn7a-vendor-cargo-deps/bc87b2b0f37b9a43ffdd82e8f11f3e864d9447ccd53a9a964250c3414c3656d9/numerica-3.0.0/src/domains/backend/integer.rs:1614:33
418.52 s
[alphal00p-docs-cargo] |
418.52 s
[alphal00p-docs-cargo] 1614 | pub(crate) use implementation::{BackendRandState, Complete, RemRounding};
418.53 s
[alphal00p-docs-cargo] | ^^^^^^^^^^^^^^^^ no `BackendRandState` in `domains::backend::integer::implementation`
418.53 s
[alphal00p-docs-cargo] |
418.53 s
[alphal00p-docs-cargo] note : found an item that was configured out
418.53 s
[alphal00p-docs-cargo] --> /nix/store/9rqk4093qnvgswmdk1pbxk9najcrjn7a-vendor-cargo-deps/bc87b2b0f37b9a43ffdd82e8f11f3e864d9447ccd53a9a964250c3414c3656d9/numerica-3.0.0/src/domains/backend/integer.rs:1378:23
418.53 s
[alphal00p-docs-cargo] |
418.53 s
[alphal00p-docs-cargo] 1377 | #[cfg(feature = "integer-malachite")]
418.53 s
[alphal00p-docs-cargo] | ----------------------------- the item is gated behind the `integer-malachite` feature
418.53 s
[alphal00p-docs-cargo] 1378 | pub(crate) struct BackendRandState {
418.53 s
[alphal00p-docs-cargo] | ^^^^^^^^^^^^^^^^
418.53 s
[alphal00p-docs-cargo] note : found an item that was configured out
418.53 s
[alphal00p-docs-cargo] --> /nix/store/9rqk4093qnvgswmdk1pbxk9najcrjn7a-vendor-cargo-deps/bc87b2b0f37b9a43ffdd82e8f11f3e864d9447ccd53a9a964250c3414c3656d9/numerica-3.0.0/src/domains/backend/integer.rs:1413:23
418.53 s
[alphal00p-docs-cargo] |
418.53 s
[alphal00p-docs-cargo] 1412 | #[cfg(feature = "integer-gmp")]
418.53 s
[alphal00p-docs-cargo] | ----------------------- the item is gated behind the `integer-gmp` feature
418.53 s
[alphal00p-docs-cargo] 1413 | pub(crate) struct BackendRandState(rug::rand::RandState<'static>);
418.53 s
[alphal00p-docs-cargo] | ^^^^^^^^^^^^^^^^
418.53 s
[alphal00p-docs-cargo]
418.53 s
[alphal00p-docs-cargo] error[E0432] : unresolved import `implementation::RawMultiPrecisionInteger`
418.53 s
[alphal00p-docs-cargo] --> /nix/store/9rqk4093qnvgswmdk1pbxk9najcrjn7a-vendor-cargo-deps/bc87b2b0f37b9a43ffdd82e8f11f3e864d9447ccd53a9a964250c3414c3656d9/numerica-3.0.0/src/domains/backend/integer.rs:1616:61
418.53 s
[alphal00p-docs-cargo] |
418.53 s
[alphal00p-docs-cargo] 1616 | MultiPrecisionInteger, ParseMultiPrecisionIntegerError, RawMultiPrecisionInteger,
418.53 s
[alphal00p-docs-cargo] | ^^^^^^^^^^^^^^^^^^^^^^^^ no `RawMultiPrecisionInteger` in `domains::backend::integer::implementation`
418.53 s
[alphal00p-docs-cargo] |
418.53 s
[alphal00p-docs-cargo] note : found an item that was configured out
418.53 s
[alphal00p-docs-cargo] --> /nix/store/9rqk4093qnvgswmdk1pbxk9najcrjn7a-vendor-cargo-deps/bc87b2b0f37b9a43ffdd82e8f11f3e864d9447ccd53a9a964250c3414c3656d9/numerica-3.0.0/src/domains/backend/integer.rs:26:14
418.53 s
[alphal00p-docs-cargo] |
418.53 s
[alphal00p-docs-cargo] 25 | #[cfg(feature = "integer-malachite")]
418.53 s
[alphal00p-docs-cargo] | ----------------------------- the item is gated behind the `integer-malachite` feature
418.53 s
[alphal00p-docs-cargo] 26 | pub type RawMultiPrecisionInteger = malachite_nz::integer::Integer;
418.53 s
[alphal00p-docs-cargo] | ^^^^^^^^^^^^^^^^^^^^^^^^
418.53 s
[alphal00p-docs-cargo] note : found an item that was configured out
418.53 s
[alphal00p-docs-cargo] --> /nix/store/9rqk4093qnvgswmdk1pbxk9najcrjn7a-vendor-cargo-deps/bc87b2b0f37b9a43ffdd82e8f11f3e864d9447ccd53a9a964250c3414c3656d9/numerica-3.0.0/src/domains/backend/integer.rs:29:14
418.53 s
[alphal00p-docs-cargo] |
418.53 s
[alphal00p-docs-cargo] 28 | #[cfg(feature = "integer-gmp")]
418.53 s
[alphal00p-docs-cargo] | ----------------------- the item is gated behind the `integer-gmp` feature
418.53 s
[alphal00p-docs-cargo] 29 | pub type RawMultiPrecisionInteger = rug::Integer;
418.53 s
[alphal00p-docs-cargo] | ^^^^^^^^^^^^^^^^^^^^^^^^
418.53 s
[alphal00p-docs-cargo] help : a similar name exists in the module
418.53 s
[alphal00p-docs-cargo] |
418.53 s
[alphal00p-docs-cargo] 1616 - MultiPrecisionInteger, ParseMultiPrecisionIntegerError, RawMultiPrecisionInteger ,
418.53 s
[alphal00p-docs-cargo] 1616 + MultiPrecisionInteger, ParseMultiPrecisionIntegerError, MultiPrecisionInteger ,
418.53 s
[alphal00p-docs-cargo] |
418.53 s
[alphal00p-docs-cargo]
418.53 s
[alphal00p-docs-cargo] error[E0432] : unresolved imports `implementation::from_be_bytes`, `implementation::to_be_bytes`
418.53 s
[alphal00p-docs-cargo] --> /nix/store/9rqk4093qnvgswmdk1pbxk9najcrjn7a-vendor-cargo-deps/bc87b2b0f37b9a43ffdd82e8f11f3e864d9447ccd53a9a964250c3414c3656d9/numerica-3.0.0/src/domains/backend/integer.rs:1709:33
418.53 s
[alphal00p-docs-cargo] |
418.53 s
[alphal00p-docs-cargo] 1709 | pub(crate) use implementation::{from_be_bytes, to_be_bytes};
418.53 s
[alphal00p-docs-cargo] | ^^^^^^^^^^^^^ ^^^^^^^^^^^ no `to_be_bytes` in `domains::backend::integer::implementation`
418.53 s
[alphal00p-docs-cargo] | |
418.53 s
[alphal00p-docs-cargo] | no `from_be_bytes` in `domains::backend::integer::implementation`
418.53 s
[alphal00p-docs-cargo] |
418.53 s
[alphal00p-docs-cargo] note : found an item that was configured out
418.53 s
[alphal00p-docs-cargo] --> /nix/store/9rqk4093qnvgswmdk1pbxk9najcrjn7a-vendor-cargo-deps/bc87b2b0f37b9a43ffdd82e8f11f3e864d9447ccd53a9a964250c3414c3656d9/numerica-3.0.0/src/domains/backend/integer.rs:1370:19
418.53 s
[alphal00p-docs-cargo] |
418.53 s
[alphal00p-docs-cargo] 1369 | #[cfg(all(feature = "integer-malachite", feature = "bincode"))]
418.53 s
[alphal00p-docs-cargo] | ----------------------------- the item is gated behind the `integer-malachite` feature
418.53 s
[alphal00p-docs-cargo] 1370 | pub(crate) fn from_be_bytes(bytes: &[u8]) -> Result<MultiPrecisionInteger, &'static str> {
418.53 s
[alphal00p-docs-cargo] | ^^^^^^^^^^^^^
418.53 s
[alphal00p-docs-cargo] note : found an item that was configured out
418.53 s
[alphal00p-docs-cargo] --> /nix/store/9rqk4093qnvgswmdk1pbxk9najcrjn7a-vendor-cargo-deps/bc87b2b0f37b9a43ffdd82e8f11f3e864d9447ccd53a9a964250c3414c3656d9/numerica-3.0.0/src/domains/backend/integer.rs:1405:19
418.53 s
[alphal00p-docs-cargo] |
418.53 s
[alphal00p-docs-cargo] 1404 | #[cfg(all(feature = "integer-gmp", feature = "bincode"))]
418.53 s
[alphal00p-docs-cargo] | ----------------------- the item is gated behind the `integer-gmp` feature
418.53 s
[alphal00p-docs-cargo] 1405 | pub(crate) fn from_be_bytes(bytes: &[u8]) -> Result<MultiPrecisionInteger, &'static str> {
418.53 s
[alphal00p-docs-cargo] | ^^^^^^^^^^^^^
418.53 s
[alphal00p-docs-cargo] note : found an item that was configured out
418.53 s
[alphal00p-docs-cargo] --> /nix/store/9rqk4093qnvgswmdk1pbxk9najcrjn7a-vendor-cargo-deps/bc87b2b0f37b9a43ffdd82e8f11f3e864d9447ccd53a9a964250c3414c3656d9/numerica-3.0.0/src/domains/backend/integer.rs:1365:19
418.53 s
[alphal00p-docs-cargo] |
418.53 s
[alphal00p-docs-cargo] 1364 | #[cfg(all(feature = "integer-malachite", feature = "bincode"))]
418.53 s
[alphal00p-docs-cargo] | ----------------------------- the item is gated behind the `integer-malachite` feature
418.53 s
[alphal00p-docs-cargo] 1365 | pub(crate) fn to_be_bytes(value: &MultiPrecisionInteger) -> Vec<u8> {
418.53 s
[alphal00p-docs-cargo] | ^^^^^^^^^^^
418.53 s
[alphal00p-docs-cargo] note : found an item that was configured out
418.53 s
[alphal00p-docs-cargo] --> /nix/store/9rqk4093qnvgswmdk1pbxk9najcrjn7a-vendor-cargo-deps/bc87b2b0f37b9a43ffdd82e8f11f3e864d9447ccd53a9a964250c3414c3656d9/numerica-3.0.0/src/domains/backend/integer.rs:1400:19
418.53 s
[alphal00p-docs-cargo] |
418.53 s
[alphal00p-docs-cargo] 1399 | #[cfg(all(feature = "integer-gmp", feature = "bincode"))]
418.53 s
[alphal00p-docs-cargo] | ----------------------- the item is gated behind the `integer-gmp` feature
418.53 s
[alphal00p-docs-cargo] 1400 | pub(crate) fn to_be_bytes(value: &MultiPrecisionInteger) -> Vec<u8> {
418.53 s
[alphal00p-docs-cargo] | ^^^^^^^^^^^
418.53 s
[alphal00p-docs-cargo]
418.54 s
[alphal00p-docs-cargo] error[E0432] : unresolved imports `crate::domains::backend::float::Assign`, `crate::domains::backend::float::CompleteRound`, `crate::domains::backend::float::Constant`, `crate::domains::backend::float::MultiPrecisionFloat`, `crate::domains::backend::float::Pow`
418.54 s
[alphal00p-docs-cargo] --> /nix/store/9rqk4093qnvgswmdk1pbxk9najcrjn7a-vendor-cargo-deps/bc87b2b0f37b9a43ffdd82e8f11f3e864d9447ccd53a9a964250c3414c3656d9/numerica-3.0.0/src/domains/float/multiprecision.rs:15:9
418.54 s
[alphal00p-docs-cargo] |
418.54 s
[alphal00p-docs-cargo] 15 | Assign, CompleteRound, Constant, MultiPrecisionFloat, MultiPrecisionFloatInteger,
418.54 s
[alphal00p-docs-cargo] | ^^^^^^ ^^^^^^^^^^^^^ ^^^^^^^^ ^^^^^^^^^^^^^^^^^^^ no `MultiPrecisionFloat` in `domains::backend::float`
418.54 s
[alphal00p-docs-cargo] | | | |
418.54 s
[alphal00p-docs-cargo] | | | no `Constant` in `domains::backend::float`
418.54 s
[alphal00p-docs-cargo] | | no `CompleteRound` in `domains::backend::float`
418.54 s
[alphal00p-docs-cargo] | no `Assign` in `domains::backend::float`
418.54 s
[alphal00p-docs-cargo] 16 | MultiPrecisionFloatRational, MultiPrecisionFloatRounding, Pow, RoundingDirection,
418.54 s
[alphal00p-docs-cargo] | ^^^ no `Pow` in `domains::backend::float`
418.54 s
[alphal00p-docs-cargo] |
418.54 s
[alphal00p-docs-cargo] note : found an item that was configured out
418.54 s
[alphal00p-docs-cargo] --> /nix/store/9rqk4093qnvgswmdk1pbxk9najcrjn7a-vendor-cargo-deps/bc87b2b0f37b9a43ffdd82e8f11f3e864d9447ccd53a9a964250c3414c3656d9/numerica-3.0.0/src/domains/backend/float.rs:17:5
418.54 s
[alphal00p-docs-cargo] |
418.54 s
[alphal00p-docs-cargo] 15 | #[cfg(feature = "float-mpfr")]
418.54 s
[alphal00p-docs-cargo] | ---------------------- the item is gated behind the `float-mpfr` feature
418.54 s
[alphal00p-docs-cargo] 16 | pub use rug::{
418.54 s
[alphal00p-docs-cargo] 17 | Assign, Float as MultiPrecisionFloat, Rational as BackendRational,
418.54 s
[alphal00p-docs-cargo] | ^^^^^^
418.54 s
[alphal00p-docs-cargo] note : found an item that was configured out
418.54 s
[alphal00p-docs-cargo] --> /nix/store/9rqk4093qnvgswmdk1pbxk9najcrjn7a-vendor-cargo-deps/bc87b2b0f37b9a43ffdd82e8f11f3e864d9447ccd53a9a964250c3414c3656d9/numerica-3.0.0/src/domains/backend/float.rs:1578:5
418.54 s
[alphal00p-docs-cargo] |
418.54 s
[alphal00p-docs-cargo] 1576 | #[cfg(feature = "float-astro")]
418.54 s
[alphal00p-docs-cargo] | ----------------------- the item is gated behind the `float-astro` feature
418.54 s
[alphal00p-docs-cargo] 1577 | pub use astro::{
418.54 s
[alphal00p-docs-cargo] 1578 | Assign, BackendRational, CompleteRound, Constant, IntoMultiPrecisionFloat, MultiPrecisionFloat,
418.54 s
[alphal00p-docs-cargo] | ^^^^^^
418.54 s
[alphal00p-docs-cargo] note : found an item that was configured out
418.54 s
[alphal00p-docs-cargo] --> /nix/store/9rqk4093qnvgswmdk1pbxk9najcrjn7a-vendor-cargo-deps/bc87b2b0f37b9a43ffdd82e8f11f3e864d9447ccd53a9a964250c3414c3656d9/numerica-3.0.0/src/domains/backend/float.rs:19:11
418.54 s
[alphal00p-docs-cargo] |
418.54 s
[alphal00p-docs-cargo] 15 | #[cfg(feature = "float-mpfr")]
418.54 s
[alphal00p-docs-cargo] | ---------------------- the item is gated behind the `float-mpfr` feature
418.54 s
[alphal00p-docs-cargo] ...
418.54 s
[alphal00p-docs-cargo] 19 | ops::{CompleteRound, Pow},
418.54 s
[alphal00p-docs-cargo] | ^^^^^^^^^^^^^
418.54 s
[alphal00p-docs-cargo] note : found an item that was configured out
418.54 s
[alphal00p-docs-cargo] --> /nix/store/9rqk4093qnvgswmdk1pbxk9najcrjn7a-vendor-cargo-deps/bc87b2b0f37b9a43ffdd82e8f11f3e864d9447ccd53a9a964250c3414c3656d9/numerica-3.0.0/src/domains/backend/float.rs:1578:30
418.54 s
[alphal00p-docs-cargo] |
418.54 s
[alphal00p-docs-cargo] 1576 | #[cfg(feature = "float-astro")]
418.54 s
[alphal00p-docs-cargo] | ----------------------- the item is gated behind the `float-astro` feature
418.54 s
[alphal00p-docs-cargo] 1577 | pub use astro::{
418.54 s
[alphal00p-docs-cargo] 1578 | Assign, BackendRational, CompleteRound, Constant, IntoMultiPrecisionFloat, MultiPrecisionFloat,
418.54 s
[alphal00p-docs-cargo] | ^^^^^^^^^^^^^
418.54 s
[alphal00p-docs-cargo] note : found an item that was configured out
418.54 s
[alphal00p-docs-cargo] --> /nix/store/9rqk4093qnvgswmdk1pbxk9najcrjn7a-vendor-cargo-deps/bc87b2b0f37b9a43ffdd82e8f11f3e864d9447ccd53a9a964250c3414c3656d9/numerica-3.0.0/src/domains/backend/float.rs:18:12
418.54 s
[alphal00p-docs-cargo] |
418.54 s
[alphal00p-docs-cargo] 15 | #[cfg(feature = "float-mpfr")]
418.54 s
[alphal00p-docs-cargo] | ---------------------- the item is gated behind the `float-mpfr` feature
418.54 s
[alphal00p-docs-cargo] ...
418.54 s
[alphal00p-docs-cargo] 18 | float::Constant,
418.54 s
[alphal00p-docs-cargo] | ^^^^^^^^
418.54 s
[alphal00p-docs-cargo] note : found an item that was configured out
418.54 s
[alphal00p-docs-cargo] --> /nix/store/9rqk4093qnvgswmdk1pbxk9najcrjn7a-vendor-cargo-deps/bc87b2b0f37b9a43ffdd82e8f11f3e864d9447ccd53a9a964250c3414c3656d9/numerica-3.0.0/src/domains/backend/float.rs:1578:45
418.54 s
[alphal00p-docs-cargo] |
418.54 s
[alphal00p-docs-cargo] 1576 | #[cfg(feature = "float-astro")]
418.54 s
[alphal00p-docs-cargo] | ----------------------- the item is gated behind the `float-astro` feature
418.54 s
[alphal00p-docs-cargo] 1577 | pub use astro::{
418.54 s
[alphal00p-docs-cargo] 1578 | Assign, BackendRational, CompleteRound, Constant, IntoMultiPrecisionFloat, MultiPrecisionFloat,
418.54 s
[alphal00p-docs-cargo] | ^^^^^^^^
418.54 s
[alphal00p-docs-cargo] note : found an item that was configured out
418.54 s
[alphal00p-docs-cargo] --> /nix/store/9rqk4093qnvgswmdk1pbxk9najcrjn7a-vendor-cargo-deps/bc87b2b0f37b9a43ffdd82e8f11f3e864d9447ccd53a9a964250c3414c3656d9/numerica-3.0.0/src/domains/backend/float.rs:17:22
418.54 s
[alphal00p-docs-cargo] |
418.54 s
[alphal00p-docs-cargo] 15 | #[cfg(feature = "float-mpfr")]
418.54 s
[alphal00p-docs-cargo] | ---------------------- the item is gated behind the `float-mpfr` feature
418.54 s
[alphal00p-docs-cargo] 16 | pub use rug::{
418.54 s
[alphal00p-docs-cargo] 17 | Assign, Float as MultiPrecisionFloat, Rational as BackendRational,
418.54 s
[alphal00p-docs-cargo] | ^^^^^^^^^^^^^^^^^^^
418.54 s
[alphal00p-docs-cargo] note : found an item that was configured out
418.54 s
[alphal00p-docs-cargo] --> /nix/store/9rqk4093qnvgswmdk1pbxk9najcrjn7a-vendor-cargo-deps/bc87b2b0f37b9a43ffdd82e8f11f3e864d9447ccd53a9a964250c3414c3656d9/numerica-3.0.0/src/domains/backend/float.rs:1578:80
418.54 s
[alphal00p-docs-cargo] |
418.54 s
[alphal00p-docs-cargo] 1576 | #[cfg(feature = "float-astro")]
418.54 s
[alphal00p-docs-cargo] | ----------------------- the item is gated behind the `float-astro` feature
418.54 s
[alphal00p-docs-cargo] 1577 | pub use astro::{
418.54 s
[alphal00p-docs-cargo] 1578 | Assign, BackendRational, CompleteRound, Constant, IntoMultiPrecisionFloat, MultiPrecisionFloat,
418.54 s
[alphal00p-docs-cargo] | ^^^^^^^^^^^^^^^^^^^
418.54 s
[alphal00p-docs-cargo] note : found an item that was configured out
418.54 s
[alphal00p-docs-cargo] --> /nix/store/9rqk4093qnvgswmdk1pbxk9najcrjn7a-vendor-cargo-deps/bc87b2b0f37b9a43ffdd82e8f11f3e864d9447ccd53a9a964250c3414c3656d9/numerica-3.0.0/src/domains/backend/float.rs:19:26
418.54 s
[alphal00p-docs-cargo] |
418.54 s
[alphal00p-docs-cargo] 15 | #[cfg(feature = "float-mpfr")]
418.54 s
[alphal00p-docs-cargo] | ---------------------- the item is gated behind the `float-mpfr` feature
418.54 s
[alphal00p-docs-cargo] ...
418.54 s
[alphal00p-docs-cargo] 19 | ops::{CompleteRound, Pow},
418.54 s
[alphal00p-docs-cargo] | ^^^
418.54 s
[alphal00p-docs-cargo] note : found an item that was configured out
418.54 s
[alphal00p-docs-cargo] --> /nix/store/9rqk4093qnvgswmdk1pbxk9najcrjn7a-vendor-cargo-deps/bc87b2b0f37b9a43ffdd82e8f11f3e864d9447ccd53a9a964250c3414c3656d9/numerica-3.0.0/src/domains/backend/float.rs:1579:5
418.54 s
[alphal00p-docs-cargo] |
418.54 s
[alphal00p-docs-cargo] 1576 | #[cfg(feature = "float-astro")]
418.54 s
[alphal00p-docs-cargo] | ----------------------- the item is gated behind the `float-astro` feature
418.54 s
[alphal00p-docs-cargo] ...
418.54 s
[alphal00p-docs-cargo] 1579 | Pow,
418.54 s
[alphal00p-docs-cargo] | ^^^
418.54 s
[alphal00p-docs-cargo]
418.76 s
[alphal00p-docs-cargo] error[E0425] : cannot find type `RawMultiPrecisionInteger` in this scope
418.76 s
[alphal00p-docs-cargo] --> /nix/store/9rqk4093qnvgswmdk1pbxk9najcrjn7a-vendor-cargo-deps/bc87b2b0f37b9a43ffdd82e8f11f3e864d9447ccd53a9a964250c3414c3656d9/numerica-3.0.0/src/domains/backend/integer.rs:52:38
418.76 s
[alphal00p-docs-cargo] |
418.76 s
[alphal00p-docs-cargo] 52 | pub struct MultiPrecisionInteger(RawMultiPrecisionInteger);
418.76 s
[alphal00p-docs-cargo] | ^^^^^^^^^^^^^^^^^^^^^^^^ not found in this scope
418.76 s
[alphal00p-docs-cargo]
418.76 s
[alphal00p-docs-cargo] error[E0425] : cannot find type `RawMultiPrecisionInteger` in this scope
418.76 s
[alphal00p-docs-cargo] --> /nix/store/9rqk4093qnvgswmdk1pbxk9najcrjn7a-vendor-cargo-deps/bc87b2b0f37b9a43ffdd82e8f11f3e864d9447ccd53a9a964250c3414c3656d9/numerica-3.0.0/src/domains/backend/integer.rs:52:38
418.76 s
[alphal00p-docs-cargo] |
418.76 s
[alphal00p-docs-cargo] 52 | pub struct MultiPrecisionInteger(RawMultiPrecisionInteger);
418.76 s
[alphal00p-docs-cargo] | ^^^^^^^^^^^^^^^^^^^^^^^^ not found in this scope
418.76 s
[alphal00p-docs-cargo] |
418.76 s
[alphal00p-docs-cargo] help : you might be missing a type parameter
418.76 s
[alphal00p-docs-cargo] |
418.76 s
[alphal00p-docs-cargo] 52 | pub struct MultiPrecisionInteger<RawMultiPrecisionInteger> (RawMultiPrecisionInteger);
418.76 s
[alphal00p-docs-cargo] | ++++++++++++++++++++++++++
418.76 s
[alphal00p-docs-cargo]
418.76 s
[alphal00p-docs-cargo] error[E0425] : cannot find type `RawMultiPrecisionInteger` in this scope
418.76 s
[alphal00p-docs-cargo] --> /nix/store/9rqk4093qnvgswmdk1pbxk9najcrjn7a-vendor-cargo-deps/bc87b2b0f37b9a43ffdd82e8f11f3e864d9447ccd53a9a964250c3414c3656d9/numerica-3.0.0/src/domains/backend/integer.rs:149:32
418.76 s
[alphal00p-docs-cargo] |
418.76 s
[alphal00p-docs-cargo] 52 | pub struct MultiPrecisionInteger(RawMultiPrecisionInteger);
418.76 s
[alphal00p-docs-cargo] | ----------------------------------------------------------- similarly named struct `MultiPrecisionInteger` defined here
418.76 s
[alphal00p-docs-cargo] ...
418.76 s
[alphal00p-docs-cargo] 149 | pub fn from_raw(value: RawMultiPrecisionInteger) -> Self {
418.76 s
[alphal00p-docs-cargo] | ^^^^^^^^^^^^^^^^^^^^^^^^
418.76 s
[alphal00p-docs-cargo] |
418.76 s
[alphal00p-docs-cargo] help : a struct with a similar name exists
418.76 s
[alphal00p-docs-cargo] |
418.76 s
[alphal00p-docs-cargo] 149 - pub fn from_raw(value: RawMultiPrecisionInteger ) -> Self {
418.76 s
[alphal00p-docs-cargo] 149 + pub fn from_raw(value: MultiPrecisionInteger ) -> Self {
418.76 s
[alphal00p-docs-cargo] |
418.76 s
[alphal00p-docs-cargo]
418.76 s
[alphal00p-docs-cargo] error[E0425] : cannot find type `RawMultiPrecisionInteger` in this scope
418.76 s
[alphal00p-docs-cargo] --> /nix/store/9rqk4093qnvgswmdk1pbxk9najcrjn7a-vendor-cargo-deps/bc87b2b0f37b9a43ffdd82e8f11f3e864d9447ccd53a9a964250c3414c3656d9/numerica-3.0.0/src/domains/backend/integer.rs:187:34
418.76 s
[alphal00p-docs-cargo] |
418.76 s
[alphal00p-docs-cargo] 52 | pub struct MultiPrecisionInteger(RawMultiPrecisionInteger);
418.76 s
[alphal00p-docs-cargo] | ----------------------------------------------------------- similarly named struct `MultiPrecisionInteger` defined here
418.76 s
[alphal00p-docs-cargo] ...
418.76 s
[alphal00p-docs-cargo] 187 | pub fn as_raw(&self) -> &RawMultiPrecisionInteger {
418.76 s
[alphal00p-docs-cargo] | ^^^^^^^^^^^^^^^^^^^^^^^^
418.76 s
[alphal00p-docs-cargo] |
418.76 s
[alphal00p-docs-cargo] help : a struct with a similar name exists
418.76 s
[alphal00p-docs-cargo] |
418.76 s
[alphal00p-docs-cargo] 187 - pub fn as_raw(&self) -> &RawMultiPrecisionInteger {
418.76 s
[alphal00p-docs-cargo] 187 + pub fn as_raw(&self) -> &MultiPrecisionInteger {
418.76 s
[alphal00p-docs-cargo] |
418.76 s
[alphal00p-docs-cargo]
418.77 s
[alphal00p-docs-cargo] error[E0425] : cannot find type `RawMultiPrecisionInteger` in this scope
418.77 s
[alphal00p-docs-cargo] --> /nix/store/9rqk4093qnvgswmdk1pbxk9najcrjn7a-vendor-cargo-deps/bc87b2b0f37b9a43ffdd82e8f11f3e864d9447ccd53a9a964250c3414c3656d9/numerica-3.0.0/src/domains/backend/integer.rs:193:33
418.77 s
[alphal00p-docs-cargo] |
418.77 s
[alphal00p-docs-cargo] 52 | pub struct MultiPrecisionInteger(RawMultiPrecisionInteger);
418.77 s
[alphal00p-docs-cargo] | ----------------------------------------------------------- similarly named struct `MultiPrecisionInteger` defined here
418.77 s
[alphal00p-docs-cargo] ...
418.77 s
[alphal00p-docs-cargo] 193 | pub fn to_raw(&self) -> RawMultiPrecisionInteger {
418.77 s
[alphal00p-docs-cargo] | ^^^^^^^^^^^^^^^^^^^^^^^^
418.77 s
[alphal00p-docs-cargo] |
418.77 s
[alphal00p-docs-cargo] help : a struct with a similar name exists
418.77 s
[alphal00p-docs-cargo] |
418.77 s
[alphal00p-docs-cargo] 193 - pub fn to_raw(&self) -> RawMultiPrecisionInteger {
418.77 s
[alphal00p-docs-cargo] 193 + pub fn to_raw(&self) -> MultiPrecisionInteger {
418.77 s
[alphal00p-docs-cargo] |
418.77 s
[alphal00p-docs-cargo]
418.77 s
[alphal00p-docs-cargo] error[E0425] : cannot find type `RawMultiPrecisionInteger` in this scope
418.77 s
[alphal00p-docs-cargo] --> /nix/store/9rqk4093qnvgswmdk1pbxk9najcrjn7a-vendor-cargo-deps/bc87b2b0f37b9a43ffdd82e8f11f3e864d9447ccd53a9a964250c3414c3656d9/numerica-3.0.0/src/domains/backend/integer.rs:199:34
418.77 s
[alphal00p-docs-cargo] |
418.77 s
[alphal00p-docs-cargo] 52 | pub struct MultiPrecisionInteger(RawMultiPrecisionInteger);
418.77 s
[alphal00p-docs-cargo] | ----------------------------------------------------------- similarly named struct `MultiPrecisionInteger` defined here
418.77 s
[alphal00p-docs-cargo] ...
418.77 s
[alphal00p-docs-cargo] 199 | pub fn into_raw(self) -> RawMultiPrecisionInteger {
418.77 s
[alphal00p-docs-cargo] | ^^^^^^^^^^^^^^^^^^^^^^^^
418.77 s
[alphal00p-docs-cargo] |
418.77 s
[alphal00p-docs-cargo] help : a struct with a similar name exists
418.77 s
[alphal00p-docs-cargo] |
418.77 s
[alphal00p-docs-cargo] 199 - pub fn into_raw(self) -> RawMultiPrecisionInteger {
418.77 s
[alphal00p-docs-cargo] 199 + pub fn into_raw(self) -> MultiPrecisionInteger {
418.77 s
[alphal00p-docs-cargo] |
418.77 s
[alphal00p-docs-cargo]
418.77 s
[alphal00p-docs-cargo] error[E0425] : cannot find type `RawMultiPrecisionInteger` in this scope
418.77 s
[alphal00p-docs-cargo] --> /nix/store/9rqk4093qnvgswmdk1pbxk9najcrjn7a-vendor-cargo-deps/bc87b2b0f37b9a43ffdd82e8f11f3e864d9447ccd53a9a964250c3414c3656d9/numerica-3.0.0/src/domains/backend/integer.rs:567:27
418.77 s
[alphal00p-docs-cargo] |
418.77 s
[alphal00p-docs-cargo] 52 | pub struct MultiPrecisionInteger(RawMultiPrecisionInteger);
418.77 s
[alphal00p-docs-cargo] | ----------------------------------------------------------- similarly named struct `MultiPrecisionInteger` defined here
418.77 s
[alphal00p-docs-cargo] ...
418.77 s
[alphal00p-docs-cargo] 567 | fn rem_trunc(lhs: RawMultiPrecisionInteger, rhs: RawMultiPrecisionInteger) -> Self {
418.77 s
[alphal00p-docs-cargo] | ^^^^^^^^^^^^^^^^^^^^^^^^
418.77 s
[alphal00p-docs-cargo] |
418.77 s
[alphal00p-docs-cargo] help : a struct with a similar name exists
418.77 s
[alphal00p-docs-cargo] |
418.77 s
[alphal00p-docs-cargo] 567 - fn rem_trunc(lhs: RawMultiPrecisionInteger , rhs: RawMultiPrecisionInteger) -> Self {
418.77 s
[alphal00p-docs-cargo] 567 + fn rem_trunc(lhs: MultiPrecisionInteger , rhs: RawMultiPrecisionInteger) -> Self {
418.77 s
[alphal00p-docs-cargo] |
418.77 s
[alphal00p-docs-cargo]
418.77 s
[alphal00p-docs-cargo] error[E0425] : cannot find type `RawMultiPrecisionInteger` in this scope
418.77 s
[alphal00p-docs-cargo] --> /nix/store/9rqk4093qnvgswmdk1pbxk9najcrjn7a-vendor-cargo-deps/bc87b2b0f37b9a43ffdd82e8f11f3e864d9447ccd53a9a964250c3414c3656d9/numerica-3.0.0/src/domains/backend/integer.rs:567:58
418.77 s
[alphal00p-docs-cargo] |
418.77 s
[alphal00p-docs-cargo] 52 | pub struct MultiPrecisionInteger(RawMultiPrecisionInteger);
418.77 s
[alphal00p-docs-cargo] | ----------------------------------------------------------- similarly named struct `MultiPrecisionInteger` defined here
418.77 s
[alphal00p-docs-cargo] ...
418.77 s
[alphal00p-docs-cargo] 567 | fn rem_trunc(lhs: RawMultiPrecisionInteger, rhs: RawMultiPrecisionInteger) -> Self {
418.77 s
[alphal00p-docs-cargo] | ^^^^^^^^^^^^^^^^^^^^^^^^
418.77 s
[alphal00p-docs-cargo] |
418.77 s
[alphal00p-docs-cargo] help : a struct with a similar name exists
418.77 s
[alphal00p-docs-cargo] |
418.77 s
[alphal00p-docs-cargo] 567 - fn rem_trunc(lhs: RawMultiPrecisionInteger, rhs: RawMultiPrecisionInteger ) -> Self {
418.77 s
[alphal00p-docs-cargo] 567 + fn rem_trunc(lhs: RawMultiPrecisionInteger, rhs: MultiPrecisionInteger ) -> Self {
418.77 s
[alphal00p-docs-cargo] |
418.77 s
[alphal00p-docs-cargo]
418.77 s
[alphal00p-docs-cargo] error[E0425] : cannot find type `RawMultiPrecisionInteger` in this scope
418.77 s
[alphal00p-docs-cargo] --> /nix/store/9rqk4093qnvgswmdk1pbxk9najcrjn7a-vendor-cargo-deps/bc87b2b0f37b9a43ffdd82e8f11f3e864d9447ccd53a9a964250c3414c3656d9/numerica-3.0.0/src/domains/backend/integer.rs:582:27
418.77 s
[alphal00p-docs-cargo] |
418.77 s
[alphal00p-docs-cargo] 52 | pub struct MultiPrecisionInteger(RawMultiPrecisionInteger);
418.77 s
[alphal00p-docs-cargo] | ----------------------------------------------------------- similarly named struct `MultiPrecisionInteger` defined here
418.77 s
[alphal00p-docs-cargo] ...
418.77 s
[alphal00p-docs-cargo] 582 | fn shl_raw(value: RawMultiPrecisionInteger, rhs: u64) -> RawMultiPrecisionInteger {
418.77 s
[alphal00p-docs-cargo] | ^^^^^^^^^^^^^^^^^^^^^^^^
418.77 s
[alphal00p-docs-cargo] |
418.77 s
[alphal00p-docs-cargo] help : a struct with a similar name exists
418.77 s
[alphal00p-docs-cargo] |
418.77 s
[alphal00p-docs-cargo] 582 - fn shl_raw(value: RawMultiPrecisionInteger , rhs: u64) -> RawMultiPrecisionInteger {
418.77 s
[alphal00p-docs-cargo] 582 + fn shl_raw(value: MultiPrecisionInteger , rhs: u64) -> RawMultiPrecisionInteger {
418.77 s
[alphal00p-docs-cargo] |
418.77 s
[alphal00p-docs-cargo]
418.77 s
[alphal00p-docs-cargo] error[E0425] : cannot find type `RawMultiPrecisionInteger` in this scope
418.77 s
[alphal00p-docs-cargo] --> /nix/store/9rqk4093qnvgswmdk1pbxk9najcrjn7a-vendor-cargo-deps/bc87b2b0f37b9a43ffdd82e8f11f3e864d9447ccd53a9a964250c3414c3656d9/numerica-3.0.0/src/domains/backend/integer.rs:582:66
418.77 s
[alphal00p-docs-cargo] |
418.77 s
[alphal00p-docs-cargo] 52 | pub struct MultiPrecisionInteger(RawMultiPrecisionInteger);
418.77 s
[alphal00p-docs-cargo] | ----------------------------------------------------------- similarly named struct `MultiPrecisionInteger` defined here
418.77 s
[alphal00p-docs-cargo] ...
418.77 s
[alphal00p-docs-cargo] 582 | fn shl_raw(value: RawMultiPrecisionInteger, rhs: u64) -> RawMultiPrecisionInteger {
418.77 s
[alphal00p-docs-cargo] | ^^^^^^^^^^^^^^^^^^^^^^^^
418.77 s
[alphal00p-docs-cargo] |
418.77 s
[alphal00p-docs-cargo] help : a struct with a similar name exists
418.77 s
[alphal00p-docs-cargo] |
418.77 s
[alphal00p-docs-cargo] 582 - fn shl_raw(value: RawMultiPrecisionInteger, rhs: u64) -> RawMultiPrecisionInteger {
418.77 s
[alphal00p-docs-cargo] 582 + fn shl_raw(value: RawMultiPrecisionInteger, rhs: u64) -> MultiPrecisionInteger {
418.77 s
[alphal00p-docs-cargo] |
418.77 s
[alphal00p-docs-cargo]
418.77 s
[alphal00p-docs-cargo] error[E0425] : cannot find type `RawMultiPrecisionInteger` in this scope
418.77 s
[alphal00p-docs-cargo] --> /nix/store/9rqk4093qnvgswmdk1pbxk9najcrjn7a-vendor-cargo-deps/bc87b2b0f37b9a43ffdd82e8f11f3e864d9447ccd53a9a964250c3414c3656d9/numerica-3.0.0/src/domains/backend/integer.rs:590:27
418.77 s
[alphal00p-docs-cargo] |
418.77 s
[alphal00p-docs-cargo] 52 | pub struct MultiPrecisionInteger(RawMultiPrecisionInteger);
418.77 s
[alphal00p-docs-cargo] | ----------------------------------------------------------- similarly named struct `MultiPrecisionInteger` defined here
418.77 s
[alphal00p-docs-cargo] ...
418.77 s
[alphal00p-docs-cargo] 590 | fn shr_raw(value: RawMultiPrecisionInteger, rhs: u64) -> RawMultiPrecisionInteger {
418.77 s
[alphal00p-docs-cargo] | ^^^^^^^^^^^^^^^^^^^^^^^^
418.77 s
[alphal00p-docs-cargo] |
418.77 s
[alphal00p-docs-cargo] help : a struct with a similar name exists
418.77 s
[alphal00p-docs-cargo] |
418.77 s
[alphal00p-docs-cargo] 590 - fn shr_raw(value: RawMultiPrecisionInteger , rhs: u64) -> RawMultiPrecisionInteger {
418.77 s
[alphal00p-docs-cargo] 590 + fn shr_raw(value: MultiPrecisionInteger , rhs: u64) -> RawMultiPrecisionInteger {
418.77 s
[alphal00p-docs-cargo] |
418.77 s
[alphal00p-docs-cargo]
418.78 s
[alphal00p-docs-cargo] error[E0425] : cannot find type `RawMultiPrecisionInteger` in this scope
418.78 s
[alphal00p-docs-cargo] --> /nix/store/9rqk4093qnvgswmdk1pbxk9najcrjn7a-vendor-cargo-deps/bc87b2b0f37b9a43ffdd82e8f11f3e864d9447ccd53a9a964250c3414c3656d9/numerica-3.0.0/src/domains/backend/integer.rs:590:66
418.78 s
[alphal00p-docs-cargo] |
418.78 s
[alphal00p-docs-cargo] 52 | pub struct MultiPrecisionInteger(RawMultiPrecisionInteger);
418.78 s
[alphal00p-docs-cargo] | ----------------------------------------------------------- similarly named struct `MultiPrecisionInteger` defined here
418.78 s
[alphal00p-docs-cargo] ...
418.78 s
[alphal00p-docs-cargo] 590 | fn shr_raw(value: RawMultiPrecisionInteger, rhs: u64) -> RawMultiPrecisionInteger {
418.78 s
[alphal00p-docs-cargo] | ^^^^^^^^^^^^^^^^^^^^^^^^
418.78 s
[alphal00p-docs-cargo] |
418.78 s
[alphal00p-docs-cargo] help : a struct with a similar name exists
418.78 s
[alphal00p-docs-cargo] |
418.78 s
[alphal00p-docs-cargo] 590 - fn shr_raw(value: RawMultiPrecisionInteger, rhs: u64) -> RawMultiPrecisionInteger {
418.78 s
[alphal00p-docs-cargo] 590 + fn shr_raw(value: RawMultiPrecisionInteger, rhs: u64) -> MultiPrecisionInteger {
418.78 s
[alphal00p-docs-cargo] |
418.78 s
[alphal00p-docs-cargo]
418.78 s
[alphal00p-docs-cargo] error[E0425] : cannot find type `RawMultiPrecisionInteger` in this scope
418.78 s
[alphal00p-docs-cargo] --> /nix/store/9rqk4093qnvgswmdk1pbxk9najcrjn7a-vendor-cargo-deps/bc87b2b0f37b9a43ffdd82e8f11f3e864d9447ccd53a9a964250c3414c3656d9/numerica-3.0.0/src/domains/backend/integer.rs:654:15
418.78 s
[alphal00p-docs-cargo] |
418.78 s
[alphal00p-docs-cargo] 52 | pub struct MultiPrecisionInteger(RawMultiPrecisionInteger);
418.78 s
[alphal00p-docs-cargo] | ----------------------------------------------------------- similarly named struct `MultiPrecisionInteger` defined here
418.78 s
[alphal00p-docs-cargo] ...
418.78 s
[alphal00p-docs-cargo] 654 | impl From<RawMultiPrecisionInteger> for MultiPrecisionInteger {
418.78 s
[alphal00p-docs-cargo] | ^^^^^^^^^^^^^^^^^^^^^^^^
418.78 s
[alphal00p-docs-cargo] |
418.78 s
[alphal00p-docs-cargo] help : a struct with a similar name exists
418.78 s
[alphal00p-docs-cargo] |
418.78 s
[alphal00p-docs-cargo] 654 - impl From<RawMultiPrecisionInteger > for MultiPrecisionInteger {
418.78 s
[alphal00p-docs-cargo] 654 + impl From<MultiPrecisionInteger > for MultiPrecisionInteger {
418.78 s
[alphal00p-docs-cargo] |
418.78 s
[alphal00p-docs-cargo] help : you might be missing a type parameter
418.78 s
[alphal00p-docs-cargo] |
418.78 s
[alphal00p-docs-cargo] 654 | impl<RawMultiPrecisionInteger> From<RawMultiPrecisionInteger> for MultiPrecisionInteger {
418.78 s
[alphal00p-docs-cargo] | ++++++++++++++++++++++++++
418.78 s
[alphal00p-docs-cargo]
418.78 s
[alphal00p-docs-cargo] error[E0425] : cannot find type `RawMultiPrecisionInteger` in this scope
418.78 s
[alphal00p-docs-cargo] --> /nix/store/9rqk4093qnvgswmdk1pbxk9najcrjn7a-vendor-cargo-deps/bc87b2b0f37b9a43ffdd82e8f11f3e864d9447ccd53a9a964250c3414c3656d9/numerica-3.0.0/src/domains/backend/integer.rs:656:24
418.78 s
[alphal00p-docs-cargo] |
418.78 s
[alphal00p-docs-cargo] 52 | pub struct MultiPrecisionInteger(RawMultiPrecisionInteger);
418.78 s
[alphal00p-docs-cargo] | ----------------------------------------------------------- similarly named struct `MultiPrecisionInteger` defined here
418.78 s
[alphal00p-docs-cargo] ...
418.78 s
[alphal00p-docs-cargo] 656 | fn from(value: RawMultiPrecisionInteger) -> Self {
418.78 s
[alphal00p-docs-cargo] | ^^^^^^^^^^^^^^^^^^^^^^^^
418.78 s
[alphal00p-docs-cargo] |
418.78 s
[alphal00p-docs-cargo] help : a struct with a similar name exists
418.78 s
[alphal00p-docs-cargo] |
418.78 s
[alphal00p-docs-cargo] 656 - fn from(value: RawMultiPrecisionInteger ) -> Self {
418.78 s
[alphal00p-docs-cargo] 656 + fn from(value: MultiPrecisionInteger ) -> Self {
418.78 s
[alphal00p-docs-cargo] |
418.78 s
[alphal00p-docs-cargo]
418.78 s
[alphal00p-docs-cargo] error[E0425] : cannot find type `RawMultiPrecisionInteger` in this scope
418.78 s
[alphal00p-docs-cargo] --> /nix/store/9rqk4093qnvgswmdk1pbxk9najcrjn7a-vendor-cargo-deps/bc87b2b0f37b9a43ffdd82e8f11f3e864d9447ccd53a9a964250c3414c3656d9/numerica-3.0.0/src/domains/backend/integer.rs:661:42
418.78 s
[alphal00p-docs-cargo] |
418.78 s
[alphal00p-docs-cargo] 52 | pub struct MultiPrecisionInteger(RawMultiPrecisionInteger);
418.78 s
[alphal00p-docs-cargo] | ----------------------------------------------------------- similarly named struct `MultiPrecisionInteger` defined here
418.78 s
[alphal00p-docs-cargo] ...
418.78 s
[alphal00p-docs-cargo] 661 | impl From<MultiPrecisionInteger> for RawMultiPrecisionInteger {
418.78 s
[alphal00p-docs-cargo] | ^^^^^^^^^^^^^^^^^^^^^^^^
418.78 s
[alphal00p-docs-cargo] |
418.78 s
[alphal00p-docs-cargo] help : a struct with a similar name exists
418.78 s
[alphal00p-docs-cargo] |
418.78 s
[alphal00p-docs-cargo] 661 - impl From<MultiPrecisionInteger> for RawMultiPrecisionInteger {
418.78 s
[alphal00p-docs-cargo] 661 + impl From<MultiPrecisionInteger> for MultiPrecisionInteger {
418.78 s
[alphal00p-docs-cargo] |
418.78 s
[alphal00p-docs-cargo]
419.06 s
[alphal00p-docs-cargo] error[E0433] : cannot find type `RawMultiPrecisionInteger` in this scope
419.06 s
[alphal00p-docs-cargo] --> /nix/store/9rqk4093qnvgswmdk1pbxk9najcrjn7a-vendor-cargo-deps/bc87b2b0f37b9a43ffdd82e8f11f3e864d9447ccd53a9a964250c3414c3656d9/numerica-3.0.0/src/domains/backend/integer.rs:620:13
419.06 s
[alphal00p-docs-cargo] |
419.06 s
[alphal00p-docs-cargo] 620 | RawMultiPrecisionInteger::from_str(s)
419.06 s
[alphal00p-docs-cargo] | ^^^^^^^^^^^^^^^^^^^^^^^^ use of undeclared type `RawMultiPrecisionInteger`
419.06 s
[alphal00p-docs-cargo] |
419.06 s
[alphal00p-docs-cargo] help : a struct with a similar name exists
419.06 s
[alphal00p-docs-cargo] |
419.06 s
[alphal00p-docs-cargo] 620 - RawMultiPrecisionInteger ::from_str(s)
419.06 s
[alphal00p-docs-cargo] 620 + MultiPrecisionInteger ::from_str(s)
419.06 s
[alphal00p-docs-cargo] |
419.06 s
[alphal00p-docs-cargo]
419.06 s
[alphal00p-docs-cargo] error[E0433] : cannot find type `RawMultiPrecisionInteger` in this scope
419.06 s
[alphal00p-docs-cargo] --> /nix/store/9rqk4093qnvgswmdk1pbxk9najcrjn7a-vendor-cargo-deps/bc87b2b0f37b9a43ffdd82e8f11f3e864d9447ccd53a9a964250c3414c3656d9/numerica-3.0.0/src/domains/backend/integer.rs:674:35
419.06 s
[alphal00p-docs-cargo] |
419.06 s
[alphal00p-docs-cargo] 674 | self.0 == RawMultiPrecisionInteger::from(*other)
419.06 s
[alphal00p-docs-cargo] | ^^^^^^^^^^^^^^^^^^^^^^^^ use of undeclared type `RawMultiPrecisionInteger`
419.06 s
[alphal00p-docs-cargo] ...
419.06 s
[alphal00p-docs-cargo] 702 | impl_cmp_primitive!(i32, i64, i128, u32, u64, u128);
419.06 s
[alphal00p-docs-cargo] | --------------------------------------------------- in this macro invocation
419.06 s
[alphal00p-docs-cargo] |
419.06 s
[alphal00p-docs-cargo] = note : this error originates in the macro `impl_cmp_primitive` (in Nightly builds, run with -Z macro-backtrace for more info)
419.06 s
[alphal00p-docs-cargo] help : a struct with a similar name exists
419.06 s
[alphal00p-docs-cargo] |
419.06 s
[alphal00p-docs-cargo] 674 - self.0 == RawMultiPrecisionInteger ::from(*other)
419.06 s
[alphal00p-docs-cargo] 674 + self.0 == MultiPrecisionInteger ::from(*other)
419.06 s
[alphal00p-docs-cargo] |
419.06 s
[alphal00p-docs-cargo]
419.06 s
[alphal00p-docs-cargo] error[E0433] : cannot find type `RawMultiPrecisionInteger` in this scope
419.06 s
[alphal00p-docs-cargo] --> /nix/store/9rqk4093qnvgswmdk1pbxk9najcrjn7a-vendor-cargo-deps/bc87b2b0f37b9a43ffdd82e8f11f3e864d9447ccd53a9a964250c3414c3656d9/numerica-3.0.0/src/domains/backend/integer.rs:681:25
419.06 s
[alphal00p-docs-cargo] |
419.06 s
[alphal00p-docs-cargo] 681 | RawMultiPrecisionInteger::from(*self) == other.0
419.06 s
[alphal00p-docs-cargo] | ^^^^^^^^^^^^^^^^^^^^^^^^ use of undeclared type `RawMultiPrecisionInteger`
419.06 s
[alphal00p-docs-cargo] ...
419.06 s
[alphal00p-docs-cargo] 702 | impl_cmp_primitive!(i32, i64, i128, u32, u64, u128);
419.06 s
[alphal00p-docs-cargo] | --------------------------------------------------- in this macro invocation
419.06 s
[alphal00p-docs-cargo] |
419.06 s
[alphal00p-docs-cargo] = note : this error originates in the macro `impl_cmp_primitive` (in Nightly builds, run with -Z macro-backtrace for more info)
419.06 s
[alphal00p-docs-cargo] help : a struct with a similar name exists
419.06 s
[alphal00p-docs-cargo] |
419.06 s
[alphal00p-docs-cargo] 681 - RawMultiPrecisionInteger ::from(*self) == other.0
419.06 s
[alphal00p-docs-cargo] 681 + MultiPrecisionInteger ::from(*self) == other.0
419.06 s
[alphal00p-docs-cargo] |
419.06 s
[alphal00p-docs-cargo]
419.06 s
[alphal00p-docs-cargo] error[E0433] : cannot find type `RawMultiPrecisionInteger` in this scope
419.06 s
[alphal00p-docs-cargo] --> /nix/store/9rqk4093qnvgswmdk1pbxk9najcrjn7a-vendor-cargo-deps/bc87b2b0f37b9a43ffdd82e8f11f3e864d9447ccd53a9a964250c3414c3656d9/numerica-3.0.0/src/domains/backend/integer.rs:688:45
419.06 s
[alphal00p-docs-cargo] |
419.06 s
[alphal00p-docs-cargo] 688 | self.0.partial_cmp(&RawMultiPrecisionInteger::from(*other))
419.06 s
[alphal00p-docs-cargo] | ^^^^^^^^^^^^^^^^^^^^^^^^ use of undeclared type `RawMultiPrecisionInteger`
419.06 s
[alphal00p-docs-cargo] ...
419.06 s
[alphal00p-docs-cargo] 702 | impl_cmp_primitive!(i32, i64, i128, u32, u64, u128);
419.06 s
[alphal00p-docs-cargo] | --------------------------------------------------- in this macro invocation
419.06 s
[alphal00p-docs-cargo] |
419.06 s
[alphal00p-docs-cargo] = note : this error originates in the macro `impl_cmp_primitive` (in Nightly builds, run with -Z macro-backtrace for more info)
419.06 s
[alphal00p-docs-cargo] help : a struct with a similar name exists
419.06 s
[alphal00p-docs-cargo] |
419.06 s
[alphal00p-docs-cargo] 688 - self.0.partial_cmp(&RawMultiPrecisionInteger ::from(*other))
419.06 s
[alphal00p-docs-cargo] 688 + self.0.partial_cmp(&MultiPrecisionInteger ::from(*other))
419.06 s
[alphal00p-docs-cargo] |
419.06 s
[alphal00p-docs-cargo]
419.06 s
[alphal00p-docs-cargo] error[E0433] : cannot find type `RawMultiPrecisionInteger` in this scope
419.06 s
[alphal00p-docs-cargo] --> /nix/store/9rqk4093qnvgswmdk1pbxk9najcrjn7a-vendor-cargo-deps/bc87b2b0f37b9a43ffdd82e8f11f3e864d9447ccd53a9a964250c3414c3656d9/numerica-3.0.0/src/domains/backend/integer.rs:695:25
419.06 s
[alphal00p-docs-cargo] |
419.06 s
[alphal00p-docs-cargo] 695 | RawMultiPrecisionInteger::from(*self).partial_cmp(&other.0)
419.06 s
[alphal00p-docs-cargo] | ^^^^^^^^^^^^^^^^^^^^^^^^ use of undeclared type `RawMultiPrecisionInteger`
419.06 s
[alphal00p-docs-cargo] ...
419.06 s
[alphal00p-docs-cargo] 702 | impl_cmp_primitive!(i32, i64, i128, u32, u64, u128);
419.06 s
[alphal00p-docs-cargo] | --------------------------------------------------- in this macro invocation
419.06 s
[alphal00p-docs-cargo] |
419.06 s
[alphal00p-docs-cargo] = note : this error originates in the macro `impl_cmp_primitive` (in Nightly builds, run with -Z macro-backtrace for more info)
419.06 s
[alphal00p-docs-cargo] help : a struct with a similar name exists
419.06 s
[alphal00p-docs-cargo] |
419.06 s
[alphal00p-docs-cargo] 695 - RawMultiPrecisionInteger ::from(*self).partial_cmp(&other.0)
419.06 s
[alphal00p-docs-cargo] 695 + MultiPrecisionInteger ::from(*self).partial_cmp(&other.0)
419.06 s
[alphal00p-docs-cargo] |
419.06 s
[alphal00p-docs-cargo]
419.06 s
[alphal00p-docs-cargo] error[E0433] : cannot find type `RawMultiPrecisionInteger` in this scope
419.06 s
[alphal00p-docs-cargo] --> /nix/store/9rqk4093qnvgswmdk1pbxk9najcrjn7a-vendor-cargo-deps/bc87b2b0f37b9a43ffdd82e8f11f3e864d9447ccd53a9a964250c3414c3656d9/numerica-3.0.0/src/domains/backend/integer.rs:1180:35
419.06 s
[alphal00p-docs-cargo] |
419.06 s
[alphal00p-docs-cargo] 1180 | MultiPrecisionInteger(RawMultiPrecisionInteger::from((&self.0) & &rhs.0))
419.06 s
[alphal00p-docs-cargo] | ^^^^^^^^^^^^^^^^^^^^^^^^ use of undeclared type `RawMultiPrecisionInteger`
419.06 s
[alphal00p-docs-cargo] |
419.06 s
[alphal00p-docs-cargo] help : a struct with a similar name exists
419.06 s
[alphal00p-docs-cargo] |
419.06 s
[alphal00p-docs-cargo] 1180 - MultiPrecisionInteger(RawMultiPrecisionInteger ::from((&self.0) & &rhs.0))
419.06 s
[alphal00p-docs-cargo] 1180 + MultiPrecisionInteger(MultiPrecisionInteger ::from((&self.0) & &rhs.0))
419.06 s
[alphal00p-docs-cargo] |
419.06 s
[alphal00p-docs-cargo]
419.06 s
[alphal00p-docs-cargo] error[E0433] : cannot find type `RawMultiPrecisionInteger` in this scope
419.06 s
[alphal00p-docs-cargo] --> /nix/store/9rqk4093qnvgswmdk1pbxk9najcrjn7a-vendor-cargo-deps/bc87b2b0f37b9a43ffdd82e8f11f3e864d9447ccd53a9a964250c3414c3656d9/numerica-3.0.0/src/domains/backend/integer.rs:1212:35
419.06 s
[alphal00p-docs-cargo] |
419.06 s
[alphal00p-docs-cargo] 1212 | MultiPrecisionInteger(RawMultiPrecisionInteger::from(-&self.0))
419.06 s
[alphal00p-docs-cargo] | ^^^^^^^^^^^^^^^^^^^^^^^^ use of undeclared type `RawMultiPrecisionInteger`
419.06 s
[alphal00p-docs-cargo] |
419.06 s
[alphal00p-docs-cargo] help : a struct with a similar name exists
419.06 s
[alphal00p-docs-cargo] |
419.06 s
[alphal00p-docs-cargo] 1212 - MultiPrecisionInteger(RawMultiPrecisionInteger ::from(-&self.0))
419.06 s
[alphal00p-docs-cargo] 1212 + MultiPrecisionInteger(MultiPrecisionInteger ::from(-&self.0))
419.06 s
[alphal00p-docs-cargo] |
419.06 s
[alphal00p-docs-cargo]
419.06 s
[alphal00p-docs-cargo] error[E0425] : cannot find function `write_lsf_bytes` in this scope
419.06 s
[alphal00p-docs-cargo] --> /nix/store/9rqk4093qnvgswmdk1pbxk9najcrjn7a-vendor-cargo-deps/bc87b2b0f37b9a43ffdd82e8f11f3e864d9447ccd53a9a964250c3414c3656d9/numerica-3.0.0/src/domains/backend/integer.rs:1682:5
419.06 s
[alphal00p-docs-cargo] |
419.06 s
[alphal00p-docs-cargo] 1682 | write_lsf_bytes(value, &mut bytes);
419.06 s
[alphal00p-docs-cargo] | ^^^^^^^^^^^^^^^ not found in this scope
419.06 s
[alphal00p-docs-cargo]
419.06 s
[alphal00p-docs-cargo] Some errors have detailed explanations: E0425, E0432, E0433.
419.06 s
[alphal00p-docs-cargo] For more information about an error, try `rustc --explain E0425`.
419.07 s
[alphal00p-docs-cargo] error : could not compile `numerica` (lib) due to 29 previous errors
419.07 s
[alphal00p-docs-cargo] warning : build failed, waiting for other jobs to finish...
474.09 s
Progress: 5 of 6 built (1 failed), 42 of 42 downloaded from cache
474.09 s
Failed to build alphal00p-docs-cargo after 7m01s
474.09 s
Cannot build ' /nix/store/8y99gpj1qs95jysr3c6kccvh7lrd78i4-alphal00p-docs-cargo-0.1.0.drv '.
474.09 s
Reason: builder failed with exit code 101 .
474.09 s
Output paths:
474.09 s
/nix/store/fqkj46cxkiacfpx0ka5kpgqxjp46xnvs-alphal00p-docs-cargo-0.1.0
474.09 s
Last 1200 log lines:
474.09 s
> cargoArtifacts not set, will not reuse any cargo artifacts
474.09 s
> Running phase: unpackPhase
474.09 s
> unpacking source archive /nix/store/4pklqwhrgb01wfp3djh4jb2wr4xr9ila-source
474.09 s
> source root is source
474.09 s
> Running phase: patchPhase
474.09 s
> Executing configureCargoCommonVars
474.09 s
> Running phase: updateAutotoolsGnuConfigScriptsPhase
474.09 s
> Running phase: configurePhase
474.09 s
> will append /build/source/.cargo-home/config.toml with contents of /nix/store/9rqk4093qnvgswmdk1pbxk9najcrjn7a-vendor-cargo-deps/config.toml
474.09 s
> default configurePhase, nothing to do
474.09 s
> Running phase: buildPhase
474.09 s
> +++ command cargo --version
474.09 s
> cargo 1.98.1 (797e8a9bc 2026-08-05)
474.09 s
> +++ command cargo build --profile docs --locked -p alphal00p-docs-catalogs --bin alphal00p-docs-catalogs
474.09 s
> Compiling proc-macro2 v1.0.106
474.09 s
> Compiling unicode-ident v1.0.24
474.09 s
> Compiling quote v1.0.45
474.09 s
> Compiling serde_core v1.0.228
474.09 s
> Compiling memchr v2.8.0
474.09 s
> Compiling utf8parse v0.2.2
474.09 s
> Compiling zmij v1.0.21
474.09 s
> Compiling serde v1.0.228
474.09 s
> Compiling anstyle-query v1.1.5
474.09 s
> Compiling colorchoice v1.0.5
474.09 s
> Compiling is_terminal_polyfill v1.70.2
474.09 s
> Compiling serde_json v1.0.149
474.09 s
> Compiling anstyle v1.0.14
474.09 s
> Compiling thiserror v2.0.18
474.09 s
> Compiling equivalent v1.0.2
474.09 s
> Compiling eyre v0.6.12
474.09 s
> Compiling anstyle-parse v1.0.0
474.09 s
> Compiling itoa v1.0.18
474.09 s
> Compiling heck v0.5.0
474.09 s
> Compiling hashbrown v0.17.1
474.09 s
> Compiling clap_lex v1.1.0
474.09 s
> Compiling regex-syntax v0.8.10
474.09 s
> Compiling anstream v1.0.0
474.09 s
> Compiling strsim v0.11.1
474.09 s
> Compiling indenter v0.3.4
474.09 s
> Compiling once_cell v1.21.4
474.09 s
> Compiling clap_builder v4.6.0
474.09 s
> Compiling aho-corasick v1.1.4
474.09 s
> Compiling syn v2.0.117
474.09 s
> Compiling regex-automata v0.4.14
474.09 s
> Compiling indexmap v2.14.0
474.09 s
> Compiling serde_derive v1.0.228
474.09 s
> Compiling thiserror-impl v2.0.18
474.09 s
> Compiling clap_derive v4.6.1
474.09 s
> Compiling alphal00p-docs-macros v0.1.0 (/build/source/crates/alphal00p-docs-macros)
474.09 s
> Compiling regex v1.12.3
474.09 s
> Compiling clap v4.6.1
474.09 s
> Compiling alphal00p-docs-schema v0.1.0 (/build/source/crates/alphal00p-docs-schema)
474.09 s
> Compiling alphal00p-docs-catalogs v0.1.0 (/build/source/crates/alphal00p-docs-catalogs)
474.09 s
> Finished `docs` profile [unoptimized] target(s) in 9.75s
474.09 s
> +++ command cargo build --profile docs --locked -p alphal00p-docs-python-exporter --features gammaloop
474.09 s
> Compiling serde_core v1.0.228
474.09 s
> Compiling libc v0.2.186
474.09 s
> Compiling cfg-if v1.0.4
474.09 s
> Compiling serde v1.0.228
474.09 s
> Compiling memchr v2.8.0
474.09 s
> Compiling autocfg v1.5.0
474.09 s
> Compiling libm v0.2.16
474.09 s
> Compiling version_check v0.9.5
474.09 s
> Compiling either v1.15.0
474.09 s
> Compiling zerocopy v0.8.48
474.09 s
> Compiling crossbeam-utils v0.8.21
474.09 s
> Compiling log v0.4.29
474.09 s
> Compiling rayon-core v1.13.0
474.09 s
> Compiling unicode-width v0.2.2
474.09 s
> Compiling foldhash v0.2.0
474.09 s
> Compiling target-lexicon v0.13.5
474.09 s
> Compiling syn v2.0.117
474.09 s
> Compiling syn v3.0.4
474.09 s
> Compiling serde_json v1.0.149
474.09 s
> Compiling lazy_static v1.5.0
474.09 s
> Compiling crunchy v0.2.4
474.09 s
> Compiling getrandom v0.3.4
474.09 s
> Compiling paste v1.0.15
474.09 s
> Compiling siphasher v1.0.2
474.09 s
> Compiling aho-corasick v1.1.4
474.09 s
> Compiling num-traits v0.2.19
474.09 s
> Compiling tiny-keccak v2.0.2
474.09 s
> Compiling anyhow v1.0.102
474.09 s
> Compiling itertools v0.14.0
474.09 s
> Compiling static_assertions v1.1.0
474.09 s
> Compiling num-conv v0.2.1
474.09 s
> Compiling powerfmt v0.2.0
474.09 s
> Compiling rustix v1.1.4
474.09 s
> Compiling time-core v0.1.8
474.09 s
> Compiling time-macros v0.2.27
474.09 s
> Compiling crossbeam-epoch v0.9.18
474.09 s
> Compiling deranged v0.5.8
474.09 s
> Compiling linux-raw-sys v0.12.1
474.09 s
> Compiling allocator-api2 v0.2.21
474.09 s
> Compiling pyo3-build-config v0.28.3
474.09 s
> Compiling crossbeam-deque v0.8.6
474.09 s
> Compiling num_threads v0.1.7
474.09 s
> Compiling hashbrown v0.16.1
474.09 s
> Compiling tracing-core v0.1.36
474.09 s
> Compiling virtue v0.0.18
474.09 s
> Compiling winnow v1.0.2
474.09 s
> Compiling arrayvec v0.7.6
474.09 s
> Compiling regex-automata v0.4.14
474.09 s
> Compiling rayon v1.12.0
474.09 s
> Compiling phf_shared v0.11.3
474.09 s
> Compiling bincode_derive v2.0.1
474.09 s
> Compiling unty v0.0.4
474.09 s
> Compiling toml_writer v1.1.1+spec-1.1.0
474.09 s
> Compiling gmp-mpfr-sys v1.7.1
474.09 s
> Compiling getrandom v0.2.17
474.09 s
> Compiling bitflags v2.11.1
474.09 s
> Compiling time v0.3.47
474.09 s
> Compiling rand_core v0.6.4
474.09 s
> Compiling serde_spanned v1.1.1
474.09 s
> Compiling rand_core v0.9.5
474.09 s
> Compiling pin-project-lite v0.2.17
474.09 s
> Compiling nu-ansi-term v0.50.3
474.09 s
> Compiling num-integer v0.1.46
474.09 s
> Compiling approx v0.5.1
474.09 s
> Compiling bytemuck_derive v1.12.0
474.09 s
> Compiling toml_parser v1.1.2+spec-1.1.0
474.09 s
> Compiling tracing-log v0.2.0
474.09 s
> Compiling matrixmultiply v0.3.10
474.09 s
> Compiling sharded-slab v0.1.7
474.09 s
> Compiling hashbrown v0.17.1
474.09 s
> Compiling thread_local v1.1.9
474.09 s
> Compiling syn v1.0.109
474.09 s
> Compiling typenum v1.20.0
474.09 s
> Compiling rug v1.30.0
474.09 s
> Compiling option-ext v0.2.0
474.09 s
> Compiling dirs-sys v0.5.0
474.09 s
> Compiling pyo3-ffi v0.28.3
474.09 s
> Compiling num-complex v0.4.6
474.09 s
> Compiling toml_datetime v1.1.1+spec-1.1.0
474.09 s
> Compiling dyn-clone v1.0.20
474.09 s
> Compiling az v1.3.0
474.09 s
> Compiling rawpointer v0.2.1
474.09 s
> Compiling fnv v1.0.7
474.09 s
> Compiling alloc-no-stdlib v2.0.4
474.09 s
> Compiling alloc-stdlib v0.2.2
474.09 s
> Compiling num-bigint v0.4.6
474.09 s
> Compiling pyo3-macros-backend v0.28.3
474.09 s
> Compiling generic-array v0.14.7
474.09 s
> Compiling colored v3.1.1
474.09 s
> Compiling bitflags v1.3.2
474.09 s
> Compiling errno v0.3.14
474.09 s
> Compiling getopts v0.2.24
474.09 s
> Compiling ident_case v1.0.1
474.09 s
> Compiling same-file v1.0.6
474.09 s
> Compiling parking_lot_core v0.9.12
474.09 s
> Compiling signal-hook v0.3.18
474.09 s
> Compiling walkdir v2.5.0
474.09 s
> Compiling bytemuck v1.25.0
474.09 s
> Compiling signal-hook-registry v1.4.8
474.09 s
> Compiling indexmap v2.14.0
474.09 s
> Compiling region v3.0.2
474.09 s
> Compiling toml v1.1.2+spec-1.1.0
474.09 s
> Compiling safe_arch v0.7.4
474.09 s
> Compiling safe_arch v1.2.0
474.09 s
> Compiling matchers v0.2.0
474.09 s
> Compiling regex v1.12.3
474.09 s
> Compiling synstructure v0.13.2
474.09 s
> Compiling const-random-macro v0.1.16
474.09 s
> Compiling hugepage-rs v0.1.1
474.09 s
> Compiling wasmtime-jit-icache-coherence v34.0.2
474.09 s
> Compiling vte v0.14.1
474.09 s
> Compiling wide v0.7.33
474.09 s
> Compiling smartstring v1.0.1
474.09 s
> Compiling wide v1.7.0
474.09 s
> Compiling ahash v0.8.12
474.09 s
> Compiling scopeguard v1.2.0
474.09 s
> Compiling unic-common v0.9.0
474.09 s
> Compiling spec_math v0.1.6
474.09 s
> Compiling unic-char-range v0.9.0
474.09 s
> Compiling inventory v0.3.24
474.09 s
> Compiling unic-char-property v0.9.0
474.09 s
> Compiling serde_derive v1.0.228
474.09 s
> Compiling zerocopy-derive v0.8.48
474.09 s
> Compiling tracing-attributes v0.1.31
474.09 s
> Compiling thiserror-impl v2.0.18
474.09 s
> Compiling strum_macros v0.27.2
474.09 s
> Compiling is-macro v0.3.7
474.09 s
> Compiling unic-ucd-version v0.9.0
474.09 s
> Compiling lock_api v0.4.14
474.09 s
> Compiling const-random v0.1.18
474.09 s
> Compiling terminal_size v0.4.4
474.09 s
> Compiling brotli-decompressor v5.0.0
474.09 s
> Compiling mio v1.2.0
474.09 s
> Compiling rustpython-parser-vendored v0.4.0
474.09 s
> Compiling itertools v0.11.0
474.09 s
> Compiling iana-time-zone v0.1.65
474.09 s
> Compiling fastrand v2.4.1
474.09 s
> Compiling winnow v0.7.15
474.09 s
> Compiling minimal-lexical v0.2.1
474.09 s
> Compiling unicase v2.9.0
474.09 s
> Compiling rustix v0.38.44
474.09 s
> Compiling indenter v0.3.4
474.09 s
> Compiling brotli v8.0.2
474.09 s
> Compiling nom v7.1.3
474.09 s
> Compiling clap_builder v4.6.0
474.09 s
> Compiling thiserror v2.0.18
474.09 s
> Compiling tracing v0.1.44
474.09 s
> Compiling simba v0.9.1
474.09 s
> Compiling rustpython-parser-core v0.4.0
474.09 s
> Compiling signal-hook-mio v0.2.5
474.09 s
> Compiling zerofrom-derive v0.1.7
474.09 s
> Compiling clap_derive v4.6.1
474.09 s
> Compiling crypto-common v0.1.7
474.09 s
> Compiling block-buffer v0.10.4
474.09 s
> Compiling directories v6.0.0
474.09 s
> Compiling numpy v0.28.0
474.09 s
> Compiling strum v0.27.2
474.09 s
> Compiling phf v0.11.3
474.09 s
> Compiling libloading v0.9.0
474.09 s
> Compiling self_cell v1.2.2
474.09 s
> Compiling tinyjson v2.5.1
474.09 s
> Compiling ed25519-compact v2.4.2
474.09 s
> Compiling bytes v1.11.1
474.09 s
> Compiling append-only-vec v0.1.8
474.09 s
> Compiling linux-raw-sys v0.4.15
474.09 s
> Compiling byteorder v1.5.0
474.09 s
> Compiling unicode-segmentation v1.13.2
474.09 s
> Compiling rustc-hash v2.1.2
474.09 s
> Compiling data-encoding v2.11.1
474.09 s
> Compiling ansitok v0.3.0
474.09 s
> Compiling digest v0.10.7
474.09 s
> Compiling rustpython-ast v0.4.0
474.09 s
> Compiling zerofrom v0.1.8
474.09 s
> Compiling unic-ucd-ident v0.9.0
474.09 s
> Compiling pyo3-macros v0.28.3
474.09 s
> Compiling unic-emoji-char v0.9.0
474.09 s
> Compiling yoke-derive v0.8.2
474.09 s
> Compiling pyo3 v0.28.3
474.09 s
> Compiling phf_shared v0.13.1
474.09 s
> Compiling smallvec v1.15.1
474.09 s
> Compiling bincode v2.0.1
474.09 s
> Compiling tracing-serde v0.2.0
474.09 s
> Compiling chrono v0.4.44
474.09 s
> Compiling tracing-subscriber v0.3.23
474.09 s
> Compiling clap v4.6.1
474.09 s
> Compiling bstr v1.12.1
474.09 s
> Compiling parking_lot v0.12.5
474.09 s
> Compiling lalrpop-util v0.20.2
474.09 s
> Compiling typeid v1.0.3
474.09 s
> Compiling bincode-trait-derive v0.1.1
474.09 s
> Compiling stable_deref_trait v1.2.1
474.09 s
> Compiling getrandom v0.4.2
474.09 s
> Compiling cpufeatures v0.2.17
474.09 s
> Compiling rustc-hash v1.1.0
474.09 s
> Compiling ciborium-io v0.2.2
474.09 s
> Compiling plotters-backend v0.3.7
474.09 s
> Compiling sha2 v0.10.9
474.09 s
> Compiling num-rational v0.4.2
474.09 s
> Compiling plotters-svg v0.3.7
474.09 s
> Compiling globset v0.4.18
474.09 s
> Compiling crossterm v0.28.1
474.09 s
> Compiling toml_datetime v0.6.11
474.09 s
> Compiling yoke v0.8.3
474.09 s
> Compiling serde_spanned v0.6.9
474.09 s
> Compiling xprec v0.2.2
474.09 s
> Compiling eyre v0.6.12
474.09 s
> Compiling ppv-lite86 v0.2.21
474.09 s
> Compiling half v2.7.1
474.09 s
> Compiling zerovec-derive v0.11.6
474.09 s
> Compiling console v0.16.3
474.09 s
> Compiling toml_datetime v0.7.5+spec-1.1.0
474.09 s
> Compiling itertools v0.10.5
474.09 s
> Compiling ucd-trie v0.1.7
474.09 s
> Compiling adler2 v2.0.1
474.09 s
> Compiling ciborium-ll v0.2.2
474.09 s
> Compiling cast v0.3.0
474.09 s
> Compiling toml_write v0.1.2
474.09 s
> Compiling rand_chacha v0.3.1
474.09 s
> Compiling rand_chacha v0.9.0
474.09 s
> Compiling symbolica v2.2.0 (https://github.com/symbolica-dev/symbolica?rev=4f1323185fe5e0c0f8c864ab89edd1905e7adef1#4f132318)
474.09 s
> Compiling rustversion v1.0.22
474.09 s
> Compiling simd-adler32 v0.3.10
474.09 s
> Compiling toml_edit v0.22.27
474.09 s
> Compiling rand v0.8.6
474.09 s
> Compiling rand v0.9.4
474.09 s
> Compiling miniz_oxide v0.8.9
474.09 s
> Compiling ciborium v0.2.2
474.09 s
> Compiling pest v2.8.6
474.09 s
> Compiling toml v0.9.12+spec-1.1.0
474.09 s
> Compiling rust-embed-utils v8.11.0
474.09 s
> Compiling plotters v0.3.7
474.09 s
> Compiling symjit v2.25.6
474.09 s
> Compiling phf_generator v0.11.3
474.09 s
> Compiling tinytemplate v1.2.1
474.09 s
> Compiling zerovec v0.11.8
474.09 s
> Compiling ansi-str v0.9.0
474.09 s
> Compiling ndarray v0.17.2
474.09 s
> Compiling phf_codegen v0.11.3
474.09 s
> Compiling criterion-plot v0.5.0
474.09 s
> Compiling displaydoc v0.2.7
474.09 s
> Compiling unicode_names2_generator v1.3.0
474.09 s
> Compiling rustpython-parser v0.4.0
474.09 s
> Compiling is-terminal v0.4.17
474.09 s
> Compiling slotmap v1.1.1
474.09 s
> Compiling maplit v1.0.2
474.09 s
> Compiling oorandom v11.1.5
474.09 s
> Compiling bytecount v0.6.9
474.09 s
> Compiling anes v0.1.6
474.09 s
> Compiling pest_meta v2.8.6
474.09 s
> Compiling papergrid v0.18.0
474.09 s
> Compiling ron v0.12.1
474.09 s
> Compiling criterion v0.5.1
474.09 s
> Compiling tempfile v3.27.0
474.09 s
> Compiling testing_table v0.3.0
474.09 s
> Compiling unicode_names2 v1.3.0
474.09 s
> Compiling toml v0.8.23
474.09 s
> Compiling tinystr v0.8.4
474.09 s
> Compiling toml_edit v0.25.11+spec-1.1.0
474.09 s
> Compiling tabled_derive v0.12.0
474.09 s
> Compiling similar v2.7.0
474.09 s
> Compiling unic-langid-impl v0.9.6
474.09 s
> Compiling pest_generator v2.8.6
474.09 s
> Compiling insta v1.47.2
474.09 s
> Compiling proc-macro2-diagnostics v0.10.1
474.09 s
> Compiling proc-macro-error-attr v1.0.4
474.09 s
> Compiling uncased v0.9.10
474.09 s
> Compiling slab v0.4.12
474.09 s
> Compiling strsim v0.10.0
474.09 s
> Compiling radium v0.7.0
474.09 s
> Compiling pest_derive v2.8.6
474.09 s
> Compiling darling_core v0.23.0
474.09 s
> Compiling darling_core v0.14.4
474.09 s
> Compiling tabled v0.22.0
474.09 s
> Compiling figment v0.10.19
474.09 s
> Compiling proc-macro-error v1.0.4
474.09 s
> Compiling tap v1.0.1
474.09 s
> Compiling ryu v1.0.23
474.09 s
> Compiling wyz v0.5.1
474.09 s
> Compiling castaway v0.2.4
474.09 s
> Compiling find-msvc-tools v0.1.9
474.09 s
> Compiling indoc v2.0.7
474.09 s
> Compiling instability v0.3.12
474.09 s
> Compiling shlex v1.3.0
474.09 s
> Compiling heck v0.4.1
474.09 s
> Compiling funty v2.0.0
474.09 s
> Compiling cc v1.2.61
474.09 s
> Compiling duplicate v2.0.1
474.09 s
> Compiling compact_str v0.9.0
474.09 s
> Compiling bitvec v1.0.1
474.09 s
> Compiling dot-parser v0.5.1
474.09 s
> Compiling unicode-truncate v2.0.1
474.09 s
> Compiling convert_case v0.10.0
474.09 s
> Compiling kasuari v0.4.12
474.09 s
> Compiling darling_macro v0.14.4
474.09 s
> Compiling serde_repr v0.1.20
474.09 s
> Compiling env_filter v1.0.1
474.09 s
> Compiling num-iter v0.1.45
474.09 s
> Compiling lru v0.16.4
474.09 s
> Compiling ref-ops v0.2.5
474.09 s
> Compiling darling_macro v0.23.0
474.09 s
> Compiling convert_case v0.4.0
474.09 s
> Compiling jiff v0.2.24
474.09 s
> Compiling ratatui-core v0.1.0
474.09 s
> Compiling num v0.4.3
474.09 s
> Compiling derive_more-impl v2.1.1
474.09 s
> Compiling duplicate v1.0.0
474.09 s
> Compiling enum-try-as-inner v0.1.1
474.09 s
> Compiling darling v0.14.4
474.09 s
> Compiling derive_builder_core v0.11.2
474.09 s
> Compiling blake3 v1.8.5
474.09 s
> Compiling derive_more v0.99.20
474.09 s
> Compiling rand_xoshiro v0.6.0
474.09 s
> Compiling delegate v0.12.0
474.09 s
> Compiling features v0.10.0
474.09 s
> Compiling colored v2.2.0
474.09 s
> Compiling object v0.37.3
474.09 s
> Compiling darling v0.23.0
474.09 s
> Compiling constcat v0.5.1
474.09 s
> Compiling thiserror v1.0.69
474.09 s
> Compiling portable-atomic v1.13.1
474.09 s
> Compiling owo-colors v4.3.0
474.09 s
> Compiling gat-lending-iterator v0.1.8
474.09 s
> Compiling litrs v1.0.0
474.09 s
> Compiling cfg_aliases v0.2.1
474.09 s
> Compiling nix v0.31.2
474.09 s
> Compiling derive_more v2.1.1
474.09 s
> Compiling derive_builder_macro v0.11.2
474.09 s
> Compiling rand_distr v0.4.3
474.09 s
> Compiling simba v0.6.0
474.09 s
> Compiling phf_generator v0.13.1
474.09 s
> Compiling nalgebra-macros v0.1.0
474.09 s
> Compiling thiserror-impl v1.0.69
474.09 s
> Compiling dirs v6.0.0
474.09 s
> Compiling line-clipping v0.3.7
474.09 s
> Compiling vte v0.15.0
474.09 s
> Compiling document-features v0.2.12
474.09 s
> Compiling joinery v2.1.0
474.09 s
> Compiling constant_time_eq v0.4.2
474.09 s
> Compiling cpufeatures v0.3.0
474.09 s
> Compiling gimli v0.32.3
474.09 s
> Compiling ref-cast v1.0.25
474.09 s
> Compiling color-spantrace v0.3.0
474.09 s
> Compiling arrayref v0.3.9
474.09 s
> Compiling clarabel v0.11.1
474.09 s
> Compiling ratatui-widgets v0.3.0
474.09 s
> Compiling vt100 v0.16.2
474.09 s
> Compiling derive_builder v0.11.2
474.09 s
> Compiling titlecase v2.2.1
474.09 s
> Compiling phf_macros v0.13.1
474.09 s
> Compiling crossterm v0.29.0
474.09 s
> Compiling tracing-error v0.2.1
474.09 s
> Compiling serde-big-array v0.5.1
474.09 s
> Compiling ref-cast-impl v1.0.25
474.09 s
> Compiling enum_dispatch v0.3.13
474.09 s
> Compiling delegate v0.13.5
474.09 s
> Compiling serde_derive_internals v0.29.1
474.09 s
> Compiling env_logger v0.11.10
474.09 s
> Compiling amd v0.2.2
474.09 s
> Compiling subprocess v0.2.15
474.09 s
> Compiling rust_lisp v0.18.0
474.09 s
> Compiling semver v1.0.28
474.09 s
> Compiling rustc-demangle v0.1.27
474.09 s
> Compiling vakint v0.1.2 (/build/source/crates/vakint)
474.09 s
> Compiling unit-prefix v0.5.2
474.09 s
> Compiling base64 v0.22.1
474.09 s
> Compiling indicatif v0.18.4
474.09 s
> Compiling deprecate-until v1.0.0
474.09 s
> Compiling string-template-plus v0.4.3
474.09 s
> Compiling schemars_derive v1.2.1
474.09 s
> Compiling phf v0.13.1
474.09 s
> Compiling ratatui-crossterm v0.1.0
474.09 s
> Compiling ratatui-macros v0.7.0
474.09 s
> Compiling shellexpand v3.1.2
474.09 s
> Compiling xpct v0.5.1
474.09 s
> Compiling brotli-decompressor v4.0.3
474.09 s
> Compiling integer-sqrt v0.1.5
474.09 s
> Compiling addr2line v0.25.1
474.09 s
> Compiling crossbeam-channel v0.5.15
474.09 s
> Compiling itertools v0.12.1
474.09 s
> Compiling include_dir_macros v0.7.4
474.09 s
> Compiling gammaloop-tracing-filter-macros v0.1.0 (/build/source/crates/gammaloop-tracing-filter-macros)
474.09 s
> Compiling pyo3-stub-gen-derive v0.17.2
474.09 s
> Compiling unsafe-libyaml v0.2.11
474.09 s
> Compiling version-compare v0.2.1
474.09 s
> Compiling gammalooprs v0.3.4 (/build/source/crates/gammalooprs)
474.09 s
> Compiling symlink v0.1.0
474.09 s
> Compiling ctrlc v3.5.2
474.09 s
> Compiling tracing-appender v0.2.5
474.09 s
> Compiling include_dir v0.7.4
474.09 s
> Compiling pathfinding v4.15.0
474.09 s
> Compiling tracing-indicatif v0.3.14
474.09 s
> Compiling rust-embed-impl v8.11.0
474.09 s
> Compiling ratatui v0.30.0
474.09 s
> Compiling json5 v0.4.1
474.09 s
> Compiling strum_macros v0.26.4
474.09 s
> Compiling typed-index-collections v3.5.0
474.09 s
> Compiling brotli v7.0.0
474.09 s
> Compiling serde_yaml v0.9.34+deprecated
474.09 s
> Compiling clap_complete v4.6.3
474.09 s
> Compiling vectorize v0.2.0
474.09 s
> Compiling strip-ansi-escapes v0.2.1
474.09 s
> Compiling gammaloop-api v0.1.0 (/build/source/crates/gammaloop-api)
474.09 s
> Compiling fd-lock v4.0.4
474.09 s
> Compiling itertools v0.13.0
474.09 s
> Compiling base62 v2.2.4
474.09 s
> Compiling strum v0.26.3
474.09 s
> Compiling ringbuffer v0.16.0
474.09 s
> Compiling nalgebra v0.29.0
474.09 s
> Compiling schemars v1.2.1
474.09 s
> Compiling clap_complete_nushell v4.6.0
474.09 s
> Compiling sysinfo v0.33.1
474.09 s
> Compiling backtrace v0.3.76
474.09 s
> Compiling rust-embed v8.11.0
474.09 s
> Compiling color-eyre v0.6.5
474.09 s
> Compiling pyo3-stub-gen v0.17.2
474.09 s
> Compiling reedline v0.42.0
474.09 s
> Compiling statrs v0.16.1
474.09 s
> Compiling momtrop v0.3.0
474.09 s
> Compiling numerica v3.0.0 (https://github.com/symbolica-dev/symbolica?rev=4f1323185fe5e0c0f8c864ab89edd1905e7adef1#4f132318)
474.09 s
> Compiling graphica v3.0.0 (https://github.com/symbolica-dev/symbolica?rev=4f1323185fe5e0c0f8c864ab89edd1905e7adef1#4f132318)
474.09 s
> Compiling symbolica-utils v0.1.0 (/build/source/crates/symbolica-utils)
474.09 s
> Compiling gammaloop-workspace-hack v0.1.0 (/build/source/crates/gammaloop-workspace-hack)
474.09 s
> Compiling spenso-macros v0.3.2 (/build/source/crates/spenso-macros)
474.09 s
> Compiling linnet v0.17.0 (/build/source/crates/linnet)
474.09 s
> Compiling spenso v0.6.0 (/build/source/crates/spenso)
474.09 s
> Compiling idenso v0.3.0 (/build/source/crates/idenso)
474.09 s
> Compiling gammaloop-tracing-filter v0.1.0 (/build/source/crates/gammaloop-tracing-filter)
474.09 s
> Compiling spenso-hep-lib v0.1.7 (/build/source/crates/spenso-hep-lib)
474.09 s
> Compiling alphal00p-docs-python-exporter v0.1.0 (/build/source/crates/alphal00p-docs-python-exporter)
474.09 s
> Finished `docs` profile [unoptimized] target(s) in 3m 54s
474.09 s
> +++ command cargo build --profile docs --locked -p alphal00p-docs-python-exporter --features linnet
474.09 s
> Compiling libc v0.2.186
474.09 s
> Compiling serde_core v1.0.228
474.09 s
> Compiling zerocopy v0.8.48
474.09 s
> Compiling log v0.4.29
474.09 s
> Compiling num-traits v0.2.19
474.09 s
> Compiling syn v1.0.109
474.09 s
> Compiling syn v2.0.117
474.09 s
> Compiling ahash v0.7.8
474.09 s
> Compiling bytecheck v0.6.12
474.09 s
> Compiling regex-syntax v0.8.10
474.09 s
> Compiling rend v0.4.2
474.09 s
> Compiling simdutf8 v0.1.5
474.09 s
> Compiling indexmap v2.14.0
474.09 s
> Compiling ahash v0.8.12
474.09 s
> Compiling figment v0.10.19
474.09 s
> Compiling either v1.15.0
474.09 s
> Compiling rkyv v0.7.46
474.09 s
> Compiling cgmath v0.18.0
474.09 s
> Compiling bincode v2.0.1
474.09 s
> Compiling itertools v0.11.0
474.09 s
> Compiling pyo3 v0.28.3
474.09 s
> Compiling venial v0.5.0
474.09 s
> Compiling seahash v4.1.0
474.09 s
> Compiling winnow v1.0.2
474.09 s
> Compiling arrayvec v0.7.6
474.09 s
> Compiling rustix v1.1.4
474.09 s
> Compiling smallvec v1.15.1
474.09 s
> Compiling polycool v0.4.0
474.09 s
> Compiling winnow v0.7.15
474.09 s
> Compiling bitflags v2.11.1
474.09 s
> Compiling toml_parser v1.1.2+spec-1.1.0
474.09 s
> Compiling toml_writer v1.1.1+spec-1.1.0
474.09 s
> Compiling kurbo v0.13.1
474.09 s
> Compiling linnet-py v0.1.0 (/build/source/crates/linnet-py)
474.09 s
> Compiling num-integer v0.1.46
474.09 s
> Compiling approx v0.4.0
474.09 s
> Compiling wasm-minimal-protocol v0.2.0
474.09 s
> Compiling num-complex v0.4.6
474.09 s
> Compiling regex-automata v0.4.14
474.09 s
> Compiling num-bigint v0.4.6
474.09 s
> Compiling chrono v0.4.44
474.09 s
> Compiling getrandom v0.2.17
474.09 s
> Compiling dirs-sys v0.5.0
474.09 s
> Compiling rand_core v0.6.4
474.09 s
> Compiling const-random-macro v0.1.16
474.09 s
> Compiling pyo3-ffi v0.28.3
474.09 s
> Compiling dirs v6.0.0
474.09 s
> Compiling hashbrown v0.12.3
474.09 s
> Compiling shellexpand v3.1.2
474.09 s
> Compiling getrandom v0.4.2
474.09 s
> Compiling const-random v0.1.18
474.09 s
> Compiling tempfile v3.27.0
474.09 s
> Compiling toml_datetime v0.7.5+spec-1.1.0
474.09 s
> Compiling serde_spanned v1.1.1
474.09 s
> Compiling serde_json v1.0.149
474.09 s
> Compiling toml v0.9.12+spec-1.1.0
474.09 s
> Compiling ptr_meta_derive v0.1.4
474.09 s
> Compiling bytecheck_derive v0.6.12
474.09 s
> Compiling rkyv_derive v0.7.46
474.09 s
> Compiling globset v0.4.18
474.09 s
> Compiling ptr_meta v0.1.4
474.09 s
> Compiling pest_generator v2.8.6
474.09 s
> Compiling pyo3-macros-backend v0.28.3
474.09 s
> Compiling proc-macro2-diagnostics v0.10.1
474.09 s
> Compiling rust-embed-utils v8.11.0
474.09 s
> Compiling zerocopy-derive v0.8.48
474.09 s
> Compiling serde_derive v1.0.228
474.09 s
> Compiling is-macro v0.3.7
474.09 s
> Compiling thiserror-impl v2.0.18
474.09 s
> Compiling bincode-trait-derive v0.1.1
474.09 s
> Compiling duplicate v2.0.1
474.09 s
> Compiling serde_repr v0.1.20
474.09 s
> Compiling rust-embed-impl v8.11.0
474.09 s
> Compiling pest_derive v2.8.6
474.09 s
> Compiling ppv-lite86 v0.2.21
474.09 s
> Compiling rand_chacha v0.3.1
474.09 s
> Compiling dot-parser v0.5.1
474.09 s
> Compiling rustpython-parser-core v0.4.0
474.09 s
> Compiling rustpython-ast v0.4.0
474.09 s
> Compiling rand v0.8.6
474.09 s
> Compiling thiserror v2.0.18
474.09 s
> Compiling rust-embed v8.11.0
474.09 s
> Compiling phf_generator v0.11.3
474.09 s
> Compiling phf_codegen v0.11.3
474.09 s
> Compiling unicode_names2_generator v1.3.0
474.09 s
> Compiling rustpython-parser v0.4.0
474.09 s
> Compiling unicode_names2 v1.3.0
474.09 s
> Compiling pyo3-macros v0.28.3
474.09 s
> Compiling serde v1.0.228
474.09 s
> Compiling bitvec v1.0.1
474.09 s
> Compiling half v2.7.1
474.09 s
> Compiling ciborium-ll v0.2.2
474.09 s
> Compiling ciborium v0.2.2
474.09 s
> Compiling kurvst v0.1.0 (/build/source/crates/kurvst)
474.09 s
> Compiling linnet v0.17.0 (/build/source/crates/linnet)
474.09 s
> Compiling pyo3-stub-gen-derive v0.17.2
474.09 s
> Compiling pyo3-stub-gen v0.17.2
474.09 s
> Compiling linnest v0.1.0 (/build/source/crates/linnest)
474.09 s
> Compiling alphal00p-docs-python-exporter v0.1.0 (/build/source/crates/alphal00p-docs-python-exporter)
474.09 s
> Finished `docs` profile [unoptimized] target(s) in 19.34s
474.09 s
> +++ command cargo build --profile docs --locked -p alphal00p-docs-python-exporter --features spenso
474.09 s
> Compiling pyo3-build-config v0.28.3
474.09 s
> Compiling symbolica v2.2.0 (https://github.com/symbolica-dev/symbolica?rev=4f1323185fe5e0c0f8c864ab89edd1905e7adef1#4f132318)
474.09 s
> Compiling syn v1.0.109
474.09 s
> Compiling figment v0.10.19
474.09 s
> Compiling proc-macro-error v1.0.4
474.09 s
> Compiling duplicate v1.0.0
474.09 s
> Compiling pyo3-macros-backend v0.28.3
474.09 s
> Compiling numpy v0.28.0
474.09 s
> Compiling pyo3-ffi v0.28.3
474.09 s
> Compiling pyo3 v0.28.3
474.09 s
> Compiling pyo3-macros v0.28.3
474.09 s
> Compiling pyo3-stub-gen v0.17.2
474.09 s
> Compiling numerica v3.0.0 (https://github.com/symbolica-dev/symbolica?rev=4f1323185fe5e0c0f8c864ab89edd1905e7adef1#4f132318)
474.09 s
> Compiling gammaloop-workspace-hack v0.1.0 (/build/source/crates/gammaloop-workspace-hack)
474.09 s
> Compiling graphica v3.0.0 (https://github.com/symbolica-dev/symbolica?rev=4f1323185fe5e0c0f8c864ab89edd1905e7adef1#4f132318)
474.09 s
> Compiling symbolica-utils v0.1.0 (/build/source/crates/symbolica-utils)
474.09 s
> Compiling tymbolica-atom-payload v0.1.0 (https://github.com/lcnbr/tymbolica?rev=32ae00483b4845161401afac8be755cc336cb2bb#32ae0048)
474.09 s
> Compiling linnet v0.17.0 (/build/source/crates/linnet)
474.09 s
> Compiling spenso v0.6.0 (/build/source/crates/spenso)
474.09 s
> Compiling idenso v0.3.0 (/build/source/crates/idenso)
474.09 s
> Compiling spenso-hep-lib v0.1.7 (/build/source/crates/spenso-hep-lib)
474.09 s
> Compiling spynso3 v0.1.2 (/build/source/crates/spynso3)
474.09 s
> Compiling alphal00p-docs-python-exporter v0.1.0 (/build/source/crates/alphal00p-docs-python-exporter)
474.09 s
> Finished `docs` profile [unoptimized] target(s) in 49.14s
474.09 s
> +++ command cargo build --profile docs --locked -p alphal00p-docs-python-exporter --features idenso
474.09 s
> Compiling pyo3 v0.28.3
474.09 s
> Compiling numpy v0.28.0
474.09 s
> Compiling pyo3-stub-gen v0.17.2
474.09 s
> Compiling numerica v3.0.0 (https://github.com/symbolica-dev/symbolica?rev=4f1323185fe5e0c0f8c864ab89edd1905e7adef1#4f132318)
474.09 s
> Compiling graphica v3.0.0 (https://github.com/symbolica-dev/symbolica?rev=4f1323185fe5e0c0f8c864ab89edd1905e7adef1#4f132318)
474.09 s
> Compiling symbolica v2.2.0 (https://github.com/symbolica-dev/symbolica?rev=4f1323185fe5e0c0f8c864ab89edd1905e7adef1#4f132318)
474.09 s
> Compiling symbolica-utils v0.1.0 (/build/source/crates/symbolica-utils)
474.09 s
> Compiling gammaloop-workspace-hack v0.1.0 (/build/source/crates/gammaloop-workspace-hack)
474.09 s
> Compiling linnet v0.17.0 (/build/source/crates/linnet)
474.09 s
> Compiling spenso v0.6.0 (/build/source/crates/spenso)
474.09 s
> Compiling idenso v0.3.0 (/build/source/crates/idenso)
474.09 s
> Compiling alphal00p-docs-python-exporter v0.1.0 (/build/source/crates/alphal00p-docs-python-exporter)
474.09 s
> Finished `docs` profile [unoptimized] target(s) in 44.60s
474.09 s
> +++ command cargo build --profile docs --locked -p alphal00p-docs-python-exporter --features vakint
474.09 s
> Compiling libc v0.2.186
474.09 s
> Compiling tiny-keccak v2.0.2
474.09 s
> Compiling bytemuck v1.25.0
474.09 s
> Compiling matrixmultiply v0.3.10
474.09 s
> Compiling getrandom v0.3.4
474.09 s
> Compiling num-integer v0.1.46
474.09 s
> Compiling pyo3 v0.28.3
474.09 s
> Compiling regex-automata v0.4.14
474.09 s
> Compiling pyo3-macros-backend v0.28.3
474.09 s
> Compiling pyo3-ffi v0.28.3
474.09 s
> Compiling ahash v0.8.12
474.09 s
> Compiling approx v0.5.1
474.09 s
> Compiling serde v1.0.228
474.09 s
> Compiling itertools v0.14.0
474.09 s
> Compiling smallvec v1.15.1
474.09 s
> Compiling gmp-mpfr-sys v1.7.1
474.09 s
> Compiling safe_arch v0.7.4
474.09 s
> Compiling rand_core v0.9.5
474.09 s
> Compiling safe_arch v1.2.0
474.09 s
> Compiling rayon v1.12.0
474.09 s
> Compiling tracing-attributes v0.1.31
474.09 s
> Compiling rand_chacha v0.9.0
474.09 s
> Compiling smartstring v1.0.1
474.09 s
> Compiling phf_shared v0.13.1
474.09 s
> Compiling wide v0.7.33
474.09 s
> Compiling fastrand v2.4.1
474.09 s
> Compiling rug v1.30.0
474.09 s
> Compiling wide v1.7.0
474.09 s
> Compiling rand v0.9.4
474.09 s
> Compiling phf_generator v0.13.1
474.09 s
> Compiling symbolica v2.2.0 (https://github.com/symbolica-dev/symbolica?rev=4f1323185fe5e0c0f8c864ab89edd1905e7adef1#4f132318)
474.09 s
> Compiling ndarray v0.17.2
474.09 s
> Compiling phf_macros v0.13.1
474.09 s
> Compiling directories v6.0.0
474.09 s
> Compiling subprocess v0.2.15
474.09 s
> Compiling vakint v0.1.2 (/build/source/crates/vakint)
474.09 s
> Compiling getrandom v0.2.17
474.09 s
> Compiling rand_core v0.6.4
474.09 s
> Compiling rand_chacha v0.3.1
474.09 s
> Compiling phf v0.13.1
474.09 s
> Compiling tracing v0.1.44
474.09 s
> Compiling rand v0.8.6
474.09 s
> Compiling simba v0.9.1
474.09 s
> Compiling phf_generator v0.11.3
474.09 s
> Compiling phf_codegen v0.11.3
474.09 s
> Compiling unicode_names2_generator v1.3.0
474.09 s
> Compiling rustpython-parser v0.4.0
474.09 s
> Compiling regex v1.12.3
474.09 s
> Compiling matchers v0.2.0
474.09 s
> Compiling tracing-subscriber v0.3.23
474.09 s
> Compiling unicode_names2 v1.3.0
474.09 s
> Compiling titlecase v2.2.1
474.09 s
> Compiling pyo3-macros v0.28.3
474.09 s
> Compiling string-template-plus v0.4.3
474.09 s
> Compiling xprec v0.2.2
474.09 s
> Compiling numpy v0.28.0
474.09 s
> Compiling pyo3-stub-gen-derive v0.17.2
474.09 s
> Compiling pyo3-stub-gen v0.17.2
474.09 s
> Compiling numerica v3.0.0 (https://github.com/symbolica-dev/symbolica?rev=4f1323185fe5e0c0f8c864ab89edd1905e7adef1#4f132318)
474.09 s
> error : select an integer backend: `integer-gmp` or `integer-malachite`
474.09 s
> --> /nix/store/9rqk4093qnvgswmdk1pbxk9najcrjn7a-vendor-cargo-deps/bc87b2b0f37b9a43ffdd82e8f11f3e864d9447ccd53a9a964250c3414c3656d9/numerica-3.0.0/src/lib.rs:40:1
474.09 s
> |
474.09 s
> 40 | compile_error!("select an integer backend: `integer-gmp` or `integer-malachite`");
474.09 s
> | ^^^^^^^^^^^^^^^^^^^^^^^^^^^^^^^^^^^^^^^^^^^^^^^^^^^^^^^^^^^^^^^^^^^^^^^^^^^^^^^^^
474.09 s
>
474.09 s
> error : select a float backend: `float-mpfr` or `float-astro`
474.09 s
> --> /nix/store/9rqk4093qnvgswmdk1pbxk9najcrjn7a-vendor-cargo-deps/bc87b2b0f37b9a43ffdd82e8f11f3e864d9447ccd53a9a964250c3414c3656d9/numerica-3.0.0/src/lib.rs:44:1
474.09 s
> |
474.09 s
> 44 | compile_error!("select a float backend: `float-mpfr` or `float-astro`");
474.09 s
> | ^^^^^^^^^^^^^^^^^^^^^^^^^^^^^^^^^^^^^^^^^^^^^^^^^^^^^^^^^^^^^^^^^^^^^^^
474.09 s
>
474.09 s
> error[E0432] : unresolved import `implementation::BackendRandState`
474.09 s
> --> /nix/store/9rqk4093qnvgswmdk1pbxk9najcrjn7a-vendor-cargo-deps/bc87b2b0f37b9a43ffdd82e8f11f3e864d9447ccd53a9a964250c3414c3656d9/numerica-3.0.0/src/domains/backend/integer.rs:1614:33
474.09 s
> |
474.09 s
> 1614 | pub(crate) use implementation::{BackendRandState, Complete, RemRounding};
474.09 s
> | ^^^^^^^^^^^^^^^^ no `BackendRandState` in `domains::backend::integer::implementation`
474.09 s
> |
474.09 s
> note : found an item that was configured out
474.09 s
> --> /nix/store/9rqk4093qnvgswmdk1pbxk9najcrjn7a-vendor-cargo-deps/bc87b2b0f37b9a43ffdd82e8f11f3e864d9447ccd53a9a964250c3414c3656d9/numerica-3.0.0/src/domains/backend/integer.rs:1378:23
474.09 s
> |
474.09 s
> 1377 | #[cfg(feature = "integer-malachite")]
474.09 s
> | ----------------------------- the item is gated behind the `integer-malachite` feature
474.09 s
> 1378 | pub(crate) struct BackendRandState {
474.09 s
> | ^^^^^^^^^^^^^^^^
474.09 s
> note : found an item that was configured out
474.09 s
> --> /nix/store/9rqk4093qnvgswmdk1pbxk9najcrjn7a-vendor-cargo-deps/bc87b2b0f37b9a43ffdd82e8f11f3e864d9447ccd53a9a964250c3414c3656d9/numerica-3.0.0/src/domains/backend/integer.rs:1413:23
474.09 s
> |
474.09 s
> 1412 | #[cfg(feature = "integer-gmp")]
474.09 s
> | ----------------------- the item is gated behind the `integer-gmp` feature
474.09 s
> 1413 | pub(crate) struct BackendRandState(rug::rand::RandState<'static>);
474.09 s
> | ^^^^^^^^^^^^^^^^
474.09 s
>
474.09 s
> error[E0432] : unresolved import `implementation::RawMultiPrecisionInteger`
474.09 s
> --> /nix/store/9rqk4093qnvgswmdk1pbxk9najcrjn7a-vendor-cargo-deps/bc87b2b0f37b9a43ffdd82e8f11f3e864d9447ccd53a9a964250c3414c3656d9/numerica-3.0.0/src/domains/backend/integer.rs:1616:61
474.09 s
> |
474.09 s
> 1616 | MultiPrecisionInteger, ParseMultiPrecisionIntegerError, RawMultiPrecisionInteger,
474.09 s
> | ^^^^^^^^^^^^^^^^^^^^^^^^ no `RawMultiPrecisionInteger` in `domains::backend::integer::implementation`
474.09 s
> |
474.09 s
> note : found an item that was configured out
474.09 s
> --> /nix/store/9rqk4093qnvgswmdk1pbxk9najcrjn7a-vendor-cargo-deps/bc87b2b0f37b9a43ffdd82e8f11f3e864d9447ccd53a9a964250c3414c3656d9/numerica-3.0.0/src/domains/backend/integer.rs:26:14
474.09 s
> |
474.09 s
> 25 | #[cfg(feature = "integer-malachite")]
474.09 s
> | ----------------------------- the item is gated behind the `integer-malachite` feature
474.09 s
> 26 | pub type RawMultiPrecisionInteger = malachite_nz::integer::Integer;
474.09 s
> | ^^^^^^^^^^^^^^^^^^^^^^^^
474.09 s
> note : found an item that was configured out
474.09 s
> --> /nix/store/9rqk4093qnvgswmdk1pbxk9najcrjn7a-vendor-cargo-deps/bc87b2b0f37b9a43ffdd82e8f11f3e864d9447ccd53a9a964250c3414c3656d9/numerica-3.0.0/src/domains/backend/integer.rs:29:14
474.09 s
> |
474.09 s
> 28 | #[cfg(feature = "integer-gmp")]
474.09 s
> | ----------------------- the item is gated behind the `integer-gmp` feature
474.09 s
> 29 | pub type RawMultiPrecisionInteger = rug::Integer;
474.09 s
> | ^^^^^^^^^^^^^^^^^^^^^^^^
474.09 s
> help : a similar name exists in the module
474.09 s
> |
474.09 s
> 1616 - MultiPrecisionInteger, ParseMultiPrecisionIntegerError, RawMultiPrecisionInteger ,
474.09 s
> 1616 + MultiPrecisionInteger, ParseMultiPrecisionIntegerError, MultiPrecisionInteger ,
474.09 s
> |
474.09 s
>
474.09 s
> error[E0432] : unresolved imports `implementation::from_be_bytes`, `implementation::to_be_bytes`
474.09 s
> --> /nix/store/9rqk4093qnvgswmdk1pbxk9najcrjn7a-vendor-cargo-deps/bc87b2b0f37b9a43ffdd82e8f11f3e864d9447ccd53a9a964250c3414c3656d9/numerica-3.0.0/src/domains/backend/integer.rs:1709:33
474.09 s
> |
474.09 s
> 1709 | pub(crate) use implementation::{from_be_bytes, to_be_bytes};
474.09 s
> | ^^^^^^^^^^^^^ ^^^^^^^^^^^ no `to_be_bytes` in `domains::backend::integer::implementation`
474.09 s
> | |
474.09 s
> | no `from_be_bytes` in `domains::backend::integer::implementation`
474.09 s
> |
474.09 s
> note : found an item that was configured out
474.09 s
> --> /nix/store/9rqk4093qnvgswmdk1pbxk9najcrjn7a-vendor-cargo-deps/bc87b2b0f37b9a43ffdd82e8f11f3e864d9447ccd53a9a964250c3414c3656d9/numerica-3.0.0/src/domains/backend/integer.rs:1370:19
474.09 s
> |
474.09 s
> 1369 | #[cfg(all(feature = "integer-malachite", feature = "bincode"))]
474.09 s
> | ----------------------------- the item is gated behind the `integer-malachite` feature
474.09 s
> 1370 | pub(crate) fn from_be_bytes(bytes: &[u8]) -> Result<MultiPrecisionInteger, &'static str> {
474.09 s
> | ^^^^^^^^^^^^^
474.09 s
> note : found an item that was configured out
474.09 s
> --> /nix/store/9rqk4093qnvgswmdk1pbxk9najcrjn7a-vendor-cargo-deps/bc87b2b0f37b9a43ffdd82e8f11f3e864d9447ccd53a9a964250c3414c3656d9/numerica-3.0.0/src/domains/backend/integer.rs:1405:19
474.09 s
> |
474.09 s
> 1404 | #[cfg(all(feature = "integer-gmp", feature = "bincode"))]
474.09 s
> | ----------------------- the item is gated behind the `integer-gmp` feature
474.09 s
> 1405 | pub(crate) fn from_be_bytes(bytes: &[u8]) -> Result<MultiPrecisionInteger, &'static str> {
474.09 s
> | ^^^^^^^^^^^^^
474.09 s
> note : found an item that was configured out
474.09 s
> --> /nix/store/9rqk4093qnvgswmdk1pbxk9najcrjn7a-vendor-cargo-deps/bc87b2b0f37b9a43ffdd82e8f11f3e864d9447ccd53a9a964250c3414c3656d9/numerica-3.0.0/src/domains/backend/integer.rs:1365:19
474.09 s
> |
474.09 s
> 1364 | #[cfg(all(feature = "integer-malachite", feature = "bincode"))]
474.09 s
> | ----------------------------- the item is gated behind the `integer-malachite` feature
474.09 s
> 1365 | pub(crate) fn to_be_bytes(value: &MultiPrecisionInteger) -> Vec<u8> {
474.09 s
> | ^^^^^^^^^^^
474.09 s
> note : found an item that was configured out
474.09 s
> --> /nix/store/9rqk4093qnvgswmdk1pbxk9najcrjn7a-vendor-cargo-deps/bc87b2b0f37b9a43ffdd82e8f11f3e864d9447ccd53a9a964250c3414c3656d9/numerica-3.0.0/src/domains/backend/integer.rs:1400:19
474.09 s
> |
474.09 s
> 1399 | #[cfg(all(feature = "integer-gmp", feature = "bincode"))]
474.09 s
> | ----------------------- the item is gated behind the `integer-gmp` feature
474.09 s
> 1400 | pub(crate) fn to_be_bytes(value: &MultiPrecisionInteger) -> Vec<u8> {
474.09 s
> | ^^^^^^^^^^^
474.09 s
>
474.09 s
> error[E0432] : unresolved imports `crate::domains::backend::float::Assign`, `crate::domains::backend::float::CompleteRound`, `crate::domains::backend::float::Constant`, `crate::domains::backend::float::MultiPrecisionFloat`, `crate::domains::backend::float::Pow`
474.09 s
> --> /nix/store/9rqk4093qnvgswmdk1pbxk9najcrjn7a-vendor-cargo-deps/bc87b2b0f37b9a43ffdd82e8f11f3e864d9447ccd53a9a964250c3414c3656d9/numerica-3.0.0/src/domains/float/multiprecision.rs:15:9
474.09 s
> |
474.09 s
> 15 | Assign, CompleteRound, Constant, MultiPrecisionFloat, MultiPrecisionFloatInteger,
474.09 s
> | ^^^^^^ ^^^^^^^^^^^^^ ^^^^^^^^ ^^^^^^^^^^^^^^^^^^^ no `MultiPrecisionFloat` in `domains::backend::float`
474.09 s
> | | | |
474.09 s
> | | | no `Constant` in `domains::backend::float`
474.09 s
> | | no `CompleteRound` in `domains::backend::float`
474.09 s
> | no `Assign` in `domains::backend::float`
474.09 s
> 16 | MultiPrecisionFloatRational, MultiPrecisionFloatRounding, Pow, RoundingDirection,
474.09 s
> | ^^^ no `Pow` in `domains::backend::float`
474.09 s
> |
474.09 s
> note : found an item that was configured out
474.09 s
> --> /nix/store/9rqk4093qnvgswmdk1pbxk9najcrjn7a-vendor-cargo-deps/bc87b2b0f37b9a43ffdd82e8f11f3e864d9447ccd53a9a964250c3414c3656d9/numerica-3.0.0/src/domains/backend/float.rs:17:5
474.09 s
> |
474.09 s
> 15 | #[cfg(feature = "float-mpfr")]
474.09 s
> | ---------------------- the item is gated behind the `float-mpfr` feature
474.09 s
> 16 | pub use rug::{
474.09 s
> 17 | Assign, Float as MultiPrecisionFloat, Rational as BackendRational,
474.09 s
> | ^^^^^^
474.09 s
> note : found an item that was configured out
474.09 s
> --> /nix/store/9rqk4093qnvgswmdk1pbxk9najcrjn7a-vendor-cargo-deps/bc87b2b0f37b9a43ffdd82e8f11f3e864d9447ccd53a9a964250c3414c3656d9/numerica-3.0.0/src/domains/backend/float.rs:1578:5
474.09 s
> |
474.09 s
> 1576 | #[cfg(feature = "float-astro")]
474.09 s
> | ----------------------- the item is gated behind the `float-astro` feature
474.09 s
> 1577 | pub use astro::{
474.09 s
> 1578 | Assign, BackendRational, CompleteRound, Constant, IntoMultiPrecisionFloat, MultiPrecisionFloat,
474.09 s
> | ^^^^^^
474.09 s
> note : found an item that was configured out
474.09 s
> --> /nix/store/9rqk4093qnvgswmdk1pbxk9najcrjn7a-vendor-cargo-deps/bc87b2b0f37b9a43ffdd82e8f11f3e864d9447ccd53a9a964250c3414c3656d9/numerica-3.0.0/src/domains/backend/float.rs:19:11
474.09 s
> |
474.09 s
> 15 | #[cfg(feature = "float-mpfr")]
474.09 s
> | ---------------------- the item is gated behind the `float-mpfr` feature
474.09 s
> ...
474.09 s
> 19 | ops::{CompleteRound, Pow},
474.09 s
> | ^^^^^^^^^^^^^
474.09 s
> note : found an item that was configured out
474.09 s
> --> /nix/store/9rqk4093qnvgswmdk1pbxk9najcrjn7a-vendor-cargo-deps/bc87b2b0f37b9a43ffdd82e8f11f3e864d9447ccd53a9a964250c3414c3656d9/numerica-3.0.0/src/domains/backend/float.rs:1578:30
474.09 s
> |
474.09 s
> 1576 | #[cfg(feature = "float-astro")]
474.09 s
> | ----------------------- the item is gated behind the `float-astro` feature
474.09 s
> 1577 | pub use astro::{
474.09 s
> 1578 | Assign, BackendRational, CompleteRound, Constant, IntoMultiPrecisionFloat, MultiPrecisionFloat,
474.09 s
> | ^^^^^^^^^^^^^
474.09 s
> note : found an item that was configured out
474.09 s
> --> /nix/store/9rqk4093qnvgswmdk1pbxk9najcrjn7a-vendor-cargo-deps/bc87b2b0f37b9a43ffdd82e8f11f3e864d9447ccd53a9a964250c3414c3656d9/numerica-3.0.0/src/domains/backend/float.rs:18:12
474.09 s
> |
474.09 s
> 15 | #[cfg(feature = "float-mpfr")]
474.09 s
> | ---------------------- the item is gated behind the `float-mpfr` feature
474.09 s
> ...
474.09 s
> 18 | float::Constant,
474.09 s
> | ^^^^^^^^
474.09 s
> note : found an item that was configured out
474.09 s
> --> /nix/store/9rqk4093qnvgswmdk1pbxk9najcrjn7a-vendor-cargo-deps/bc87b2b0f37b9a43ffdd82e8f11f3e864d9447ccd53a9a964250c3414c3656d9/numerica-3.0.0/src/domains/backend/float.rs:1578:45
474.09 s
> |
474.09 s
> 1576 | #[cfg(feature = "float-astro")]
474.09 s
> | ----------------------- the item is gated behind the `float-astro` feature
474.09 s
> 1577 | pub use astro::{
474.09 s
> 1578 | Assign, BackendRational, CompleteRound, Constant, IntoMultiPrecisionFloat, MultiPrecisionFloat,
474.09 s
> | ^^^^^^^^
474.09 s
> note : found an item that was configured out
474.09 s
> --> /nix/store/9rqk4093qnvgswmdk1pbxk9najcrjn7a-vendor-cargo-deps/bc87b2b0f37b9a43ffdd82e8f11f3e864d9447ccd53a9a964250c3414c3656d9/numerica-3.0.0/src/domains/backend/float.rs:17:22
474.09 s
> |
474.09 s
> 15 | #[cfg(feature = "float-mpfr")]
474.09 s
> | ---------------------- the item is gated behind the `float-mpfr` feature
474.09 s
> 16 | pub use rug::{
474.09 s
> 17 | Assign, Float as MultiPrecisionFloat, Rational as BackendRational,
474.09 s
> | ^^^^^^^^^^^^^^^^^^^
474.09 s
> note : found an item that was configured out
474.09 s
> --> /nix/store/9rqk4093qnvgswmdk1pbxk9najcrjn7a-vendor-cargo-deps/bc87b2b0f37b9a43ffdd82e8f11f3e864d9447ccd53a9a964250c3414c3656d9/numerica-3.0.0/src/domains/backend/float.rs:1578:80
474.09 s
> |
474.09 s
> 1576 | #[cfg(feature = "float-astro")]
474.09 s
> | ----------------------- the item is gated behind the `float-astro` feature
474.09 s
> 1577 | pub use astro::{
474.09 s
> 1578 | Assign, BackendRational, CompleteRound, Constant, IntoMultiPrecisionFloat, MultiPrecisionFloat,
474.09 s
> | ^^^^^^^^^^^^^^^^^^^
474.09 s
> note : found an item that was configured out
474.09 s
> --> /nix/store/9rqk4093qnvgswmdk1pbxk9najcrjn7a-vendor-cargo-deps/bc87b2b0f37b9a43ffdd82e8f11f3e864d9447ccd53a9a964250c3414c3656d9/numerica-3.0.0/src/domains/backend/float.rs:19:26
474.09 s
> |
474.09 s
> 15 | #[cfg(feature = "float-mpfr")]
474.09 s
> | ---------------------- the item is gated behind the `float-mpfr` feature
474.09 s
> ...
474.09 s
> 19 | ops::{CompleteRound, Pow},
474.09 s
> | ^^^
474.09 s
> note : found an item that was configured out
474.09 s
> --> /nix/store/9rqk4093qnvgswmdk1pbxk9najcrjn7a-vendor-cargo-deps/bc87b2b0f37b9a43ffdd82e8f11f3e864d9447ccd53a9a964250c3414c3656d9/numerica-3.0.0/src/domains/backend/float.rs:1579:5
474.09 s
> |
474.09 s
> 1576 | #[cfg(feature = "float-astro")]
474.09 s
> | ----------------------- the item is gated behind the `float-astro` feature
474.09 s
> ...
474.09 s
> 1579 | Pow,
474.09 s
> | ^^^
474.09 s
>
474.09 s
> error[E0425] : cannot find type `RawMultiPrecisionInteger` in this scope
474.09 s
> --> /nix/store/9rqk4093qnvgswmdk1pbxk9najcrjn7a-vendor-cargo-deps/bc87b2b0f37b9a43ffdd82e8f11f3e864d9447ccd53a9a964250c3414c3656d9/numerica-3.0.0/src/domains/backend/integer.rs:52:38
474.09 s
> |
474.09 s
> 52 | pub struct MultiPrecisionInteger(RawMultiPrecisionInteger);
474.09 s
> | ^^^^^^^^^^^^^^^^^^^^^^^^ not found in this scope
474.09 s
>
474.09 s
> error[E0425] : cannot find type `RawMultiPrecisionInteger` in this scope
474.09 s
> --> /nix/store/9rqk4093qnvgswmdk1pbxk9najcrjn7a-vendor-cargo-deps/bc87b2b0f37b9a43ffdd82e8f11f3e864d9447ccd53a9a964250c3414c3656d9/numerica-3.0.0/src/domains/backend/integer.rs:52:38
474.09 s
> |
474.09 s
> 52 | pub struct MultiPrecisionInteger(RawMultiPrecisionInteger);
474.09 s
> | ^^^^^^^^^^^^^^^^^^^^^^^^ not found in this scope
474.09 s
> |
474.09 s
> help : you might be missing a type parameter
474.09 s
> |
474.09 s
> 52 | pub struct MultiPrecisionInteger<RawMultiPrecisionInteger> (RawMultiPrecisionInteger);
474.09 s
> | ++++++++++++++++++++++++++
474.09 s
>
474.09 s
> error[E0425] : cannot find type `RawMultiPrecisionInteger` in this scope
474.09 s
> --> /nix/store/9rqk4093qnvgswmdk1pbxk9najcrjn7a-vendor-cargo-deps/bc87b2b0f37b9a43ffdd82e8f11f3e864d9447ccd53a9a964250c3414c3656d9/numerica-3.0.0/src/domains/backend/integer.rs:149:32
474.09 s
> |
474.09 s
> 52 | pub struct MultiPrecisionInteger(RawMultiPrecisionInteger);
474.09 s
> | ----------------------------------------------------------- similarly named struct `MultiPrecisionInteger` defined here
474.09 s
> ...
474.09 s
> 149 | pub fn from_raw(value: RawMultiPrecisionInteger) -> Self {
474.09 s
> | ^^^^^^^^^^^^^^^^^^^^^^^^
474.09 s
> |
474.09 s
> help : a struct with a similar name exists
474.09 s
> |
474.09 s
> 149 - pub fn from_raw(value: RawMultiPrecisionInteger ) -> Self {
474.09 s
> 149 + pub fn from_raw(value: MultiPrecisionInteger ) -> Self {
474.09 s
> |
474.09 s
>
474.09 s
> error[E0425] : cannot find type `RawMultiPrecisionInteger` in this scope
474.09 s
> --> /nix/store/9rqk4093qnvgswmdk1pbxk9najcrjn7a-vendor-cargo-deps/bc87b2b0f37b9a43ffdd82e8f11f3e864d9447ccd53a9a964250c3414c3656d9/numerica-3.0.0/src/domains/backend/integer.rs:187:34
474.09 s
> |
474.09 s
> 52 | pub struct MultiPrecisionInteger(RawMultiPrecisionInteger);
474.09 s
> | ----------------------------------------------------------- similarly named struct `MultiPrecisionInteger` defined here
474.09 s
> ...
474.09 s
> 187 | pub fn as_raw(&self) -> &RawMultiPrecisionInteger {
474.09 s
> | ^^^^^^^^^^^^^^^^^^^^^^^^
474.09 s
> |
474.09 s
> help : a struct with a similar name exists
474.09 s
> |
474.09 s
> 187 - pub fn as_raw(&self) -> &RawMultiPrecisionInteger {
474.09 s
> 187 + pub fn as_raw(&self) -> &MultiPrecisionInteger {
474.09 s
> |
474.09 s
>
474.09 s
> error[E0425] : cannot find type `RawMultiPrecisionInteger` in this scope
474.09 s
> --> /nix/store/9rqk4093qnvgswmdk1pbxk9najcrjn7a-vendor-cargo-deps/bc87b2b0f37b9a43ffdd82e8f11f3e864d9447ccd53a9a964250c3414c3656d9/numerica-3.0.0/src/domains/backend/integer.rs:193:33
474.09 s
> |
474.09 s
> 52 | pub struct MultiPrecisionInteger(RawMultiPrecisionInteger);
474.09 s
> | ----------------------------------------------------------- similarly named struct `MultiPrecisionInteger` defined here
474.09 s
> ...
474.09 s
> 193 | pub fn to_raw(&self) -> RawMultiPrecisionInteger {
474.09 s
> | ^^^^^^^^^^^^^^^^^^^^^^^^
474.09 s
> |
474.09 s
> help : a struct with a similar name exists
474.09 s
> |
474.09 s
> 193 - pub fn to_raw(&self) -> RawMultiPrecisionInteger {
474.09 s
> 193 + pub fn to_raw(&self) -> MultiPrecisionInteger {
474.09 s
> |
474.09 s
>
474.09 s
> error[E0425] : cannot find type `RawMultiPrecisionInteger` in this scope
474.09 s
> --> /nix/store/9rqk4093qnvgswmdk1pbxk9najcrjn7a-vendor-cargo-deps/bc87b2b0f37b9a43ffdd82e8f11f3e864d9447ccd53a9a964250c3414c3656d9/numerica-3.0.0/src/domains/backend/integer.rs:199:34
474.09 s
> |
474.09 s
> 52 | pub struct MultiPrecisionInteger(RawMultiPrecisionInteger);
474.09 s
> | ----------------------------------------------------------- similarly named struct `MultiPrecisionInteger` defined here
474.09 s
> ...
474.09 s
> 199 | pub fn into_raw(self) -> RawMultiPrecisionInteger {
474.09 s
> | ^^^^^^^^^^^^^^^^^^^^^^^^
474.09 s
> |
474.09 s
> help : a struct with a similar name exists
474.09 s
> |
474.09 s
> 199 - pub fn into_raw(self) -> RawMultiPrecisionInteger {
474.09 s
> 199 + pub fn into_raw(self) -> MultiPrecisionInteger {
474.09 s
> |
474.09 s
>
474.09 s
> error[E0425] : cannot find type `RawMultiPrecisionInteger` in this scope
474.09 s
> --> /nix/store/9rqk4093qnvgswmdk1pbxk9najcrjn7a-vendor-cargo-deps/bc87b2b0f37b9a43ffdd82e8f11f3e864d9447ccd53a9a964250c3414c3656d9/numerica-3.0.0/src/domains/backend/integer.rs:567:27
474.09 s
> |
474.09 s
> 52 | pub struct MultiPrecisionInteger(RawMultiPrecisionInteger);
474.09 s
> | ----------------------------------------------------------- similarly named struct `MultiPrecisionInteger` defined here
474.09 s
> ...
474.09 s
> 567 | fn rem_trunc(lhs: RawMultiPrecisionInteger, rhs: RawMultiPrecisionInteger) -> Self {
474.09 s
> | ^^^^^^^^^^^^^^^^^^^^^^^^
474.09 s
> |
474.09 s
> help : a struct with a similar name exists
474.09 s
> |
474.09 s
> 567 - fn rem_trunc(lhs: RawMultiPrecisionInteger , rhs: RawMultiPrecisionInteger) -> Self {
474.09 s
> 567 + fn rem_trunc(lhs: MultiPrecisionInteger , rhs: RawMultiPrecisionInteger) -> Self {
474.09 s
> |
474.09 s
>
474.09 s
> error[E0425] : cannot find type `RawMultiPrecisionInteger` in this scope
474.09 s
> --> /nix/store/9rqk4093qnvgswmdk1pbxk9najcrjn7a-vendor-cargo-deps/bc87b2b0f37b9a43ffdd82e8f11f3e864d9447ccd53a9a964250c3414c3656d9/numerica-3.0.0/src/domains/backend/integer.rs:567:58
474.09 s
> |
474.09 s
> 52 | pub struct MultiPrecisionInteger(RawMultiPrecisionInteger);
474.09 s
> | ----------------------------------------------------------- similarly named struct `MultiPrecisionInteger` defined here
474.09 s
> ...
474.09 s
> 567 | fn rem_trunc(lhs: RawMultiPrecisionInteger, rhs: RawMultiPrecisionInteger) -> Self {
474.09 s
> | ^^^^^^^^^^^^^^^^^^^^^^^^
474.09 s
> |
474.09 s
> help : a struct with a similar name exists
474.09 s
> |
474.09 s
> 567 - fn rem_trunc(lhs: RawMultiPrecisionInteger, rhs: RawMultiPrecisionInteger ) -> Self {
474.09 s
> 567 + fn rem_trunc(lhs: RawMultiPrecisionInteger, rhs: MultiPrecisionInteger ) -> Self {
474.09 s
> |
474.09 s
>
474.09 s
> error[E0425] : cannot find type `RawMultiPrecisionInteger` in this scope
474.09 s
> --> /nix/store/9rqk4093qnvgswmdk1pbxk9najcrjn7a-vendor-cargo-deps/bc87b2b0f37b9a43ffdd82e8f11f3e864d9447ccd53a9a964250c3414c3656d9/numerica-3.0.0/src/domains/backend/integer.rs:582:27
474.09 s
> |
474.09 s
> 52 | pub struct MultiPrecisionInteger(RawMultiPrecisionInteger);
474.09 s
> | ----------------------------------------------------------- similarly named struct `MultiPrecisionInteger` defined here
474.09 s
> ...
474.09 s
> 582 | fn shl_raw(value: RawMultiPrecisionInteger, rhs: u64) -> RawMultiPrecisionInteger {
474.09 s
> | ^^^^^^^^^^^^^^^^^^^^^^^^
474.09 s
> |
474.09 s
> help : a struct with a similar name exists
474.09 s
> |
474.09 s
> 582 - fn shl_raw(value: RawMultiPrecisionInteger , rhs: u64) -> RawMultiPrecisionInteger {
474.09 s
> 582 + fn shl_raw(value: MultiPrecisionInteger , rhs: u64) -> RawMultiPrecisionInteger {
474.09 s
> |
474.09 s
>
474.09 s
> error[E0425] : cannot find type `RawMultiPrecisionInteger` in this scope
474.09 s
> --> /nix/store/9rqk4093qnvgswmdk1pbxk9najcrjn7a-vendor-cargo-deps/bc87b2b0f37b9a43ffdd82e8f11f3e864d9447ccd53a9a964250c3414c3656d9/numerica-3.0.0/src/domains/backend/integer.rs:582:66
474.09 s
> |
474.09 s
> 52 | pub struct MultiPrecisionInteger(RawMultiPrecisionInteger);
474.09 s
> | ----------------------------------------------------------- similarly named struct `MultiPrecisionInteger` defined here
474.09 s
> ...
474.09 s
> 582 | fn shl_raw(value: RawMultiPrecisionInteger, rhs: u64) -> RawMultiPrecisionInteger {
474.09 s
> | ^^^^^^^^^^^^^^^^^^^^^^^^
474.09 s
> |
474.09 s
> help : a struct with a similar name exists
474.09 s
> |
474.09 s
> 582 - fn shl_raw(value: RawMultiPrecisionInteger, rhs: u64) -> RawMultiPrecisionInteger {
474.09 s
> 582 + fn shl_raw(value: RawMultiPrecisionInteger, rhs: u64) -> MultiPrecisionInteger {
474.09 s
> |
474.09 s
>
474.09 s
> error[E0425] : cannot find type `RawMultiPrecisionInteger` in this scope
474.09 s
> --> /nix/store/9rqk4093qnvgswmdk1pbxk9najcrjn7a-vendor-cargo-deps/bc87b2b0f37b9a43ffdd82e8f11f3e864d9447ccd53a9a964250c3414c3656d9/numerica-3.0.0/src/domains/backend/integer.rs:590:27
474.09 s
> |
474.09 s
> 52 | pub struct MultiPrecisionInteger(RawMultiPrecisionInteger);
474.09 s
> | ----------------------------------------------------------- similarly named struct `MultiPrecisionInteger` defined here
474.09 s
> ...
474.09 s
> 590 | fn shr_raw(value: RawMultiPrecisionInteger, rhs: u64) -> RawMultiPrecisionInteger {
474.09 s
> | ^^^^^^^^^^^^^^^^^^^^^^^^
474.09 s
> |
474.09 s
> help : a struct with a similar name exists
474.09 s
> |
474.09 s
> 590 - fn shr_raw(value: RawMultiPrecisionInteger , rhs: u64) -> RawMultiPrecisionInteger {
474.09 s
> 590 + fn shr_raw(value: MultiPrecisionInteger , rhs: u64) -> RawMultiPrecisionInteger {
474.09 s
> |
474.09 s
>
474.09 s
> error[E0425] : cannot find type `RawMultiPrecisionInteger` in this scope
474.09 s
> --> /nix/store/9rqk4093qnvgswmdk1pbxk9najcrjn7a-vendor-cargo-deps/bc87b2b0f37b9a43ffdd82e8f11f3e864d9447ccd53a9a964250c3414c3656d9/numerica-3.0.0/src/domains/backend/integer.rs:590:66
474.09 s
> |
474.09 s
> 52 | pub struct MultiPrecisionInteger(RawMultiPrecisionInteger);
474.09 s
> | ----------------------------------------------------------- similarly named struct `MultiPrecisionInteger` defined here
474.09 s
> ...
474.09 s
> 590 | fn shr_raw(value: RawMultiPrecisionInteger, rhs: u64) -> RawMultiPrecisionInteger {
474.09 s
> | ^^^^^^^^^^^^^^^^^^^^^^^^
474.09 s
> |
474.09 s
> help : a struct with a similar name exists
474.09 s
> |
474.09 s
> 590 - fn shr_raw(value: RawMultiPrecisionInteger, rhs: u64) -> RawMultiPrecisionInteger {
474.09 s
> 590 + fn shr_raw(value: RawMultiPrecisionInteger, rhs: u64) -> MultiPrecisionInteger {
474.09 s
> |
474.09 s
>
474.09 s
> error[E0425] : cannot find type `RawMultiPrecisionInteger` in this scope
474.09 s
> --> /nix/store/9rqk4093qnvgswmdk1pbxk9najcrjn7a-vendor-cargo-deps/bc87b2b0f37b9a43ffdd82e8f11f3e864d9447ccd53a9a964250c3414c3656d9/numerica-3.0.0/src/domains/backend/integer.rs:654:15
474.09 s
> |
474.09 s
> 52 | pub struct MultiPrecisionInteger(RawMultiPrecisionInteger);
474.09 s
> | ----------------------------------------------------------- similarly named struct `MultiPrecisionInteger` defined here
474.09 s
> ...
474.09 s
> 654 | impl From<RawMultiPrecisionInteger> for MultiPrecisionInteger {
474.09 s
> | ^^^^^^^^^^^^^^^^^^^^^^^^
474.09 s
> |
474.09 s
> help : a struct with a similar name exists
474.09 s
> |
474.09 s
> 654 - impl From<RawMultiPrecisionInteger > for MultiPrecisionInteger {
474.09 s
> 654 + impl From<MultiPrecisionInteger > for MultiPrecisionInteger {
474.09 s
> |
474.09 s
> help : you might be missing a type parameter
474.09 s
> |
474.09 s
> 654 | impl<RawMultiPrecisionInteger> From<RawMultiPrecisionInteger> for MultiPrecisionInteger {
474.09 s
> | ++++++++++++++++++++++++++
474.09 s
>
474.09 s
> error[E0425] : cannot find type `RawMultiPrecisionInteger` in this scope
474.09 s
> --> /nix/store/9rqk4093qnvgswmdk1pbxk9najcrjn7a-vendor-cargo-deps/bc87b2b0f37b9a43ffdd82e8f11f3e864d9447ccd53a9a964250c3414c3656d9/numerica-3.0.0/src/domains/backend/integer.rs:656:24
474.09 s
> |
474.09 s
> 52 | pub struct MultiPrecisionInteger(RawMultiPrecisionInteger);
474.09 s
> | ----------------------------------------------------------- similarly named struct `MultiPrecisionInteger` defined here
474.09 s
> ...
474.09 s
> 656 | fn from(value: RawMultiPrecisionInteger) -> Self {
474.09 s
> | ^^^^^^^^^^^^^^^^^^^^^^^^
474.09 s
> |
474.09 s
> help : a struct with a similar name exists
474.09 s
> |
474.09 s
> 656 - fn from(value: RawMultiPrecisionInteger ) -> Self {
474.09 s
> 656 + fn from(value: MultiPrecisionInteger ) -> Self {
474.09 s
> |
474.09 s
>
474.09 s
> error[E0425] : cannot find type `RawMultiPrecisionInteger` in this scope
474.09 s
> --> /nix/store/9rqk4093qnvgswmdk1pbxk9najcrjn7a-vendor-cargo-deps/bc87b2b0f37b9a43ffdd82e8f11f3e864d9447ccd53a9a964250c3414c3656d9/numerica-3.0.0/src/domains/backend/integer.rs:661:42
474.09 s
> |
474.09 s
> 52 | pub struct MultiPrecisionInteger(RawMultiPrecisionInteger);
474.09 s
> | ----------------------------------------------------------- similarly named struct `MultiPrecisionInteger` defined here
474.09 s
> ...
474.09 s
> 661 | impl From<MultiPrecisionInteger> for RawMultiPrecisionInteger {
474.09 s
> | ^^^^^^^^^^^^^^^^^^^^^^^^
474.09 s
> |
474.09 s
> help : a struct with a similar name exists
474.09 s
> |
474.09 s
> 661 - impl From<MultiPrecisionInteger> for RawMultiPrecisionInteger {
474.09 s
> 661 + impl From<MultiPrecisionInteger> for MultiPrecisionInteger {
474.09 s
> |
474.09 s
>
474.09 s
> error[E0433] : cannot find type `RawMultiPrecisionInteger` in this scope
474.09 s
> --> /nix/store/9rqk4093qnvgswmdk1pbxk9najcrjn7a-vendor-cargo-deps/bc87b2b0f37b9a43ffdd82e8f11f3e864d9447ccd53a9a964250c3414c3656d9/numerica-3.0.0/src/domains/backend/integer.rs:620:13
474.09 s
> |
474.09 s
> 620 | RawMultiPrecisionInteger::from_str(s)
474.09 s
> | ^^^^^^^^^^^^^^^^^^^^^^^^ use of undeclared type `RawMultiPrecisionInteger`
474.09 s
> |
474.09 s
> help : a struct with a similar name exists
474.09 s
> |
474.09 s
> 620 - RawMultiPrecisionInteger ::from_str(s)
474.09 s
> 620 + MultiPrecisionInteger ::from_str(s)
474.09 s
> |
474.09 s
>
474.09 s
> error[E0433] : cannot find type `RawMultiPrecisionInteger` in this scope
474.09 s
> --> /nix/store/9rqk4093qnvgswmdk1pbxk9najcrjn7a-vendor-cargo-deps/bc87b2b0f37b9a43ffdd82e8f11f3e864d9447ccd53a9a964250c3414c3656d9/numerica-3.0.0/src/domains/backend/integer.rs:674:35
474.09 s
> |
474.09 s
> 674 | self.0 == RawMultiPrecisionInteger::from(*other)
474.09 s
> | ^^^^^^^^^^^^^^^^^^^^^^^^ use of undeclared type `RawMultiPrecisionInteger`
474.09 s
> ...
474.09 s
> 702 | impl_cmp_primitive!(i32, i64, i128, u32, u64, u128);
474.09 s
> | --------------------------------------------------- in this macro invocation
474.09 s
> |
474.09 s
> = note : this error originates in the macro `impl_cmp_primitive` (in Nightly builds, run with -Z macro-backtrace for more info)
474.09 s
> help : a struct with a similar name exists
474.09 s
> |
474.09 s
> 674 - self.0 == RawMultiPrecisionInteger ::from(*other)
474.09 s
> 674 + self.0 == MultiPrecisionInteger ::from(*other)
474.09 s
> |
474.09 s
>
474.09 s
> error[E0433] : cannot find type `RawMultiPrecisionInteger` in this scope
474.09 s
> --> /nix/store/9rqk4093qnvgswmdk1pbxk9najcrjn7a-vendor-cargo-deps/bc87b2b0f37b9a43ffdd82e8f11f3e864d9447ccd53a9a964250c3414c3656d9/numerica-3.0.0/src/domains/backend/integer.rs:681:25
474.09 s
> |
474.09 s
> 681 | RawMultiPrecisionInteger::from(*self) == other.0
474.09 s
> | ^^^^^^^^^^^^^^^^^^^^^^^^ use of undeclared type `RawMultiPrecisionInteger`
474.09 s
> ...
474.09 s
> 702 | impl_cmp_primitive!(i32, i64, i128, u32, u64, u128);
474.09 s
> | --------------------------------------------------- in this macro invocation
474.09 s
> |
474.09 s
> = note : this error originates in the macro `impl_cmp_primitive` (in Nightly builds, run with -Z macro-backtrace for more info)
474.09 s
> help : a struct with a similar name exists
474.09 s
> |
474.09 s
> 681 - RawMultiPrecisionInteger ::from(*self) == other.0
474.09 s
> 681 + MultiPrecisionInteger ::from(*self) == other.0
474.09 s
> |
474.09 s
>
474.09 s
> error[E0433] : cannot find type `RawMultiPrecisionInteger` in this scope
474.09 s
> --> /nix/store/9rqk4093qnvgswmdk1pbxk9najcrjn7a-vendor-cargo-deps/bc87b2b0f37b9a43ffdd82e8f11f3e864d9447ccd53a9a964250c3414c3656d9/numerica-3.0.0/src/domains/backend/integer.rs:688:45
474.09 s
> |
474.09 s
> 688 | self.0.partial_cmp(&RawMultiPrecisionInteger::from(*other))
474.09 s
> | ^^^^^^^^^^^^^^^^^^^^^^^^ use of undeclared type `RawMultiPrecisionInteger`
474.09 s
> ...
474.09 s
> 702 | impl_cmp_primitive!(i32, i64, i128, u32, u64, u128);
474.09 s
> | --------------------------------------------------- in this macro invocation
474.09 s
> |
474.09 s
> = note : this error originates in the macro `impl_cmp_primitive` (in Nightly builds, run with -Z macro-backtrace for more info)
474.09 s
> help : a struct with a similar name exists
474.09 s
> |
474.09 s
> 688 - self.0.partial_cmp(&RawMultiPrecisionInteger ::from(*other))
474.09 s
> 688 + self.0.partial_cmp(&MultiPrecisionInteger ::from(*other))
474.09 s
> |
474.09 s
>
474.09 s
> error[E0433] : cannot find type `RawMultiPrecisionInteger` in this scope
474.09 s
> --> /nix/store/9rqk4093qnvgswmdk1pbxk9najcrjn7a-vendor-cargo-deps/bc87b2b0f37b9a43ffdd82e8f11f3e864d9447ccd53a9a964250c3414c3656d9/numerica-3.0.0/src/domains/backend/integer.rs:695:25
474.09 s
> |
474.09 s
> 695 | RawMultiPrecisionInteger::from(*self).partial_cmp(&other.0)
474.09 s
> | ^^^^^^^^^^^^^^^^^^^^^^^^ use of undeclared type `RawMultiPrecisionInteger`
474.09 s
> ...
474.09 s
> 702 | impl_cmp_primitive!(i32, i64, i128, u32, u64, u128);
474.09 s
> | --------------------------------------------------- in this macro invocation
474.09 s
> |
474.09 s
> = note : this error originates in the macro `impl_cmp_primitive` (in Nightly builds, run with -Z macro-backtrace for more info)
474.09 s
> help : a struct with a similar name exists
474.09 s
> |
474.09 s
> 695 - RawMultiPrecisionInteger ::from(*self).partial_cmp(&other.0)
474.09 s
> 695 + MultiPrecisionInteger ::from(*self).partial_cmp(&other.0)
474.09 s
> |
474.09 s
>
474.09 s
> error[E0433] : cannot find type `RawMultiPrecisionInteger` in this scope
474.09 s
> --> /nix/store/9rqk4093qnvgswmdk1pbxk9najcrjn7a-vendor-cargo-deps/bc87b2b0f37b9a43ffdd82e8f11f3e864d9447ccd53a9a964250c3414c3656d9/numerica-3.0.0/src/domains/backend/integer.rs:1180:35
474.09 s
> |
474.09 s
> 1180 | MultiPrecisionInteger(RawMultiPrecisionInteger::from((&self.0) & &rhs.0))
474.09 s
> | ^^^^^^^^^^^^^^^^^^^^^^^^ use of undeclared type `RawMultiPrecisionInteger`
474.09 s
> |
474.09 s
> help : a struct with a similar name exists
474.09 s
> |
474.09 s
> 1180 - MultiPrecisionInteger(RawMultiPrecisionInteger ::from((&self.0) & &rhs.0))
474.09 s
> 1180 + MultiPrecisionInteger(MultiPrecisionInteger ::from((&self.0) & &rhs.0))
474.09 s
> |
474.09 s
>
474.09 s
> error[E0433] : cannot find type `RawMultiPrecisionInteger` in this scope
474.09 s
> --> /nix/store/9rqk4093qnvgswmdk1pbxk9najcrjn7a-vendor-cargo-deps/bc87b2b0f37b9a43ffdd82e8f11f3e864d9447ccd53a9a964250c3414c3656d9/numerica-3.0.0/src/domains/backend/integer.rs:1212:35
474.09 s
> |
474.09 s
> 1212 | MultiPrecisionInteger(RawMultiPrecisionInteger::from(-&self.0))
474.09 s
> | ^^^^^^^^^^^^^^^^^^^^^^^^ use of undeclared type `RawMultiPrecisionInteger`
474.09 s
> |
474.09 s
> help : a struct with a similar name exists
474.09 s
> |
474.09 s
> 1212 - MultiPrecisionInteger(RawMultiPrecisionInteger ::from(-&self.0))
474.09 s
> 1212 + MultiPrecisionInteger(MultiPrecisionInteger ::from(-&self.0))
474.09 s
> |
474.09 s
>
474.09 s
> error[E0425] : cannot find function `write_lsf_bytes` in this scope
474.09 s
> --> /nix/store/9rqk4093qnvgswmdk1pbxk9najcrjn7a-vendor-cargo-deps/bc87b2b0f37b9a43ffdd82e8f11f3e864d9447ccd53a9a964250c3414c3656d9/numerica-3.0.0/src/domains/backend/integer.rs:1682:5
474.09 s
> |
474.09 s
> 1682 | write_lsf_bytes(value, &mut bytes);
474.09 s
> | ^^^^^^^^^^^^^^^ not found in this scope
474.09 s
>
474.09 s
> Some errors have detailed explanations: E0425, E0432, E0433.
474.09 s
> For more information about an error, try `rustc --explain E0425`.
474.09 s
> error : could not compile `numerica` (lib) due to 29 previous errors
474.09 s
> warning : build failed, waiting for other jobs to finish...
474.09 s
For full logs, run:
474.09 s
nix log /nix/store/8y99gpj1qs95jysr3c6kccvh7lrd78i4-alphal00p-docs-cargo-0.1.0.drv
474.12 s
Build failed.