1. 0.00 s $ /nix/store/9ypz3flqsrl5xl495mm8h645gadjsxi1-coreutils-9.11/bin/timeout --kill-after=15s 7200s /nix/store/23zk8sgzamrbmj1fday15szf7f2279s8-nix-2.34.7/bin/nix --extra-experimental-features nix-command --extra-experimental-features flakes --log-format internal-json build --no-link --print-out-paths git+https://github.com/alphal00p/gammaloop?ref=simplify-spenso-api&rev=43649e2ed5bc140b6fa2364e5e528f13134be9f5&shallow=1#packages.x86_64-linux.alphal00p-docs-cargo-artifacts --print-build-logs
  2. 0.08 s fetching Git repository 'https://github.com/alphal00p/gammaloop'
  3. 0.84 s remote: Enumerating objects: 2201, done.
  4. 0.93 s remote: Counting objects: 0% (1/2201) remote: Counting objects: 1% (23/2201) remote: Counting objects: 2% (45/2201) remote: Counting objects: 3% (67/2201) remote: Counting objects: 4% (89/2201) remote: Counting objects: 5% (111/2201) remote: Counting objects: 6% (133/2201) remote: Counting objects: 7% (155/2201) remote: Counting objects: 8% (177/2201) remote: Counting objects: 9% (199/2201) remote: Counting objects: 10% (221/2201) remote: Counting objects: 11% (243/2201) remote: Counting objects: 12% (265/2201) remote: Counting objects: 13% (287/2201) remote: Counting objects: 14% (309/2201) remote: Counting objects: 15% (331/2201) remote: Counting objects: 16% (353/2201) remote: Counting objects: 17% (375/2201) remote: Counting objects: 18% (397/2201) remote: Counting objects: 19% (419/2201) remote: Counting objects: 20% (441/2201) remote: Counting objects: 21% (463/2201) remote: Counting objects: 22% (485/2201) remote: Counting objects: 23% (507/2201) remote: Counting objects: 24% (529/2201) remote: Counting objects: 25% (551/2201) remote: Counting objects: 26% (573/2201) remote: Counting objects: 27% (595/2201) remote: Counting objects: 28% (617/2201) remote: Counting objects: 29% (639/2201) remote: Counting objects: 30% (661/2201) remote: Counting objects: 31% (683/2201) remote: Counting objects: 32% (705/2201) remote: Counting objects: 33% (727/2201) remote: Counting objects: 34% (749/2201) remote: Counting objects: 35% (771/2201) remote: Counting objects: 36% (793/2201) remote: Counting objects: 37% (815/2201) remote: Counting objects: 38% (837/2201) remote: Counting objects: 39% (859/2201) remote: Counting objects: 40% (881/2201) remote: Counting objects: 41% (903/2201) remote: Counting objects: 42% (925/2201) remote: Counting objects: 43% (947/2201) remote: Counting objects: 44% (969/2201) remote: Counting objects: 45% (991/2201) remote: Counting objects: 46% (1013/2201) remote: Counting objects: 47% (1035/2201) remote: Counting objects: 48% (1057/2201) remote: Counting objects: 49% (1079/2201) remote: Counting objects: 50% (1101/2201) remote: Counting objects: 51% (1123/2201) remote: Counting objects: 52% (1145/2201) remote: Counting objects: 53% (1167/2201) remote: Counting objects: 54% (1189/2201) remote: Counting objects: 55% (1211/2201) remote: Counting objects: 56% (1233/2201) remote: Counting objects: 57% (1255/2201) remote: Counting objects: 58% (1277/2201) remote: Counting objects: 59% (1299/2201) remote: Counting objects: 60% (1321/2201) remote: Counting objects: 61% (1343/2201) remote: Counting objects: 62% (1365/2201) remote: Counting objects: 63% (1387/2201) remote: Counting objects: 64% (1409/2201) remote: Counting objects: 65% (1431/2201) remote: Counting objects: 66% (1453/2201) remote: Counting objects: 67% (1475/2201) remote: Counting objects: 68% (1497/2201) remote: Counting objects: 69% (1519/2201) remote: Counting objects: 70% (1541/2201) remote: Counting objects: 71% (1563/2201) remote: Counting objects: 72% (1585/2201) remote: Counting objects: 73% (1607/2201) remote: Counting objects: 74% (1629/2201) remote: Counting objects: 75% (1651/2201) remote: Counting objects: 76% (1673/2201) remote: Counting objects: 77% (1695/2201) remote: Counting objects: 78% (1717/2201) remote: Counting objects: 79% (1739/2201) remote: Counting objects: 80% (1761/2201) remote: Counting objects: 81% (1783/2201) remote: Counting objects: 82% (1805/2201) remote: Counting objects: 83% (1827/2201) remote: Counting objects: 84% (1849/2201) remote: Counting objects: 85% (1871/2201) remote: Counting objects: 86% (1893/2201) remote: Counting objects: 87% (1915/2201) remote: Counting objects: 88% (1937/2201) remote: Counting objects: 89% (1959/2201) remote: Counting objects: 90% (1981/2201) remote: Counting objects: 91% (2003/2201) remote: Counting objects: 92% (2025/2201) remote: Counting objects: 93% (2047/2201) remote: Counting objects: 94% (2069/2201) remote: Counting objects: 95% (2091/2201) remote: Counting objects: 96% (2113/2201) remote: Counting objects: 97% (2135/2201) remote: Counting objects: 98% (2157/2201) remote: Counting objects: 99% (2179/2201) remote: Counting objects: 100% (2201/2201) remote: Counting objects: 100% (2201/2201), done.
  5. 1.59 s remote: Compressing objects: 0% (1/1512) remote: Compressing objects: 1% (16/1512) remote: Compressing objects: 2% (31/1512) remote: Compressing objects: 3% (46/1512) remote: Compressing objects: 4% (61/1512) remote: Compressing objects: 5% (76/1512) remote: Compressing objects: 6% (91/1512) remote: Compressing objects: 7% (106/1512) remote: Compressing objects: 8% (121/1512) remote: Compressing objects: 9% (137/1512) remote: Compressing objects: 10% (152/1512) remote: Compressing objects: 11% (167/1512) remote: Compressing objects: 12% (182/1512) remote: Compressing objects: 13% (197/1512) remote: Compressing objects: 14% (212/1512) remote: Compressing objects: 15% (227/1512) remote: Compressing objects: 16% (242/1512) remote: Compressing objects: 17% (258/1512) remote: Compressing objects: 18% (273/1512) remote: Compressing objects: 19% (288/1512) remote: Compressing objects: 20% (303/1512) remote: Compressing objects: 21% (318/1512) remote: Compressing objects: 22% (333/1512) remote: Compressing objects: 23% (348/1512) remote: Compressing objects: 24% (363/1512) remote: Compressing objects: 25% (378/1512) remote: Compressing objects: 26% (394/1512) remote: Compressing objects: 27% (409/1512) remote: Compressing objects: 28% (424/1512) remote: Compressing objects: 29% (439/1512) remote: Compressing objects: 30% (454/1512) remote: Compressing objects: 31% (469/1512) remote: Compressing objects: 32% (484/1512) remote: Compressing objects: 33% (499/1512) remote: Compressing objects: 34% (515/1512) remote: Compressing objects: 35% (530/1512) remote: Compressing objects: 36% (545/1512) remote: Compressing objects: 37% (560/1512) remote: Compressing objects: 38% (575/1512) remote: Compressing objects: 39% (590/1512) remote: Compressing objects: 40% (605/1512) remote: Compressing objects: 41% (620/1512) remote: Compressing objects: 42% (636/1512) remote: Compressing objects: 43% (651/1512) remote: Compressing objects: 44% (666/1512) remote: Compressing objects: 45% (681/1512) remote: Compressing objects: 46% (696/1512) remote: Compressing objects: 47% (711/1512) remote: Compressing objects: 48% (726/1512) remote: Compressing objects: 49% (741/1512) remote: Compressing objects: 50% (756/1512) remote: Compressing objects: 51% (772/1512) remote: Compressing objects: 52% (787/1512) remote: Compressing objects: 53% (802/1512) remote: Compressing objects: 54% (817/1512) remote: Compressing objects: 55% (832/1512) remote: Compressing objects: 56% (847/1512) remote: Compressing objects: 57% (862/1512) remote: Compressing objects: 58% (877/1512) remote: Compressing objects: 59% (893/1512) remote: Compressing objects: 60% (908/1512) remote: Compressing objects: 61% (923/1512) remote: Compressing objects: 62% (938/1512) remote: Compressing objects: 63% (953/1512) remote: Compressing objects: 64% (968/1512) remote: Compressing objects: 65% (983/1512) remote: Compressing objects: 66% (998/1512) remote: Compressing objects: 67% (1014/1512) remote: Compressing objects: 68% (1029/1512) remote: Compressing objects: 69% (1044/1512) remote: Compressing objects: 70% (1059/1512) remote: Compressing objects: 71% (1074/1512) remote: Compressing objects: 72% (1089/1512) remote: Compressing objects: 73% (1104/1512) remote: Compressing objects: 74% (1119/1512) remote: Compressing objects: 75% (1134/1512) remote: Compressing objects: 76% (1150/1512) remote: Compressing objects: 77% (1165/1512) remote: Compressing objects: 78% (1180/1512) remote: Compressing objects: 79% (1195/1512) remote: Compressing objects: 80% (1210/1512) remote: Compressing objects: 81% (1225/1512) remote: Compressing objects: 82% (1240/1512) remote: Compressing objects: 83% (1255/1512) remote: Compressing objects: 84% (1271/1512) remote: Compressing objects: 85% (1286/1512) remote: Compressing objects: 86% (1301/1512) remote: Compressing objects: 87% (1316/1512) remote: Compressing objects: 88% (1331/1512) remote: Compressing objects: 89% (1346/1512) remote: Compressing objects: 90% (1361/1512) remote: Compressing objects: 91% (1376/1512) remote: Compressing objects: 92% (1392/1512) remote: Compressing objects: 93% (1407/1512) remote: Compressing objects: 94% (1422/1512) remote: Compressing objects: 95% (1437/1512) remote: Compressing objects: 96% (1452/1512) remote: Compressing objects: 97% (1467/1512) remote: Compressing objects: 98% (1482/1512) remote: Compressing objects: 99% (1497/1512) remote: Compressing objects: 100% (1512/1512) remote: Compressing objects: 100% (1512/1512), done.
  6. 2.42 s Receiving objects: 0% (1/2201) Receiving objects: 1% (23/2201) Receiving objects: 2% (45/2201) Receiving objects: 3% (67/2201) Receiving objects: 4% (89/2201) Receiving objects: 5% (111/2201) Receiving objects: 6% (133/2201) Receiving objects: 7% (155/2201) Receiving objects: 8% (177/2201) Receiving objects: 9% (199/2201) Receiving objects: 10% (221/2201) Receiving objects: 11% (243/2201) Receiving objects: 12% (265/2201) Receiving objects: 13% (287/2201) Receiving objects: 14% (309/2201) Receiving objects: 15% (331/2201) Receiving objects: 16% (353/2201) Receiving objects: 17% (375/2201) Receiving objects: 18% (397/2201) Receiving objects: 19% (419/2201) Receiving objects: 20% (441/2201) Receiving objects: 21% (463/2201) Receiving objects: 22% (485/2201) Receiving objects: 23% (507/2201) Receiving objects: 24% (529/2201) Receiving objects: 25% (551/2201) Receiving objects: 26% (573/2201) Receiving objects: 27% (595/2201) Receiving objects: 28% (617/2201) Receiving objects: 29% (639/2201) Receiving objects: 30% (661/2201) Receiving objects: 31% (683/2201) Receiving objects: 32% (705/2201) Receiving objects: 33% (727/2201) Receiving objects: 34% (749/2201) Receiving objects: 35% (771/2201) Receiving objects: 36% (793/2201) Receiving objects: 37% (815/2201) Receiving objects: 38% (837/2201) Receiving objects: 39% (859/2201) Receiving objects: 40% (881/2201) Receiving objects: 41% (903/2201) Receiving objects: 42% (925/2201) Receiving objects: 43% (947/2201) Receiving objects: 44% (969/2201) Receiving objects: 45% (991/2201) Receiving objects: 46% (1013/2201) Receiving objects: 47% (1035/2201) Receiving objects: 48% (1057/2201) Receiving objects: 49% (1079/2201) Receiving objects: 50% (1101/2201) Receiving objects: 51% (1123/2201) Receiving objects: 52% (1145/2201) Receiving objects: 53% (1167/2201), 10.80 MiB | 21.60 MiB/s Receiving objects: 54% (1189/2201), 10.80 MiB | 21.60 MiB/s Receiving objects: 55% (1211/2201), 10.80 MiB | 21.60 MiB/s Receiving objects: 56% (1233/2201), 10.80 MiB | 21.60 MiB/s Receiving objects: 57% (1255/2201), 10.80 MiB | 21.60 MiB/s Receiving objects: 58% (1277/2201), 10.80 MiB | 21.60 MiB/s Receiving objects: 59% (1299/2201), 10.80 MiB | 21.60 MiB/s Receiving objects: 60% (1321/2201), 10.80 MiB | 21.60 MiB/s Receiving objects: 61% (1343/2201), 10.80 MiB | 21.60 MiB/s Receiving objects: 62% (1365/2201), 10.80 MiB | 21.60 MiB/s Receiving objects: 63% (1387/2201), 10.80 MiB | 21.60 MiB/s Receiving objects: 64% (1409/2201), 10.80 MiB | 21.60 MiB/s Receiving objects: 65% (1431/2201), 10.80 MiB | 21.60 MiB/s Receiving objects: 66% (1453/2201), 10.80 MiB | 21.60 MiB/s Receiving objects: 67% (1475/2201), 10.80 MiB | 21.60 MiB/s Receiving objects: 68% (1497/2201), 10.80 MiB | 21.60 MiB/s Receiving objects: 69% (1519/2201), 10.80 MiB | 21.60 MiB/s Receiving objects: 70% (1541/2201), 10.80 MiB | 21.60 MiB/s Receiving objects: 71% (1563/2201), 10.80 MiB | 21.60 MiB/s Receiving objects: 72% (1585/2201), 10.80 MiB | 21.60 MiB/s Receiving objects: 73% (1607/2201), 10.80 MiB | 21.60 MiB/s Receiving objects: 74% (1629/2201), 10.80 MiB | 21.60 MiB/s Receiving objects: 75% (1651/2201), 10.80 MiB | 21.60 MiB/s Receiving objects: 76% (1673/2201), 10.80 MiB | 21.60 MiB/s Receiving objects: 77% (1695/2201), 10.80 MiB | 21.60 MiB/s Receiving objects: 78% (1717/2201), 10.80 MiB | 21.60 MiB/s Receiving objects: 79% (1739/2201), 10.80 MiB | 21.60 MiB/s Receiving objects: 80% (1761/2201), 10.80 MiB | 21.60 MiB/s Receiving objects: 81% (1783/2201), 10.80 MiB | 21.60 MiB/s Receiving objects: 82% (1805/2201), 10.80 MiB | 21.60 MiB/s Receiving objects: 83% (1827/2201), 10.80 MiB | 21.60 MiB/s Receiving objects: 84% (1849/2201), 10.80 MiB | 21.60 MiB/s Receiving objects: 85% (1871/2201), 10.80 MiB | 21.60 MiB/s Receiving objects: 86% (1893/2201), 10.80 MiB | 21.60 MiB/s Receiving objects: 87% (1915/2201), 10.80 MiB | 21.60 MiB/s Receiving objects: 88% (1937/2201), 10.80 MiB | 21.60 MiB/s Receiving objects: 89% (1959/2201), 10.80 MiB | 21.60 MiB/s Receiving objects: 90% (1981/2201), 10.80 MiB | 21.60 MiB/s Receiving objects: 91% (2003/2201), 10.80 MiB | 21.60 MiB/s Receiving objects: 92% (2025/2201), 10.80 MiB | 21.60 MiB/s Receiving objects: 93% (2047/2201), 10.80 MiB | 21.60 MiB/s Receiving objects: 94% (2069/2201), 10.80 MiB | 21.60 MiB/s Receiving objects: 95% (2091/2201), 10.80 MiB | 21.60 MiB/s Receiving objects: 96% (2113/2201), 10.80 MiB | 21.60 MiB/s Receiving objects: 97% (2135/2201), 10.80 MiB | 21.60 MiB/s Receiving objects: 98% (2157/2201), 10.80 MiB | 21.60 MiB/s Receiving objects: 99% (2179/2201), 10.80 MiB | 21.60 MiB/s remote: Total 2201 (delta 678), reused 1557 (delta 608), pack-reused 0 (from 0)
  7. 2.42 s Receiving objects: 100% (2201/2201), 10.80 MiB | 21.60 MiB/s Receiving objects: 100% (2201/2201), 20.59 MiB | 25.10 MiB/s, done.
  8. 2.43 s Resolving deltas: 0% (0/678) Resolving deltas: 1% (8/678) Resolving deltas: 2% (14/678) Resolving deltas: 3% (21/678) Resolving deltas: 4% (28/678) Resolving deltas: 5% (34/678) Resolving deltas: 6% (41/678) Resolving deltas: 7% (48/678) Resolving deltas: 8% (55/678) Resolving deltas: 9% (62/678) Resolving deltas: 10% (69/678) Resolving deltas: 11% (75/678) Resolving deltas: 12% (82/678) Resolving deltas: 13% (89/678) Resolving deltas: 14% (95/678) Resolving deltas: 15% (102/678) Resolving deltas: 16% (109/678) Resolving deltas: 17% (116/678) Resolving deltas: 18% (123/678) Resolving deltas: 19% (129/678) Resolving deltas: 20% (136/678) Resolving deltas: 21% (143/678) Resolving deltas: 22% (150/678) Resolving deltas: 23% (156/678) Resolving deltas: 24% (163/678) Resolving deltas: 25% (170/678) Resolving deltas: 26% (177/678) Resolving deltas: 27% (184/678) Resolving deltas: 28% (190/678) Resolving deltas: 29% (197/678) Resolving deltas: 30% (204/678) Resolving deltas: 31% (211/678) Resolving deltas: 32% (217/678) Resolving deltas: 33% (224/678) Resolving deltas: 34% (231/678) Resolving deltas: 35% (238/678) Resolving deltas: 36% (245/678) Resolving deltas: 37% (251/678) Resolving deltas: 38% (258/678) Resolving deltas: 39% (265/678) Resolving deltas: 40% (272/678) Resolving deltas: 41% (278/678) Resolving deltas: 42% (285/678) Resolving deltas: 43% (292/678) Resolving deltas: 44% (300/678) Resolving deltas: 45% (306/678) Resolving deltas: 46% (312/678) Resolving deltas: 47% (319/678) Resolving deltas: 48% (326/678) Resolving deltas: 49% (333/678) Resolving deltas: 50% (339/678) Resolving deltas: 51% (346/678) Resolving deltas: 52% (353/678) Resolving deltas: 53% (360/678) Resolving deltas: 54% (367/678) Resolving deltas: 55% (373/678) Resolving deltas: 56% (380/678) Resolving deltas: 57% (387/678) Resolving deltas: 58% (394/678) Resolving deltas: 59% (401/678) Resolving deltas: 60% (407/678) Resolving deltas: 61% (414/678) Resolving deltas: 62% (421/678) Resolving deltas: 63% (428/678) Resolving deltas: 64% (434/678) Resolving deltas: 65% (441/678) Resolving deltas: 66% (448/678) Resolving deltas: 67% (455/678) Resolving deltas: 68% (462/678) Resolving deltas: 69% (468/678) Resolving deltas: 70% (475/678) Resolving deltas: 71% (482/678) Resolving deltas: 72% (489/678) Resolving deltas: 73% (495/678) Resolving deltas: 74% (502/678) Resolving deltas: 75% (509/678) Resolving deltas: 76% (516/678) Resolving deltas: 77% (523/678) Resolving deltas: 78% (529/678) Resolving deltas: 79% (536/678) Resolving deltas: 80% (543/678) Resolving deltas: 81% (550/678) Resolving deltas: 82% (556/678) Resolving deltas: 83% (563/678) Resolving deltas: 84% (570/678) Resolving deltas: 85% (577/678) Resolving deltas: 86% (584/678) Resolving deltas: 87% (590/678) Resolving deltas: 88% (597/678) Resolving deltas: 89% (604/678) Resolving deltas: 90% (612/678) Resolving deltas: 91% (617/678) Resolving deltas: 92% (624/678) Resolving deltas: 93% (631/678) Resolving deltas: 94% (638/678) Resolving deltas: 95% (645/678) Resolving deltas: 96% (651/678) Resolving deltas: 97% (658/678) Resolving deltas: 98% (665/678) Resolving deltas: 99% (672/678) Resolving deltas: 100% (678/678) Resolving deltas: 100% (678/678), done.
  9. 2.46 s From https://github.com/alphal00p/gammaloop
  10. 2.46 s * branch 43649e2ed5bc140b6fa2364e5e528f13134be9f5 -> FETCH_HEAD
  11. 4.19 s fetching Git repository 'https://github.com/lcnbr/tymbolica'
  12. 4.87 s remote: Enumerating objects: 33, done.
  13. 5.00 s remote: Counting objects: 3% (1/33) remote: Counting objects: 6% (2/33) remote: Counting objects: 9% (3/33) remote: Counting objects: 12% (4/33) remote: Counting objects: 15% (5/33) remote: Counting objects: 18% (6/33) remote: Counting objects: 21% (7/33) remote: Counting objects: 24% (8/33) remote: Counting objects: 27% (9/33) remote: Counting objects: 30% (10/33) remote: Counting objects: 33% (11/33) remote: Counting objects: 36% (12/33) remote: Counting objects: 39% (13/33) remote: Counting objects: 42% (14/33) remote: Counting objects: 45% (15/33) remote: Counting objects: 48% (16/33) remote: Counting objects: 51% (17/33) remote: Counting objects: 54% (18/33) remote: Counting objects: 57% (19/33) remote: Counting objects: 60% (20/33) remote: Counting objects: 63% (21/33) remote: Counting objects: 66% (22/33) remote: Counting objects: 69% (23/33) remote: Counting objects: 72% (24/33) remote: Counting objects: 75% (25/33) remote: Counting objects: 78% (26/33) remote: Counting objects: 81% (27/33) remote: Counting objects: 84% (28/33) remote: Counting objects: 87% (29/33) remote: Counting objects: 90% (30/33) remote: Counting objects: 93% (31/33) remote: Counting objects: 96% (32/33) remote: Counting objects: 100% (33/33) remote: Counting objects: 100% (33/33), done.
  14. 5.18 s remote: Compressing objects: 20% (1/5) remote: Compressing objects: 40% (2/5) remote: Compressing objects: 60% (3/5) remote: Compressing objects: 80% (4/5) remote: Compressing objects: 100% (5/5) remote: Compressing objects: 100% (5/5), done.
  15. 5.69 s Unpacking objects: 5% (1/17) Unpacking objects: 11% (2/17) Unpacking objects: 17% (3/17) Unpacking objects: 23% (4/17) Unpacking objects: 29% (5/17) Unpacking objects: 35% (6/17) Unpacking objects: 41% (7/17) Unpacking objects: 47% (8/17) Unpacking objects: 52% (9/17) Unpacking objects: 58% (10/17) Unpacking objects: 64% (11/17) Unpacking objects: 70% (12/17) Unpacking objects: 76% (13/17) Unpacking objects: 82% (14/17) Unpacking objects: 88% (15/17) Unpacking objects: 94% (16/17) remote: Total 17 (delta 12), reused 16 (delta 11), pack-reused 0 (from 0)
  16. 5.74 s Unpacking objects: 100% (17/17) Unpacking objects: 100% (17/17), 12.12 MiB | 22.70 MiB/s, done.
  17. 5.75 s From https://github.com/lcnbr/tymbolica
  18. 5.75 s f8b08db..32ae004 main -> main
  19. 6.33 s
  20. 7.52 s Downloading cached oniguruma-6.9.10-lib from https://cache.nix-ci.com
  21. 7.52 s Downloading cached cargo-install-hook.sh from https://cache.nix-ci.com
  22. 7.52 s Downloading cached writable-tmpdir-as-home-hook from https://cache.nix-ci.com
  23. 7.52 s Downloading cached anyhow from https://cache.nix-ci.com
  24. 7.52 s Downloading cached diff from https://cache.nix-ci.com
  25. 7.52 s Downloading cached equivalent from https://cache.nix-ci.com
  26. 7.52 s Downloading cached hashbrown from https://cache.nix-ci.com
  27. 7.52 s Downloading cached indexmap from https://cache.nix-ci.com
  28. 7.52 s Downloading cached itoa from https://cache.nix-ci.com
  29. 7.52 s Downloading cached memchr from https://cache.nix-ci.com
  30. 7.52 s Downloading cached pretty_assertions from https://cache.nix-ci.com
  31. 7.52 s Downloading cached proc-macro2 from https://cache.nix-ci.com
  32. 7.52 s Downloading cached quote from https://cache.nix-ci.com
  33. 7.52 s Downloading cached serde from https://cache.nix-ci.com
  34. 7.52 s Downloading cached serde_core from https://cache.nix-ci.com
  35. 7.52 s Downloading cached serde_derive from https://cache.nix-ci.com
  36. 7.57 s Downloaded cached cargo-install-hook.sh (2008 B) in 50ms
  37. 7.57 s Progress: 0 of 17 built, 1 of 42 downloaded from cache (15 downloading)
  38. 7.57 s Downloading cached cargo-auditable from https://cache.nix-ci.com
  39. 7.57 s Downloaded cached writable-tmpdir-as-home-hook (760 B) in 49ms
  40. 7.57 s Progress: 0 of 16 built, 2 of 42 downloaded from cache (15 downloading)
  41. 7.57 s Downloading cached cargo-build-hook.sh from https://cache.nix-ci.com
  42. 7.58 s Downloaded cached indexmap (530 KiB) in 60ms
  43. 7.58 s Progress: 0 of 15 built, 3 of 42 downloaded from cache (15 downloading)
  44. 7.58 s Downloading cached cargo-check-hook.sh from https://cache.nix-ci.com
  45. 7.59 s Downloaded cached itoa (53 KiB) in 67ms
  46. 7.59 s Progress: 0 of 15 built, 4 of 42 downloaded from cache (15 downloading)
  47. 7.59 s Downloading cached diffutils from https://cache.nix-ci.com
  48. 7.59 s Downloaded cached anyhow (240 KiB) in 68ms
  49. 7.59 s Progress: 0 of 15 built, 5 of 42 downloaded from cache (15 downloading)
  50. 7.59 s Downloading cached llvm-21.1.8-lib from https://cache.nix-ci.com
  51. 7.60 s Downloaded cached hashbrown (876 KiB) in 75ms
  52. 7.60 s Progress: 0 of 15 built, 6 of 42 downloaded from cache (15 downloading)
  53. 7.60 s Downloaded cached equivalent (21 KiB) in 75ms
  54. 7.60 s Downloading cached serde_json from https://cache.nix-ci.com
  55. 7.60 s Progress: 0 of 15 built, 7 of 42 downloaded from cache (15 downloading)
  56. 7.60 s Downloading cached serde_spanned from https://cache.nix-ci.com
  57. 7.60 s Downloaded cached quote (142 KiB) in 77ms
  58. 7.60 s Progress: 0 of 15 built, 8 of 42 downloaded from cache (15 downloading)
  59. 7.60 s Downloading cached syn from https://cache.nix-ci.com
  60. 7.60 s Downloaded cached memchr (585 KiB) in 78ms
  61. 7.60 s Progress: 0 of 15 built, 9 of 42 downloaded from cache (15 downloading)
  62. 7.60 s Downloaded cached diff (933 KiB) in 79ms
  63. 7.60 s Downloading cached toml-1.1.4+spec from https://cache.nix-ci.com
  64. 7.60 s Progress: 0 of 15 built, 10 of 42 downloaded from cache (15 downloading)
  65. 7.60 s Downloaded cached serde_core (389 KiB) in 78ms
  66. 7.60 s Downloading cached toml_datetime-1.1.1+spec from https://cache.nix-ci.com
  67. 7.60 s Progress: 0 of 15 built, 11 of 42 downloaded from cache (15 downloading)
  68. 7.60 s Downloading cached toml_edit-0.25.13+spec from https://cache.nix-ci.com
  69. 7.60 s Downloaded cached proc-macro2 (271 KiB) in 80ms
  70. 7.60 s Progress: 0 of 15 built, 12 of 42 downloaded from cache (15 downloading)
  71. 7.60 s Downloading cached toml_parser-1.1.3+spec from https://cache.nix-ci.com
  72. 7.60 s Downloaded cached pretty_assertions (127 KiB) in 81ms
  73. 7.60 s Progress: 0 of 15 built, 13 of 42 downloaded from cache (15 downloading)
  74. 7.60 s Downloading cached toml_writer-1.1.2+spec from https://cache.nix-ci.com
  75. 7.60 s Downloaded cached serde (555 KiB) in 82ms
  76. 7.60 s Progress: 0 of 15 built, 14 of 42 downloaded from cache (15 downloading)
  77. 7.60 s Downloading cached unicode-ident from https://cache.nix-ci.com
  78. 7.63 s Downloaded cached cargo-build-hook.sh (2688 B) in 55ms
  79. 7.63 s Progress: 0 of 15 built, 15 of 42 downloaded from cache (15 downloading)
  80. 7.63 s Downloading cached winnow from https://cache.nix-ci.com
  81. 7.63 s Downloaded cached cargo-auditable (2.7 MiB) in 62ms
  82. 7.63 s Progress: 0 of 14 built, 16 of 42 downloaded from cache (15 downloading)
  83. 7.63 s Downloading cached yansi from https://cache.nix-ci.com
  84. 7.63 s Downloaded cached cargo-check-hook.sh (2608 B) in 51ms
  85. 7.63 s Progress: 0 of 14 built, 17 of 42 downloaded from cache (15 downloading)
  86. 7.64 s Downloading cached zmij from https://cache.nix-ci.com
  87. 7.65 s Downloaded cached serde_spanned (35 KiB) in 54ms
  88. 7.65 s Progress: 0 of 13 built, 18 of 42 downloaded from cache (15 downloading)
  89. 7.66 s Downloaded cached diffutils (1.5 MiB) in 69ms
  90. 7.66 s Progress: 0 of 13 built, 19 of 42 downloaded from cache (14 downloading)
  91. 7.66 s Downloading cached cargo-setup-hook.sh from https://cache.nix-ci.com
  92. 7.66 s Downloaded cached toml-1.1.4+spec (326 KiB) in 60ms
  93. 7.66 s Progress: 0 of 13 built, 20 of 42 downloaded from cache (14 downloading)
  94. 7.67 s Downloaded cached syn (2.3 MiB) in 65ms
  95. 7.67 s Progress: 0 of 13 built, 21 of 42 downloaded from cache (13 downloading)
  96. 7.67 s Downloaded cached toml_edit-0.25.13+spec (359 KiB) in 70ms
  97. 7.67 s Progress: 0 of 13 built, 22 of 42 downloaded from cache (12 downloading)
  98. 7.67 s Downloaded cached toml_datetime-1.1.1+spec (71 KiB) in 71ms
  99. 7.67 s Progress: 0 of 13 built, 23 of 42 downloaded from cache (11 downloading)
  100. 7.68 s Downloaded cached toml_parser-1.1.3+spec (241 KiB) in 78ms
  101. 7.68 s Progress: 0 of 13 built, 24 of 42 downloaded from cache (10 downloading)
  102. 7.69 s Downloaded cached toml_writer-1.1.2+spec (74 KiB) in 82ms
  103. 7.69 s Progress: 0 of 13 built, 25 of 42 downloaded from cache (9 downloading)
  104. 7.70 s Downloaded cached unicode-ident (335 KiB) in 94ms
  105. 7.70 s Progress: 0 of 13 built, 26 of 42 downloaded from cache (8 downloading)
  106. 7.71 s Downloaded cached oniguruma-6.9.10-lib (692 KiB) in 189ms
  107. 7.71 s Progress: 0 of 13 built, 27 of 42 downloaded from cache (7 downloading)
  108. 7.71 s Downloading cached jq from https://cache.nix-ci.com
  109. 7.72 s Downloaded cached yansi (168 KiB) in 86ms
  110. 7.72 s Progress: 0 of 13 built, 28 of 42 downloaded from cache (7 downloading)
  111. 7.72 s Downloaded cached serde_derive (333 KiB) in 197ms
  112. 7.72 s Progress: 0 of 13 built, 29 of 42 downloaded from cache (6 downloading)
  113. 7.72 s Downloaded cached zmij (95 KiB) in 85ms
  114. 7.72 s Progress: 0 of 13 built, 30 of 42 downloaded from cache (5 downloading)
  115. 7.73 s Downloaded cached cargo-setup-hook.sh (3896 B) in 71ms
  116. 7.73 s Progress: 0 of 13 built, 31 of 42 downloaded from cache (4 downloading)
  117. 7.73 s Downloaded cached winnow (1.3 MiB) in 105ms
  118. 7.73 s Progress: 0 of 12 built, 32 of 42 downloaded from cache (3 downloading)
  119. 7.79 s Downloaded cached serde_json (751 KiB) in 187ms
  120. 7.79 s Progress: 0 of 12 built, 33 of 42 downloaded from cache (2 downloading)
  121. 7.79 s Downloading cached cargo-vendor-dir from https://cache.nix-ci.com
  122. 7.79 s Downloaded cached jq (440 KiB) in 79ms
  123. 7.79 s Progress: 0 of 12 built, 34 of 42 downloaded from cache (2 downloading)
  124. 7.79 s Downloading cached jq-1.8.2-bin from https://cache.nix-ci.com
  125. 7.83 s Downloaded cached cargo-vendor-dir (7336 B) in 48ms
  126. 7.83 s Progress: 0 of 12 built, 35 of 42 downloaded from cache (2 downloading)
  127. 7.88 s Downloaded cached jq-1.8.2-bin (34 KiB) in 89ms
  128. 7.88 s Progress: 0 of 11 built, 36 of 42 downloaded from cache (1 downloading)
  129. 7.88 s Downloading cached jq-1.8.2-dev from https://cache.nix-ci.com
  130. 7.96 s Downloaded cached jq-1.8.2-dev (14 KiB) in 77ms
  131. 7.96 s Progress: 0 of 11 built, 37 of 42 downloaded from cache (1 downloading)
  132. 9.28 s Downloaded cached llvm-21.1.8-lib (540.2 MiB) in 1.6s
  133. 9.28 s Progress: 0 of 10 built, 38 of 42 downloaded from cache
  134. 9.28 s Downloading cached rustc from https://cache.nix-ci.com
  135. 12.63 s Downloaded cached rustc (1 GiB) in 3.3s
  136. 12.63 s Progress: 0 of 10 built, 39 of 42 downloaded from cache
  137. 12.63 s Downloading cached rustc-wrapper from https://cache.nix-ci.com
  138. 12.68 s Downloaded cached rustc-wrapper (3368 B) in 49ms
  139. 12.68 s Progress: 0 of 10 built, 40 of 42 downloaded from cache
  140. 12.68 s Downloading cached cargo from https://cache.nix-ci.com
  141. 12.85 s Downloaded cached cargo (38.1 MiB) in 171ms
  142. 12.85 s Progress: 0 of 9 built, 41 of 42 downloaded from cache
  143. 12.85 s Downloading cached auditable-cargo from https://cache.nix-ci.com
  144. 12.90 s Downloaded cached auditable-cargo (16 KiB) in 48ms
  145. 12.90 s Progress: 0 of 8 built, 42 of 42 downloaded from cache
  146. 13.00 s Building /nix/store/mgnhvgks1lcy7dp8bxxhmqkm331x87cy-crane-utils-0.0.1.drv
  147. 13.04 s [crane-utils] Phase: unpackPhase
  148. 13.05 s [crane-utils] unpacking source archive /nix/store/0j28arwrbgjrf5z45dcz8xv1krkazjp6-source
  149. 13.05 s [crane-utils] source root is source
  150. 13.05 s [crane-utils] Executing cargoSetupPostUnpackHook
  151. 13.14 s [crane-utils] Finished cargoSetupPostUnpackHook
  152. 13.14 s [crane-utils] Phase: patchPhase
  153. 13.15 s [crane-utils] Executing cargoSetupPostPatchHook
  154. 13.15 s [crane-utils] Validating consistency between /build/source/Cargo.lock and /build/cargo-vendor-dir/Cargo.lock
  155. 13.15 s [crane-utils] Finished cargoSetupPostPatchHook
  156. 13.15 s [crane-utils] Phase: updateAutotoolsGnuConfigScriptsPhase
  157. 13.16 s [crane-utils] Phase: configurePhase
  158. 13.16 s [crane-utils] Phase: buildPhase
  159. 13.16 s [crane-utils] Executing cargoBuildHook
  160. 13.16 s [crane-utils] cargoBuildHook flags: -j 16 --target x86_64-unknown-linux-gnu --offline --profile release
  161. 13.28 s [crane-utils] Compiling serde_core v1.0.229
  162. 13.28 s [crane-utils] Compiling proc-macro2 v1.0.106
  163. 13.29 s [crane-utils] Compiling quote v1.0.45
  164. 13.29 s [crane-utils] Compiling unicode-ident v1.0.24
  165. 13.29 s [crane-utils] Compiling equivalent v1.0.2
  166. 13.29 s [crane-utils] Compiling zmij v1.0.21
  167. 13.29 s [crane-utils] Compiling winnow v1.0.1
  168. 13.29 s [crane-utils] Compiling hashbrown v0.17.0
  169. 13.29 s [crane-utils] Compiling toml_writer v1.1.2+spec-1.1.0
  170. 13.29 s [crane-utils] Compiling serde_json v1.0.151
  171. 13.29 s [crane-utils] Compiling serde v1.0.229
  172. 13.29 s [crane-utils] Compiling anyhow v1.0.104
  173. 13.29 s [crane-utils] Compiling memchr v2.8.0
  174. 13.29 s [crane-utils] Compiling itoa v1.0.18
  175. 14.06 s [crane-utils] Compiling indexmap v2.14.0
  176. 14.16 s [crane-utils] Compiling syn v3.0.3
  177. 14.60 s [crane-utils] Compiling toml_parser v1.1.3+spec-1.1.0
  178. 15.74 s [crane-utils] Compiling serde_derive v1.0.229
  179. 15.89 s [crane-utils] Compiling toml_datetime v1.1.1+spec-1.1.0
  180. 15.89 s [crane-utils] Compiling serde_spanned v1.1.1
  181. 16.06 s [crane-utils] Compiling toml v1.1.4+spec-1.1.0
  182. 16.06 s [crane-utils] Compiling toml_edit v0.25.13+spec-1.1.0
  183. 18.91 s [crane-utils] Compiling crane-utils v0.1.0 (/build/source)
  184. 19.79 s [crane-utils] Finished `release` profile [optimized] target(s) in 6.59s
  185. 19.79 s [crane-utils] Executing cargoInstallPostBuildHook
  186. 19.82 s [crane-utils] Finished cargoInstallPostBuildHook
  187. 19.82 s [crane-utils] Finished cargoBuildHook
  188. 19.82 s [crane-utils] Phase: checkPhase
  189. 19.82 s [crane-utils] Executing cargoCheckHook
  190. 19.83 s [crane-utils] cargoCheckHook flags: -j 16 --profile release --target x86_64-unknown-linux-gnu --offline --
  191. 19.86 s [crane-utils] Compiling yansi v1.0.1
  192. 19.86 s [crane-utils] Compiling diff v0.1.13
  193. 20.11 s [crane-utils] Compiling pretty_assertions v1.4.1
  194. 20.48 s [crane-utils] Compiling crane-utils v0.1.0 (/build/source)
  195. 21.10 s [crane-utils] Finished `release` profile [optimized] target(s) in 1.25s
  196. 21.10 s [crane-utils] Running unittests src/bin/crane-json2toml.rs (target/x86_64-unknown-linux-gnu/release/deps/crane_json2toml-81e0493385ff602f)
  197. 21.10 s [crane-utils]
  198. 21.10 s [crane-utils] running 0 tests
  199. 21.10 s [crane-utils]
  200. 21.10 s [crane-utils] test result: ok. 0 passed; 0 failed; 0 ignored; 0 measured; 0 filtered out; finished in 0.00s
  201. 21.10 s [crane-utils]
  202. 21.10 s [crane-utils] Running unittests src/bin/crane-resolve-workspace-inheritance.rs (target/x86_64-unknown-linux-gnu/release/deps/crane_resolve_workspace_inheritance-17631877c58153a5)
  203. 21.10 s [crane-utils]
  204. 21.10 s [crane-utils] running 2 tests
  205. 21.10 s [crane-utils] test tests::dependency_comments_ignored ... ok
  206. 21.10 s [crane-utils] test tests::smoke ... ok
  207. 21.10 s [crane-utils]
  208. 21.10 s [crane-utils] test result: ok. 2 passed; 0 failed; 0 ignored; 0 measured; 0 filtered out; finished in 0.00s
  209. 21.10 s [crane-utils]
  210. 21.10 s [crane-utils] Finished cargoCheckHook
  211. 21.11 s [crane-utils] Phase: installPhase
  212. 21.11 s [crane-utils] Executing cargoInstallHook
  213. 21.13 s [crane-utils] Finished cargoInstallHook
  214. 21.13 s [crane-utils] Phase: fixupPhase
  215. 21.14 s [crane-utils] shrinking RPATHs of ELF executables and libraries in /nix/store/carsnga6bh1ilqhsm8dx0h5zk0y8xwyn-crane-utils-0.0.1
  216. 21.15 s [crane-utils] shrinking /nix/store/carsnga6bh1ilqhsm8dx0h5zk0y8xwyn-crane-utils-0.0.1/bin/crane-json2toml
  217. 21.15 s [crane-utils] shrinking /nix/store/carsnga6bh1ilqhsm8dx0h5zk0y8xwyn-crane-utils-0.0.1/bin/crane-resolve-workspace-inheritance
  218. 21.15 s [crane-utils] checking for references to /build/ in /nix/store/carsnga6bh1ilqhsm8dx0h5zk0y8xwyn-crane-utils-0.0.1...
  219. 21.16 s [crane-utils] patching script interpreter paths in /nix/store/carsnga6bh1ilqhsm8dx0h5zk0y8xwyn-crane-utils-0.0.1
  220. 21.17 s [crane-utils] stripping (with command strip and flags -S -p) in /nix/store/carsnga6bh1ilqhsm8dx0h5zk0y8xwyn-crane-utils-0.0.1/bin
  221. 21.25 s [crane-utils:post-build] Uploading to the NixCI cache: /nix/store/carsnga6bh1ilqhsm8dx0h5zk0y8xwyn-crane-utils-0.0.1
  222. 21.30 s [crane-utils:post-build] warning: 'warn-short-path-literals' is deprecated, use 'lint-short-path-literals = ignore' instead
  223. 21.31 s [crane-utils:post-build] copying 1 paths...
  224. 21.31 s [crane-utils:post-build] copying path '/nix/store/carsnga6bh1ilqhsm8dx0h5zk0y8xwyn-crane-utils-0.0.1' to 'https://cache.nix-ci.com'...
  225. 21.96 s [crane-utils:post-build] warning: 'warn-short-path-literals' is deprecated, use 'lint-short-path-literals = ignore' instead
  226. 22.02 s [crane-utils:post-build] copying 0 paths...
  227. 22.03 s Uploaded crane-utils in 800ms
  228. 22.04 s Progress: 1 of 8 built, 42 of 42 downloaded from cache
  229. 22.04 s Built crane-utils in 9.0s
  230. 22.06 s Building /nix/store/z3anfm6g8wivqivwhmz1i5ba17i9bsnz-cargo-git-https-github.com-lcnbr-tymbolica-32ae00483b4845161401afac8be755cc336cb2bb.drv
  231. 22.09 s Building /nix/store/1bwb620m37xdacivng364zxcllmi8bi0-cargo-git-https-github.com-symbolica-dev-symbolica-4f1323185fe5e0c0f8c864ab89edd1905e7adef1.drv
  232. 22.13 s [cargo-git-https-github.com-lcnbr-tymbolica] Phase: unpackPhase
  233. 22.14 s [cargo-git-https-github.com-lcnbr-tymbolica] unpacking source archive /nix/store/hghi51iby4jnwnp3w20ll6irxli6yw9l-source
  234. 22.17 s [cargo-git-https-github.com-lcnbr-tymbolica] source root is source
  235. 22.17 s [cargo-git-https-github.com-symbolica-dev-symbolica] Phase: unpackPhase
  236. 22.17 s [cargo-git-https-github.com-symbolica-dev-symbolica] unpacking source archive /nix/store/20yn9jfx1dr8sydak881lh263db95i1s-source
  237. 22.17 s [cargo-git-https-github.com-lcnbr-tymbolica] Phase: patchPhase
  238. 22.18 s [cargo-git-https-github.com-lcnbr-tymbolica] Phase: updateAutotoolsGnuConfigScriptsPhase
  239. 22.19 s [cargo-git-https-github.com-lcnbr-tymbolica] Phase: installPhase
  240. 22.21 s [cargo-git-https-github.com-symbolica-dev-symbolica] source root is source
  241. 22.22 s [cargo-git-https-github.com-symbolica-dev-symbolica] Phase: patchPhase
  242. 22.23 s [cargo-git-https-github.com-symbolica-dev-symbolica] Phase: updateAutotoolsGnuConfigScriptsPhase
  243. 22.24 s [cargo-git-https-github.com-symbolica-dev-symbolica] Phase: installPhase
  244. 22.26 s [cargo-git-https-github.com-symbolica-dev-symbolica] warning: manifest has no description, license, license-file, documentation, homepage or repository
  245. 22.26 s [cargo-git-https-github.com-symbolica-dev-symbolica] |
  246. 22.26 s [cargo-git-https-github.com-symbolica-dev-symbolica] = note: see https://doc.rust-lang.org/cargo/reference/manifest.html#package-metadata for more info
  247. 22.30 s [cargo-git-https-github.com-symbolica-dev-symbolica] warning: manifest has no description, license, license-file, documentation, homepage or repository
  248. 22.30 s [cargo-git-https-github.com-symbolica-dev-symbolica] |
  249. 22.30 s [cargo-git-https-github.com-symbolica-dev-symbolica] = note: see https://doc.rust-lang.org/cargo/reference/manifest.html#package-metadata for more info
  250. 22.51 s [cargo-git-https-github.com-lcnbr-tymbolica] warning: manifest has no description, documentation, homepage or repository
  251. 22.51 s [cargo-git-https-github.com-lcnbr-tymbolica] |
  252. 22.51 s [cargo-git-https-github.com-lcnbr-tymbolica] = note: see https://doc.rust-lang.org/cargo/reference/manifest.html#package-metadata for more info
  253. 22.55 s [cargo-git-https-github.com-lcnbr-tymbolica] warning: manifest has no description, documentation, homepage or repository
  254. 22.55 s [cargo-git-https-github.com-lcnbr-tymbolica] |
  255. 22.55 s [cargo-git-https-github.com-lcnbr-tymbolica] = note: see https://doc.rust-lang.org/cargo/reference/manifest.html#package-metadata for more info
  256. 22.59 s [cargo-git-https-github.com-lcnbr-tymbolica] warning: manifest has no description, documentation, homepage or repository
  257. 22.59 s [cargo-git-https-github.com-lcnbr-tymbolica] |
  258. 22.59 s [cargo-git-https-github.com-lcnbr-tymbolica] = note: see https://doc.rust-lang.org/cargo/reference/manifest.html#package-metadata for more info
  259. 22.62 s [cargo-git-https-github.com-lcnbr-tymbolica] warning: manifest has no description, documentation, homepage or repository
  260. 22.62 s [cargo-git-https-github.com-lcnbr-tymbolica] |
  261. 22.62 s [cargo-git-https-github.com-lcnbr-tymbolica] = note: see https://doc.rust-lang.org/cargo/reference/manifest.html#package-metadata for more info
  262. 22.71 s [cargo-git-https-github.com-lcnbr-tymbolica] warning: manifest has no description, documentation, homepage or repository
  263. 22.71 s [cargo-git-https-github.com-lcnbr-tymbolica] |
  264. 22.71 s [cargo-git-https-github.com-lcnbr-tymbolica] = note: see https://doc.rust-lang.org/cargo/reference/manifest.html#package-metadata for more info
  265. 22.80 s [cargo-git-https-github.com-lcnbr-tymbolica:post-build] Uploading to the NixCI cache: /nix/store/2hrk5r35kdv4hcjg0hyifjznri2xvd0g-cargo-git-https-github.com-lcnbr-tymbolica-32ae00483b4845161401afac8be755cc336cb2bb
  266. 22.85 s [cargo-git-https-github.com-lcnbr-tymbolica:post-build] warning: 'warn-short-path-literals' is deprecated, use 'lint-short-path-literals = ignore' instead
  267. 22.86 s [cargo-git-https-github.com-lcnbr-tymbolica:post-build] copying 1 paths...
  268. 22.86 s [cargo-git-https-github.com-lcnbr-tymbolica:post-build] copying path '/nix/store/2hrk5r35kdv4hcjg0hyifjznri2xvd0g-cargo-git-https-github.com-lcnbr-tymbolica-32ae00483b4845161401afac8be755cc336cb2bb' to 'https://cache.nix-ci.com'...
  269. 29.02 s [cargo-git-https-github.com-lcnbr-tymbolica:post-build] warning: 'warn-short-path-literals' is deprecated, use 'lint-short-path-literals = ignore' instead
  270. 29.33 s [cargo-git-https-github.com-lcnbr-tymbolica:post-build] copying 2 paths...
  271. 29.33 s [cargo-git-https-github.com-lcnbr-tymbolica:post-build] copying path '/nix/store/hghi51iby4jnwnp3w20ll6irxli6yw9l-source' to 'https://cache.nix-ci.com'...
  272. 35.65 s [cargo-git-https-github.com-lcnbr-tymbolica:post-build] copying path '/nix/store/z3anfm6g8wivqivwhmz1i5ba17i9bsnz-cargo-git-https-github.com-lcnbr-tymbolica-32ae00483b4845161401afac8be755cc336cb2bb.drv' to 'https://cache.nix-ci.com'...
  273. 35.75 s Uploaded cargo-git-https-github.com-lcnbr-tymbolica in 12.9s
  274. 35.75 s Progress: 2 of 8 built (1 building), 42 of 42 downloaded from cache
  275. 35.75 s Built cargo-git-https-github.com-lcnbr-tymbolica in 13.6s
  276. 35.75 s Waiting for lock on linkLockedDeps
  277. 35.83 s [cargo-git-https-github.com-symbolica-dev-symbolica:post-build] Uploading to the NixCI cache: /nix/store/0d9skqfjp0i0kc3239p7dnsdbsggczv9-cargo-git-https-github.com-symbolica-dev-symbolica-4f1323185fe5e0c0f8c864ab89edd1905e7adef1
  278. 35.88 s [cargo-git-https-github.com-symbolica-dev-symbolica:post-build] warning: 'warn-short-path-literals' is deprecated, use 'lint-short-path-literals = ignore' instead
  279. 35.88 s [cargo-git-https-github.com-symbolica-dev-symbolica:post-build] copying 1 paths...
  280. 35.88 s [cargo-git-https-github.com-symbolica-dev-symbolica:post-build] copying path '/nix/store/0d9skqfjp0i0kc3239p7dnsdbsggczv9-cargo-git-https-github.com-symbolica-dev-symbolica-4f1323185fe5e0c0f8c864ab89edd1905e7adef1' to 'https://cache.nix-ci.com'...
  281. 43.18 s [cargo-git-https-github.com-symbolica-dev-symbolica:post-build] warning: 'warn-short-path-literals' is deprecated, use 'lint-short-path-literals = ignore' instead
  282. 43.43 s [cargo-git-https-github.com-symbolica-dev-symbolica:post-build] copying 2 paths...
  283. 43.43 s [cargo-git-https-github.com-symbolica-dev-symbolica:post-build] copying path '/nix/store/20yn9jfx1dr8sydak881lh263db95i1s-source' to 'https://cache.nix-ci.com'...
  284. 51.74 s [cargo-git-https-github.com-symbolica-dev-symbolica:post-build] copying path '/nix/store/1bwb620m37xdacivng364zxcllmi8bi0-cargo-git-https-github.com-symbolica-dev-symbolica-4f1323185fe5e0c0f8c864ab89edd1905e7adef1.drv' to 'https://cache.nix-ci.com'...
  285. 51.83 s Uploaded cargo-git-https-github.com-symbolica-dev-symbolica in 16.0s
  286. 51.83 s Progress: 3 of 8 built, 42 of 42 downloaded from cache
  287. 51.83 s Built cargo-git-https-github.com-symbolica-dev-symbolica in 29.7s
  288. 51.86 s Building /nix/store/1ixf4sgajw8k33bfzwnwsqzqj0bacw0b-linkLockedDeps.drv
  289. 51.90 s [linkLockedDeps:post-build] Uploading to the NixCI cache: /nix/store/adqvrk6shrff39zzq2zmcgmv7d0823qz-linkLockedDeps
  290. 51.94 s [linkLockedDeps:post-build] warning: 'warn-short-path-literals' is deprecated, use 'lint-short-path-literals = ignore' instead
  291. 52.06 s [linkLockedDeps:post-build] copying 0 paths...
  292. 52.10 s [linkLockedDeps:post-build] warning: 'warn-short-path-literals' is deprecated, use 'lint-short-path-literals = ignore' instead
  293. 52.24 s [linkLockedDeps:post-build] copying 0 paths...
  294. 52.26 s Uploaded linkLockedDeps in 362ms
  295. 52.26 s Progress: 4 of 8 built, 42 of 42 downloaded from cache
  296. 52.26 s Built linkLockedDeps in 400ms
  297. 52.39 s Building /nix/store/kgm57dlvnvvicjlrbbjbs98r4ypa3qyx-vendor-cargo-deps.drv
  298. 52.47 s [vendor-cargo-deps:post-build] Uploading to the NixCI cache: /nix/store/9rqk4093qnvgswmdk1pbxk9najcrjn7a-vendor-cargo-deps
  299. 52.51 s [vendor-cargo-deps:post-build] warning: 'warn-short-path-literals' is deprecated, use 'lint-short-path-literals = ignore' instead
  300. 52.64 s [vendor-cargo-deps:post-build] copying 0 paths...
  301. 52.69 s [vendor-cargo-deps:post-build] warning: 'warn-short-path-literals' is deprecated, use 'lint-short-path-literals = ignore' instead
  302. 52.89 s [vendor-cargo-deps:post-build] copying 0 paths...
  303. 52.91 s Uploaded vendor-cargo-deps in 449ms
  304. 52.91 s Progress: 5 of 7 built, 42 of 42 downloaded from cache
  305. 52.91 s Built vendor-cargo-deps in 511ms
  306. 52.99 s Building /nix/store/8y99gpj1qs95jysr3c6kccvh7lrd78i4-alphal00p-docs-cargo-0.1.0.drv
  307. 53.03 s [alphal00p-docs-cargo] cargoArtifacts not set, will not reuse any cargo artifacts
  308. 53.05 s [alphal00p-docs-cargo] Phase: unpackPhase
  309. 53.05 s [alphal00p-docs-cargo] unpacking source archive /nix/store/4pklqwhrgb01wfp3djh4jb2wr4xr9ila-source
  310. 53.11 s [alphal00p-docs-cargo] source root is source
  311. 53.12 s [alphal00p-docs-cargo] Phase: patchPhase
  312. 53.13 s [alphal00p-docs-cargo] Executing configureCargoCommonVars
  313. 53.14 s [alphal00p-docs-cargo] Phase: updateAutotoolsGnuConfigScriptsPhase
  314. 53.15 s [alphal00p-docs-cargo] Phase: configurePhase
  315. 53.15 s [alphal00p-docs-cargo] will append /build/source/.cargo-home/config.toml with contents of /nix/store/9rqk4093qnvgswmdk1pbxk9najcrjn7a-vendor-cargo-deps/config.toml
  316. 53.15 s [alphal00p-docs-cargo] default configurePhase, nothing to do
  317. 53.15 s [alphal00p-docs-cargo] Phase: buildPhase
  318. 53.16 s [alphal00p-docs-cargo] +++ command cargo --version
  319. 53.16 s [alphal00p-docs-cargo] cargo 1.98.1 (797e8a9bc 2026-08-05)
  320. 53.16 s [alphal00p-docs-cargo] +++ command cargo build --profile docs --locked -p alphal00p-docs-catalogs --bin alphal00p-docs-catalogs
  321. 53.44 s [alphal00p-docs-cargo] Compiling proc-macro2 v1.0.106
  322. 53.44 s [alphal00p-docs-cargo] Compiling unicode-ident v1.0.24
  323. 53.44 s [alphal00p-docs-cargo] Compiling quote v1.0.45
  324. 53.44 s [alphal00p-docs-cargo] Compiling serde_core v1.0.228
  325. 53.44 s [alphal00p-docs-cargo] Compiling memchr v2.8.0
  326. 53.44 s [alphal00p-docs-cargo] Compiling utf8parse v0.2.2
  327. 53.44 s [alphal00p-docs-cargo] Compiling zmij v1.0.21
  328. 53.44 s [alphal00p-docs-cargo] Compiling serde v1.0.228
  329. 53.45 s [alphal00p-docs-cargo] Compiling anstyle-query v1.1.5
  330. 53.45 s [alphal00p-docs-cargo] Compiling colorchoice v1.0.5
  331. 53.45 s [alphal00p-docs-cargo] Compiling is_terminal_polyfill v1.70.2
  332. 53.46 s [alphal00p-docs-cargo] Compiling serde_json v1.0.149
  333. 53.47 s [alphal00p-docs-cargo] Compiling anstyle v1.0.14
  334. 53.47 s [alphal00p-docs-cargo] Compiling thiserror v2.0.18
  335. 53.47 s [alphal00p-docs-cargo] Compiling equivalent v1.0.2
  336. 53.47 s [alphal00p-docs-cargo] Compiling eyre v0.6.12
  337. 53.57 s [alphal00p-docs-cargo] Compiling anstyle-parse v1.0.0
  338. 53.57 s [alphal00p-docs-cargo] Compiling itoa v1.0.18
  339. 53.58 s [alphal00p-docs-cargo] Compiling heck v0.5.0
  340. 53.58 s [alphal00p-docs-cargo] Compiling hashbrown v0.17.1
  341. 53.58 s [alphal00p-docs-cargo] Compiling clap_lex v1.1.0
  342. 53.59 s [alphal00p-docs-cargo] Compiling regex-syntax v0.8.10
  343. 53.66 s [alphal00p-docs-cargo] Compiling anstream v1.0.0
  344. 53.67 s [alphal00p-docs-cargo] Compiling strsim v0.11.1
  345. 53.68 s [alphal00p-docs-cargo] Compiling indenter v0.3.4
  346. 53.70 s [alphal00p-docs-cargo] Compiling once_cell v1.21.4
  347. 53.81 s [alphal00p-docs-cargo] Compiling clap_builder v4.6.0
  348. 53.84 s [alphal00p-docs-cargo] Compiling aho-corasick v1.1.4
  349. 54.18 s [alphal00p-docs-cargo] Compiling syn v2.0.117
  350. 54.61 s [alphal00p-docs-cargo] Compiling regex-automata v0.4.14
  351. 55.01 s [alphal00p-docs-cargo] Compiling indexmap v2.14.0
  352. 55.78 s [alphal00p-docs-cargo] Compiling serde_derive v1.0.228
  353. 55.78 s [alphal00p-docs-cargo] Compiling thiserror-impl v2.0.18
  354. 55.78 s [alphal00p-docs-cargo] Compiling clap_derive v4.6.1
  355. 55.78 s [alphal00p-docs-cargo] Compiling alphal00p-docs-macros v0.1.0 (/build/source/crates/alphal00p-docs-macros)
  356. 55.94 s [alphal00p-docs-cargo] Compiling regex v1.12.3
  357. 56.97 s [alphal00p-docs-cargo] Compiling clap v4.6.1
  358. 57.83 s [alphal00p-docs-cargo] Compiling alphal00p-docs-schema v0.1.0 (/build/source/crates/alphal00p-docs-schema)
  359. 58.37 s [alphal00p-docs-cargo] Compiling alphal00p-docs-catalogs v0.1.0 (/build/source/crates/alphal00p-docs-catalogs)
  360. 62.92 s [alphal00p-docs-cargo] Finished `docs` profile [unoptimized] target(s) in 9.75s
  361. 62.98 s [alphal00p-docs-cargo] +++ command cargo build --profile docs --locked -p alphal00p-docs-python-exporter --features gammaloop
  362. 63.39 s [alphal00p-docs-cargo] Compiling serde_core v1.0.228
  363. 63.39 s [alphal00p-docs-cargo] Compiling libc v0.2.186
  364. 63.39 s [alphal00p-docs-cargo] Compiling cfg-if v1.0.4
  365. 63.39 s [alphal00p-docs-cargo] Compiling serde v1.0.228
  366. 63.39 s [alphal00p-docs-cargo] Compiling memchr v2.8.0
  367. 63.39 s [alphal00p-docs-cargo] Compiling autocfg v1.5.0
  368. 63.39 s [alphal00p-docs-cargo] Compiling libm v0.2.16
  369. 63.39 s [alphal00p-docs-cargo] Compiling version_check v0.9.5
  370. 63.40 s [alphal00p-docs-cargo] Compiling either v1.15.0
  371. 63.41 s [alphal00p-docs-cargo] Compiling zerocopy v0.8.48
  372. 63.42 s [alphal00p-docs-cargo] Compiling crossbeam-utils v0.8.21
  373. 63.42 s [alphal00p-docs-cargo] Compiling log v0.4.29
  374. 63.43 s [alphal00p-docs-cargo] Compiling rayon-core v1.13.0
  375. 63.43 s [alphal00p-docs-cargo] Compiling unicode-width v0.2.2
  376. 63.43 s [alphal00p-docs-cargo] Compiling foldhash v0.2.0
  377. 63.43 s [alphal00p-docs-cargo] Compiling target-lexicon v0.13.5
  378. 63.43 s [alphal00p-docs-cargo] Compiling syn v2.0.117
  379. 63.57 s [alphal00p-docs-cargo] Compiling syn v3.0.4
  380. 63.58 s [alphal00p-docs-cargo] Compiling serde_json v1.0.149
  381. 63.60 s [alphal00p-docs-cargo] Compiling lazy_static v1.5.0
  382. 63.64 s [alphal00p-docs-cargo] Compiling crunchy v0.2.4
  383. 63.64 s [alphal00p-docs-cargo] Compiling getrandom v0.3.4
  384. 63.69 s [alphal00p-docs-cargo] Compiling paste v1.0.15
  385. 63.69 s [alphal00p-docs-cargo] Compiling siphasher v1.0.2
  386. 63.81 s [alphal00p-docs-cargo] Compiling aho-corasick v1.1.4
  387. 63.86 s [alphal00p-docs-cargo] Compiling num-traits v0.2.19
  388. 63.89 s [alphal00p-docs-cargo] Compiling tiny-keccak v2.0.2
  389. 63.91 s [alphal00p-docs-cargo] Compiling anyhow v1.0.102
  390. 63.92 s [alphal00p-docs-cargo] Compiling itertools v0.14.0
  391. 64.02 s [alphal00p-docs-cargo] Compiling static_assertions v1.1.0
  392. 64.05 s [alphal00p-docs-cargo] Compiling num-conv v0.2.1
  393. 64.11 s [alphal00p-docs-cargo] Compiling powerfmt v0.2.0
  394. 64.14 s [alphal00p-docs-cargo] Compiling rustix v1.1.4
  395. 64.18 s [alphal00p-docs-cargo] Compiling time-core v0.1.8
  396. 64.28 s [alphal00p-docs-cargo] Compiling time-macros v0.2.27
  397. 64.37 s [alphal00p-docs-cargo] Compiling crossbeam-epoch v0.9.18
  398. 64.38 s [alphal00p-docs-cargo] Compiling deranged v0.5.8
  399. 64.45 s [alphal00p-docs-cargo] Compiling linux-raw-sys v0.12.1
  400. 64.49 s [alphal00p-docs-cargo] Compiling allocator-api2 v0.2.21
  401. 64.55 s [alphal00p-docs-cargo] Compiling pyo3-build-config v0.28.3
  402. 64.88 s [alphal00p-docs-cargo] Compiling crossbeam-deque v0.8.6
  403. 64.93 s [alphal00p-docs-cargo] Compiling num_threads v0.1.7
  404. 64.94 s [alphal00p-docs-cargo] Compiling hashbrown v0.16.1
  405. 64.94 s [alphal00p-docs-cargo] Compiling tracing-core v0.1.36
  406. 64.95 s [alphal00p-docs-cargo] Compiling virtue v0.0.18
  407. 64.97 s [alphal00p-docs-cargo] Compiling winnow v1.0.2
  408. 65.02 s [alphal00p-docs-cargo] Compiling arrayvec v0.7.6
  409. 65.29 s [alphal00p-docs-cargo] Compiling regex-automata v0.4.14
  410. 65.46 s [alphal00p-docs-cargo] Compiling rayon v1.12.0
  411. 65.60 s [alphal00p-docs-cargo] Compiling phf_shared v0.11.3
  412. 65.62 s [alphal00p-docs-cargo] Compiling bincode_derive v2.0.1
  413. 65.66 s [alphal00p-docs-cargo] Compiling unty v0.0.4
  414. 65.70 s [alphal00p-docs-cargo] Compiling toml_writer v1.1.1+spec-1.1.0
  415. 65.72 s [alphal00p-docs-cargo] Compiling gmp-mpfr-sys v1.7.1
  416. 65.78 s [alphal00p-docs-cargo] Compiling getrandom v0.2.17
  417. 65.82 s [alphal00p-docs-cargo] Compiling bitflags v2.11.1
  418. 65.88 s [alphal00p-docs-cargo] Compiling time v0.3.47
  419. 65.95 s [alphal00p-docs-cargo] Compiling rand_core v0.6.4
  420. 65.95 s [alphal00p-docs-cargo] Compiling serde_spanned v1.1.1
  421. 66.00 s [alphal00p-docs-cargo] Compiling rand_core v0.9.5
  422. 66.05 s [alphal00p-docs-cargo] Compiling pin-project-lite v0.2.17
  423. 66.09 s [alphal00p-docs-cargo] Compiling nu-ansi-term v0.50.3
  424. 66.16 s [alphal00p-docs-cargo] Compiling num-integer v0.1.46
  425. 66.18 s [alphal00p-docs-cargo] Compiling approx v0.5.1
  426. 66.19 s [alphal00p-docs-cargo] Compiling bytemuck_derive v1.12.0
  427. 66.20 s [alphal00p-docs-cargo] Compiling toml_parser v1.1.2+spec-1.1.0
  428. 66.20 s [alphal00p-docs-cargo] Compiling tracing-log v0.2.0
  429. 66.26 s [alphal00p-docs-cargo] Compiling matrixmultiply v0.3.10
  430. 66.30 s [alphal00p-docs-cargo] Compiling sharded-slab v0.1.7
  431. 66.35 s [alphal00p-docs-cargo] Compiling hashbrown v0.17.1
  432. 66.37 s [alphal00p-docs-cargo] Compiling thread_local v1.1.9
  433. 66.38 s [alphal00p-docs-cargo] Compiling syn v1.0.109
  434. 66.45 s [alphal00p-docs-cargo] Compiling typenum v1.20.0
  435. 66.47 s [alphal00p-docs-cargo] Compiling rug v1.30.0
  436. 66.48 s [alphal00p-docs-cargo] Compiling option-ext v0.2.0
  437. 66.52 s [alphal00p-docs-cargo] Compiling dirs-sys v0.5.0
  438. 66.54 s [alphal00p-docs-cargo] Compiling pyo3-ffi v0.28.3
  439. 66.68 s [alphal00p-docs-cargo] Compiling num-complex v0.4.6
  440. 66.70 s [alphal00p-docs-cargo] Compiling toml_datetime v1.1.1+spec-1.1.0
  441. 66.71 s [alphal00p-docs-cargo] Compiling dyn-clone v1.0.20
  442. 66.71 s [alphal00p-docs-cargo] Compiling az v1.3.0
  443. 66.73 s [alphal00p-docs-cargo] Compiling rawpointer v0.2.1
  444. 66.78 s [alphal00p-docs-cargo] Compiling fnv v1.0.7
  445. 66.78 s [alphal00p-docs-cargo] Compiling alloc-no-stdlib v2.0.4
  446. 66.85 s [alphal00p-docs-cargo] Compiling alloc-stdlib v0.2.2
  447. 66.86 s [alphal00p-docs-cargo] Compiling num-bigint v0.4.6
  448. 66.90 s [alphal00p-docs-cargo] Compiling pyo3-macros-backend v0.28.3
  449. 66.91 s [alphal00p-docs-cargo] Compiling generic-array v0.14.7
  450. 66.93 s [alphal00p-docs-cargo] Compiling colored v3.1.1
  451. 67.06 s [alphal00p-docs-cargo] Compiling bitflags v1.3.2
  452. 67.06 s [alphal00p-docs-cargo] Compiling errno v0.3.14
  453. 67.11 s [alphal00p-docs-cargo] Compiling getopts v0.2.24
  454. 67.14 s [alphal00p-docs-cargo] Compiling ident_case v1.0.1
  455. 67.15 s [alphal00p-docs-cargo] Compiling same-file v1.0.6
  456. 67.17 s [alphal00p-docs-cargo] Compiling parking_lot_core v0.9.12
  457. 67.17 s [alphal00p-docs-cargo] Compiling signal-hook v0.3.18
  458. 67.24 s [alphal00p-docs-cargo] Compiling walkdir v2.5.0
  459. 67.27 s [alphal00p-docs-cargo] Compiling bytemuck v1.25.0
  460. 67.28 s [alphal00p-docs-cargo] Compiling signal-hook-registry v1.4.8
  461. 67.36 s [alphal00p-docs-cargo] Compiling indexmap v2.14.0
  462. 67.40 s [alphal00p-docs-cargo] Compiling region v3.0.2
  463. 67.41 s [alphal00p-docs-cargo] Compiling toml v1.1.2+spec-1.1.0
  464. 67.42 s [alphal00p-docs-cargo] Compiling safe_arch v0.7.4
  465. 67.43 s [alphal00p-docs-cargo] Compiling safe_arch v1.2.0
  466. 67.44 s [alphal00p-docs-cargo] Compiling matchers v0.2.0
  467. 67.45 s [alphal00p-docs-cargo] Compiling regex v1.12.3
  468. 67.48 s [alphal00p-docs-cargo] Compiling synstructure v0.13.2
  469. 67.49 s [alphal00p-docs-cargo] Compiling const-random-macro v0.1.16
  470. 67.51 s [alphal00p-docs-cargo] Compiling hugepage-rs v0.1.1
  471. 67.56 s [alphal00p-docs-cargo] Compiling wasmtime-jit-icache-coherence v34.0.2
  472. 67.60 s [alphal00p-docs-cargo] Compiling vte v0.14.1
  473. 67.64 s [alphal00p-docs-cargo] Compiling wide v0.7.33
  474. 67.67 s [alphal00p-docs-cargo] Compiling smartstring v1.0.1
  475. 67.70 s [alphal00p-docs-cargo] Compiling wide v1.7.0
  476. 67.71 s [alphal00p-docs-cargo] Compiling ahash v0.8.12
  477. 67.76 s [alphal00p-docs-cargo] Compiling scopeguard v1.2.0
  478. 67.78 s [alphal00p-docs-cargo] Compiling unic-common v0.9.0
  479. 67.80 s [alphal00p-docs-cargo] Compiling spec_math v0.1.6
  480. 67.82 s [alphal00p-docs-cargo] Compiling unic-char-range v0.9.0
  481. 67.89 s [alphal00p-docs-cargo] Compiling inventory v0.3.24
  482. 67.90 s [alphal00p-docs-cargo] Compiling unic-char-property v0.9.0
  483. 67.92 s [alphal00p-docs-cargo] Compiling serde_derive v1.0.228
  484. 67.92 s [alphal00p-docs-cargo] Compiling zerocopy-derive v0.8.48
  485. 67.93 s [alphal00p-docs-cargo] Compiling tracing-attributes v0.1.31
  486. 67.93 s [alphal00p-docs-cargo] Compiling thiserror-impl v2.0.18
  487. 67.96 s [alphal00p-docs-cargo] Compiling strum_macros v0.27.2
  488. 67.98 s [alphal00p-docs-cargo] Compiling is-macro v0.3.7
  489. 68.03 s [alphal00p-docs-cargo] Compiling unic-ucd-version v0.9.0
  490. 68.08 s [alphal00p-docs-cargo] Compiling lock_api v0.4.14
  491. 68.10 s [alphal00p-docs-cargo] Compiling const-random v0.1.18
  492. 68.27 s [alphal00p-docs-cargo] Compiling terminal_size v0.4.4
  493. 68.28 s [alphal00p-docs-cargo] Compiling brotli-decompressor v5.0.0
  494. 68.40 s [alphal00p-docs-cargo] Compiling mio v1.2.0
  495. 68.74 s [alphal00p-docs-cargo] Compiling rustpython-parser-vendored v0.4.0
  496. 68.76 s [alphal00p-docs-cargo] Compiling itertools v0.11.0
  497. 68.88 s [alphal00p-docs-cargo] Compiling iana-time-zone v0.1.65
  498. 68.90 s [alphal00p-docs-cargo] Compiling fastrand v2.4.1
  499. 68.92 s [alphal00p-docs-cargo] Compiling winnow v0.7.15
  500. 68.98 s [alphal00p-docs-cargo] Compiling minimal-lexical v0.2.1
  501. 69.03 s [alphal00p-docs-cargo] Compiling unicase v2.9.0
  502. 69.07 s [alphal00p-docs-cargo] Compiling rustix v0.38.44
  503. 69.11 s [alphal00p-docs-cargo] Compiling indenter v0.3.4
  504. 69.18 s [alphal00p-docs-cargo] Compiling brotli v8.0.2
  505. 69.19 s [alphal00p-docs-cargo] Compiling nom v7.1.3
  506. 69.19 s [alphal00p-docs-cargo] Compiling clap_builder v4.6.0
  507. 69.34 s [alphal00p-docs-cargo] Compiling thiserror v2.0.18
  508. 69.35 s [alphal00p-docs-cargo] Compiling tracing v0.1.44
  509. 69.37 s [alphal00p-docs-cargo] Compiling simba v0.9.1
  510. 69.41 s [alphal00p-docs-cargo] Compiling rustpython-parser-core v0.4.0
  511. 69.47 s [alphal00p-docs-cargo] Compiling signal-hook-mio v0.2.5
  512. 69.58 s [alphal00p-docs-cargo] Compiling zerofrom-derive v0.1.7
  513. 69.61 s [alphal00p-docs-cargo] Compiling clap_derive v4.6.1
  514. 69.80 s [alphal00p-docs-cargo] Compiling crypto-common v0.1.7
  515. 69.82 s [alphal00p-docs-cargo] Compiling block-buffer v0.10.4
  516. 69.90 s [alphal00p-docs-cargo] Compiling directories v6.0.0
  517. 69.91 s [alphal00p-docs-cargo] Compiling numpy v0.28.0
  518. 70.01 s [alphal00p-docs-cargo] Compiling strum v0.27.2
  519. 70.04 s [alphal00p-docs-cargo] Compiling phf v0.11.3
  520. 70.08 s [alphal00p-docs-cargo] Compiling libloading v0.9.0
  521. 70.16 s [alphal00p-docs-cargo] Compiling self_cell v1.2.2
  522. 70.21 s [alphal00p-docs-cargo] Compiling tinyjson v2.5.1
  523. 70.24 s [alphal00p-docs-cargo] Compiling ed25519-compact v2.4.2
  524. 70.25 s [alphal00p-docs-cargo] Compiling bytes v1.11.1
  525. 70.49 s [alphal00p-docs-cargo] Compiling append-only-vec v0.1.8
  526. 70.53 s [alphal00p-docs-cargo] Compiling linux-raw-sys v0.4.15
  527. 70.57 s [alphal00p-docs-cargo] Compiling byteorder v1.5.0
  528. 70.60 s [alphal00p-docs-cargo] Compiling unicode-segmentation v1.13.2
  529. 70.61 s [alphal00p-docs-cargo] Compiling rustc-hash v2.1.2
  530. 70.70 s [alphal00p-docs-cargo] Compiling data-encoding v2.11.1
  531. 70.77 s [alphal00p-docs-cargo] Compiling ansitok v0.3.0
  532. 70.82 s [alphal00p-docs-cargo] Compiling digest v0.10.7
  533. 70.83 s [alphal00p-docs-cargo] Compiling rustpython-ast v0.4.0
  534. 70.85 s [alphal00p-docs-cargo] Compiling zerofrom v0.1.8
  535. 70.97 s [alphal00p-docs-cargo] Compiling unic-ucd-ident v0.9.0
  536. 70.99 s [alphal00p-docs-cargo] Compiling pyo3-macros v0.28.3
  537. 71.01 s [alphal00p-docs-cargo] Compiling unic-emoji-char v0.9.0
  538. 71.10 s [alphal00p-docs-cargo] Compiling yoke-derive v0.8.2
  539. 71.14 s [alphal00p-docs-cargo] Compiling pyo3 v0.28.3
  540. 71.19 s [alphal00p-docs-cargo] Compiling phf_shared v0.13.1
  541. 71.34 s [alphal00p-docs-cargo] Compiling smallvec v1.15.1
  542. 71.37 s [alphal00p-docs-cargo] Compiling bincode v2.0.1
  543. 71.39 s [alphal00p-docs-cargo] Compiling tracing-serde v0.2.0
  544. 71.49 s [alphal00p-docs-cargo] Compiling chrono v0.4.44
  545. 71.61 s [alphal00p-docs-cargo] Compiling tracing-subscriber v0.3.23
  546. 71.68 s [alphal00p-docs-cargo] Compiling clap v4.6.1
  547. 71.78 s [alphal00p-docs-cargo] Compiling bstr v1.12.1
  548. 71.86 s [alphal00p-docs-cargo] Compiling parking_lot v0.12.5
  549. 71.87 s [alphal00p-docs-cargo] Compiling lalrpop-util v0.20.2
  550. 72.04 s [alphal00p-docs-cargo] Compiling typeid v1.0.3
  551. 72.05 s [alphal00p-docs-cargo] Compiling bincode-trait-derive v0.1.1
  552. 72.19 s [alphal00p-docs-cargo] Compiling stable_deref_trait v1.2.1
  553. 72.19 s [alphal00p-docs-cargo] Compiling getrandom v0.4.2
  554. 72.20 s [alphal00p-docs-cargo] Compiling cpufeatures v0.2.17
  555. 72.24 s [alphal00p-docs-cargo] Compiling rustc-hash v1.1.0
  556. 72.24 s [alphal00p-docs-cargo] Compiling ciborium-io v0.2.2
  557. 72.28 s [alphal00p-docs-cargo] Compiling plotters-backend v0.3.7
  558. 72.29 s [alphal00p-docs-cargo] Compiling sha2 v0.10.9
  559. 72.33 s [alphal00p-docs-cargo] Compiling num-rational v0.4.2
  560. 72.43 s [alphal00p-docs-cargo] Compiling plotters-svg v0.3.7
  561. 72.44 s [alphal00p-docs-cargo] Compiling globset v0.4.18
  562. 72.47 s [alphal00p-docs-cargo] Compiling crossterm v0.28.1
  563. 72.56 s [alphal00p-docs-cargo] Compiling toml_datetime v0.6.11
  564. 72.57 s [alphal00p-docs-cargo] Compiling yoke v0.8.3
  565. 72.58 s [alphal00p-docs-cargo] Compiling serde_spanned v0.6.9
  566. 72.60 s [alphal00p-docs-cargo] Compiling xprec v0.2.2
  567. 72.60 s [alphal00p-docs-cargo] Compiling eyre v0.6.12
  568. 72.76 s [alphal00p-docs-cargo] Compiling ppv-lite86 v0.2.21
  569. 72.79 s [alphal00p-docs-cargo] Compiling half v2.7.1
  570. 72.80 s [alphal00p-docs-cargo] Compiling zerovec-derive v0.11.6
  571. 72.83 s [alphal00p-docs-cargo] Compiling console v0.16.3
  572. 72.83 s [alphal00p-docs-cargo] Compiling toml_datetime v0.7.5+spec-1.1.0
  573. 72.86 s [alphal00p-docs-cargo] Compiling itertools v0.10.5
  574. 72.89 s [alphal00p-docs-cargo] Compiling ucd-trie v0.1.7
  575. 72.96 s [alphal00p-docs-cargo] Compiling adler2 v2.0.1
  576. 72.98 s [alphal00p-docs-cargo] Compiling ciborium-ll v0.2.2
  577. 73.00 s [alphal00p-docs-cargo] Compiling cast v0.3.0
  578. 73.00 s [alphal00p-docs-cargo] Compiling toml_write v0.1.2
  579. 73.02 s [alphal00p-docs-cargo] Compiling rand_chacha v0.3.1
  580. 73.03 s [alphal00p-docs-cargo] Compiling rand_chacha v0.9.0
  581. 73.06 s [alphal00p-docs-cargo] Compiling symbolica v2.2.0 (https://github.com/symbolica-dev/symbolica?rev=4f1323185fe5e0c0f8c864ab89edd1905e7adef1#4f132318)
  582. 73.07 s [alphal00p-docs-cargo] Compiling rustversion v1.0.22
  583. 73.10 s [alphal00p-docs-cargo] Compiling simd-adler32 v0.3.10
  584. 73.14 s [alphal00p-docs-cargo] Compiling toml_edit v0.22.27
  585. 73.20 s [alphal00p-docs-cargo] Compiling rand v0.8.6
  586. 73.26 s [alphal00p-docs-cargo] Compiling rand v0.9.4
  587. 73.32 s [alphal00p-docs-cargo] Compiling miniz_oxide v0.8.9
  588. 73.33 s [alphal00p-docs-cargo] Compiling ciborium v0.2.2
  589. 73.37 s [alphal00p-docs-cargo] Compiling pest v2.8.6
  590. 73.40 s [alphal00p-docs-cargo] Compiling toml v0.9.12+spec-1.1.0
  591. 73.42 s [alphal00p-docs-cargo] Compiling rust-embed-utils v8.11.0
  592. 73.59 s [alphal00p-docs-cargo] Compiling plotters v0.3.7
  593. 73.70 s [alphal00p-docs-cargo] Compiling symjit v2.25.6
  594. 73.78 s [alphal00p-docs-cargo] Compiling phf_generator v0.11.3
  595. 73.79 s [alphal00p-docs-cargo] Compiling tinytemplate v1.2.1
  596. 73.79 s [alphal00p-docs-cargo] Compiling zerovec v0.11.8
  597. 73.81 s [alphal00p-docs-cargo] Compiling ansi-str v0.9.0
  598. 73.81 s [alphal00p-docs-cargo] Compiling ndarray v0.17.2
  599. 73.90 s [alphal00p-docs-cargo] Compiling phf_codegen v0.11.3
  600. 73.92 s [alphal00p-docs-cargo] Compiling criterion-plot v0.5.0
  601. 73.97 s [alphal00p-docs-cargo] Compiling displaydoc v0.2.7
  602. 74.02 s [alphal00p-docs-cargo] Compiling unicode_names2_generator v1.3.0
  603. 74.10 s [alphal00p-docs-cargo] Compiling rustpython-parser v0.4.0
  604. 74.13 s [alphal00p-docs-cargo] Compiling is-terminal v0.4.17
  605. 74.15 s [alphal00p-docs-cargo] Compiling slotmap v1.1.1
  606. 74.24 s [alphal00p-docs-cargo] Compiling maplit v1.0.2
  607. 74.30 s [alphal00p-docs-cargo] Compiling oorandom v11.1.5
  608. 74.40 s [alphal00p-docs-cargo] Compiling bytecount v0.6.9
  609. 74.41 s [alphal00p-docs-cargo] Compiling anes v0.1.6
  610. 74.45 s [alphal00p-docs-cargo] Compiling pest_meta v2.8.6
  611. 74.50 s [alphal00p-docs-cargo] Compiling papergrid v0.18.0
  612. 74.54 s [alphal00p-docs-cargo] Compiling ron v0.12.1
  613. 74.55 s [alphal00p-docs-cargo] Compiling criterion v0.5.1
  614. 74.57 s [alphal00p-docs-cargo] Compiling tempfile v3.27.0
  615. 74.64 s [alphal00p-docs-cargo] Compiling testing_table v0.3.0
  616. 74.69 s [alphal00p-docs-cargo] Compiling unicode_names2 v1.3.0
  617. 74.73 s [alphal00p-docs-cargo] Compiling toml v0.8.23
  618. 74.81 s [alphal00p-docs-cargo] Compiling tinystr v0.8.4
  619. 75.14 s [alphal00p-docs-cargo] Compiling toml_edit v0.25.11+spec-1.1.0
  620. 75.18 s [alphal00p-docs-cargo] Compiling tabled_derive v0.12.0
  621. 75.20 s [alphal00p-docs-cargo] Compiling similar v2.7.0
  622. 75.28 s [alphal00p-docs-cargo] Compiling unic-langid-impl v0.9.6
  623. 75.30 s [alphal00p-docs-cargo] Compiling pest_generator v2.8.6
  624. 75.94 s [alphal00p-docs-cargo] Compiling insta v1.47.2
  625. 76.08 s [alphal00p-docs-cargo] Compiling proc-macro2-diagnostics v0.10.1
  626. 76.10 s [alphal00p-docs-cargo] Compiling proc-macro-error-attr v1.0.4
  627. 76.27 s [alphal00p-docs-cargo] Compiling uncased v0.9.10
  628. 76.29 s [alphal00p-docs-cargo] Compiling slab v0.4.12
  629. 76.35 s [alphal00p-docs-cargo] Compiling strsim v0.10.0
  630. 76.36 s [alphal00p-docs-cargo] Compiling radium v0.7.0
  631. 76.44 s [alphal00p-docs-cargo] Compiling pest_derive v2.8.6
  632. 76.55 s [alphal00p-docs-cargo] Compiling darling_core v0.23.0
  633. 76.59 s [alphal00p-docs-cargo] Compiling darling_core v0.14.4
  634. 76.60 s [alphal00p-docs-cargo] Compiling tabled v0.22.0
  635. 76.68 s [alphal00p-docs-cargo] Compiling figment v0.10.19
  636. 76.68 s [alphal00p-docs-cargo] Compiling proc-macro-error v1.0.4
  637. 76.93 s [alphal00p-docs-cargo] Compiling tap v1.0.1
  638. 76.98 s [alphal00p-docs-cargo] Compiling ryu v1.0.23
  639. 77.00 s [alphal00p-docs-cargo] Compiling wyz v0.5.1
  640. 77.33 s [alphal00p-docs-cargo] Compiling castaway v0.2.4
  641. 77.34 s [alphal00p-docs-cargo] Compiling find-msvc-tools v0.1.9
  642. 77.39 s [alphal00p-docs-cargo] Compiling indoc v2.0.7
  643. 77.48 s [alphal00p-docs-cargo] Compiling instability v0.3.12
  644. 77.57 s [alphal00p-docs-cargo] Compiling shlex v1.3.0
  645. 77.65 s [alphal00p-docs-cargo] Compiling heck v0.4.1
  646. 77.83 s [alphal00p-docs-cargo] Compiling funty v2.0.0
  647. 77.96 s [alphal00p-docs-cargo] Compiling cc v1.2.61
  648. 77.97 s [alphal00p-docs-cargo] Compiling duplicate v2.0.1
  649. 78.08 s [alphal00p-docs-cargo] Compiling compact_str v0.9.0
  650. 78.41 s [alphal00p-docs-cargo] Compiling bitvec v1.0.1
  651. 78.48 s [alphal00p-docs-cargo] Compiling dot-parser v0.5.1
  652. 78.60 s [alphal00p-docs-cargo] Compiling unicode-truncate v2.0.1
  653. 78.64 s [alphal00p-docs-cargo] Compiling convert_case v0.10.0
  654. 78.82 s [alphal00p-docs-cargo] Compiling kasuari v0.4.12
  655. 78.93 s [alphal00p-docs-cargo] Compiling darling_macro v0.14.4
  656. 78.95 s [alphal00p-docs-cargo] Compiling serde_repr v0.1.20
  657. 79.07 s [alphal00p-docs-cargo] Compiling env_filter v1.0.1
  658. 79.48 s [alphal00p-docs-cargo] Compiling num-iter v0.1.45
  659. 79.49 s [alphal00p-docs-cargo] Compiling lru v0.16.4
  660. 79.51 s [alphal00p-docs-cargo] Compiling ref-ops v0.2.5
  661. 79.57 s [alphal00p-docs-cargo] Compiling darling_macro v0.23.0
  662. 79.62 s [alphal00p-docs-cargo] Compiling convert_case v0.4.0
  663. 79.64 s [alphal00p-docs-cargo] Compiling jiff v0.2.24
  664. 79.65 s [alphal00p-docs-cargo] Compiling ratatui-core v0.1.0
  665. 79.67 s [alphal00p-docs-cargo] Compiling num v0.4.3
  666. 79.69 s [alphal00p-docs-cargo] Compiling derive_more-impl v2.1.1
  667. 79.71 s [alphal00p-docs-cargo] Compiling duplicate v1.0.0
  668. 79.75 s [alphal00p-docs-cargo] Compiling enum-try-as-inner v0.1.1
  669. 79.76 s [alphal00p-docs-cargo] Compiling darling v0.14.4
  670. 79.84 s [alphal00p-docs-cargo] Compiling derive_builder_core v0.11.2
  671. 79.90 s [alphal00p-docs-cargo] Compiling blake3 v1.8.5
  672. 79.92 s [alphal00p-docs-cargo] Compiling derive_more v0.99.20
  673. 79.94 s [alphal00p-docs-cargo] Compiling rand_xoshiro v0.6.0
  674. 80.00 s [alphal00p-docs-cargo] Compiling delegate v0.12.0
  675. 80.09 s [alphal00p-docs-cargo] Compiling features v0.10.0
  676. 80.15 s [alphal00p-docs-cargo] Compiling colored v2.2.0
  677. 80.22 s [alphal00p-docs-cargo] Compiling object v0.37.3
  678. 80.40 s [alphal00p-docs-cargo] Compiling darling v0.23.0
  679. 80.41 s [alphal00p-docs-cargo] Compiling constcat v0.5.1
  680. 80.45 s [alphal00p-docs-cargo] Compiling thiserror v1.0.69
  681. 80.54 s [alphal00p-docs-cargo] Compiling portable-atomic v1.13.1
  682. 80.58 s [alphal00p-docs-cargo] Compiling owo-colors v4.3.0
  683. 80.67 s [alphal00p-docs-cargo] Compiling gat-lending-iterator v0.1.8
  684. 80.70 s [alphal00p-docs-cargo] Compiling litrs v1.0.0
  685. 80.71 s [alphal00p-docs-cargo] Compiling cfg_aliases v0.2.1
  686. 80.78 s [alphal00p-docs-cargo] Compiling nix v0.31.2
  687. 80.79 s [alphal00p-docs-cargo] Compiling derive_more v2.1.1
  688. 80.84 s [alphal00p-docs-cargo] Compiling derive_builder_macro v0.11.2
  689. 80.93 s [alphal00p-docs-cargo] Compiling rand_distr v0.4.3
  690. 80.94 s [alphal00p-docs-cargo] Compiling simba v0.6.0
  691. 80.94 s [alphal00p-docs-cargo] Compiling phf_generator v0.13.1
  692. 80.97 s [alphal00p-docs-cargo] Compiling nalgebra-macros v0.1.0
  693. 81.01 s [alphal00p-docs-cargo] Compiling thiserror-impl v1.0.69
  694. 81.10 s [alphal00p-docs-cargo] Compiling dirs v6.0.0
  695. 81.11 s [alphal00p-docs-cargo] Compiling line-clipping v0.3.7
  696. 81.13 s [alphal00p-docs-cargo] Compiling vte v0.15.0
  697. 81.20 s [alphal00p-docs-cargo] Compiling document-features v0.2.12
  698. 81.21 s [alphal00p-docs-cargo] Compiling joinery v2.1.0
  699. 81.28 s [alphal00p-docs-cargo] Compiling constant_time_eq v0.4.2
  700. 81.32 s [alphal00p-docs-cargo] Compiling cpufeatures v0.3.0
  701. 81.32 s [alphal00p-docs-cargo] Compiling gimli v0.32.3
  702. 81.33 s [alphal00p-docs-cargo] Compiling ref-cast v1.0.25
  703. 81.35 s [alphal00p-docs-cargo] Compiling color-spantrace v0.3.0
  704. 81.38 s [alphal00p-docs-cargo] Compiling arrayref v0.3.9
  705. 81.42 s [alphal00p-docs-cargo] Compiling clarabel v0.11.1
  706. 81.45 s [alphal00p-docs-cargo] Compiling ratatui-widgets v0.3.0
  707. 81.49 s [alphal00p-docs-cargo] Compiling vt100 v0.16.2
  708. 81.68 s [alphal00p-docs-cargo] Compiling derive_builder v0.11.2
  709. 81.74 s [alphal00p-docs-cargo] Compiling titlecase v2.2.1
  710. 81.75 s [alphal00p-docs-cargo] Compiling phf_macros v0.13.1
  711. 81.90 s [alphal00p-docs-cargo] Compiling crossterm v0.29.0
  712. 82.01 s [alphal00p-docs-cargo] Compiling tracing-error v0.2.1
  713. 82.03 s [alphal00p-docs-cargo] Compiling serde-big-array v0.5.1
  714. 82.06 s [alphal00p-docs-cargo] Compiling ref-cast-impl v1.0.25
  715. 82.16 s [alphal00p-docs-cargo] Compiling enum_dispatch v0.3.13
  716. 82.17 s [alphal00p-docs-cargo] Compiling delegate v0.13.5
  717. 82.39 s [alphal00p-docs-cargo] Compiling serde_derive_internals v0.29.1
  718. 82.80 s [alphal00p-docs-cargo] Compiling env_logger v0.11.10
  719. 82.89 s [alphal00p-docs-cargo] Compiling amd v0.2.2
  720. 82.98 s [alphal00p-docs-cargo] Compiling subprocess v0.2.15
  721. 83.01 s [alphal00p-docs-cargo] Compiling rust_lisp v0.18.0
  722. 83.06 s [alphal00p-docs-cargo] Compiling semver v1.0.28
  723. 83.14 s [alphal00p-docs-cargo] Compiling rustc-demangle v0.1.27
  724. 83.22 s [alphal00p-docs-cargo] Compiling vakint v0.1.2 (/build/source/crates/vakint)
  725. 83.25 s [alphal00p-docs-cargo] Compiling unit-prefix v0.5.2
  726. 83.36 s [alphal00p-docs-cargo] Compiling base64 v0.22.1
  727. 83.38 s [alphal00p-docs-cargo] Compiling indicatif v0.18.4
  728. 83.41 s [alphal00p-docs-cargo] Compiling deprecate-until v1.0.0
  729. 83.52 s [alphal00p-docs-cargo] Compiling string-template-plus v0.4.3
  730. 83.53 s [alphal00p-docs-cargo] Compiling schemars_derive v1.2.1
  731. 83.62 s [alphal00p-docs-cargo] Compiling phf v0.13.1
  732. 83.63 s [alphal00p-docs-cargo] Compiling ratatui-crossterm v0.1.0
  733. 83.73 s [alphal00p-docs-cargo] Compiling ratatui-macros v0.7.0
  734. 83.82 s [alphal00p-docs-cargo] Compiling shellexpand v3.1.2
  735. 83.85 s [alphal00p-docs-cargo] Compiling xpct v0.5.1
  736. 83.98 s [alphal00p-docs-cargo] Compiling brotli-decompressor v4.0.3
  737. 84.00 s [alphal00p-docs-cargo] Compiling integer-sqrt v0.1.5
  738. 84.01 s [alphal00p-docs-cargo] Compiling addr2line v0.25.1
  739. 84.06 s [alphal00p-docs-cargo] Compiling crossbeam-channel v0.5.15
  740. 84.07 s [alphal00p-docs-cargo] Compiling itertools v0.12.1
  741. 84.10 s [alphal00p-docs-cargo] Compiling include_dir_macros v0.7.4
  742. 84.26 s [alphal00p-docs-cargo] Compiling gammaloop-tracing-filter-macros v0.1.0 (/build/source/crates/gammaloop-tracing-filter-macros)
  743. 84.31 s [alphal00p-docs-cargo] Compiling pyo3-stub-gen-derive v0.17.2
  744. 84.33 s [alphal00p-docs-cargo] Compiling unsafe-libyaml v0.2.11
  745. 84.45 s [alphal00p-docs-cargo] Compiling version-compare v0.2.1
  746. 84.56 s [alphal00p-docs-cargo] Compiling gammalooprs v0.3.4 (/build/source/crates/gammalooprs)
  747. 84.61 s [alphal00p-docs-cargo] Compiling symlink v0.1.0
  748. 84.62 s [alphal00p-docs-cargo] Compiling ctrlc v3.5.2
  749. 84.67 s [alphal00p-docs-cargo] Compiling tracing-appender v0.2.5
  750. 84.67 s [alphal00p-docs-cargo] Compiling include_dir v0.7.4
  751. 84.69 s [alphal00p-docs-cargo] Compiling pathfinding v4.15.0
  752. 84.76 s [alphal00p-docs-cargo] Compiling tracing-indicatif v0.3.14
  753. 84.77 s [alphal00p-docs-cargo] Compiling rust-embed-impl v8.11.0
  754. 84.81 s [alphal00p-docs-cargo] Compiling ratatui v0.30.0
  755. 84.85 s [alphal00p-docs-cargo] Compiling json5 v0.4.1
  756. 84.87 s [alphal00p-docs-cargo] Compiling strum_macros v0.26.4
  757. 85.01 s [alphal00p-docs-cargo] Compiling typed-index-collections v3.5.0
  758. 85.09 s [alphal00p-docs-cargo] Compiling brotli v7.0.0
  759. 85.29 s [alphal00p-docs-cargo] Compiling serde_yaml v0.9.34+deprecated
  760. 85.33 s [alphal00p-docs-cargo] Compiling clap_complete v4.6.3
  761. 85.40 s [alphal00p-docs-cargo] Compiling vectorize v0.2.0
  762. 85.43 s [alphal00p-docs-cargo] Compiling strip-ansi-escapes v0.2.1
  763. 85.49 s [alphal00p-docs-cargo] Compiling gammaloop-api v0.1.0 (/build/source/crates/gammaloop-api)
  764. 85.63 s [alphal00p-docs-cargo] Compiling fd-lock v4.0.4
  765. 85.65 s [alphal00p-docs-cargo] Compiling itertools v0.13.0
  766. 85.75 s [alphal00p-docs-cargo] Compiling base62 v2.2.4
  767. 85.84 s [alphal00p-docs-cargo] Compiling strum v0.26.3
  768. 85.86 s [alphal00p-docs-cargo] Compiling ringbuffer v0.16.0
  769. 85.88 s [alphal00p-docs-cargo] Compiling nalgebra v0.29.0
  770. 85.95 s [alphal00p-docs-cargo] Compiling schemars v1.2.1
  771. 85.99 s [alphal00p-docs-cargo] Compiling clap_complete_nushell v4.6.0
  772. 86.04 s [alphal00p-docs-cargo] Compiling sysinfo v0.33.1
  773. 86.19 s [alphal00p-docs-cargo] Compiling backtrace v0.3.76
  774. 86.53 s [alphal00p-docs-cargo] Compiling rust-embed v8.11.0
  775. 86.80 s [alphal00p-docs-cargo] Compiling color-eyre v0.6.5
  776. 87.27 s [alphal00p-docs-cargo] Compiling pyo3-stub-gen v0.17.2
  777. 87.55 s [alphal00p-docs-cargo] Compiling reedline v0.42.0
  778. 91.80 s [alphal00p-docs-cargo] Compiling statrs v0.16.1
  779. 92.35 s [alphal00p-docs-cargo] Compiling momtrop v0.3.0
  780. 185.63 s [alphal00p-docs-cargo] Compiling numerica v3.0.0 (https://github.com/symbolica-dev/symbolica?rev=4f1323185fe5e0c0f8c864ab89edd1905e7adef1#4f132318)
  781. 188.44 s [alphal00p-docs-cargo] Compiling graphica v3.0.0 (https://github.com/symbolica-dev/symbolica?rev=4f1323185fe5e0c0f8c864ab89edd1905e7adef1#4f132318)
  782. 209.18 s [alphal00p-docs-cargo] Compiling symbolica-utils v0.1.0 (/build/source/crates/symbolica-utils)
  783. 222.76 s [alphal00p-docs-cargo] Compiling gammaloop-workspace-hack v0.1.0 (/build/source/crates/gammaloop-workspace-hack)
  784. 222.76 s [alphal00p-docs-cargo] Compiling spenso-macros v0.3.2 (/build/source/crates/spenso-macros)
  785. 222.98 s [alphal00p-docs-cargo] Compiling linnet v0.17.0 (/build/source/crates/linnet)
  786. 225.72 s [alphal00p-docs-cargo] Compiling spenso v0.6.0 (/build/source/crates/spenso)
  787. 230.34 s [alphal00p-docs-cargo] Compiling idenso v0.3.0 (/build/source/crates/idenso)
  788. 230.34 s [alphal00p-docs-cargo] Compiling gammaloop-tracing-filter v0.1.0 (/build/source/crates/gammaloop-tracing-filter)
  789. 232.31 s [alphal00p-docs-cargo] Compiling spenso-hep-lib v0.1.7 (/build/source/crates/spenso-hep-lib)
  790. 285.81 s [alphal00p-docs-cargo] Compiling alphal00p-docs-python-exporter v0.1.0 (/build/source/crates/alphal00p-docs-python-exporter)
  791. 297.34 s [alphal00p-docs-cargo] Finished `docs` profile [unoptimized] target(s) in 3m 54s
  792. 297.39 s [alphal00p-docs-cargo] +++ command cargo build --profile docs --locked -p alphal00p-docs-python-exporter --features linnet
  793. 297.63 s [alphal00p-docs-cargo] Compiling libc v0.2.186
  794. 297.63 s [alphal00p-docs-cargo] Compiling serde_core v1.0.228
  795. 297.63 s [alphal00p-docs-cargo] Compiling zerocopy v0.8.48
  796. 297.63 s [alphal00p-docs-cargo] Compiling log v0.4.29
  797. 297.64 s [alphal00p-docs-cargo] Compiling num-traits v0.2.19
  798. 297.64 s [alphal00p-docs-cargo] Compiling syn v1.0.109
  799. 297.65 s [alphal00p-docs-cargo] Compiling syn v2.0.117
  800. 297.65 s [alphal00p-docs-cargo] Compiling ahash v0.7.8
  801. 297.65 s [alphal00p-docs-cargo] Compiling bytecheck v0.6.12
  802. 297.65 s [alphal00p-docs-cargo] Compiling regex-syntax v0.8.10
  803. 297.66 s [alphal00p-docs-cargo] Compiling rend v0.4.2
  804. 297.66 s [alphal00p-docs-cargo] Compiling simdutf8 v0.1.5
  805. 297.66 s [alphal00p-docs-cargo] Compiling indexmap v2.14.0
  806. 297.67 s [alphal00p-docs-cargo] Compiling ahash v0.8.12
  807. 297.67 s [alphal00p-docs-cargo] Compiling figment v0.10.19
  808. 297.67 s [alphal00p-docs-cargo] Compiling either v1.15.0
  809. 297.75 s [alphal00p-docs-cargo] Compiling rkyv v0.7.46
  810. 297.79 s [alphal00p-docs-cargo] Compiling cgmath v0.18.0
  811. 297.80 s [alphal00p-docs-cargo] Compiling bincode v2.0.1
  812. 297.86 s [alphal00p-docs-cargo] Compiling itertools v0.11.0
  813. 297.86 s [alphal00p-docs-cargo] Compiling pyo3 v0.28.3
  814. 297.87 s [alphal00p-docs-cargo] Compiling venial v0.5.0
  815. 297.89 s [alphal00p-docs-cargo] Compiling seahash v4.1.0
  816. 297.90 s [alphal00p-docs-cargo] Compiling winnow v1.0.2
  817. 297.92 s [alphal00p-docs-cargo] Compiling arrayvec v0.7.6
  818. 297.96 s [alphal00p-docs-cargo] Compiling rustix v1.1.4
  819. 297.98 s [alphal00p-docs-cargo] Compiling smallvec v1.15.1
  820. 298.03 s [alphal00p-docs-cargo] Compiling polycool v0.4.0
  821. 298.08 s [alphal00p-docs-cargo] Compiling winnow v0.7.15
  822. 298.09 s [alphal00p-docs-cargo] Compiling bitflags v2.11.1
  823. 298.10 s [alphal00p-docs-cargo] Compiling toml_parser v1.1.2+spec-1.1.0
  824. 298.13 s [alphal00p-docs-cargo] Compiling toml_writer v1.1.1+spec-1.1.0
  825. 298.22 s [alphal00p-docs-cargo] Compiling kurbo v0.13.1
  826. 298.24 s [alphal00p-docs-cargo] Compiling linnet-py v0.1.0 (/build/source/crates/linnet-py)
  827. 298.31 s [alphal00p-docs-cargo] Compiling num-integer v0.1.46
  828. 298.31 s [alphal00p-docs-cargo] Compiling approx v0.4.0
  829. 298.32 s [alphal00p-docs-cargo] Compiling wasm-minimal-protocol v0.2.0
  830. 298.34 s [alphal00p-docs-cargo] Compiling num-complex v0.4.6
  831. 298.40 s [alphal00p-docs-cargo] Compiling regex-automata v0.4.14
  832. 298.45 s [alphal00p-docs-cargo] Compiling num-bigint v0.4.6
  833. 298.49 s [alphal00p-docs-cargo] Compiling chrono v0.4.44
  834. 298.56 s [alphal00p-docs-cargo] Compiling getrandom v0.2.17
  835. 298.59 s [alphal00p-docs-cargo] Compiling dirs-sys v0.5.0
  836. 298.65 s [alphal00p-docs-cargo] Compiling rand_core v0.6.4
  837. 298.66 s [alphal00p-docs-cargo] Compiling const-random-macro v0.1.16
  838. 298.66 s [alphal00p-docs-cargo] Compiling pyo3-ffi v0.28.3
  839. 298.76 s [alphal00p-docs-cargo] Compiling dirs v6.0.0
  840. 298.80 s [alphal00p-docs-cargo] Compiling hashbrown v0.12.3
  841. 298.81 s [alphal00p-docs-cargo] Compiling shellexpand v3.1.2
  842. 298.83 s [alphal00p-docs-cargo] Compiling getrandom v0.4.2
  843. 298.89 s [alphal00p-docs-cargo] Compiling const-random v0.1.18
  844. 299.23 s [alphal00p-docs-cargo] Compiling tempfile v3.27.0
  845. 299.24 s [alphal00p-docs-cargo] Compiling toml_datetime v0.7.5+spec-1.1.0
  846. 299.24 s [alphal00p-docs-cargo] Compiling serde_spanned v1.1.1
  847. 299.26 s [alphal00p-docs-cargo] Compiling serde_json v1.0.149
  848. 299.35 s [alphal00p-docs-cargo] Compiling toml v0.9.12+spec-1.1.0
  849. 299.38 s [alphal00p-docs-cargo] Compiling ptr_meta_derive v0.1.4
  850. 299.38 s [alphal00p-docs-cargo] Compiling bytecheck_derive v0.6.12
  851. 299.38 s [alphal00p-docs-cargo] Compiling rkyv_derive v0.7.46
  852. 299.56 s [alphal00p-docs-cargo] Compiling globset v0.4.18
  853. 299.67 s [alphal00p-docs-cargo] Compiling ptr_meta v0.1.4
  854. 299.76 s [alphal00p-docs-cargo] Compiling pest_generator v2.8.6
  855. 299.76 s [alphal00p-docs-cargo] Compiling pyo3-macros-backend v0.28.3
  856. 299.76 s [alphal00p-docs-cargo] Compiling proc-macro2-diagnostics v0.10.1
  857. 299.76 s [alphal00p-docs-cargo] Compiling rust-embed-utils v8.11.0
  858. 300.07 s [alphal00p-docs-cargo] Compiling zerocopy-derive v0.8.48
  859. 300.07 s [alphal00p-docs-cargo] Compiling serde_derive v1.0.228
  860. 300.07 s [alphal00p-docs-cargo] Compiling is-macro v0.3.7
  861. 300.07 s [alphal00p-docs-cargo] Compiling thiserror-impl v2.0.18
  862. 300.07 s [alphal00p-docs-cargo] Compiling bincode-trait-derive v0.1.1
  863. 300.07 s [alphal00p-docs-cargo] Compiling duplicate v2.0.1
  864. 300.07 s [alphal00p-docs-cargo] Compiling serde_repr v0.1.20
  865. 300.08 s [alphal00p-docs-cargo] Compiling rust-embed-impl v8.11.0
  866. 300.10 s [alphal00p-docs-cargo] Compiling pest_derive v2.8.6
  867. 300.35 s [alphal00p-docs-cargo] Compiling ppv-lite86 v0.2.21
  868. 300.54 s [alphal00p-docs-cargo] Compiling rand_chacha v0.3.1
  869. 300.54 s [alphal00p-docs-cargo] Compiling dot-parser v0.5.1
  870. 300.57 s [alphal00p-docs-cargo] Compiling rustpython-parser-core v0.4.0
  871. 300.63 s [alphal00p-docs-cargo] Compiling rustpython-ast v0.4.0
  872. 300.67 s [alphal00p-docs-cargo] Compiling rand v0.8.6
  873. 300.82 s [alphal00p-docs-cargo] Compiling thiserror v2.0.18
  874. 300.85 s [alphal00p-docs-cargo] Compiling rust-embed v8.11.0
  875. 301.01 s [alphal00p-docs-cargo] Compiling phf_generator v0.11.3
  876. 301.06 s [alphal00p-docs-cargo] Compiling phf_codegen v0.11.3
  877. 301.10 s [alphal00p-docs-cargo] Compiling unicode_names2_generator v1.3.0
  878. 301.11 s [alphal00p-docs-cargo] Compiling rustpython-parser v0.4.0
  879. 301.34 s [alphal00p-docs-cargo] Compiling unicode_names2 v1.3.0
  880. 301.52 s [alphal00p-docs-cargo] Compiling pyo3-macros v0.28.3
  881. 301.62 s [alphal00p-docs-cargo] Compiling serde v1.0.228
  882. 301.88 s [alphal00p-docs-cargo] Compiling bitvec v1.0.1
  883. 303.05 s [alphal00p-docs-cargo] Compiling half v2.7.1
  884. 303.18 s [alphal00p-docs-cargo] Compiling ciborium-ll v0.2.2
  885. 303.25 s [alphal00p-docs-cargo] Compiling ciborium v0.2.2
  886. 303.55 s [alphal00p-docs-cargo] Compiling kurvst v0.1.0 (/build/source/crates/kurvst)
  887. 304.24 s [alphal00p-docs-cargo] Compiling linnet v0.17.0 (/build/source/crates/linnet)
  888. 305.43 s [alphal00p-docs-cargo] Compiling pyo3-stub-gen-derive v0.17.2
  889. 306.33 s [alphal00p-docs-cargo] Compiling pyo3-stub-gen v0.17.2
  890. 307.17 s [alphal00p-docs-cargo] Compiling linnest v0.1.0 (/build/source/crates/linnest)
  891. 315.86 s [alphal00p-docs-cargo] Compiling alphal00p-docs-python-exporter v0.1.0 (/build/source/crates/alphal00p-docs-python-exporter)
  892. 316.73 s [alphal00p-docs-cargo] Finished `docs` profile [unoptimized] target(s) in 19.34s
  893. 316.77 s [alphal00p-docs-cargo] +++ command cargo build --profile docs --locked -p alphal00p-docs-python-exporter --features spenso
  894. 317.05 s [alphal00p-docs-cargo] Compiling pyo3-build-config v0.28.3
  895. 317.05 s [alphal00p-docs-cargo] Compiling symbolica v2.2.0 (https://github.com/symbolica-dev/symbolica?rev=4f1323185fe5e0c0f8c864ab89edd1905e7adef1#4f132318)
  896. 317.06 s [alphal00p-docs-cargo] Compiling syn v1.0.109
  897. 317.06 s [alphal00p-docs-cargo] Compiling figment v0.10.19
  898. 317.42 s [alphal00p-docs-cargo] Compiling proc-macro-error v1.0.4
  899. 317.53 s [alphal00p-docs-cargo] Compiling duplicate v1.0.0
  900. 317.69 s [alphal00p-docs-cargo] Compiling pyo3-macros-backend v0.28.3
  901. 317.69 s [alphal00p-docs-cargo] Compiling numpy v0.28.0
  902. 317.69 s [alphal00p-docs-cargo] Compiling pyo3-ffi v0.28.3
  903. 317.69 s [alphal00p-docs-cargo] Compiling pyo3 v0.28.3
  904. 319.23 s [alphal00p-docs-cargo] Compiling pyo3-macros v0.28.3
  905. 321.62 s [alphal00p-docs-cargo] Compiling pyo3-stub-gen v0.17.2
  906. 322.09 s [alphal00p-docs-cargo] Compiling numerica v3.0.0 (https://github.com/symbolica-dev/symbolica?rev=4f1323185fe5e0c0f8c864ab89edd1905e7adef1#4f132318)
  907. 322.20 s [alphal00p-docs-cargo] Compiling gammaloop-workspace-hack v0.1.0 (/build/source/crates/gammaloop-workspace-hack)
  908. 324.52 s [alphal00p-docs-cargo] Compiling graphica v3.0.0 (https://github.com/symbolica-dev/symbolica?rev=4f1323185fe5e0c0f8c864ab89edd1905e7adef1#4f132318)
  909. 346.24 s [alphal00p-docs-cargo] Compiling symbolica-utils v0.1.0 (/build/source/crates/symbolica-utils)
  910. 346.24 s [alphal00p-docs-cargo] Compiling tymbolica-atom-payload v0.1.0 (https://github.com/lcnbr/tymbolica?rev=32ae00483b4845161401afac8be755cc336cb2bb#32ae0048)
  911. 346.40 s [alphal00p-docs-cargo] Compiling linnet v0.17.0 (/build/source/crates/linnet)
  912. 348.56 s [alphal00p-docs-cargo] Compiling spenso v0.6.0 (/build/source/crates/spenso)
  913. 353.09 s [alphal00p-docs-cargo] Compiling idenso v0.3.0 (/build/source/crates/idenso)
  914. 356.03 s [alphal00p-docs-cargo] Compiling spenso-hep-lib v0.1.7 (/build/source/crates/spenso-hep-lib)
  915. 356.26 s [alphal00p-docs-cargo] Compiling spynso3 v0.1.2 (/build/source/crates/spynso3)
  916. 360.03 s [alphal00p-docs-cargo] Compiling alphal00p-docs-python-exporter v0.1.0 (/build/source/crates/alphal00p-docs-python-exporter)
  917. 365.92 s [alphal00p-docs-cargo] Finished `docs` profile [unoptimized] target(s) in 49.14s
  918. 365.97 s [alphal00p-docs-cargo] +++ command cargo build --profile docs --locked -p alphal00p-docs-python-exporter --features idenso
  919. 366.24 s [alphal00p-docs-cargo] Compiling pyo3 v0.28.3
  920. 367.76 s [alphal00p-docs-cargo] Compiling numpy v0.28.0
  921. 368.15 s [alphal00p-docs-cargo] Compiling pyo3-stub-gen v0.17.2
  922. 368.57 s [alphal00p-docs-cargo] Compiling numerica v3.0.0 (https://github.com/symbolica-dev/symbolica?rev=4f1323185fe5e0c0f8c864ab89edd1905e7adef1#4f132318)
  923. 370.96 s [alphal00p-docs-cargo] Compiling graphica v3.0.0 (https://github.com/symbolica-dev/symbolica?rev=4f1323185fe5e0c0f8c864ab89edd1905e7adef1#4f132318)
  924. 371.15 s [alphal00p-docs-cargo] Compiling symbolica v2.2.0 (https://github.com/symbolica-dev/symbolica?rev=4f1323185fe5e0c0f8c864ab89edd1905e7adef1#4f132318)
  925. 392.63 s [alphal00p-docs-cargo] Compiling symbolica-utils v0.1.0 (/build/source/crates/symbolica-utils)
  926. 392.63 s [alphal00p-docs-cargo] Compiling gammaloop-workspace-hack v0.1.0 (/build/source/crates/gammaloop-workspace-hack)
  927. 392.79 s [alphal00p-docs-cargo] Compiling linnet v0.17.0 (/build/source/crates/linnet)
  928. 394.99 s [alphal00p-docs-cargo] Compiling spenso v0.6.0 (/build/source/crates/spenso)
  929. 399.34 s [alphal00p-docs-cargo] Compiling idenso v0.3.0 (/build/source/crates/idenso)
  930. 404.61 s [alphal00p-docs-cargo] Compiling alphal00p-docs-python-exporter v0.1.0 (/build/source/crates/alphal00p-docs-python-exporter)
  931. 410.57 s [alphal00p-docs-cargo] Finished `docs` profile [unoptimized] target(s) in 44.60s
  932. 410.62 s [alphal00p-docs-cargo] +++ command cargo build --profile docs --locked -p alphal00p-docs-python-exporter --features vakint
  933. 410.85 s [alphal00p-docs-cargo] Compiling libc v0.2.186
  934. 410.85 s [alphal00p-docs-cargo] Compiling tiny-keccak v2.0.2
  935. 410.86 s [alphal00p-docs-cargo] Compiling bytemuck v1.25.0
  936. 410.86 s [alphal00p-docs-cargo] Compiling matrixmultiply v0.3.10
  937. 410.86 s [alphal00p-docs-cargo] Compiling getrandom v0.3.4
  938. 410.87 s [alphal00p-docs-cargo] Compiling num-integer v0.1.46
  939. 410.87 s [alphal00p-docs-cargo] Compiling pyo3 v0.28.3
  940. 410.87 s [alphal00p-docs-cargo] Compiling regex-automata v0.4.14
  941. 410.88 s [alphal00p-docs-cargo] Compiling pyo3-macros-backend v0.28.3
  942. 410.88 s [alphal00p-docs-cargo] Compiling pyo3-ffi v0.28.3
  943. 410.88 s [alphal00p-docs-cargo] Compiling ahash v0.8.12
  944. 410.88 s [alphal00p-docs-cargo] Compiling approx v0.5.1
  945. 410.89 s [alphal00p-docs-cargo] Compiling serde v1.0.228
  946. 410.89 s [alphal00p-docs-cargo] Compiling itertools v0.14.0
  947. 410.89 s [alphal00p-docs-cargo] Compiling smallvec v1.15.1
  948. 410.90 s [alphal00p-docs-cargo] Compiling gmp-mpfr-sys v1.7.1
  949. 410.96 s [alphal00p-docs-cargo] Compiling safe_arch v0.7.4
  950. 410.97 s [alphal00p-docs-cargo] Compiling rand_core v0.9.5
  951. 410.98 s [alphal00p-docs-cargo] Compiling safe_arch v1.2.0
  952. 411.02 s [alphal00p-docs-cargo] Compiling rayon v1.12.0
  953. 411.04 s [alphal00p-docs-cargo] Compiling tracing-attributes v0.1.31
  954. 411.07 s [alphal00p-docs-cargo] Compiling rand_chacha v0.9.0
  955. 411.09 s [alphal00p-docs-cargo] Compiling smartstring v1.0.1
  956. 411.10 s [alphal00p-docs-cargo] Compiling phf_shared v0.13.1
  957. 411.16 s [alphal00p-docs-cargo] Compiling wide v0.7.33
  958. 411.19 s [alphal00p-docs-cargo] Compiling fastrand v2.4.1
  959. 411.22 s [alphal00p-docs-cargo] Compiling rug v1.30.0
  960. 411.24 s [alphal00p-docs-cargo] Compiling wide v1.7.0
  961. 411.25 s [alphal00p-docs-cargo] Compiling rand v0.9.4
  962. 411.27 s [alphal00p-docs-cargo] Compiling phf_generator v0.13.1
  963. 411.28 s [alphal00p-docs-cargo] Compiling symbolica v2.2.0 (https://github.com/symbolica-dev/symbolica?rev=4f1323185fe5e0c0f8c864ab89edd1905e7adef1#4f132318)
  964. 411.37 s [alphal00p-docs-cargo] Compiling ndarray v0.17.2
  965. 411.38 s [alphal00p-docs-cargo] Compiling phf_macros v0.13.1
  966. 411.42 s [alphal00p-docs-cargo] Compiling directories v6.0.0
  967. 411.46 s [alphal00p-docs-cargo] Compiling subprocess v0.2.15
  968. 411.51 s [alphal00p-docs-cargo] Compiling vakint v0.1.2 (/build/source/crates/vakint)
  969. 411.73 s [alphal00p-docs-cargo] Compiling getrandom v0.2.17
  970. 411.80 s [alphal00p-docs-cargo] Compiling rand_core v0.6.4
  971. 411.89 s [alphal00p-docs-cargo] Compiling rand_chacha v0.3.1
  972. 411.93 s [alphal00p-docs-cargo] Compiling phf v0.13.1
  973. 411.98 s [alphal00p-docs-cargo] Compiling tracing v0.1.44
  974. 412.00 s [alphal00p-docs-cargo] Compiling rand v0.8.6
  975. 412.03 s [alphal00p-docs-cargo] Compiling simba v0.9.1
  976. 412.37 s [alphal00p-docs-cargo] Compiling phf_generator v0.11.3
  977. 412.43 s [alphal00p-docs-cargo] Compiling phf_codegen v0.11.3
  978. 412.47 s [alphal00p-docs-cargo] Compiling unicode_names2_generator v1.3.0
  979. 412.48 s [alphal00p-docs-cargo] Compiling rustpython-parser v0.4.0
  980. 412.64 s [alphal00p-docs-cargo] Compiling regex v1.12.3
  981. 412.64 s [alphal00p-docs-cargo] Compiling matchers v0.2.0
  982. 412.70 s [alphal00p-docs-cargo] Compiling tracing-subscriber v0.3.23
  983. 412.76 s [alphal00p-docs-cargo] Compiling unicode_names2 v1.3.0
  984. 412.82 s [alphal00p-docs-cargo] Compiling titlecase v2.2.1
  985. 412.85 s [alphal00p-docs-cargo] Compiling pyo3-macros v0.28.3
  986. 412.91 s [alphal00p-docs-cargo] Compiling string-template-plus v0.4.3
  987. 414.26 s [alphal00p-docs-cargo] Compiling xprec v0.2.2
  988. 415.16 s [alphal00p-docs-cargo] Compiling numpy v0.28.0
  989. 416.91 s [alphal00p-docs-cargo] Compiling pyo3-stub-gen-derive v0.17.2
  990. 417.82 s [alphal00p-docs-cargo] Compiling pyo3-stub-gen v0.17.2
  991. 418.28 s [alphal00p-docs-cargo] Compiling numerica v3.0.0 (https://github.com/symbolica-dev/symbolica?rev=4f1323185fe5e0c0f8c864ab89edd1905e7adef1#4f132318)
  992. 418.37 s [alphal00p-docs-cargo] error: select an integer backend: `integer-gmp` or `integer-malachite`
  993. 418.37 s [alphal00p-docs-cargo] --> /nix/store/9rqk4093qnvgswmdk1pbxk9najcrjn7a-vendor-cargo-deps/bc87b2b0f37b9a43ffdd82e8f11f3e864d9447ccd53a9a964250c3414c3656d9/numerica-3.0.0/src/lib.rs:40:1
  994. 418.37 s [alphal00p-docs-cargo] |
  995. 418.37 s [alphal00p-docs-cargo] 40 | compile_error!("select an integer backend: `integer-gmp` or `integer-malachite`");
  996. 418.37 s [alphal00p-docs-cargo] | ^^^^^^^^^^^^^^^^^^^^^^^^^^^^^^^^^^^^^^^^^^^^^^^^^^^^^^^^^^^^^^^^^^^^^^^^^^^^^^^^^
  997. 418.37 s [alphal00p-docs-cargo]
  998. 418.37 s [alphal00p-docs-cargo] error: select a float backend: `float-mpfr` or `float-astro`
  999. 418.37 s [alphal00p-docs-cargo] --> /nix/store/9rqk4093qnvgswmdk1pbxk9najcrjn7a-vendor-cargo-deps/bc87b2b0f37b9a43ffdd82e8f11f3e864d9447ccd53a9a964250c3414c3656d9/numerica-3.0.0/src/lib.rs:44:1
  1000. 418.37 s [alphal00p-docs-cargo] |
  1001. 418.37 s [alphal00p-docs-cargo] 44 | compile_error!("select a float backend: `float-mpfr` or `float-astro`");
  1002. 418.37 s [alphal00p-docs-cargo] | ^^^^^^^^^^^^^^^^^^^^^^^^^^^^^^^^^^^^^^^^^^^^^^^^^^^^^^^^^^^^^^^^^^^^^^^
  1003. 418.37 s [alphal00p-docs-cargo]
  1004. 418.52 s [alphal00p-docs-cargo] error[E0432]: unresolved import `implementation::BackendRandState`
  1005. 418.52 s [alphal00p-docs-cargo] --> /nix/store/9rqk4093qnvgswmdk1pbxk9najcrjn7a-vendor-cargo-deps/bc87b2b0f37b9a43ffdd82e8f11f3e864d9447ccd53a9a964250c3414c3656d9/numerica-3.0.0/src/domains/backend/integer.rs:1614:33
  1006. 418.52 s [alphal00p-docs-cargo] |
  1007. 418.52 s [alphal00p-docs-cargo] 1614 | pub(crate) use implementation::{BackendRandState, Complete, RemRounding};
  1008. 418.53 s [alphal00p-docs-cargo] | ^^^^^^^^^^^^^^^^ no `BackendRandState` in `domains::backend::integer::implementation`
  1009. 418.53 s [alphal00p-docs-cargo] |
  1010. 418.53 s [alphal00p-docs-cargo] note: found an item that was configured out
  1011. 418.53 s [alphal00p-docs-cargo] --> /nix/store/9rqk4093qnvgswmdk1pbxk9najcrjn7a-vendor-cargo-deps/bc87b2b0f37b9a43ffdd82e8f11f3e864d9447ccd53a9a964250c3414c3656d9/numerica-3.0.0/src/domains/backend/integer.rs:1378:23
  1012. 418.53 s [alphal00p-docs-cargo] |
  1013. 418.53 s [alphal00p-docs-cargo] 1377 | #[cfg(feature = "integer-malachite")]
  1014. 418.53 s [alphal00p-docs-cargo] | ----------------------------- the item is gated behind the `integer-malachite` feature
  1015. 418.53 s [alphal00p-docs-cargo] 1378 | pub(crate) struct BackendRandState {
  1016. 418.53 s [alphal00p-docs-cargo] | ^^^^^^^^^^^^^^^^
  1017. 418.53 s [alphal00p-docs-cargo] note: found an item that was configured out
  1018. 418.53 s [alphal00p-docs-cargo] --> /nix/store/9rqk4093qnvgswmdk1pbxk9najcrjn7a-vendor-cargo-deps/bc87b2b0f37b9a43ffdd82e8f11f3e864d9447ccd53a9a964250c3414c3656d9/numerica-3.0.0/src/domains/backend/integer.rs:1413:23
  1019. 418.53 s [alphal00p-docs-cargo] |
  1020. 418.53 s [alphal00p-docs-cargo] 1412 | #[cfg(feature = "integer-gmp")]
  1021. 418.53 s [alphal00p-docs-cargo] | ----------------------- the item is gated behind the `integer-gmp` feature
  1022. 418.53 s [alphal00p-docs-cargo] 1413 | pub(crate) struct BackendRandState(rug::rand::RandState<'static>);
  1023. 418.53 s [alphal00p-docs-cargo] | ^^^^^^^^^^^^^^^^
  1024. 418.53 s [alphal00p-docs-cargo]
  1025. 418.53 s [alphal00p-docs-cargo] error[E0432]: unresolved import `implementation::RawMultiPrecisionInteger`
  1026. 418.53 s [alphal00p-docs-cargo] --> /nix/store/9rqk4093qnvgswmdk1pbxk9najcrjn7a-vendor-cargo-deps/bc87b2b0f37b9a43ffdd82e8f11f3e864d9447ccd53a9a964250c3414c3656d9/numerica-3.0.0/src/domains/backend/integer.rs:1616:61
  1027. 418.53 s [alphal00p-docs-cargo] |
  1028. 418.53 s [alphal00p-docs-cargo] 1616 | MultiPrecisionInteger, ParseMultiPrecisionIntegerError, RawMultiPrecisionInteger,
  1029. 418.53 s [alphal00p-docs-cargo] | ^^^^^^^^^^^^^^^^^^^^^^^^ no `RawMultiPrecisionInteger` in `domains::backend::integer::implementation`
  1030. 418.53 s [alphal00p-docs-cargo] |
  1031. 418.53 s [alphal00p-docs-cargo] note: found an item that was configured out
  1032. 418.53 s [alphal00p-docs-cargo] --> /nix/store/9rqk4093qnvgswmdk1pbxk9najcrjn7a-vendor-cargo-deps/bc87b2b0f37b9a43ffdd82e8f11f3e864d9447ccd53a9a964250c3414c3656d9/numerica-3.0.0/src/domains/backend/integer.rs:26:14
  1033. 418.53 s [alphal00p-docs-cargo] |
  1034. 418.53 s [alphal00p-docs-cargo] 25 | #[cfg(feature = "integer-malachite")]
  1035. 418.53 s [alphal00p-docs-cargo] | ----------------------------- the item is gated behind the `integer-malachite` feature
  1036. 418.53 s [alphal00p-docs-cargo] 26 | pub type RawMultiPrecisionInteger = malachite_nz::integer::Integer;
  1037. 418.53 s [alphal00p-docs-cargo] | ^^^^^^^^^^^^^^^^^^^^^^^^
  1038. 418.53 s [alphal00p-docs-cargo] note: found an item that was configured out
  1039. 418.53 s [alphal00p-docs-cargo] --> /nix/store/9rqk4093qnvgswmdk1pbxk9najcrjn7a-vendor-cargo-deps/bc87b2b0f37b9a43ffdd82e8f11f3e864d9447ccd53a9a964250c3414c3656d9/numerica-3.0.0/src/domains/backend/integer.rs:29:14
  1040. 418.53 s [alphal00p-docs-cargo] |
  1041. 418.53 s [alphal00p-docs-cargo] 28 | #[cfg(feature = "integer-gmp")]
  1042. 418.53 s [alphal00p-docs-cargo] | ----------------------- the item is gated behind the `integer-gmp` feature
  1043. 418.53 s [alphal00p-docs-cargo] 29 | pub type RawMultiPrecisionInteger = rug::Integer;
  1044. 418.53 s [alphal00p-docs-cargo] | ^^^^^^^^^^^^^^^^^^^^^^^^
  1045. 418.53 s [alphal00p-docs-cargo] help: a similar name exists in the module
  1046. 418.53 s [alphal00p-docs-cargo] |
  1047. 418.53 s [alphal00p-docs-cargo] 1616 - MultiPrecisionInteger, ParseMultiPrecisionIntegerError, RawMultiPrecisionInteger,
  1048. 418.53 s [alphal00p-docs-cargo] 1616 + MultiPrecisionInteger, ParseMultiPrecisionIntegerError, MultiPrecisionInteger,
  1049. 418.53 s [alphal00p-docs-cargo] |
  1050. 418.53 s [alphal00p-docs-cargo]
  1051. 418.53 s [alphal00p-docs-cargo] error[E0432]: unresolved imports `implementation::from_be_bytes`, `implementation::to_be_bytes`
  1052. 418.53 s [alphal00p-docs-cargo] --> /nix/store/9rqk4093qnvgswmdk1pbxk9najcrjn7a-vendor-cargo-deps/bc87b2b0f37b9a43ffdd82e8f11f3e864d9447ccd53a9a964250c3414c3656d9/numerica-3.0.0/src/domains/backend/integer.rs:1709:33
  1053. 418.53 s [alphal00p-docs-cargo] |
  1054. 418.53 s [alphal00p-docs-cargo] 1709 | pub(crate) use implementation::{from_be_bytes, to_be_bytes};
  1055. 418.53 s [alphal00p-docs-cargo] | ^^^^^^^^^^^^^ ^^^^^^^^^^^ no `to_be_bytes` in `domains::backend::integer::implementation`
  1056. 418.53 s [alphal00p-docs-cargo] | |
  1057. 418.53 s [alphal00p-docs-cargo] | no `from_be_bytes` in `domains::backend::integer::implementation`
  1058. 418.53 s [alphal00p-docs-cargo] |
  1059. 418.53 s [alphal00p-docs-cargo] note: found an item that was configured out
  1060. 418.53 s [alphal00p-docs-cargo] --> /nix/store/9rqk4093qnvgswmdk1pbxk9najcrjn7a-vendor-cargo-deps/bc87b2b0f37b9a43ffdd82e8f11f3e864d9447ccd53a9a964250c3414c3656d9/numerica-3.0.0/src/domains/backend/integer.rs:1370:19
  1061. 418.53 s [alphal00p-docs-cargo] |
  1062. 418.53 s [alphal00p-docs-cargo] 1369 | #[cfg(all(feature = "integer-malachite", feature = "bincode"))]
  1063. 418.53 s [alphal00p-docs-cargo] | ----------------------------- the item is gated behind the `integer-malachite` feature
  1064. 418.53 s [alphal00p-docs-cargo] 1370 | pub(crate) fn from_be_bytes(bytes: &[u8]) -> Result<MultiPrecisionInteger, &'static str> {
  1065. 418.53 s [alphal00p-docs-cargo] | ^^^^^^^^^^^^^
  1066. 418.53 s [alphal00p-docs-cargo] note: found an item that was configured out
  1067. 418.53 s [alphal00p-docs-cargo] --> /nix/store/9rqk4093qnvgswmdk1pbxk9najcrjn7a-vendor-cargo-deps/bc87b2b0f37b9a43ffdd82e8f11f3e864d9447ccd53a9a964250c3414c3656d9/numerica-3.0.0/src/domains/backend/integer.rs:1405:19
  1068. 418.53 s [alphal00p-docs-cargo] |
  1069. 418.53 s [alphal00p-docs-cargo] 1404 | #[cfg(all(feature = "integer-gmp", feature = "bincode"))]
  1070. 418.53 s [alphal00p-docs-cargo] | ----------------------- the item is gated behind the `integer-gmp` feature
  1071. 418.53 s [alphal00p-docs-cargo] 1405 | pub(crate) fn from_be_bytes(bytes: &[u8]) -> Result<MultiPrecisionInteger, &'static str> {
  1072. 418.53 s [alphal00p-docs-cargo] | ^^^^^^^^^^^^^
  1073. 418.53 s [alphal00p-docs-cargo] note: found an item that was configured out
  1074. 418.53 s [alphal00p-docs-cargo] --> /nix/store/9rqk4093qnvgswmdk1pbxk9najcrjn7a-vendor-cargo-deps/bc87b2b0f37b9a43ffdd82e8f11f3e864d9447ccd53a9a964250c3414c3656d9/numerica-3.0.0/src/domains/backend/integer.rs:1365:19
  1075. 418.53 s [alphal00p-docs-cargo] |
  1076. 418.53 s [alphal00p-docs-cargo] 1364 | #[cfg(all(feature = "integer-malachite", feature = "bincode"))]
  1077. 418.53 s [alphal00p-docs-cargo] | ----------------------------- the item is gated behind the `integer-malachite` feature
  1078. 418.53 s [alphal00p-docs-cargo] 1365 | pub(crate) fn to_be_bytes(value: &MultiPrecisionInteger) -> Vec<u8> {
  1079. 418.53 s [alphal00p-docs-cargo] | ^^^^^^^^^^^
  1080. 418.53 s [alphal00p-docs-cargo] note: found an item that was configured out
  1081. 418.53 s [alphal00p-docs-cargo] --> /nix/store/9rqk4093qnvgswmdk1pbxk9najcrjn7a-vendor-cargo-deps/bc87b2b0f37b9a43ffdd82e8f11f3e864d9447ccd53a9a964250c3414c3656d9/numerica-3.0.0/src/domains/backend/integer.rs:1400:19
  1082. 418.53 s [alphal00p-docs-cargo] |
  1083. 418.53 s [alphal00p-docs-cargo] 1399 | #[cfg(all(feature = "integer-gmp", feature = "bincode"))]
  1084. 418.53 s [alphal00p-docs-cargo] | ----------------------- the item is gated behind the `integer-gmp` feature
  1085. 418.53 s [alphal00p-docs-cargo] 1400 | pub(crate) fn to_be_bytes(value: &MultiPrecisionInteger) -> Vec<u8> {
  1086. 418.53 s [alphal00p-docs-cargo] | ^^^^^^^^^^^
  1087. 418.53 s [alphal00p-docs-cargo]
  1088. 418.54 s [alphal00p-docs-cargo] error[E0432]: unresolved imports `crate::domains::backend::float::Assign`, `crate::domains::backend::float::CompleteRound`, `crate::domains::backend::float::Constant`, `crate::domains::backend::float::MultiPrecisionFloat`, `crate::domains::backend::float::Pow`
  1089. 418.54 s [alphal00p-docs-cargo] --> /nix/store/9rqk4093qnvgswmdk1pbxk9najcrjn7a-vendor-cargo-deps/bc87b2b0f37b9a43ffdd82e8f11f3e864d9447ccd53a9a964250c3414c3656d9/numerica-3.0.0/src/domains/float/multiprecision.rs:15:9
  1090. 418.54 s [alphal00p-docs-cargo] |
  1091. 418.54 s [alphal00p-docs-cargo] 15 | Assign, CompleteRound, Constant, MultiPrecisionFloat, MultiPrecisionFloatInteger,
  1092. 418.54 s [alphal00p-docs-cargo] | ^^^^^^ ^^^^^^^^^^^^^ ^^^^^^^^ ^^^^^^^^^^^^^^^^^^^ no `MultiPrecisionFloat` in `domains::backend::float`
  1093. 418.54 s [alphal00p-docs-cargo] | | | |
  1094. 418.54 s [alphal00p-docs-cargo] | | | no `Constant` in `domains::backend::float`
  1095. 418.54 s [alphal00p-docs-cargo] | | no `CompleteRound` in `domains::backend::float`
  1096. 418.54 s [alphal00p-docs-cargo] | no `Assign` in `domains::backend::float`
  1097. 418.54 s [alphal00p-docs-cargo] 16 | MultiPrecisionFloatRational, MultiPrecisionFloatRounding, Pow, RoundingDirection,
  1098. 418.54 s [alphal00p-docs-cargo] | ^^^ no `Pow` in `domains::backend::float`
  1099. 418.54 s [alphal00p-docs-cargo] |
  1100. 418.54 s [alphal00p-docs-cargo] note: found an item that was configured out
  1101. 418.54 s [alphal00p-docs-cargo] --> /nix/store/9rqk4093qnvgswmdk1pbxk9najcrjn7a-vendor-cargo-deps/bc87b2b0f37b9a43ffdd82e8f11f3e864d9447ccd53a9a964250c3414c3656d9/numerica-3.0.0/src/domains/backend/float.rs:17:5
  1102. 418.54 s [alphal00p-docs-cargo] |
  1103. 418.54 s [alphal00p-docs-cargo] 15 | #[cfg(feature = "float-mpfr")]
  1104. 418.54 s [alphal00p-docs-cargo] | ---------------------- the item is gated behind the `float-mpfr` feature
  1105. 418.54 s [alphal00p-docs-cargo] 16 | pub use rug::{
  1106. 418.54 s [alphal00p-docs-cargo] 17 | Assign, Float as MultiPrecisionFloat, Rational as BackendRational,
  1107. 418.54 s [alphal00p-docs-cargo] | ^^^^^^
  1108. 418.54 s [alphal00p-docs-cargo] note: found an item that was configured out
  1109. 418.54 s [alphal00p-docs-cargo] --> /nix/store/9rqk4093qnvgswmdk1pbxk9najcrjn7a-vendor-cargo-deps/bc87b2b0f37b9a43ffdd82e8f11f3e864d9447ccd53a9a964250c3414c3656d9/numerica-3.0.0/src/domains/backend/float.rs:1578:5
  1110. 418.54 s [alphal00p-docs-cargo] |
  1111. 418.54 s [alphal00p-docs-cargo] 1576 | #[cfg(feature = "float-astro")]
  1112. 418.54 s [alphal00p-docs-cargo] | ----------------------- the item is gated behind the `float-astro` feature
  1113. 418.54 s [alphal00p-docs-cargo] 1577 | pub use astro::{
  1114. 418.54 s [alphal00p-docs-cargo] 1578 | Assign, BackendRational, CompleteRound, Constant, IntoMultiPrecisionFloat, MultiPrecisionFloat,
  1115. 418.54 s [alphal00p-docs-cargo] | ^^^^^^
  1116. 418.54 s [alphal00p-docs-cargo] note: found an item that was configured out
  1117. 418.54 s [alphal00p-docs-cargo] --> /nix/store/9rqk4093qnvgswmdk1pbxk9najcrjn7a-vendor-cargo-deps/bc87b2b0f37b9a43ffdd82e8f11f3e864d9447ccd53a9a964250c3414c3656d9/numerica-3.0.0/src/domains/backend/float.rs:19:11
  1118. 418.54 s [alphal00p-docs-cargo] |
  1119. 418.54 s [alphal00p-docs-cargo] 15 | #[cfg(feature = "float-mpfr")]
  1120. 418.54 s [alphal00p-docs-cargo] | ---------------------- the item is gated behind the `float-mpfr` feature
  1121. 418.54 s [alphal00p-docs-cargo] ...
  1122. 418.54 s [alphal00p-docs-cargo] 19 | ops::{CompleteRound, Pow},
  1123. 418.54 s [alphal00p-docs-cargo] | ^^^^^^^^^^^^^
  1124. 418.54 s [alphal00p-docs-cargo] note: found an item that was configured out
  1125. 418.54 s [alphal00p-docs-cargo] --> /nix/store/9rqk4093qnvgswmdk1pbxk9najcrjn7a-vendor-cargo-deps/bc87b2b0f37b9a43ffdd82e8f11f3e864d9447ccd53a9a964250c3414c3656d9/numerica-3.0.0/src/domains/backend/float.rs:1578:30
  1126. 418.54 s [alphal00p-docs-cargo] |
  1127. 418.54 s [alphal00p-docs-cargo] 1576 | #[cfg(feature = "float-astro")]
  1128. 418.54 s [alphal00p-docs-cargo] | ----------------------- the item is gated behind the `float-astro` feature
  1129. 418.54 s [alphal00p-docs-cargo] 1577 | pub use astro::{
  1130. 418.54 s [alphal00p-docs-cargo] 1578 | Assign, BackendRational, CompleteRound, Constant, IntoMultiPrecisionFloat, MultiPrecisionFloat,
  1131. 418.54 s [alphal00p-docs-cargo] | ^^^^^^^^^^^^^
  1132. 418.54 s [alphal00p-docs-cargo] note: found an item that was configured out
  1133. 418.54 s [alphal00p-docs-cargo] --> /nix/store/9rqk4093qnvgswmdk1pbxk9najcrjn7a-vendor-cargo-deps/bc87b2b0f37b9a43ffdd82e8f11f3e864d9447ccd53a9a964250c3414c3656d9/numerica-3.0.0/src/domains/backend/float.rs:18:12
  1134. 418.54 s [alphal00p-docs-cargo] |
  1135. 418.54 s [alphal00p-docs-cargo] 15 | #[cfg(feature = "float-mpfr")]
  1136. 418.54 s [alphal00p-docs-cargo] | ---------------------- the item is gated behind the `float-mpfr` feature
  1137. 418.54 s [alphal00p-docs-cargo] ...
  1138. 418.54 s [alphal00p-docs-cargo] 18 | float::Constant,
  1139. 418.54 s [alphal00p-docs-cargo] | ^^^^^^^^
  1140. 418.54 s [alphal00p-docs-cargo] note: found an item that was configured out
  1141. 418.54 s [alphal00p-docs-cargo] --> /nix/store/9rqk4093qnvgswmdk1pbxk9najcrjn7a-vendor-cargo-deps/bc87b2b0f37b9a43ffdd82e8f11f3e864d9447ccd53a9a964250c3414c3656d9/numerica-3.0.0/src/domains/backend/float.rs:1578:45
  1142. 418.54 s [alphal00p-docs-cargo] |
  1143. 418.54 s [alphal00p-docs-cargo] 1576 | #[cfg(feature = "float-astro")]
  1144. 418.54 s [alphal00p-docs-cargo] | ----------------------- the item is gated behind the `float-astro` feature
  1145. 418.54 s [alphal00p-docs-cargo] 1577 | pub use astro::{
  1146. 418.54 s [alphal00p-docs-cargo] 1578 | Assign, BackendRational, CompleteRound, Constant, IntoMultiPrecisionFloat, MultiPrecisionFloat,
  1147. 418.54 s [alphal00p-docs-cargo] | ^^^^^^^^
  1148. 418.54 s [alphal00p-docs-cargo] note: found an item that was configured out
  1149. 418.54 s [alphal00p-docs-cargo] --> /nix/store/9rqk4093qnvgswmdk1pbxk9najcrjn7a-vendor-cargo-deps/bc87b2b0f37b9a43ffdd82e8f11f3e864d9447ccd53a9a964250c3414c3656d9/numerica-3.0.0/src/domains/backend/float.rs:17:22
  1150. 418.54 s [alphal00p-docs-cargo] |
  1151. 418.54 s [alphal00p-docs-cargo] 15 | #[cfg(feature = "float-mpfr")]
  1152. 418.54 s [alphal00p-docs-cargo] | ---------------------- the item is gated behind the `float-mpfr` feature
  1153. 418.54 s [alphal00p-docs-cargo] 16 | pub use rug::{
  1154. 418.54 s [alphal00p-docs-cargo] 17 | Assign, Float as MultiPrecisionFloat, Rational as BackendRational,
  1155. 418.54 s [alphal00p-docs-cargo] | ^^^^^^^^^^^^^^^^^^^
  1156. 418.54 s [alphal00p-docs-cargo] note: found an item that was configured out
  1157. 418.54 s [alphal00p-docs-cargo] --> /nix/store/9rqk4093qnvgswmdk1pbxk9najcrjn7a-vendor-cargo-deps/bc87b2b0f37b9a43ffdd82e8f11f3e864d9447ccd53a9a964250c3414c3656d9/numerica-3.0.0/src/domains/backend/float.rs:1578:80
  1158. 418.54 s [alphal00p-docs-cargo] |
  1159. 418.54 s [alphal00p-docs-cargo] 1576 | #[cfg(feature = "float-astro")]
  1160. 418.54 s [alphal00p-docs-cargo] | ----------------------- the item is gated behind the `float-astro` feature
  1161. 418.54 s [alphal00p-docs-cargo] 1577 | pub use astro::{
  1162. 418.54 s [alphal00p-docs-cargo] 1578 | Assign, BackendRational, CompleteRound, Constant, IntoMultiPrecisionFloat, MultiPrecisionFloat,
  1163. 418.54 s [alphal00p-docs-cargo] | ^^^^^^^^^^^^^^^^^^^
  1164. 418.54 s [alphal00p-docs-cargo] note: found an item that was configured out
  1165. 418.54 s [alphal00p-docs-cargo] --> /nix/store/9rqk4093qnvgswmdk1pbxk9najcrjn7a-vendor-cargo-deps/bc87b2b0f37b9a43ffdd82e8f11f3e864d9447ccd53a9a964250c3414c3656d9/numerica-3.0.0/src/domains/backend/float.rs:19:26
  1166. 418.54 s [alphal00p-docs-cargo] |
  1167. 418.54 s [alphal00p-docs-cargo] 15 | #[cfg(feature = "float-mpfr")]
  1168. 418.54 s [alphal00p-docs-cargo] | ---------------------- the item is gated behind the `float-mpfr` feature
  1169. 418.54 s [alphal00p-docs-cargo] ...
  1170. 418.54 s [alphal00p-docs-cargo] 19 | ops::{CompleteRound, Pow},
  1171. 418.54 s [alphal00p-docs-cargo] | ^^^
  1172. 418.54 s [alphal00p-docs-cargo] note: found an item that was configured out
  1173. 418.54 s [alphal00p-docs-cargo] --> /nix/store/9rqk4093qnvgswmdk1pbxk9najcrjn7a-vendor-cargo-deps/bc87b2b0f37b9a43ffdd82e8f11f3e864d9447ccd53a9a964250c3414c3656d9/numerica-3.0.0/src/domains/backend/float.rs:1579:5
  1174. 418.54 s [alphal00p-docs-cargo] |
  1175. 418.54 s [alphal00p-docs-cargo] 1576 | #[cfg(feature = "float-astro")]
  1176. 418.54 s [alphal00p-docs-cargo] | ----------------------- the item is gated behind the `float-astro` feature
  1177. 418.54 s [alphal00p-docs-cargo] ...
  1178. 418.54 s [alphal00p-docs-cargo] 1579 | Pow,
  1179. 418.54 s [alphal00p-docs-cargo] | ^^^
  1180. 418.54 s [alphal00p-docs-cargo]
  1181. 418.76 s [alphal00p-docs-cargo] error[E0425]: cannot find type `RawMultiPrecisionInteger` in this scope
  1182. 418.76 s [alphal00p-docs-cargo] --> /nix/store/9rqk4093qnvgswmdk1pbxk9najcrjn7a-vendor-cargo-deps/bc87b2b0f37b9a43ffdd82e8f11f3e864d9447ccd53a9a964250c3414c3656d9/numerica-3.0.0/src/domains/backend/integer.rs:52:38
  1183. 418.76 s [alphal00p-docs-cargo] |
  1184. 418.76 s [alphal00p-docs-cargo] 52 | pub struct MultiPrecisionInteger(RawMultiPrecisionInteger);
  1185. 418.76 s [alphal00p-docs-cargo] | ^^^^^^^^^^^^^^^^^^^^^^^^ not found in this scope
  1186. 418.76 s [alphal00p-docs-cargo]
  1187. 418.76 s [alphal00p-docs-cargo] error[E0425]: cannot find type `RawMultiPrecisionInteger` in this scope
  1188. 418.76 s [alphal00p-docs-cargo] --> /nix/store/9rqk4093qnvgswmdk1pbxk9najcrjn7a-vendor-cargo-deps/bc87b2b0f37b9a43ffdd82e8f11f3e864d9447ccd53a9a964250c3414c3656d9/numerica-3.0.0/src/domains/backend/integer.rs:52:38
  1189. 418.76 s [alphal00p-docs-cargo] |
  1190. 418.76 s [alphal00p-docs-cargo] 52 | pub struct MultiPrecisionInteger(RawMultiPrecisionInteger);
  1191. 418.76 s [alphal00p-docs-cargo] | ^^^^^^^^^^^^^^^^^^^^^^^^ not found in this scope
  1192. 418.76 s [alphal00p-docs-cargo] |
  1193. 418.76 s [alphal00p-docs-cargo] help: you might be missing a type parameter
  1194. 418.76 s [alphal00p-docs-cargo] |
  1195. 418.76 s [alphal00p-docs-cargo] 52 | pub struct MultiPrecisionInteger<RawMultiPrecisionInteger>(RawMultiPrecisionInteger);
  1196. 418.76 s [alphal00p-docs-cargo] | ++++++++++++++++++++++++++
  1197. 418.76 s [alphal00p-docs-cargo]
  1198. 418.76 s [alphal00p-docs-cargo] error[E0425]: cannot find type `RawMultiPrecisionInteger` in this scope
  1199. 418.76 s [alphal00p-docs-cargo] --> /nix/store/9rqk4093qnvgswmdk1pbxk9najcrjn7a-vendor-cargo-deps/bc87b2b0f37b9a43ffdd82e8f11f3e864d9447ccd53a9a964250c3414c3656d9/numerica-3.0.0/src/domains/backend/integer.rs:149:32
  1200. 418.76 s [alphal00p-docs-cargo] |
  1201. 418.76 s [alphal00p-docs-cargo] 52 | pub struct MultiPrecisionInteger(RawMultiPrecisionInteger);
  1202. 418.76 s [alphal00p-docs-cargo] | ----------------------------------------------------------- similarly named struct `MultiPrecisionInteger` defined here
  1203. 418.76 s [alphal00p-docs-cargo] ...
  1204. 418.76 s [alphal00p-docs-cargo] 149 | pub fn from_raw(value: RawMultiPrecisionInteger) -> Self {
  1205. 418.76 s [alphal00p-docs-cargo] | ^^^^^^^^^^^^^^^^^^^^^^^^
  1206. 418.76 s [alphal00p-docs-cargo] |
  1207. 418.76 s [alphal00p-docs-cargo] help: a struct with a similar name exists
  1208. 418.76 s [alphal00p-docs-cargo] |
  1209. 418.76 s [alphal00p-docs-cargo] 149 - pub fn from_raw(value: RawMultiPrecisionInteger) -> Self {
  1210. 418.76 s [alphal00p-docs-cargo] 149 + pub fn from_raw(value: MultiPrecisionInteger) -> Self {
  1211. 418.76 s [alphal00p-docs-cargo] |
  1212. 418.76 s [alphal00p-docs-cargo]
  1213. 418.76 s [alphal00p-docs-cargo] error[E0425]: cannot find type `RawMultiPrecisionInteger` in this scope
  1214. 418.76 s [alphal00p-docs-cargo] --> /nix/store/9rqk4093qnvgswmdk1pbxk9najcrjn7a-vendor-cargo-deps/bc87b2b0f37b9a43ffdd82e8f11f3e864d9447ccd53a9a964250c3414c3656d9/numerica-3.0.0/src/domains/backend/integer.rs:187:34
  1215. 418.76 s [alphal00p-docs-cargo] |
  1216. 418.76 s [alphal00p-docs-cargo] 52 | pub struct MultiPrecisionInteger(RawMultiPrecisionInteger);
  1217. 418.76 s [alphal00p-docs-cargo] | ----------------------------------------------------------- similarly named struct `MultiPrecisionInteger` defined here
  1218. 418.76 s [alphal00p-docs-cargo] ...
  1219. 418.76 s [alphal00p-docs-cargo] 187 | pub fn as_raw(&self) -> &RawMultiPrecisionInteger {
  1220. 418.76 s [alphal00p-docs-cargo] | ^^^^^^^^^^^^^^^^^^^^^^^^
  1221. 418.76 s [alphal00p-docs-cargo] |
  1222. 418.76 s [alphal00p-docs-cargo] help: a struct with a similar name exists
  1223. 418.76 s [alphal00p-docs-cargo] |
  1224. 418.76 s [alphal00p-docs-cargo] 187 - pub fn as_raw(&self) -> &RawMultiPrecisionInteger {
  1225. 418.76 s [alphal00p-docs-cargo] 187 + pub fn as_raw(&self) -> &MultiPrecisionInteger {
  1226. 418.76 s [alphal00p-docs-cargo] |
  1227. 418.76 s [alphal00p-docs-cargo]
  1228. 418.77 s [alphal00p-docs-cargo] error[E0425]: cannot find type `RawMultiPrecisionInteger` in this scope
  1229. 418.77 s [alphal00p-docs-cargo] --> /nix/store/9rqk4093qnvgswmdk1pbxk9najcrjn7a-vendor-cargo-deps/bc87b2b0f37b9a43ffdd82e8f11f3e864d9447ccd53a9a964250c3414c3656d9/numerica-3.0.0/src/domains/backend/integer.rs:193:33
  1230. 418.77 s [alphal00p-docs-cargo] |
  1231. 418.77 s [alphal00p-docs-cargo] 52 | pub struct MultiPrecisionInteger(RawMultiPrecisionInteger);
  1232. 418.77 s [alphal00p-docs-cargo] | ----------------------------------------------------------- similarly named struct `MultiPrecisionInteger` defined here
  1233. 418.77 s [alphal00p-docs-cargo] ...
  1234. 418.77 s [alphal00p-docs-cargo] 193 | pub fn to_raw(&self) -> RawMultiPrecisionInteger {
  1235. 418.77 s [alphal00p-docs-cargo] | ^^^^^^^^^^^^^^^^^^^^^^^^
  1236. 418.77 s [alphal00p-docs-cargo] |
  1237. 418.77 s [alphal00p-docs-cargo] help: a struct with a similar name exists
  1238. 418.77 s [alphal00p-docs-cargo] |
  1239. 418.77 s [alphal00p-docs-cargo] 193 - pub fn to_raw(&self) -> RawMultiPrecisionInteger {
  1240. 418.77 s [alphal00p-docs-cargo] 193 + pub fn to_raw(&self) -> MultiPrecisionInteger {
  1241. 418.77 s [alphal00p-docs-cargo] |
  1242. 418.77 s [alphal00p-docs-cargo]
  1243. 418.77 s [alphal00p-docs-cargo] error[E0425]: cannot find type `RawMultiPrecisionInteger` in this scope
  1244. 418.77 s [alphal00p-docs-cargo] --> /nix/store/9rqk4093qnvgswmdk1pbxk9najcrjn7a-vendor-cargo-deps/bc87b2b0f37b9a43ffdd82e8f11f3e864d9447ccd53a9a964250c3414c3656d9/numerica-3.0.0/src/domains/backend/integer.rs:199:34
  1245. 418.77 s [alphal00p-docs-cargo] |
  1246. 418.77 s [alphal00p-docs-cargo] 52 | pub struct MultiPrecisionInteger(RawMultiPrecisionInteger);
  1247. 418.77 s [alphal00p-docs-cargo] | ----------------------------------------------------------- similarly named struct `MultiPrecisionInteger` defined here
  1248. 418.77 s [alphal00p-docs-cargo] ...
  1249. 418.77 s [alphal00p-docs-cargo] 199 | pub fn into_raw(self) -> RawMultiPrecisionInteger {
  1250. 418.77 s [alphal00p-docs-cargo] | ^^^^^^^^^^^^^^^^^^^^^^^^
  1251. 418.77 s [alphal00p-docs-cargo] |
  1252. 418.77 s [alphal00p-docs-cargo] help: a struct with a similar name exists
  1253. 418.77 s [alphal00p-docs-cargo] |
  1254. 418.77 s [alphal00p-docs-cargo] 199 - pub fn into_raw(self) -> RawMultiPrecisionInteger {
  1255. 418.77 s [alphal00p-docs-cargo] 199 + pub fn into_raw(self) -> MultiPrecisionInteger {
  1256. 418.77 s [alphal00p-docs-cargo] |
  1257. 418.77 s [alphal00p-docs-cargo]
  1258. 418.77 s [alphal00p-docs-cargo] error[E0425]: cannot find type `RawMultiPrecisionInteger` in this scope
  1259. 418.77 s [alphal00p-docs-cargo] --> /nix/store/9rqk4093qnvgswmdk1pbxk9najcrjn7a-vendor-cargo-deps/bc87b2b0f37b9a43ffdd82e8f11f3e864d9447ccd53a9a964250c3414c3656d9/numerica-3.0.0/src/domains/backend/integer.rs:567:27
  1260. 418.77 s [alphal00p-docs-cargo] |
  1261. 418.77 s [alphal00p-docs-cargo] 52 | pub struct MultiPrecisionInteger(RawMultiPrecisionInteger);
  1262. 418.77 s [alphal00p-docs-cargo] | ----------------------------------------------------------- similarly named struct `MultiPrecisionInteger` defined here
  1263. 418.77 s [alphal00p-docs-cargo] ...
  1264. 418.77 s [alphal00p-docs-cargo] 567 | fn rem_trunc(lhs: RawMultiPrecisionInteger, rhs: RawMultiPrecisionInteger) -> Self {
  1265. 418.77 s [alphal00p-docs-cargo] | ^^^^^^^^^^^^^^^^^^^^^^^^
  1266. 418.77 s [alphal00p-docs-cargo] |
  1267. 418.77 s [alphal00p-docs-cargo] help: a struct with a similar name exists
  1268. 418.77 s [alphal00p-docs-cargo] |
  1269. 418.77 s [alphal00p-docs-cargo] 567 - fn rem_trunc(lhs: RawMultiPrecisionInteger, rhs: RawMultiPrecisionInteger) -> Self {
  1270. 418.77 s [alphal00p-docs-cargo] 567 + fn rem_trunc(lhs: MultiPrecisionInteger, rhs: RawMultiPrecisionInteger) -> Self {
  1271. 418.77 s [alphal00p-docs-cargo] |
  1272. 418.77 s [alphal00p-docs-cargo]
  1273. 418.77 s [alphal00p-docs-cargo] error[E0425]: cannot find type `RawMultiPrecisionInteger` in this scope
  1274. 418.77 s [alphal00p-docs-cargo] --> /nix/store/9rqk4093qnvgswmdk1pbxk9najcrjn7a-vendor-cargo-deps/bc87b2b0f37b9a43ffdd82e8f11f3e864d9447ccd53a9a964250c3414c3656d9/numerica-3.0.0/src/domains/backend/integer.rs:567:58
  1275. 418.77 s [alphal00p-docs-cargo] |
  1276. 418.77 s [alphal00p-docs-cargo] 52 | pub struct MultiPrecisionInteger(RawMultiPrecisionInteger);
  1277. 418.77 s [alphal00p-docs-cargo] | ----------------------------------------------------------- similarly named struct `MultiPrecisionInteger` defined here
  1278. 418.77 s [alphal00p-docs-cargo] ...
  1279. 418.77 s [alphal00p-docs-cargo] 567 | fn rem_trunc(lhs: RawMultiPrecisionInteger, rhs: RawMultiPrecisionInteger) -> Self {
  1280. 418.77 s [alphal00p-docs-cargo] | ^^^^^^^^^^^^^^^^^^^^^^^^
  1281. 418.77 s [alphal00p-docs-cargo] |
  1282. 418.77 s [alphal00p-docs-cargo] help: a struct with a similar name exists
  1283. 418.77 s [alphal00p-docs-cargo] |
  1284. 418.77 s [alphal00p-docs-cargo] 567 - fn rem_trunc(lhs: RawMultiPrecisionInteger, rhs: RawMultiPrecisionInteger) -> Self {
  1285. 418.77 s [alphal00p-docs-cargo] 567 + fn rem_trunc(lhs: RawMultiPrecisionInteger, rhs: MultiPrecisionInteger) -> Self {
  1286. 418.77 s [alphal00p-docs-cargo] |
  1287. 418.77 s [alphal00p-docs-cargo]
  1288. 418.77 s [alphal00p-docs-cargo] error[E0425]: cannot find type `RawMultiPrecisionInteger` in this scope
  1289. 418.77 s [alphal00p-docs-cargo] --> /nix/store/9rqk4093qnvgswmdk1pbxk9najcrjn7a-vendor-cargo-deps/bc87b2b0f37b9a43ffdd82e8f11f3e864d9447ccd53a9a964250c3414c3656d9/numerica-3.0.0/src/domains/backend/integer.rs:582:27
  1290. 418.77 s [alphal00p-docs-cargo] |
  1291. 418.77 s [alphal00p-docs-cargo] 52 | pub struct MultiPrecisionInteger(RawMultiPrecisionInteger);
  1292. 418.77 s [alphal00p-docs-cargo] | ----------------------------------------------------------- similarly named struct `MultiPrecisionInteger` defined here
  1293. 418.77 s [alphal00p-docs-cargo] ...
  1294. 418.77 s [alphal00p-docs-cargo] 582 | fn shl_raw(value: RawMultiPrecisionInteger, rhs: u64) -> RawMultiPrecisionInteger {
  1295. 418.77 s [alphal00p-docs-cargo] | ^^^^^^^^^^^^^^^^^^^^^^^^
  1296. 418.77 s [alphal00p-docs-cargo] |
  1297. 418.77 s [alphal00p-docs-cargo] help: a struct with a similar name exists
  1298. 418.77 s [alphal00p-docs-cargo] |
  1299. 418.77 s [alphal00p-docs-cargo] 582 - fn shl_raw(value: RawMultiPrecisionInteger, rhs: u64) -> RawMultiPrecisionInteger {
  1300. 418.77 s [alphal00p-docs-cargo] 582 + fn shl_raw(value: MultiPrecisionInteger, rhs: u64) -> RawMultiPrecisionInteger {
  1301. 418.77 s [alphal00p-docs-cargo] |
  1302. 418.77 s [alphal00p-docs-cargo]
  1303. 418.77 s [alphal00p-docs-cargo] error[E0425]: cannot find type `RawMultiPrecisionInteger` in this scope
  1304. 418.77 s [alphal00p-docs-cargo] --> /nix/store/9rqk4093qnvgswmdk1pbxk9najcrjn7a-vendor-cargo-deps/bc87b2b0f37b9a43ffdd82e8f11f3e864d9447ccd53a9a964250c3414c3656d9/numerica-3.0.0/src/domains/backend/integer.rs:582:66
  1305. 418.77 s [alphal00p-docs-cargo] |
  1306. 418.77 s [alphal00p-docs-cargo] 52 | pub struct MultiPrecisionInteger(RawMultiPrecisionInteger);
  1307. 418.77 s [alphal00p-docs-cargo] | ----------------------------------------------------------- similarly named struct `MultiPrecisionInteger` defined here
  1308. 418.77 s [alphal00p-docs-cargo] ...
  1309. 418.77 s [alphal00p-docs-cargo] 582 | fn shl_raw(value: RawMultiPrecisionInteger, rhs: u64) -> RawMultiPrecisionInteger {
  1310. 418.77 s [alphal00p-docs-cargo] | ^^^^^^^^^^^^^^^^^^^^^^^^
  1311. 418.77 s [alphal00p-docs-cargo] |
  1312. 418.77 s [alphal00p-docs-cargo] help: a struct with a similar name exists
  1313. 418.77 s [alphal00p-docs-cargo] |
  1314. 418.77 s [alphal00p-docs-cargo] 582 - fn shl_raw(value: RawMultiPrecisionInteger, rhs: u64) -> RawMultiPrecisionInteger {
  1315. 418.77 s [alphal00p-docs-cargo] 582 + fn shl_raw(value: RawMultiPrecisionInteger, rhs: u64) -> MultiPrecisionInteger {
  1316. 418.77 s [alphal00p-docs-cargo] |
  1317. 418.77 s [alphal00p-docs-cargo]
  1318. 418.77 s [alphal00p-docs-cargo] error[E0425]: cannot find type `RawMultiPrecisionInteger` in this scope
  1319. 418.77 s [alphal00p-docs-cargo] --> /nix/store/9rqk4093qnvgswmdk1pbxk9najcrjn7a-vendor-cargo-deps/bc87b2b0f37b9a43ffdd82e8f11f3e864d9447ccd53a9a964250c3414c3656d9/numerica-3.0.0/src/domains/backend/integer.rs:590:27
  1320. 418.77 s [alphal00p-docs-cargo] |
  1321. 418.77 s [alphal00p-docs-cargo] 52 | pub struct MultiPrecisionInteger(RawMultiPrecisionInteger);
  1322. 418.77 s [alphal00p-docs-cargo] | ----------------------------------------------------------- similarly named struct `MultiPrecisionInteger` defined here
  1323. 418.77 s [alphal00p-docs-cargo] ...
  1324. 418.77 s [alphal00p-docs-cargo] 590 | fn shr_raw(value: RawMultiPrecisionInteger, rhs: u64) -> RawMultiPrecisionInteger {
  1325. 418.77 s [alphal00p-docs-cargo] | ^^^^^^^^^^^^^^^^^^^^^^^^
  1326. 418.77 s [alphal00p-docs-cargo] |
  1327. 418.77 s [alphal00p-docs-cargo] help: a struct with a similar name exists
  1328. 418.77 s [alphal00p-docs-cargo] |
  1329. 418.77 s [alphal00p-docs-cargo] 590 - fn shr_raw(value: RawMultiPrecisionInteger, rhs: u64) -> RawMultiPrecisionInteger {
  1330. 418.77 s [alphal00p-docs-cargo] 590 + fn shr_raw(value: MultiPrecisionInteger, rhs: u64) -> RawMultiPrecisionInteger {
  1331. 418.77 s [alphal00p-docs-cargo] |
  1332. 418.77 s [alphal00p-docs-cargo]
  1333. 418.78 s [alphal00p-docs-cargo] error[E0425]: cannot find type `RawMultiPrecisionInteger` in this scope
  1334. 418.78 s [alphal00p-docs-cargo] --> /nix/store/9rqk4093qnvgswmdk1pbxk9najcrjn7a-vendor-cargo-deps/bc87b2b0f37b9a43ffdd82e8f11f3e864d9447ccd53a9a964250c3414c3656d9/numerica-3.0.0/src/domains/backend/integer.rs:590:66
  1335. 418.78 s [alphal00p-docs-cargo] |
  1336. 418.78 s [alphal00p-docs-cargo] 52 | pub struct MultiPrecisionInteger(RawMultiPrecisionInteger);
  1337. 418.78 s [alphal00p-docs-cargo] | ----------------------------------------------------------- similarly named struct `MultiPrecisionInteger` defined here
  1338. 418.78 s [alphal00p-docs-cargo] ...
  1339. 418.78 s [alphal00p-docs-cargo] 590 | fn shr_raw(value: RawMultiPrecisionInteger, rhs: u64) -> RawMultiPrecisionInteger {
  1340. 418.78 s [alphal00p-docs-cargo] | ^^^^^^^^^^^^^^^^^^^^^^^^
  1341. 418.78 s [alphal00p-docs-cargo] |
  1342. 418.78 s [alphal00p-docs-cargo] help: a struct with a similar name exists
  1343. 418.78 s [alphal00p-docs-cargo] |
  1344. 418.78 s [alphal00p-docs-cargo] 590 - fn shr_raw(value: RawMultiPrecisionInteger, rhs: u64) -> RawMultiPrecisionInteger {
  1345. 418.78 s [alphal00p-docs-cargo] 590 + fn shr_raw(value: RawMultiPrecisionInteger, rhs: u64) -> MultiPrecisionInteger {
  1346. 418.78 s [alphal00p-docs-cargo] |
  1347. 418.78 s [alphal00p-docs-cargo]
  1348. 418.78 s [alphal00p-docs-cargo] error[E0425]: cannot find type `RawMultiPrecisionInteger` in this scope
  1349. 418.78 s [alphal00p-docs-cargo] --> /nix/store/9rqk4093qnvgswmdk1pbxk9najcrjn7a-vendor-cargo-deps/bc87b2b0f37b9a43ffdd82e8f11f3e864d9447ccd53a9a964250c3414c3656d9/numerica-3.0.0/src/domains/backend/integer.rs:654:15
  1350. 418.78 s [alphal00p-docs-cargo] |
  1351. 418.78 s [alphal00p-docs-cargo] 52 | pub struct MultiPrecisionInteger(RawMultiPrecisionInteger);
  1352. 418.78 s [alphal00p-docs-cargo] | ----------------------------------------------------------- similarly named struct `MultiPrecisionInteger` defined here
  1353. 418.78 s [alphal00p-docs-cargo] ...
  1354. 418.78 s [alphal00p-docs-cargo] 654 | impl From<RawMultiPrecisionInteger> for MultiPrecisionInteger {
  1355. 418.78 s [alphal00p-docs-cargo] | ^^^^^^^^^^^^^^^^^^^^^^^^
  1356. 418.78 s [alphal00p-docs-cargo] |
  1357. 418.78 s [alphal00p-docs-cargo] help: a struct with a similar name exists
  1358. 418.78 s [alphal00p-docs-cargo] |
  1359. 418.78 s [alphal00p-docs-cargo] 654 - impl From<RawMultiPrecisionInteger> for MultiPrecisionInteger {
  1360. 418.78 s [alphal00p-docs-cargo] 654 + impl From<MultiPrecisionInteger> for MultiPrecisionInteger {
  1361. 418.78 s [alphal00p-docs-cargo] |
  1362. 418.78 s [alphal00p-docs-cargo] help: you might be missing a type parameter
  1363. 418.78 s [alphal00p-docs-cargo] |
  1364. 418.78 s [alphal00p-docs-cargo] 654 | impl<RawMultiPrecisionInteger> From<RawMultiPrecisionInteger> for MultiPrecisionInteger {
  1365. 418.78 s [alphal00p-docs-cargo] | ++++++++++++++++++++++++++
  1366. 418.78 s [alphal00p-docs-cargo]
  1367. 418.78 s [alphal00p-docs-cargo] error[E0425]: cannot find type `RawMultiPrecisionInteger` in this scope
  1368. 418.78 s [alphal00p-docs-cargo] --> /nix/store/9rqk4093qnvgswmdk1pbxk9najcrjn7a-vendor-cargo-deps/bc87b2b0f37b9a43ffdd82e8f11f3e864d9447ccd53a9a964250c3414c3656d9/numerica-3.0.0/src/domains/backend/integer.rs:656:24
  1369. 418.78 s [alphal00p-docs-cargo] |
  1370. 418.78 s [alphal00p-docs-cargo] 52 | pub struct MultiPrecisionInteger(RawMultiPrecisionInteger);
  1371. 418.78 s [alphal00p-docs-cargo] | ----------------------------------------------------------- similarly named struct `MultiPrecisionInteger` defined here
  1372. 418.78 s [alphal00p-docs-cargo] ...
  1373. 418.78 s [alphal00p-docs-cargo] 656 | fn from(value: RawMultiPrecisionInteger) -> Self {
  1374. 418.78 s [alphal00p-docs-cargo] | ^^^^^^^^^^^^^^^^^^^^^^^^
  1375. 418.78 s [alphal00p-docs-cargo] |
  1376. 418.78 s [alphal00p-docs-cargo] help: a struct with a similar name exists
  1377. 418.78 s [alphal00p-docs-cargo] |
  1378. 418.78 s [alphal00p-docs-cargo] 656 - fn from(value: RawMultiPrecisionInteger) -> Self {
  1379. 418.78 s [alphal00p-docs-cargo] 656 + fn from(value: MultiPrecisionInteger) -> Self {
  1380. 418.78 s [alphal00p-docs-cargo] |
  1381. 418.78 s [alphal00p-docs-cargo]
  1382. 418.78 s [alphal00p-docs-cargo] error[E0425]: cannot find type `RawMultiPrecisionInteger` in this scope
  1383. 418.78 s [alphal00p-docs-cargo] --> /nix/store/9rqk4093qnvgswmdk1pbxk9najcrjn7a-vendor-cargo-deps/bc87b2b0f37b9a43ffdd82e8f11f3e864d9447ccd53a9a964250c3414c3656d9/numerica-3.0.0/src/domains/backend/integer.rs:661:42
  1384. 418.78 s [alphal00p-docs-cargo] |
  1385. 418.78 s [alphal00p-docs-cargo] 52 | pub struct MultiPrecisionInteger(RawMultiPrecisionInteger);
  1386. 418.78 s [alphal00p-docs-cargo] | ----------------------------------------------------------- similarly named struct `MultiPrecisionInteger` defined here
  1387. 418.78 s [alphal00p-docs-cargo] ...
  1388. 418.78 s [alphal00p-docs-cargo] 661 | impl From<MultiPrecisionInteger> for RawMultiPrecisionInteger {
  1389. 418.78 s [alphal00p-docs-cargo] | ^^^^^^^^^^^^^^^^^^^^^^^^
  1390. 418.78 s [alphal00p-docs-cargo] |
  1391. 418.78 s [alphal00p-docs-cargo] help: a struct with a similar name exists
  1392. 418.78 s [alphal00p-docs-cargo] |
  1393. 418.78 s [alphal00p-docs-cargo] 661 - impl From<MultiPrecisionInteger> for RawMultiPrecisionInteger {
  1394. 418.78 s [alphal00p-docs-cargo] 661 + impl From<MultiPrecisionInteger> for MultiPrecisionInteger {
  1395. 418.78 s [alphal00p-docs-cargo] |
  1396. 418.78 s [alphal00p-docs-cargo]
  1397. 419.06 s [alphal00p-docs-cargo] error[E0433]: cannot find type `RawMultiPrecisionInteger` in this scope
  1398. 419.06 s [alphal00p-docs-cargo] --> /nix/store/9rqk4093qnvgswmdk1pbxk9najcrjn7a-vendor-cargo-deps/bc87b2b0f37b9a43ffdd82e8f11f3e864d9447ccd53a9a964250c3414c3656d9/numerica-3.0.0/src/domains/backend/integer.rs:620:13
  1399. 419.06 s [alphal00p-docs-cargo] |
  1400. 419.06 s [alphal00p-docs-cargo] 620 | RawMultiPrecisionInteger::from_str(s)
  1401. 419.06 s [alphal00p-docs-cargo] | ^^^^^^^^^^^^^^^^^^^^^^^^ use of undeclared type `RawMultiPrecisionInteger`
  1402. 419.06 s [alphal00p-docs-cargo] |
  1403. 419.06 s [alphal00p-docs-cargo] help: a struct with a similar name exists
  1404. 419.06 s [alphal00p-docs-cargo] |
  1405. 419.06 s [alphal00p-docs-cargo] 620 - RawMultiPrecisionInteger::from_str(s)
  1406. 419.06 s [alphal00p-docs-cargo] 620 + MultiPrecisionInteger::from_str(s)
  1407. 419.06 s [alphal00p-docs-cargo] |
  1408. 419.06 s [alphal00p-docs-cargo]
  1409. 419.06 s [alphal00p-docs-cargo] error[E0433]: cannot find type `RawMultiPrecisionInteger` in this scope
  1410. 419.06 s [alphal00p-docs-cargo] --> /nix/store/9rqk4093qnvgswmdk1pbxk9najcrjn7a-vendor-cargo-deps/bc87b2b0f37b9a43ffdd82e8f11f3e864d9447ccd53a9a964250c3414c3656d9/numerica-3.0.0/src/domains/backend/integer.rs:674:35
  1411. 419.06 s [alphal00p-docs-cargo] |
  1412. 419.06 s [alphal00p-docs-cargo] 674 | self.0 == RawMultiPrecisionInteger::from(*other)
  1413. 419.06 s [alphal00p-docs-cargo] | ^^^^^^^^^^^^^^^^^^^^^^^^ use of undeclared type `RawMultiPrecisionInteger`
  1414. 419.06 s [alphal00p-docs-cargo] ...
  1415. 419.06 s [alphal00p-docs-cargo] 702 | impl_cmp_primitive!(i32, i64, i128, u32, u64, u128);
  1416. 419.06 s [alphal00p-docs-cargo] | --------------------------------------------------- in this macro invocation
  1417. 419.06 s [alphal00p-docs-cargo] |
  1418. 419.06 s [alphal00p-docs-cargo] = note: this error originates in the macro `impl_cmp_primitive` (in Nightly builds, run with -Z macro-backtrace for more info)
  1419. 419.06 s [alphal00p-docs-cargo] help: a struct with a similar name exists
  1420. 419.06 s [alphal00p-docs-cargo] |
  1421. 419.06 s [alphal00p-docs-cargo] 674 - self.0 == RawMultiPrecisionInteger::from(*other)
  1422. 419.06 s [alphal00p-docs-cargo] 674 + self.0 == MultiPrecisionInteger::from(*other)
  1423. 419.06 s [alphal00p-docs-cargo] |
  1424. 419.06 s [alphal00p-docs-cargo]
  1425. 419.06 s [alphal00p-docs-cargo] error[E0433]: cannot find type `RawMultiPrecisionInteger` in this scope
  1426. 419.06 s [alphal00p-docs-cargo] --> /nix/store/9rqk4093qnvgswmdk1pbxk9najcrjn7a-vendor-cargo-deps/bc87b2b0f37b9a43ffdd82e8f11f3e864d9447ccd53a9a964250c3414c3656d9/numerica-3.0.0/src/domains/backend/integer.rs:681:25
  1427. 419.06 s [alphal00p-docs-cargo] |
  1428. 419.06 s [alphal00p-docs-cargo] 681 | RawMultiPrecisionInteger::from(*self) == other.0
  1429. 419.06 s [alphal00p-docs-cargo] | ^^^^^^^^^^^^^^^^^^^^^^^^ use of undeclared type `RawMultiPrecisionInteger`
  1430. 419.06 s [alphal00p-docs-cargo] ...
  1431. 419.06 s [alphal00p-docs-cargo] 702 | impl_cmp_primitive!(i32, i64, i128, u32, u64, u128);
  1432. 419.06 s [alphal00p-docs-cargo] | --------------------------------------------------- in this macro invocation
  1433. 419.06 s [alphal00p-docs-cargo] |
  1434. 419.06 s [alphal00p-docs-cargo] = note: this error originates in the macro `impl_cmp_primitive` (in Nightly builds, run with -Z macro-backtrace for more info)
  1435. 419.06 s [alphal00p-docs-cargo] help: a struct with a similar name exists
  1436. 419.06 s [alphal00p-docs-cargo] |
  1437. 419.06 s [alphal00p-docs-cargo] 681 - RawMultiPrecisionInteger::from(*self) == other.0
  1438. 419.06 s [alphal00p-docs-cargo] 681 + MultiPrecisionInteger::from(*self) == other.0
  1439. 419.06 s [alphal00p-docs-cargo] |
  1440. 419.06 s [alphal00p-docs-cargo]
  1441. 419.06 s [alphal00p-docs-cargo] error[E0433]: cannot find type `RawMultiPrecisionInteger` in this scope
  1442. 419.06 s [alphal00p-docs-cargo] --> /nix/store/9rqk4093qnvgswmdk1pbxk9najcrjn7a-vendor-cargo-deps/bc87b2b0f37b9a43ffdd82e8f11f3e864d9447ccd53a9a964250c3414c3656d9/numerica-3.0.0/src/domains/backend/integer.rs:688:45
  1443. 419.06 s [alphal00p-docs-cargo] |
  1444. 419.06 s [alphal00p-docs-cargo] 688 | self.0.partial_cmp(&RawMultiPrecisionInteger::from(*other))
  1445. 419.06 s [alphal00p-docs-cargo] | ^^^^^^^^^^^^^^^^^^^^^^^^ use of undeclared type `RawMultiPrecisionInteger`
  1446. 419.06 s [alphal00p-docs-cargo] ...
  1447. 419.06 s [alphal00p-docs-cargo] 702 | impl_cmp_primitive!(i32, i64, i128, u32, u64, u128);
  1448. 419.06 s [alphal00p-docs-cargo] | --------------------------------------------------- in this macro invocation
  1449. 419.06 s [alphal00p-docs-cargo] |
  1450. 419.06 s [alphal00p-docs-cargo] = note: this error originates in the macro `impl_cmp_primitive` (in Nightly builds, run with -Z macro-backtrace for more info)
  1451. 419.06 s [alphal00p-docs-cargo] help: a struct with a similar name exists
  1452. 419.06 s [alphal00p-docs-cargo] |
  1453. 419.06 s [alphal00p-docs-cargo] 688 - self.0.partial_cmp(&RawMultiPrecisionInteger::from(*other))
  1454. 419.06 s [alphal00p-docs-cargo] 688 + self.0.partial_cmp(&MultiPrecisionInteger::from(*other))
  1455. 419.06 s [alphal00p-docs-cargo] |
  1456. 419.06 s [alphal00p-docs-cargo]
  1457. 419.06 s [alphal00p-docs-cargo] error[E0433]: cannot find type `RawMultiPrecisionInteger` in this scope
  1458. 419.06 s [alphal00p-docs-cargo] --> /nix/store/9rqk4093qnvgswmdk1pbxk9najcrjn7a-vendor-cargo-deps/bc87b2b0f37b9a43ffdd82e8f11f3e864d9447ccd53a9a964250c3414c3656d9/numerica-3.0.0/src/domains/backend/integer.rs:695:25
  1459. 419.06 s [alphal00p-docs-cargo] |
  1460. 419.06 s [alphal00p-docs-cargo] 695 | RawMultiPrecisionInteger::from(*self).partial_cmp(&other.0)
  1461. 419.06 s [alphal00p-docs-cargo] | ^^^^^^^^^^^^^^^^^^^^^^^^ use of undeclared type `RawMultiPrecisionInteger`
  1462. 419.06 s [alphal00p-docs-cargo] ...
  1463. 419.06 s [alphal00p-docs-cargo] 702 | impl_cmp_primitive!(i32, i64, i128, u32, u64, u128);
  1464. 419.06 s [alphal00p-docs-cargo] | --------------------------------------------------- in this macro invocation
  1465. 419.06 s [alphal00p-docs-cargo] |
  1466. 419.06 s [alphal00p-docs-cargo] = note: this error originates in the macro `impl_cmp_primitive` (in Nightly builds, run with -Z macro-backtrace for more info)
  1467. 419.06 s [alphal00p-docs-cargo] help: a struct with a similar name exists
  1468. 419.06 s [alphal00p-docs-cargo] |
  1469. 419.06 s [alphal00p-docs-cargo] 695 - RawMultiPrecisionInteger::from(*self).partial_cmp(&other.0)
  1470. 419.06 s [alphal00p-docs-cargo] 695 + MultiPrecisionInteger::from(*self).partial_cmp(&other.0)
  1471. 419.06 s [alphal00p-docs-cargo] |
  1472. 419.06 s [alphal00p-docs-cargo]
  1473. 419.06 s [alphal00p-docs-cargo] error[E0433]: cannot find type `RawMultiPrecisionInteger` in this scope
  1474. 419.06 s [alphal00p-docs-cargo] --> /nix/store/9rqk4093qnvgswmdk1pbxk9najcrjn7a-vendor-cargo-deps/bc87b2b0f37b9a43ffdd82e8f11f3e864d9447ccd53a9a964250c3414c3656d9/numerica-3.0.0/src/domains/backend/integer.rs:1180:35
  1475. 419.06 s [alphal00p-docs-cargo] |
  1476. 419.06 s [alphal00p-docs-cargo] 1180 | MultiPrecisionInteger(RawMultiPrecisionInteger::from((&self.0) & &rhs.0))
  1477. 419.06 s [alphal00p-docs-cargo] | ^^^^^^^^^^^^^^^^^^^^^^^^ use of undeclared type `RawMultiPrecisionInteger`
  1478. 419.06 s [alphal00p-docs-cargo] |
  1479. 419.06 s [alphal00p-docs-cargo] help: a struct with a similar name exists
  1480. 419.06 s [alphal00p-docs-cargo] |
  1481. 419.06 s [alphal00p-docs-cargo] 1180 - MultiPrecisionInteger(RawMultiPrecisionInteger::from((&self.0) & &rhs.0))
  1482. 419.06 s [alphal00p-docs-cargo] 1180 + MultiPrecisionInteger(MultiPrecisionInteger::from((&self.0) & &rhs.0))
  1483. 419.06 s [alphal00p-docs-cargo] |
  1484. 419.06 s [alphal00p-docs-cargo]
  1485. 419.06 s [alphal00p-docs-cargo] error[E0433]: cannot find type `RawMultiPrecisionInteger` in this scope
  1486. 419.06 s [alphal00p-docs-cargo] --> /nix/store/9rqk4093qnvgswmdk1pbxk9najcrjn7a-vendor-cargo-deps/bc87b2b0f37b9a43ffdd82e8f11f3e864d9447ccd53a9a964250c3414c3656d9/numerica-3.0.0/src/domains/backend/integer.rs:1212:35
  1487. 419.06 s [alphal00p-docs-cargo] |
  1488. 419.06 s [alphal00p-docs-cargo] 1212 | MultiPrecisionInteger(RawMultiPrecisionInteger::from(-&self.0))
  1489. 419.06 s [alphal00p-docs-cargo] | ^^^^^^^^^^^^^^^^^^^^^^^^ use of undeclared type `RawMultiPrecisionInteger`
  1490. 419.06 s [alphal00p-docs-cargo] |
  1491. 419.06 s [alphal00p-docs-cargo] help: a struct with a similar name exists
  1492. 419.06 s [alphal00p-docs-cargo] |
  1493. 419.06 s [alphal00p-docs-cargo] 1212 - MultiPrecisionInteger(RawMultiPrecisionInteger::from(-&self.0))
  1494. 419.06 s [alphal00p-docs-cargo] 1212 + MultiPrecisionInteger(MultiPrecisionInteger::from(-&self.0))
  1495. 419.06 s [alphal00p-docs-cargo] |
  1496. 419.06 s [alphal00p-docs-cargo]
  1497. 419.06 s [alphal00p-docs-cargo] error[E0425]: cannot find function `write_lsf_bytes` in this scope
  1498. 419.06 s [alphal00p-docs-cargo] --> /nix/store/9rqk4093qnvgswmdk1pbxk9najcrjn7a-vendor-cargo-deps/bc87b2b0f37b9a43ffdd82e8f11f3e864d9447ccd53a9a964250c3414c3656d9/numerica-3.0.0/src/domains/backend/integer.rs:1682:5
  1499. 419.06 s [alphal00p-docs-cargo] |
  1500. 419.06 s [alphal00p-docs-cargo] 1682 | write_lsf_bytes(value, &mut bytes);
  1501. 419.06 s [alphal00p-docs-cargo] | ^^^^^^^^^^^^^^^ not found in this scope
  1502. 419.06 s [alphal00p-docs-cargo]
  1503. 419.06 s [alphal00p-docs-cargo] Some errors have detailed explanations: E0425, E0432, E0433.
  1504. 419.06 s [alphal00p-docs-cargo] For more information about an error, try `rustc --explain E0425`.
  1505. 419.07 s [alphal00p-docs-cargo] error: could not compile `numerica` (lib) due to 29 previous errors
  1506. 419.07 s [alphal00p-docs-cargo] warning: build failed, waiting for other jobs to finish...
  1507. 474.09 s Progress: 5 of 6 built (1 failed), 42 of 42 downloaded from cache
  1508. 474.09 s Failed to build alphal00p-docs-cargo after 7m01s
  1509. 474.09 s Cannot build '/nix/store/8y99gpj1qs95jysr3c6kccvh7lrd78i4-alphal00p-docs-cargo-0.1.0.drv'.
  1510. 474.09 s Reason: builder failed with exit code 101.
  1511. 474.09 s Output paths:
  1512. 474.09 s /nix/store/fqkj46cxkiacfpx0ka5kpgqxjp46xnvs-alphal00p-docs-cargo-0.1.0
  1513. 474.09 s Last 1200 log lines:
  1514. 474.09 s > cargoArtifacts not set, will not reuse any cargo artifacts
  1515. 474.09 s > Running phase: unpackPhase
  1516. 474.09 s > unpacking source archive /nix/store/4pklqwhrgb01wfp3djh4jb2wr4xr9ila-source
  1517. 474.09 s > source root is source
  1518. 474.09 s > Running phase: patchPhase
  1519. 474.09 s > Executing configureCargoCommonVars
  1520. 474.09 s > Running phase: updateAutotoolsGnuConfigScriptsPhase
  1521. 474.09 s > Running phase: configurePhase
  1522. 474.09 s > will append /build/source/.cargo-home/config.toml with contents of /nix/store/9rqk4093qnvgswmdk1pbxk9najcrjn7a-vendor-cargo-deps/config.toml
  1523. 474.09 s > default configurePhase, nothing to do
  1524. 474.09 s > Running phase: buildPhase
  1525. 474.09 s > +++ command cargo --version
  1526. 474.09 s > cargo 1.98.1 (797e8a9bc 2026-08-05)
  1527. 474.09 s > +++ command cargo build --profile docs --locked -p alphal00p-docs-catalogs --bin alphal00p-docs-catalogs
  1528. 474.09 s > Compiling proc-macro2 v1.0.106
  1529. 474.09 s > Compiling unicode-ident v1.0.24
  1530. 474.09 s > Compiling quote v1.0.45
  1531. 474.09 s > Compiling serde_core v1.0.228
  1532. 474.09 s > Compiling memchr v2.8.0
  1533. 474.09 s > Compiling utf8parse v0.2.2
  1534. 474.09 s > Compiling zmij v1.0.21
  1535. 474.09 s > Compiling serde v1.0.228
  1536. 474.09 s > Compiling anstyle-query v1.1.5
  1537. 474.09 s > Compiling colorchoice v1.0.5
  1538. 474.09 s > Compiling is_terminal_polyfill v1.70.2
  1539. 474.09 s > Compiling serde_json v1.0.149
  1540. 474.09 s > Compiling anstyle v1.0.14
  1541. 474.09 s > Compiling thiserror v2.0.18
  1542. 474.09 s > Compiling equivalent v1.0.2
  1543. 474.09 s > Compiling eyre v0.6.12
  1544. 474.09 s > Compiling anstyle-parse v1.0.0
  1545. 474.09 s > Compiling itoa v1.0.18
  1546. 474.09 s > Compiling heck v0.5.0
  1547. 474.09 s > Compiling hashbrown v0.17.1
  1548. 474.09 s > Compiling clap_lex v1.1.0
  1549. 474.09 s > Compiling regex-syntax v0.8.10
  1550. 474.09 s > Compiling anstream v1.0.0
  1551. 474.09 s > Compiling strsim v0.11.1
  1552. 474.09 s > Compiling indenter v0.3.4
  1553. 474.09 s > Compiling once_cell v1.21.4
  1554. 474.09 s > Compiling clap_builder v4.6.0
  1555. 474.09 s > Compiling aho-corasick v1.1.4
  1556. 474.09 s > Compiling syn v2.0.117
  1557. 474.09 s > Compiling regex-automata v0.4.14
  1558. 474.09 s > Compiling indexmap v2.14.0
  1559. 474.09 s > Compiling serde_derive v1.0.228
  1560. 474.09 s > Compiling thiserror-impl v2.0.18
  1561. 474.09 s > Compiling clap_derive v4.6.1
  1562. 474.09 s > Compiling alphal00p-docs-macros v0.1.0 (/build/source/crates/alphal00p-docs-macros)
  1563. 474.09 s > Compiling regex v1.12.3
  1564. 474.09 s > Compiling clap v4.6.1
  1565. 474.09 s > Compiling alphal00p-docs-schema v0.1.0 (/build/source/crates/alphal00p-docs-schema)
  1566. 474.09 s > Compiling alphal00p-docs-catalogs v0.1.0 (/build/source/crates/alphal00p-docs-catalogs)
  1567. 474.09 s > Finished `docs` profile [unoptimized] target(s) in 9.75s
  1568. 474.09 s > +++ command cargo build --profile docs --locked -p alphal00p-docs-python-exporter --features gammaloop
  1569. 474.09 s > Compiling serde_core v1.0.228
  1570. 474.09 s > Compiling libc v0.2.186
  1571. 474.09 s > Compiling cfg-if v1.0.4
  1572. 474.09 s > Compiling serde v1.0.228
  1573. 474.09 s > Compiling memchr v2.8.0
  1574. 474.09 s > Compiling autocfg v1.5.0
  1575. 474.09 s > Compiling libm v0.2.16
  1576. 474.09 s > Compiling version_check v0.9.5
  1577. 474.09 s > Compiling either v1.15.0
  1578. 474.09 s > Compiling zerocopy v0.8.48
  1579. 474.09 s > Compiling crossbeam-utils v0.8.21
  1580. 474.09 s > Compiling log v0.4.29
  1581. 474.09 s > Compiling rayon-core v1.13.0
  1582. 474.09 s > Compiling unicode-width v0.2.2
  1583. 474.09 s > Compiling foldhash v0.2.0
  1584. 474.09 s > Compiling target-lexicon v0.13.5
  1585. 474.09 s > Compiling syn v2.0.117
  1586. 474.09 s > Compiling syn v3.0.4
  1587. 474.09 s > Compiling serde_json v1.0.149
  1588. 474.09 s > Compiling lazy_static v1.5.0
  1589. 474.09 s > Compiling crunchy v0.2.4
  1590. 474.09 s > Compiling getrandom v0.3.4
  1591. 474.09 s > Compiling paste v1.0.15
  1592. 474.09 s > Compiling siphasher v1.0.2
  1593. 474.09 s > Compiling aho-corasick v1.1.4
  1594. 474.09 s > Compiling num-traits v0.2.19
  1595. 474.09 s > Compiling tiny-keccak v2.0.2
  1596. 474.09 s > Compiling anyhow v1.0.102
  1597. 474.09 s > Compiling itertools v0.14.0
  1598. 474.09 s > Compiling static_assertions v1.1.0
  1599. 474.09 s > Compiling num-conv v0.2.1
  1600. 474.09 s > Compiling powerfmt v0.2.0
  1601. 474.09 s > Compiling rustix v1.1.4
  1602. 474.09 s > Compiling time-core v0.1.8
  1603. 474.09 s > Compiling time-macros v0.2.27
  1604. 474.09 s > Compiling crossbeam-epoch v0.9.18
  1605. 474.09 s > Compiling deranged v0.5.8
  1606. 474.09 s > Compiling linux-raw-sys v0.12.1
  1607. 474.09 s > Compiling allocator-api2 v0.2.21
  1608. 474.09 s > Compiling pyo3-build-config v0.28.3
  1609. 474.09 s > Compiling crossbeam-deque v0.8.6
  1610. 474.09 s > Compiling num_threads v0.1.7
  1611. 474.09 s > Compiling hashbrown v0.16.1
  1612. 474.09 s > Compiling tracing-core v0.1.36
  1613. 474.09 s > Compiling virtue v0.0.18
  1614. 474.09 s > Compiling winnow v1.0.2
  1615. 474.09 s > Compiling arrayvec v0.7.6
  1616. 474.09 s > Compiling regex-automata v0.4.14
  1617. 474.09 s > Compiling rayon v1.12.0
  1618. 474.09 s > Compiling phf_shared v0.11.3
  1619. 474.09 s > Compiling bincode_derive v2.0.1
  1620. 474.09 s > Compiling unty v0.0.4
  1621. 474.09 s > Compiling toml_writer v1.1.1+spec-1.1.0
  1622. 474.09 s > Compiling gmp-mpfr-sys v1.7.1
  1623. 474.09 s > Compiling getrandom v0.2.17
  1624. 474.09 s > Compiling bitflags v2.11.1
  1625. 474.09 s > Compiling time v0.3.47
  1626. 474.09 s > Compiling rand_core v0.6.4
  1627. 474.09 s > Compiling serde_spanned v1.1.1
  1628. 474.09 s > Compiling rand_core v0.9.5
  1629. 474.09 s > Compiling pin-project-lite v0.2.17
  1630. 474.09 s > Compiling nu-ansi-term v0.50.3
  1631. 474.09 s > Compiling num-integer v0.1.46
  1632. 474.09 s > Compiling approx v0.5.1
  1633. 474.09 s > Compiling bytemuck_derive v1.12.0
  1634. 474.09 s > Compiling toml_parser v1.1.2+spec-1.1.0
  1635. 474.09 s > Compiling tracing-log v0.2.0
  1636. 474.09 s > Compiling matrixmultiply v0.3.10
  1637. 474.09 s > Compiling sharded-slab v0.1.7
  1638. 474.09 s > Compiling hashbrown v0.17.1
  1639. 474.09 s > Compiling thread_local v1.1.9
  1640. 474.09 s > Compiling syn v1.0.109
  1641. 474.09 s > Compiling typenum v1.20.0
  1642. 474.09 s > Compiling rug v1.30.0
  1643. 474.09 s > Compiling option-ext v0.2.0
  1644. 474.09 s > Compiling dirs-sys v0.5.0
  1645. 474.09 s > Compiling pyo3-ffi v0.28.3
  1646. 474.09 s > Compiling num-complex v0.4.6
  1647. 474.09 s > Compiling toml_datetime v1.1.1+spec-1.1.0
  1648. 474.09 s > Compiling dyn-clone v1.0.20
  1649. 474.09 s > Compiling az v1.3.0
  1650. 474.09 s > Compiling rawpointer v0.2.1
  1651. 474.09 s > Compiling fnv v1.0.7
  1652. 474.09 s > Compiling alloc-no-stdlib v2.0.4
  1653. 474.09 s > Compiling alloc-stdlib v0.2.2
  1654. 474.09 s > Compiling num-bigint v0.4.6
  1655. 474.09 s > Compiling pyo3-macros-backend v0.28.3
  1656. 474.09 s > Compiling generic-array v0.14.7
  1657. 474.09 s > Compiling colored v3.1.1
  1658. 474.09 s > Compiling bitflags v1.3.2
  1659. 474.09 s > Compiling errno v0.3.14
  1660. 474.09 s > Compiling getopts v0.2.24
  1661. 474.09 s > Compiling ident_case v1.0.1
  1662. 474.09 s > Compiling same-file v1.0.6
  1663. 474.09 s > Compiling parking_lot_core v0.9.12
  1664. 474.09 s > Compiling signal-hook v0.3.18
  1665. 474.09 s > Compiling walkdir v2.5.0
  1666. 474.09 s > Compiling bytemuck v1.25.0
  1667. 474.09 s > Compiling signal-hook-registry v1.4.8
  1668. 474.09 s > Compiling indexmap v2.14.0
  1669. 474.09 s > Compiling region v3.0.2
  1670. 474.09 s > Compiling toml v1.1.2+spec-1.1.0
  1671. 474.09 s > Compiling safe_arch v0.7.4
  1672. 474.09 s > Compiling safe_arch v1.2.0
  1673. 474.09 s > Compiling matchers v0.2.0
  1674. 474.09 s > Compiling regex v1.12.3
  1675. 474.09 s > Compiling synstructure v0.13.2
  1676. 474.09 s > Compiling const-random-macro v0.1.16
  1677. 474.09 s > Compiling hugepage-rs v0.1.1
  1678. 474.09 s > Compiling wasmtime-jit-icache-coherence v34.0.2
  1679. 474.09 s > Compiling vte v0.14.1
  1680. 474.09 s > Compiling wide v0.7.33
  1681. 474.09 s > Compiling smartstring v1.0.1
  1682. 474.09 s > Compiling wide v1.7.0
  1683. 474.09 s > Compiling ahash v0.8.12
  1684. 474.09 s > Compiling scopeguard v1.2.0
  1685. 474.09 s > Compiling unic-common v0.9.0
  1686. 474.09 s > Compiling spec_math v0.1.6
  1687. 474.09 s > Compiling unic-char-range v0.9.0
  1688. 474.09 s > Compiling inventory v0.3.24
  1689. 474.09 s > Compiling unic-char-property v0.9.0
  1690. 474.09 s > Compiling serde_derive v1.0.228
  1691. 474.09 s > Compiling zerocopy-derive v0.8.48
  1692. 474.09 s > Compiling tracing-attributes v0.1.31
  1693. 474.09 s > Compiling thiserror-impl v2.0.18
  1694. 474.09 s > Compiling strum_macros v0.27.2
  1695. 474.09 s > Compiling is-macro v0.3.7
  1696. 474.09 s > Compiling unic-ucd-version v0.9.0
  1697. 474.09 s > Compiling lock_api v0.4.14
  1698. 474.09 s > Compiling const-random v0.1.18
  1699. 474.09 s > Compiling terminal_size v0.4.4
  1700. 474.09 s > Compiling brotli-decompressor v5.0.0
  1701. 474.09 s > Compiling mio v1.2.0
  1702. 474.09 s > Compiling rustpython-parser-vendored v0.4.0
  1703. 474.09 s > Compiling itertools v0.11.0
  1704. 474.09 s > Compiling iana-time-zone v0.1.65
  1705. 474.09 s > Compiling fastrand v2.4.1
  1706. 474.09 s > Compiling winnow v0.7.15
  1707. 474.09 s > Compiling minimal-lexical v0.2.1
  1708. 474.09 s > Compiling unicase v2.9.0
  1709. 474.09 s > Compiling rustix v0.38.44
  1710. 474.09 s > Compiling indenter v0.3.4
  1711. 474.09 s > Compiling brotli v8.0.2
  1712. 474.09 s > Compiling nom v7.1.3
  1713. 474.09 s > Compiling clap_builder v4.6.0
  1714. 474.09 s > Compiling thiserror v2.0.18
  1715. 474.09 s > Compiling tracing v0.1.44
  1716. 474.09 s > Compiling simba v0.9.1
  1717. 474.09 s > Compiling rustpython-parser-core v0.4.0
  1718. 474.09 s > Compiling signal-hook-mio v0.2.5
  1719. 474.09 s > Compiling zerofrom-derive v0.1.7
  1720. 474.09 s > Compiling clap_derive v4.6.1
  1721. 474.09 s > Compiling crypto-common v0.1.7
  1722. 474.09 s > Compiling block-buffer v0.10.4
  1723. 474.09 s > Compiling directories v6.0.0
  1724. 474.09 s > Compiling numpy v0.28.0
  1725. 474.09 s > Compiling strum v0.27.2
  1726. 474.09 s > Compiling phf v0.11.3
  1727. 474.09 s > Compiling libloading v0.9.0
  1728. 474.09 s > Compiling self_cell v1.2.2
  1729. 474.09 s > Compiling tinyjson v2.5.1
  1730. 474.09 s > Compiling ed25519-compact v2.4.2
  1731. 474.09 s > Compiling bytes v1.11.1
  1732. 474.09 s > Compiling append-only-vec v0.1.8
  1733. 474.09 s > Compiling linux-raw-sys v0.4.15
  1734. 474.09 s > Compiling byteorder v1.5.0
  1735. 474.09 s > Compiling unicode-segmentation v1.13.2
  1736. 474.09 s > Compiling rustc-hash v2.1.2
  1737. 474.09 s > Compiling data-encoding v2.11.1
  1738. 474.09 s > Compiling ansitok v0.3.0
  1739. 474.09 s > Compiling digest v0.10.7
  1740. 474.09 s > Compiling rustpython-ast v0.4.0
  1741. 474.09 s > Compiling zerofrom v0.1.8
  1742. 474.09 s > Compiling unic-ucd-ident v0.9.0
  1743. 474.09 s > Compiling pyo3-macros v0.28.3
  1744. 474.09 s > Compiling unic-emoji-char v0.9.0
  1745. 474.09 s > Compiling yoke-derive v0.8.2
  1746. 474.09 s > Compiling pyo3 v0.28.3
  1747. 474.09 s > Compiling phf_shared v0.13.1
  1748. 474.09 s > Compiling smallvec v1.15.1
  1749. 474.09 s > Compiling bincode v2.0.1
  1750. 474.09 s > Compiling tracing-serde v0.2.0
  1751. 474.09 s > Compiling chrono v0.4.44
  1752. 474.09 s > Compiling tracing-subscriber v0.3.23
  1753. 474.09 s > Compiling clap v4.6.1
  1754. 474.09 s > Compiling bstr v1.12.1
  1755. 474.09 s > Compiling parking_lot v0.12.5
  1756. 474.09 s > Compiling lalrpop-util v0.20.2
  1757. 474.09 s > Compiling typeid v1.0.3
  1758. 474.09 s > Compiling bincode-trait-derive v0.1.1
  1759. 474.09 s > Compiling stable_deref_trait v1.2.1
  1760. 474.09 s > Compiling getrandom v0.4.2
  1761. 474.09 s > Compiling cpufeatures v0.2.17
  1762. 474.09 s > Compiling rustc-hash v1.1.0
  1763. 474.09 s > Compiling ciborium-io v0.2.2
  1764. 474.09 s > Compiling plotters-backend v0.3.7
  1765. 474.09 s > Compiling sha2 v0.10.9
  1766. 474.09 s > Compiling num-rational v0.4.2
  1767. 474.09 s > Compiling plotters-svg v0.3.7
  1768. 474.09 s > Compiling globset v0.4.18
  1769. 474.09 s > Compiling crossterm v0.28.1
  1770. 474.09 s > Compiling toml_datetime v0.6.11
  1771. 474.09 s > Compiling yoke v0.8.3
  1772. 474.09 s > Compiling serde_spanned v0.6.9
  1773. 474.09 s > Compiling xprec v0.2.2
  1774. 474.09 s > Compiling eyre v0.6.12
  1775. 474.09 s > Compiling ppv-lite86 v0.2.21
  1776. 474.09 s > Compiling half v2.7.1
  1777. 474.09 s > Compiling zerovec-derive v0.11.6
  1778. 474.09 s > Compiling console v0.16.3
  1779. 474.09 s > Compiling toml_datetime v0.7.5+spec-1.1.0
  1780. 474.09 s > Compiling itertools v0.10.5
  1781. 474.09 s > Compiling ucd-trie v0.1.7
  1782. 474.09 s > Compiling adler2 v2.0.1
  1783. 474.09 s > Compiling ciborium-ll v0.2.2
  1784. 474.09 s > Compiling cast v0.3.0
  1785. 474.09 s > Compiling toml_write v0.1.2
  1786. 474.09 s > Compiling rand_chacha v0.3.1
  1787. 474.09 s > Compiling rand_chacha v0.9.0
  1788. 474.09 s > Compiling symbolica v2.2.0 (https://github.com/symbolica-dev/symbolica?rev=4f1323185fe5e0c0f8c864ab89edd1905e7adef1#4f132318)
  1789. 474.09 s > Compiling rustversion v1.0.22
  1790. 474.09 s > Compiling simd-adler32 v0.3.10
  1791. 474.09 s > Compiling toml_edit v0.22.27
  1792. 474.09 s > Compiling rand v0.8.6
  1793. 474.09 s > Compiling rand v0.9.4
  1794. 474.09 s > Compiling miniz_oxide v0.8.9
  1795. 474.09 s > Compiling ciborium v0.2.2
  1796. 474.09 s > Compiling pest v2.8.6
  1797. 474.09 s > Compiling toml v0.9.12+spec-1.1.0
  1798. 474.09 s > Compiling rust-embed-utils v8.11.0
  1799. 474.09 s > Compiling plotters v0.3.7
  1800. 474.09 s > Compiling symjit v2.25.6
  1801. 474.09 s > Compiling phf_generator v0.11.3
  1802. 474.09 s > Compiling tinytemplate v1.2.1
  1803. 474.09 s > Compiling zerovec v0.11.8
  1804. 474.09 s > Compiling ansi-str v0.9.0
  1805. 474.09 s > Compiling ndarray v0.17.2
  1806. 474.09 s > Compiling phf_codegen v0.11.3
  1807. 474.09 s > Compiling criterion-plot v0.5.0
  1808. 474.09 s > Compiling displaydoc v0.2.7
  1809. 474.09 s > Compiling unicode_names2_generator v1.3.0
  1810. 474.09 s > Compiling rustpython-parser v0.4.0
  1811. 474.09 s > Compiling is-terminal v0.4.17
  1812. 474.09 s > Compiling slotmap v1.1.1
  1813. 474.09 s > Compiling maplit v1.0.2
  1814. 474.09 s > Compiling oorandom v11.1.5
  1815. 474.09 s > Compiling bytecount v0.6.9
  1816. 474.09 s > Compiling anes v0.1.6
  1817. 474.09 s > Compiling pest_meta v2.8.6
  1818. 474.09 s > Compiling papergrid v0.18.0
  1819. 474.09 s > Compiling ron v0.12.1
  1820. 474.09 s > Compiling criterion v0.5.1
  1821. 474.09 s > Compiling tempfile v3.27.0
  1822. 474.09 s > Compiling testing_table v0.3.0
  1823. 474.09 s > Compiling unicode_names2 v1.3.0
  1824. 474.09 s > Compiling toml v0.8.23
  1825. 474.09 s > Compiling tinystr v0.8.4
  1826. 474.09 s > Compiling toml_edit v0.25.11+spec-1.1.0
  1827. 474.09 s > Compiling tabled_derive v0.12.0
  1828. 474.09 s > Compiling similar v2.7.0
  1829. 474.09 s > Compiling unic-langid-impl v0.9.6
  1830. 474.09 s > Compiling pest_generator v2.8.6
  1831. 474.09 s > Compiling insta v1.47.2
  1832. 474.09 s > Compiling proc-macro2-diagnostics v0.10.1
  1833. 474.09 s > Compiling proc-macro-error-attr v1.0.4
  1834. 474.09 s > Compiling uncased v0.9.10
  1835. 474.09 s > Compiling slab v0.4.12
  1836. 474.09 s > Compiling strsim v0.10.0
  1837. 474.09 s > Compiling radium v0.7.0
  1838. 474.09 s > Compiling pest_derive v2.8.6
  1839. 474.09 s > Compiling darling_core v0.23.0
  1840. 474.09 s > Compiling darling_core v0.14.4
  1841. 474.09 s > Compiling tabled v0.22.0
  1842. 474.09 s > Compiling figment v0.10.19
  1843. 474.09 s > Compiling proc-macro-error v1.0.4
  1844. 474.09 s > Compiling tap v1.0.1
  1845. 474.09 s > Compiling ryu v1.0.23
  1846. 474.09 s > Compiling wyz v0.5.1
  1847. 474.09 s > Compiling castaway v0.2.4
  1848. 474.09 s > Compiling find-msvc-tools v0.1.9
  1849. 474.09 s > Compiling indoc v2.0.7
  1850. 474.09 s > Compiling instability v0.3.12
  1851. 474.09 s > Compiling shlex v1.3.0
  1852. 474.09 s > Compiling heck v0.4.1
  1853. 474.09 s > Compiling funty v2.0.0
  1854. 474.09 s > Compiling cc v1.2.61
  1855. 474.09 s > Compiling duplicate v2.0.1
  1856. 474.09 s > Compiling compact_str v0.9.0
  1857. 474.09 s > Compiling bitvec v1.0.1
  1858. 474.09 s > Compiling dot-parser v0.5.1
  1859. 474.09 s > Compiling unicode-truncate v2.0.1
  1860. 474.09 s > Compiling convert_case v0.10.0
  1861. 474.09 s > Compiling kasuari v0.4.12
  1862. 474.09 s > Compiling darling_macro v0.14.4
  1863. 474.09 s > Compiling serde_repr v0.1.20
  1864. 474.09 s > Compiling env_filter v1.0.1
  1865. 474.09 s > Compiling num-iter v0.1.45
  1866. 474.09 s > Compiling lru v0.16.4
  1867. 474.09 s > Compiling ref-ops v0.2.5
  1868. 474.09 s > Compiling darling_macro v0.23.0
  1869. 474.09 s > Compiling convert_case v0.4.0
  1870. 474.09 s > Compiling jiff v0.2.24
  1871. 474.09 s > Compiling ratatui-core v0.1.0
  1872. 474.09 s > Compiling num v0.4.3
  1873. 474.09 s > Compiling derive_more-impl v2.1.1
  1874. 474.09 s > Compiling duplicate v1.0.0
  1875. 474.09 s > Compiling enum-try-as-inner v0.1.1
  1876. 474.09 s > Compiling darling v0.14.4
  1877. 474.09 s > Compiling derive_builder_core v0.11.2
  1878. 474.09 s > Compiling blake3 v1.8.5
  1879. 474.09 s > Compiling derive_more v0.99.20
  1880. 474.09 s > Compiling rand_xoshiro v0.6.0
  1881. 474.09 s > Compiling delegate v0.12.0
  1882. 474.09 s > Compiling features v0.10.0
  1883. 474.09 s > Compiling colored v2.2.0
  1884. 474.09 s > Compiling object v0.37.3
  1885. 474.09 s > Compiling darling v0.23.0
  1886. 474.09 s > Compiling constcat v0.5.1
  1887. 474.09 s > Compiling thiserror v1.0.69
  1888. 474.09 s > Compiling portable-atomic v1.13.1
  1889. 474.09 s > Compiling owo-colors v4.3.0
  1890. 474.09 s > Compiling gat-lending-iterator v0.1.8
  1891. 474.09 s > Compiling litrs v1.0.0
  1892. 474.09 s > Compiling cfg_aliases v0.2.1
  1893. 474.09 s > Compiling nix v0.31.2
  1894. 474.09 s > Compiling derive_more v2.1.1
  1895. 474.09 s > Compiling derive_builder_macro v0.11.2
  1896. 474.09 s > Compiling rand_distr v0.4.3
  1897. 474.09 s > Compiling simba v0.6.0
  1898. 474.09 s > Compiling phf_generator v0.13.1
  1899. 474.09 s > Compiling nalgebra-macros v0.1.0
  1900. 474.09 s > Compiling thiserror-impl v1.0.69
  1901. 474.09 s > Compiling dirs v6.0.0
  1902. 474.09 s > Compiling line-clipping v0.3.7
  1903. 474.09 s > Compiling vte v0.15.0
  1904. 474.09 s > Compiling document-features v0.2.12
  1905. 474.09 s > Compiling joinery v2.1.0
  1906. 474.09 s > Compiling constant_time_eq v0.4.2
  1907. 474.09 s > Compiling cpufeatures v0.3.0
  1908. 474.09 s > Compiling gimli v0.32.3
  1909. 474.09 s > Compiling ref-cast v1.0.25
  1910. 474.09 s > Compiling color-spantrace v0.3.0
  1911. 474.09 s > Compiling arrayref v0.3.9
  1912. 474.09 s > Compiling clarabel v0.11.1
  1913. 474.09 s > Compiling ratatui-widgets v0.3.0
  1914. 474.09 s > Compiling vt100 v0.16.2
  1915. 474.09 s > Compiling derive_builder v0.11.2
  1916. 474.09 s > Compiling titlecase v2.2.1
  1917. 474.09 s > Compiling phf_macros v0.13.1
  1918. 474.09 s > Compiling crossterm v0.29.0
  1919. 474.09 s > Compiling tracing-error v0.2.1
  1920. 474.09 s > Compiling serde-big-array v0.5.1
  1921. 474.09 s > Compiling ref-cast-impl v1.0.25
  1922. 474.09 s > Compiling enum_dispatch v0.3.13
  1923. 474.09 s > Compiling delegate v0.13.5
  1924. 474.09 s > Compiling serde_derive_internals v0.29.1
  1925. 474.09 s > Compiling env_logger v0.11.10
  1926. 474.09 s > Compiling amd v0.2.2
  1927. 474.09 s > Compiling subprocess v0.2.15
  1928. 474.09 s > Compiling rust_lisp v0.18.0
  1929. 474.09 s > Compiling semver v1.0.28
  1930. 474.09 s > Compiling rustc-demangle v0.1.27
  1931. 474.09 s > Compiling vakint v0.1.2 (/build/source/crates/vakint)
  1932. 474.09 s > Compiling unit-prefix v0.5.2
  1933. 474.09 s > Compiling base64 v0.22.1
  1934. 474.09 s > Compiling indicatif v0.18.4
  1935. 474.09 s > Compiling deprecate-until v1.0.0
  1936. 474.09 s > Compiling string-template-plus v0.4.3
  1937. 474.09 s > Compiling schemars_derive v1.2.1
  1938. 474.09 s > Compiling phf v0.13.1
  1939. 474.09 s > Compiling ratatui-crossterm v0.1.0
  1940. 474.09 s > Compiling ratatui-macros v0.7.0
  1941. 474.09 s > Compiling shellexpand v3.1.2
  1942. 474.09 s > Compiling xpct v0.5.1
  1943. 474.09 s > Compiling brotli-decompressor v4.0.3
  1944. 474.09 s > Compiling integer-sqrt v0.1.5
  1945. 474.09 s > Compiling addr2line v0.25.1
  1946. 474.09 s > Compiling crossbeam-channel v0.5.15
  1947. 474.09 s > Compiling itertools v0.12.1
  1948. 474.09 s > Compiling include_dir_macros v0.7.4
  1949. 474.09 s > Compiling gammaloop-tracing-filter-macros v0.1.0 (/build/source/crates/gammaloop-tracing-filter-macros)
  1950. 474.09 s > Compiling pyo3-stub-gen-derive v0.17.2
  1951. 474.09 s > Compiling unsafe-libyaml v0.2.11
  1952. 474.09 s > Compiling version-compare v0.2.1
  1953. 474.09 s > Compiling gammalooprs v0.3.4 (/build/source/crates/gammalooprs)
  1954. 474.09 s > Compiling symlink v0.1.0
  1955. 474.09 s > Compiling ctrlc v3.5.2
  1956. 474.09 s > Compiling tracing-appender v0.2.5
  1957. 474.09 s > Compiling include_dir v0.7.4
  1958. 474.09 s > Compiling pathfinding v4.15.0
  1959. 474.09 s > Compiling tracing-indicatif v0.3.14
  1960. 474.09 s > Compiling rust-embed-impl v8.11.0
  1961. 474.09 s > Compiling ratatui v0.30.0
  1962. 474.09 s > Compiling json5 v0.4.1
  1963. 474.09 s > Compiling strum_macros v0.26.4
  1964. 474.09 s > Compiling typed-index-collections v3.5.0
  1965. 474.09 s > Compiling brotli v7.0.0
  1966. 474.09 s > Compiling serde_yaml v0.9.34+deprecated
  1967. 474.09 s > Compiling clap_complete v4.6.3
  1968. 474.09 s > Compiling vectorize v0.2.0
  1969. 474.09 s > Compiling strip-ansi-escapes v0.2.1
  1970. 474.09 s > Compiling gammaloop-api v0.1.0 (/build/source/crates/gammaloop-api)
  1971. 474.09 s > Compiling fd-lock v4.0.4
  1972. 474.09 s > Compiling itertools v0.13.0
  1973. 474.09 s > Compiling base62 v2.2.4
  1974. 474.09 s > Compiling strum v0.26.3
  1975. 474.09 s > Compiling ringbuffer v0.16.0
  1976. 474.09 s > Compiling nalgebra v0.29.0
  1977. 474.09 s > Compiling schemars v1.2.1
  1978. 474.09 s > Compiling clap_complete_nushell v4.6.0
  1979. 474.09 s > Compiling sysinfo v0.33.1
  1980. 474.09 s > Compiling backtrace v0.3.76
  1981. 474.09 s > Compiling rust-embed v8.11.0
  1982. 474.09 s > Compiling color-eyre v0.6.5
  1983. 474.09 s > Compiling pyo3-stub-gen v0.17.2
  1984. 474.09 s > Compiling reedline v0.42.0
  1985. 474.09 s > Compiling statrs v0.16.1
  1986. 474.09 s > Compiling momtrop v0.3.0
  1987. 474.09 s > Compiling numerica v3.0.0 (https://github.com/symbolica-dev/symbolica?rev=4f1323185fe5e0c0f8c864ab89edd1905e7adef1#4f132318)
  1988. 474.09 s > Compiling graphica v3.0.0 (https://github.com/symbolica-dev/symbolica?rev=4f1323185fe5e0c0f8c864ab89edd1905e7adef1#4f132318)
  1989. 474.09 s > Compiling symbolica-utils v0.1.0 (/build/source/crates/symbolica-utils)
  1990. 474.09 s > Compiling gammaloop-workspace-hack v0.1.0 (/build/source/crates/gammaloop-workspace-hack)
  1991. 474.09 s > Compiling spenso-macros v0.3.2 (/build/source/crates/spenso-macros)
  1992. 474.09 s > Compiling linnet v0.17.0 (/build/source/crates/linnet)
  1993. 474.09 s > Compiling spenso v0.6.0 (/build/source/crates/spenso)
  1994. 474.09 s > Compiling idenso v0.3.0 (/build/source/crates/idenso)
  1995. 474.09 s > Compiling gammaloop-tracing-filter v0.1.0 (/build/source/crates/gammaloop-tracing-filter)
  1996. 474.09 s > Compiling spenso-hep-lib v0.1.7 (/build/source/crates/spenso-hep-lib)
  1997. 474.09 s > Compiling alphal00p-docs-python-exporter v0.1.0 (/build/source/crates/alphal00p-docs-python-exporter)
  1998. 474.09 s > Finished `docs` profile [unoptimized] target(s) in 3m 54s
  1999. 474.09 s > +++ command cargo build --profile docs --locked -p alphal00p-docs-python-exporter --features linnet
  2000. 474.09 s > Compiling libc v0.2.186
  2001. 474.09 s > Compiling serde_core v1.0.228
  2002. 474.09 s > Compiling zerocopy v0.8.48
  2003. 474.09 s > Compiling log v0.4.29
  2004. 474.09 s > Compiling num-traits v0.2.19
  2005. 474.09 s > Compiling syn v1.0.109
  2006. 474.09 s > Compiling syn v2.0.117
  2007. 474.09 s > Compiling ahash v0.7.8
  2008. 474.09 s > Compiling bytecheck v0.6.12
  2009. 474.09 s > Compiling regex-syntax v0.8.10
  2010. 474.09 s > Compiling rend v0.4.2
  2011. 474.09 s > Compiling simdutf8 v0.1.5
  2012. 474.09 s > Compiling indexmap v2.14.0
  2013. 474.09 s > Compiling ahash v0.8.12
  2014. 474.09 s > Compiling figment v0.10.19
  2015. 474.09 s > Compiling either v1.15.0
  2016. 474.09 s > Compiling rkyv v0.7.46
  2017. 474.09 s > Compiling cgmath v0.18.0
  2018. 474.09 s > Compiling bincode v2.0.1
  2019. 474.09 s > Compiling itertools v0.11.0
  2020. 474.09 s > Compiling pyo3 v0.28.3
  2021. 474.09 s > Compiling venial v0.5.0
  2022. 474.09 s > Compiling seahash v4.1.0
  2023. 474.09 s > Compiling winnow v1.0.2
  2024. 474.09 s > Compiling arrayvec v0.7.6
  2025. 474.09 s > Compiling rustix v1.1.4
  2026. 474.09 s > Compiling smallvec v1.15.1
  2027. 474.09 s > Compiling polycool v0.4.0
  2028. 474.09 s > Compiling winnow v0.7.15
  2029. 474.09 s > Compiling bitflags v2.11.1
  2030. 474.09 s > Compiling toml_parser v1.1.2+spec-1.1.0
  2031. 474.09 s > Compiling toml_writer v1.1.1+spec-1.1.0
  2032. 474.09 s > Compiling kurbo v0.13.1
  2033. 474.09 s > Compiling linnet-py v0.1.0 (/build/source/crates/linnet-py)
  2034. 474.09 s > Compiling num-integer v0.1.46
  2035. 474.09 s > Compiling approx v0.4.0
  2036. 474.09 s > Compiling wasm-minimal-protocol v0.2.0
  2037. 474.09 s > Compiling num-complex v0.4.6
  2038. 474.09 s > Compiling regex-automata v0.4.14
  2039. 474.09 s > Compiling num-bigint v0.4.6
  2040. 474.09 s > Compiling chrono v0.4.44
  2041. 474.09 s > Compiling getrandom v0.2.17
  2042. 474.09 s > Compiling dirs-sys v0.5.0
  2043. 474.09 s > Compiling rand_core v0.6.4
  2044. 474.09 s > Compiling const-random-macro v0.1.16
  2045. 474.09 s > Compiling pyo3-ffi v0.28.3
  2046. 474.09 s > Compiling dirs v6.0.0
  2047. 474.09 s > Compiling hashbrown v0.12.3
  2048. 474.09 s > Compiling shellexpand v3.1.2
  2049. 474.09 s > Compiling getrandom v0.4.2
  2050. 474.09 s > Compiling const-random v0.1.18
  2051. 474.09 s > Compiling tempfile v3.27.0
  2052. 474.09 s > Compiling toml_datetime v0.7.5+spec-1.1.0
  2053. 474.09 s > Compiling serde_spanned v1.1.1
  2054. 474.09 s > Compiling serde_json v1.0.149
  2055. 474.09 s > Compiling toml v0.9.12+spec-1.1.0
  2056. 474.09 s > Compiling ptr_meta_derive v0.1.4
  2057. 474.09 s > Compiling bytecheck_derive v0.6.12
  2058. 474.09 s > Compiling rkyv_derive v0.7.46
  2059. 474.09 s > Compiling globset v0.4.18
  2060. 474.09 s > Compiling ptr_meta v0.1.4
  2061. 474.09 s > Compiling pest_generator v2.8.6
  2062. 474.09 s > Compiling pyo3-macros-backend v0.28.3
  2063. 474.09 s > Compiling proc-macro2-diagnostics v0.10.1
  2064. 474.09 s > Compiling rust-embed-utils v8.11.0
  2065. 474.09 s > Compiling zerocopy-derive v0.8.48
  2066. 474.09 s > Compiling serde_derive v1.0.228
  2067. 474.09 s > Compiling is-macro v0.3.7
  2068. 474.09 s > Compiling thiserror-impl v2.0.18
  2069. 474.09 s > Compiling bincode-trait-derive v0.1.1
  2070. 474.09 s > Compiling duplicate v2.0.1
  2071. 474.09 s > Compiling serde_repr v0.1.20
  2072. 474.09 s > Compiling rust-embed-impl v8.11.0
  2073. 474.09 s > Compiling pest_derive v2.8.6
  2074. 474.09 s > Compiling ppv-lite86 v0.2.21
  2075. 474.09 s > Compiling rand_chacha v0.3.1
  2076. 474.09 s > Compiling dot-parser v0.5.1
  2077. 474.09 s > Compiling rustpython-parser-core v0.4.0
  2078. 474.09 s > Compiling rustpython-ast v0.4.0
  2079. 474.09 s > Compiling rand v0.8.6
  2080. 474.09 s > Compiling thiserror v2.0.18
  2081. 474.09 s > Compiling rust-embed v8.11.0
  2082. 474.09 s > Compiling phf_generator v0.11.3
  2083. 474.09 s > Compiling phf_codegen v0.11.3
  2084. 474.09 s > Compiling unicode_names2_generator v1.3.0
  2085. 474.09 s > Compiling rustpython-parser v0.4.0
  2086. 474.09 s > Compiling unicode_names2 v1.3.0
  2087. 474.09 s > Compiling pyo3-macros v0.28.3
  2088. 474.09 s > Compiling serde v1.0.228
  2089. 474.09 s > Compiling bitvec v1.0.1
  2090. 474.09 s > Compiling half v2.7.1
  2091. 474.09 s > Compiling ciborium-ll v0.2.2
  2092. 474.09 s > Compiling ciborium v0.2.2
  2093. 474.09 s > Compiling kurvst v0.1.0 (/build/source/crates/kurvst)
  2094. 474.09 s > Compiling linnet v0.17.0 (/build/source/crates/linnet)
  2095. 474.09 s > Compiling pyo3-stub-gen-derive v0.17.2
  2096. 474.09 s > Compiling pyo3-stub-gen v0.17.2
  2097. 474.09 s > Compiling linnest v0.1.0 (/build/source/crates/linnest)
  2098. 474.09 s > Compiling alphal00p-docs-python-exporter v0.1.0 (/build/source/crates/alphal00p-docs-python-exporter)
  2099. 474.09 s > Finished `docs` profile [unoptimized] target(s) in 19.34s
  2100. 474.09 s > +++ command cargo build --profile docs --locked -p alphal00p-docs-python-exporter --features spenso
  2101. 474.09 s > Compiling pyo3-build-config v0.28.3
  2102. 474.09 s > Compiling symbolica v2.2.0 (https://github.com/symbolica-dev/symbolica?rev=4f1323185fe5e0c0f8c864ab89edd1905e7adef1#4f132318)
  2103. 474.09 s > Compiling syn v1.0.109
  2104. 474.09 s > Compiling figment v0.10.19
  2105. 474.09 s > Compiling proc-macro-error v1.0.4
  2106. 474.09 s > Compiling duplicate v1.0.0
  2107. 474.09 s > Compiling pyo3-macros-backend v0.28.3
  2108. 474.09 s > Compiling numpy v0.28.0
  2109. 474.09 s > Compiling pyo3-ffi v0.28.3
  2110. 474.09 s > Compiling pyo3 v0.28.3
  2111. 474.09 s > Compiling pyo3-macros v0.28.3
  2112. 474.09 s > Compiling pyo3-stub-gen v0.17.2
  2113. 474.09 s > Compiling numerica v3.0.0 (https://github.com/symbolica-dev/symbolica?rev=4f1323185fe5e0c0f8c864ab89edd1905e7adef1#4f132318)
  2114. 474.09 s > Compiling gammaloop-workspace-hack v0.1.0 (/build/source/crates/gammaloop-workspace-hack)
  2115. 474.09 s > Compiling graphica v3.0.0 (https://github.com/symbolica-dev/symbolica?rev=4f1323185fe5e0c0f8c864ab89edd1905e7adef1#4f132318)
  2116. 474.09 s > Compiling symbolica-utils v0.1.0 (/build/source/crates/symbolica-utils)
  2117. 474.09 s > Compiling tymbolica-atom-payload v0.1.0 (https://github.com/lcnbr/tymbolica?rev=32ae00483b4845161401afac8be755cc336cb2bb#32ae0048)
  2118. 474.09 s > Compiling linnet v0.17.0 (/build/source/crates/linnet)
  2119. 474.09 s > Compiling spenso v0.6.0 (/build/source/crates/spenso)
  2120. 474.09 s > Compiling idenso v0.3.0 (/build/source/crates/idenso)
  2121. 474.09 s > Compiling spenso-hep-lib v0.1.7 (/build/source/crates/spenso-hep-lib)
  2122. 474.09 s > Compiling spynso3 v0.1.2 (/build/source/crates/spynso3)
  2123. 474.09 s > Compiling alphal00p-docs-python-exporter v0.1.0 (/build/source/crates/alphal00p-docs-python-exporter)
  2124. 474.09 s > Finished `docs` profile [unoptimized] target(s) in 49.14s
  2125. 474.09 s > +++ command cargo build --profile docs --locked -p alphal00p-docs-python-exporter --features idenso
  2126. 474.09 s > Compiling pyo3 v0.28.3
  2127. 474.09 s > Compiling numpy v0.28.0
  2128. 474.09 s > Compiling pyo3-stub-gen v0.17.2
  2129. 474.09 s > Compiling numerica v3.0.0 (https://github.com/symbolica-dev/symbolica?rev=4f1323185fe5e0c0f8c864ab89edd1905e7adef1#4f132318)
  2130. 474.09 s > Compiling graphica v3.0.0 (https://github.com/symbolica-dev/symbolica?rev=4f1323185fe5e0c0f8c864ab89edd1905e7adef1#4f132318)
  2131. 474.09 s > Compiling symbolica v2.2.0 (https://github.com/symbolica-dev/symbolica?rev=4f1323185fe5e0c0f8c864ab89edd1905e7adef1#4f132318)
  2132. 474.09 s > Compiling symbolica-utils v0.1.0 (/build/source/crates/symbolica-utils)
  2133. 474.09 s > Compiling gammaloop-workspace-hack v0.1.0 (/build/source/crates/gammaloop-workspace-hack)
  2134. 474.09 s > Compiling linnet v0.17.0 (/build/source/crates/linnet)
  2135. 474.09 s > Compiling spenso v0.6.0 (/build/source/crates/spenso)
  2136. 474.09 s > Compiling idenso v0.3.0 (/build/source/crates/idenso)
  2137. 474.09 s > Compiling alphal00p-docs-python-exporter v0.1.0 (/build/source/crates/alphal00p-docs-python-exporter)
  2138. 474.09 s > Finished `docs` profile [unoptimized] target(s) in 44.60s
  2139. 474.09 s > +++ command cargo build --profile docs --locked -p alphal00p-docs-python-exporter --features vakint
  2140. 474.09 s > Compiling libc v0.2.186
  2141. 474.09 s > Compiling tiny-keccak v2.0.2
  2142. 474.09 s > Compiling bytemuck v1.25.0
  2143. 474.09 s > Compiling matrixmultiply v0.3.10
  2144. 474.09 s > Compiling getrandom v0.3.4
  2145. 474.09 s > Compiling num-integer v0.1.46
  2146. 474.09 s > Compiling pyo3 v0.28.3
  2147. 474.09 s > Compiling regex-automata v0.4.14
  2148. 474.09 s > Compiling pyo3-macros-backend v0.28.3
  2149. 474.09 s > Compiling pyo3-ffi v0.28.3
  2150. 474.09 s > Compiling ahash v0.8.12
  2151. 474.09 s > Compiling approx v0.5.1
  2152. 474.09 s > Compiling serde v1.0.228
  2153. 474.09 s > Compiling itertools v0.14.0
  2154. 474.09 s > Compiling smallvec v1.15.1
  2155. 474.09 s > Compiling gmp-mpfr-sys v1.7.1
  2156. 474.09 s > Compiling safe_arch v0.7.4
  2157. 474.09 s > Compiling rand_core v0.9.5
  2158. 474.09 s > Compiling safe_arch v1.2.0
  2159. 474.09 s > Compiling rayon v1.12.0
  2160. 474.09 s > Compiling tracing-attributes v0.1.31
  2161. 474.09 s > Compiling rand_chacha v0.9.0
  2162. 474.09 s > Compiling smartstring v1.0.1
  2163. 474.09 s > Compiling phf_shared v0.13.1
  2164. 474.09 s > Compiling wide v0.7.33
  2165. 474.09 s > Compiling fastrand v2.4.1
  2166. 474.09 s > Compiling rug v1.30.0
  2167. 474.09 s > Compiling wide v1.7.0
  2168. 474.09 s > Compiling rand v0.9.4
  2169. 474.09 s > Compiling phf_generator v0.13.1
  2170. 474.09 s > Compiling symbolica v2.2.0 (https://github.com/symbolica-dev/symbolica?rev=4f1323185fe5e0c0f8c864ab89edd1905e7adef1#4f132318)
  2171. 474.09 s > Compiling ndarray v0.17.2
  2172. 474.09 s > Compiling phf_macros v0.13.1
  2173. 474.09 s > Compiling directories v6.0.0
  2174. 474.09 s > Compiling subprocess v0.2.15
  2175. 474.09 s > Compiling vakint v0.1.2 (/build/source/crates/vakint)
  2176. 474.09 s > Compiling getrandom v0.2.17
  2177. 474.09 s > Compiling rand_core v0.6.4
  2178. 474.09 s > Compiling rand_chacha v0.3.1
  2179. 474.09 s > Compiling phf v0.13.1
  2180. 474.09 s > Compiling tracing v0.1.44
  2181. 474.09 s > Compiling rand v0.8.6
  2182. 474.09 s > Compiling simba v0.9.1
  2183. 474.09 s > Compiling phf_generator v0.11.3
  2184. 474.09 s > Compiling phf_codegen v0.11.3
  2185. 474.09 s > Compiling unicode_names2_generator v1.3.0
  2186. 474.09 s > Compiling rustpython-parser v0.4.0
  2187. 474.09 s > Compiling regex v1.12.3
  2188. 474.09 s > Compiling matchers v0.2.0
  2189. 474.09 s > Compiling tracing-subscriber v0.3.23
  2190. 474.09 s > Compiling unicode_names2 v1.3.0
  2191. 474.09 s > Compiling titlecase v2.2.1
  2192. 474.09 s > Compiling pyo3-macros v0.28.3
  2193. 474.09 s > Compiling string-template-plus v0.4.3
  2194. 474.09 s > Compiling xprec v0.2.2
  2195. 474.09 s > Compiling numpy v0.28.0
  2196. 474.09 s > Compiling pyo3-stub-gen-derive v0.17.2
  2197. 474.09 s > Compiling pyo3-stub-gen v0.17.2
  2198. 474.09 s > Compiling numerica v3.0.0 (https://github.com/symbolica-dev/symbolica?rev=4f1323185fe5e0c0f8c864ab89edd1905e7adef1#4f132318)
  2199. 474.09 s > error: select an integer backend: `integer-gmp` or `integer-malachite`
  2200. 474.09 s > --> /nix/store/9rqk4093qnvgswmdk1pbxk9najcrjn7a-vendor-cargo-deps/bc87b2b0f37b9a43ffdd82e8f11f3e864d9447ccd53a9a964250c3414c3656d9/numerica-3.0.0/src/lib.rs:40:1
  2201. 474.09 s > |
  2202. 474.09 s > 40 | compile_error!("select an integer backend: `integer-gmp` or `integer-malachite`");
  2203. 474.09 s > | ^^^^^^^^^^^^^^^^^^^^^^^^^^^^^^^^^^^^^^^^^^^^^^^^^^^^^^^^^^^^^^^^^^^^^^^^^^^^^^^^^
  2204. 474.09 s >
  2205. 474.09 s > error: select a float backend: `float-mpfr` or `float-astro`
  2206. 474.09 s > --> /nix/store/9rqk4093qnvgswmdk1pbxk9najcrjn7a-vendor-cargo-deps/bc87b2b0f37b9a43ffdd82e8f11f3e864d9447ccd53a9a964250c3414c3656d9/numerica-3.0.0/src/lib.rs:44:1
  2207. 474.09 s > |
  2208. 474.09 s > 44 | compile_error!("select a float backend: `float-mpfr` or `float-astro`");
  2209. 474.09 s > | ^^^^^^^^^^^^^^^^^^^^^^^^^^^^^^^^^^^^^^^^^^^^^^^^^^^^^^^^^^^^^^^^^^^^^^^
  2210. 474.09 s >
  2211. 474.09 s > error[E0432]: unresolved import `implementation::BackendRandState`
  2212. 474.09 s > --> /nix/store/9rqk4093qnvgswmdk1pbxk9najcrjn7a-vendor-cargo-deps/bc87b2b0f37b9a43ffdd82e8f11f3e864d9447ccd53a9a964250c3414c3656d9/numerica-3.0.0/src/domains/backend/integer.rs:1614:33
  2213. 474.09 s > |
  2214. 474.09 s > 1614 | pub(crate) use implementation::{BackendRandState, Complete, RemRounding};
  2215. 474.09 s > | ^^^^^^^^^^^^^^^^ no `BackendRandState` in `domains::backend::integer::implementation`
  2216. 474.09 s > |
  2217. 474.09 s > note: found an item that was configured out
  2218. 474.09 s > --> /nix/store/9rqk4093qnvgswmdk1pbxk9najcrjn7a-vendor-cargo-deps/bc87b2b0f37b9a43ffdd82e8f11f3e864d9447ccd53a9a964250c3414c3656d9/numerica-3.0.0/src/domains/backend/integer.rs:1378:23
  2219. 474.09 s > |
  2220. 474.09 s > 1377 | #[cfg(feature = "integer-malachite")]
  2221. 474.09 s > | ----------------------------- the item is gated behind the `integer-malachite` feature
  2222. 474.09 s > 1378 | pub(crate) struct BackendRandState {
  2223. 474.09 s > | ^^^^^^^^^^^^^^^^
  2224. 474.09 s > note: found an item that was configured out
  2225. 474.09 s > --> /nix/store/9rqk4093qnvgswmdk1pbxk9najcrjn7a-vendor-cargo-deps/bc87b2b0f37b9a43ffdd82e8f11f3e864d9447ccd53a9a964250c3414c3656d9/numerica-3.0.0/src/domains/backend/integer.rs:1413:23
  2226. 474.09 s > |
  2227. 474.09 s > 1412 | #[cfg(feature = "integer-gmp")]
  2228. 474.09 s > | ----------------------- the item is gated behind the `integer-gmp` feature
  2229. 474.09 s > 1413 | pub(crate) struct BackendRandState(rug::rand::RandState<'static>);
  2230. 474.09 s > | ^^^^^^^^^^^^^^^^
  2231. 474.09 s >
  2232. 474.09 s > error[E0432]: unresolved import `implementation::RawMultiPrecisionInteger`
  2233. 474.09 s > --> /nix/store/9rqk4093qnvgswmdk1pbxk9najcrjn7a-vendor-cargo-deps/bc87b2b0f37b9a43ffdd82e8f11f3e864d9447ccd53a9a964250c3414c3656d9/numerica-3.0.0/src/domains/backend/integer.rs:1616:61
  2234. 474.09 s > |
  2235. 474.09 s > 1616 | MultiPrecisionInteger, ParseMultiPrecisionIntegerError, RawMultiPrecisionInteger,
  2236. 474.09 s > | ^^^^^^^^^^^^^^^^^^^^^^^^ no `RawMultiPrecisionInteger` in `domains::backend::integer::implementation`
  2237. 474.09 s > |
  2238. 474.09 s > note: found an item that was configured out
  2239. 474.09 s > --> /nix/store/9rqk4093qnvgswmdk1pbxk9najcrjn7a-vendor-cargo-deps/bc87b2b0f37b9a43ffdd82e8f11f3e864d9447ccd53a9a964250c3414c3656d9/numerica-3.0.0/src/domains/backend/integer.rs:26:14
  2240. 474.09 s > |
  2241. 474.09 s > 25 | #[cfg(feature = "integer-malachite")]
  2242. 474.09 s > | ----------------------------- the item is gated behind the `integer-malachite` feature
  2243. 474.09 s > 26 | pub type RawMultiPrecisionInteger = malachite_nz::integer::Integer;
  2244. 474.09 s > | ^^^^^^^^^^^^^^^^^^^^^^^^
  2245. 474.09 s > note: found an item that was configured out
  2246. 474.09 s > --> /nix/store/9rqk4093qnvgswmdk1pbxk9najcrjn7a-vendor-cargo-deps/bc87b2b0f37b9a43ffdd82e8f11f3e864d9447ccd53a9a964250c3414c3656d9/numerica-3.0.0/src/domains/backend/integer.rs:29:14
  2247. 474.09 s > |
  2248. 474.09 s > 28 | #[cfg(feature = "integer-gmp")]
  2249. 474.09 s > | ----------------------- the item is gated behind the `integer-gmp` feature
  2250. 474.09 s > 29 | pub type RawMultiPrecisionInteger = rug::Integer;
  2251. 474.09 s > | ^^^^^^^^^^^^^^^^^^^^^^^^
  2252. 474.09 s > help: a similar name exists in the module
  2253. 474.09 s > |
  2254. 474.09 s > 1616 - MultiPrecisionInteger, ParseMultiPrecisionIntegerError, RawMultiPrecisionInteger,
  2255. 474.09 s > 1616 + MultiPrecisionInteger, ParseMultiPrecisionIntegerError, MultiPrecisionInteger,
  2256. 474.09 s > |
  2257. 474.09 s >
  2258. 474.09 s > error[E0432]: unresolved imports `implementation::from_be_bytes`, `implementation::to_be_bytes`
  2259. 474.09 s > --> /nix/store/9rqk4093qnvgswmdk1pbxk9najcrjn7a-vendor-cargo-deps/bc87b2b0f37b9a43ffdd82e8f11f3e864d9447ccd53a9a964250c3414c3656d9/numerica-3.0.0/src/domains/backend/integer.rs:1709:33
  2260. 474.09 s > |
  2261. 474.09 s > 1709 | pub(crate) use implementation::{from_be_bytes, to_be_bytes};
  2262. 474.09 s > | ^^^^^^^^^^^^^ ^^^^^^^^^^^ no `to_be_bytes` in `domains::backend::integer::implementation`
  2263. 474.09 s > | |
  2264. 474.09 s > | no `from_be_bytes` in `domains::backend::integer::implementation`
  2265. 474.09 s > |
  2266. 474.09 s > note: found an item that was configured out
  2267. 474.09 s > --> /nix/store/9rqk4093qnvgswmdk1pbxk9najcrjn7a-vendor-cargo-deps/bc87b2b0f37b9a43ffdd82e8f11f3e864d9447ccd53a9a964250c3414c3656d9/numerica-3.0.0/src/domains/backend/integer.rs:1370:19
  2268. 474.09 s > |
  2269. 474.09 s > 1369 | #[cfg(all(feature = "integer-malachite", feature = "bincode"))]
  2270. 474.09 s > | ----------------------------- the item is gated behind the `integer-malachite` feature
  2271. 474.09 s > 1370 | pub(crate) fn from_be_bytes(bytes: &[u8]) -> Result<MultiPrecisionInteger, &'static str> {
  2272. 474.09 s > | ^^^^^^^^^^^^^
  2273. 474.09 s > note: found an item that was configured out
  2274. 474.09 s > --> /nix/store/9rqk4093qnvgswmdk1pbxk9najcrjn7a-vendor-cargo-deps/bc87b2b0f37b9a43ffdd82e8f11f3e864d9447ccd53a9a964250c3414c3656d9/numerica-3.0.0/src/domains/backend/integer.rs:1405:19
  2275. 474.09 s > |
  2276. 474.09 s > 1404 | #[cfg(all(feature = "integer-gmp", feature = "bincode"))]
  2277. 474.09 s > | ----------------------- the item is gated behind the `integer-gmp` feature
  2278. 474.09 s > 1405 | pub(crate) fn from_be_bytes(bytes: &[u8]) -> Result<MultiPrecisionInteger, &'static str> {
  2279. 474.09 s > | ^^^^^^^^^^^^^
  2280. 474.09 s > note: found an item that was configured out
  2281. 474.09 s > --> /nix/store/9rqk4093qnvgswmdk1pbxk9najcrjn7a-vendor-cargo-deps/bc87b2b0f37b9a43ffdd82e8f11f3e864d9447ccd53a9a964250c3414c3656d9/numerica-3.0.0/src/domains/backend/integer.rs:1365:19
  2282. 474.09 s > |
  2283. 474.09 s > 1364 | #[cfg(all(feature = "integer-malachite", feature = "bincode"))]
  2284. 474.09 s > | ----------------------------- the item is gated behind the `integer-malachite` feature
  2285. 474.09 s > 1365 | pub(crate) fn to_be_bytes(value: &MultiPrecisionInteger) -> Vec<u8> {
  2286. 474.09 s > | ^^^^^^^^^^^
  2287. 474.09 s > note: found an item that was configured out
  2288. 474.09 s > --> /nix/store/9rqk4093qnvgswmdk1pbxk9najcrjn7a-vendor-cargo-deps/bc87b2b0f37b9a43ffdd82e8f11f3e864d9447ccd53a9a964250c3414c3656d9/numerica-3.0.0/src/domains/backend/integer.rs:1400:19
  2289. 474.09 s > |
  2290. 474.09 s > 1399 | #[cfg(all(feature = "integer-gmp", feature = "bincode"))]
  2291. 474.09 s > | ----------------------- the item is gated behind the `integer-gmp` feature
  2292. 474.09 s > 1400 | pub(crate) fn to_be_bytes(value: &MultiPrecisionInteger) -> Vec<u8> {
  2293. 474.09 s > | ^^^^^^^^^^^
  2294. 474.09 s >
  2295. 474.09 s > error[E0432]: unresolved imports `crate::domains::backend::float::Assign`, `crate::domains::backend::float::CompleteRound`, `crate::domains::backend::float::Constant`, `crate::domains::backend::float::MultiPrecisionFloat`, `crate::domains::backend::float::Pow`
  2296. 474.09 s > --> /nix/store/9rqk4093qnvgswmdk1pbxk9najcrjn7a-vendor-cargo-deps/bc87b2b0f37b9a43ffdd82e8f11f3e864d9447ccd53a9a964250c3414c3656d9/numerica-3.0.0/src/domains/float/multiprecision.rs:15:9
  2297. 474.09 s > |
  2298. 474.09 s > 15 | Assign, CompleteRound, Constant, MultiPrecisionFloat, MultiPrecisionFloatInteger,
  2299. 474.09 s > | ^^^^^^ ^^^^^^^^^^^^^ ^^^^^^^^ ^^^^^^^^^^^^^^^^^^^ no `MultiPrecisionFloat` in `domains::backend::float`
  2300. 474.09 s > | | | |
  2301. 474.09 s > | | | no `Constant` in `domains::backend::float`
  2302. 474.09 s > | | no `CompleteRound` in `domains::backend::float`
  2303. 474.09 s > | no `Assign` in `domains::backend::float`
  2304. 474.09 s > 16 | MultiPrecisionFloatRational, MultiPrecisionFloatRounding, Pow, RoundingDirection,
  2305. 474.09 s > | ^^^ no `Pow` in `domains::backend::float`
  2306. 474.09 s > |
  2307. 474.09 s > note: found an item that was configured out
  2308. 474.09 s > --> /nix/store/9rqk4093qnvgswmdk1pbxk9najcrjn7a-vendor-cargo-deps/bc87b2b0f37b9a43ffdd82e8f11f3e864d9447ccd53a9a964250c3414c3656d9/numerica-3.0.0/src/domains/backend/float.rs:17:5
  2309. 474.09 s > |
  2310. 474.09 s > 15 | #[cfg(feature = "float-mpfr")]
  2311. 474.09 s > | ---------------------- the item is gated behind the `float-mpfr` feature
  2312. 474.09 s > 16 | pub use rug::{
  2313. 474.09 s > 17 | Assign, Float as MultiPrecisionFloat, Rational as BackendRational,
  2314. 474.09 s > | ^^^^^^
  2315. 474.09 s > note: found an item that was configured out
  2316. 474.09 s > --> /nix/store/9rqk4093qnvgswmdk1pbxk9najcrjn7a-vendor-cargo-deps/bc87b2b0f37b9a43ffdd82e8f11f3e864d9447ccd53a9a964250c3414c3656d9/numerica-3.0.0/src/domains/backend/float.rs:1578:5
  2317. 474.09 s > |
  2318. 474.09 s > 1576 | #[cfg(feature = "float-astro")]
  2319. 474.09 s > | ----------------------- the item is gated behind the `float-astro` feature
  2320. 474.09 s > 1577 | pub use astro::{
  2321. 474.09 s > 1578 | Assign, BackendRational, CompleteRound, Constant, IntoMultiPrecisionFloat, MultiPrecisionFloat,
  2322. 474.09 s > | ^^^^^^
  2323. 474.09 s > note: found an item that was configured out
  2324. 474.09 s > --> /nix/store/9rqk4093qnvgswmdk1pbxk9najcrjn7a-vendor-cargo-deps/bc87b2b0f37b9a43ffdd82e8f11f3e864d9447ccd53a9a964250c3414c3656d9/numerica-3.0.0/src/domains/backend/float.rs:19:11
  2325. 474.09 s > |
  2326. 474.09 s > 15 | #[cfg(feature = "float-mpfr")]
  2327. 474.09 s > | ---------------------- the item is gated behind the `float-mpfr` feature
  2328. 474.09 s > ...
  2329. 474.09 s > 19 | ops::{CompleteRound, Pow},
  2330. 474.09 s > | ^^^^^^^^^^^^^
  2331. 474.09 s > note: found an item that was configured out
  2332. 474.09 s > --> /nix/store/9rqk4093qnvgswmdk1pbxk9najcrjn7a-vendor-cargo-deps/bc87b2b0f37b9a43ffdd82e8f11f3e864d9447ccd53a9a964250c3414c3656d9/numerica-3.0.0/src/domains/backend/float.rs:1578:30
  2333. 474.09 s > |
  2334. 474.09 s > 1576 | #[cfg(feature = "float-astro")]
  2335. 474.09 s > | ----------------------- the item is gated behind the `float-astro` feature
  2336. 474.09 s > 1577 | pub use astro::{
  2337. 474.09 s > 1578 | Assign, BackendRational, CompleteRound, Constant, IntoMultiPrecisionFloat, MultiPrecisionFloat,
  2338. 474.09 s > | ^^^^^^^^^^^^^
  2339. 474.09 s > note: found an item that was configured out
  2340. 474.09 s > --> /nix/store/9rqk4093qnvgswmdk1pbxk9najcrjn7a-vendor-cargo-deps/bc87b2b0f37b9a43ffdd82e8f11f3e864d9447ccd53a9a964250c3414c3656d9/numerica-3.0.0/src/domains/backend/float.rs:18:12
  2341. 474.09 s > |
  2342. 474.09 s > 15 | #[cfg(feature = "float-mpfr")]
  2343. 474.09 s > | ---------------------- the item is gated behind the `float-mpfr` feature
  2344. 474.09 s > ...
  2345. 474.09 s > 18 | float::Constant,
  2346. 474.09 s > | ^^^^^^^^
  2347. 474.09 s > note: found an item that was configured out
  2348. 474.09 s > --> /nix/store/9rqk4093qnvgswmdk1pbxk9najcrjn7a-vendor-cargo-deps/bc87b2b0f37b9a43ffdd82e8f11f3e864d9447ccd53a9a964250c3414c3656d9/numerica-3.0.0/src/domains/backend/float.rs:1578:45
  2349. 474.09 s > |
  2350. 474.09 s > 1576 | #[cfg(feature = "float-astro")]
  2351. 474.09 s > | ----------------------- the item is gated behind the `float-astro` feature
  2352. 474.09 s > 1577 | pub use astro::{
  2353. 474.09 s > 1578 | Assign, BackendRational, CompleteRound, Constant, IntoMultiPrecisionFloat, MultiPrecisionFloat,
  2354. 474.09 s > | ^^^^^^^^
  2355. 474.09 s > note: found an item that was configured out
  2356. 474.09 s > --> /nix/store/9rqk4093qnvgswmdk1pbxk9najcrjn7a-vendor-cargo-deps/bc87b2b0f37b9a43ffdd82e8f11f3e864d9447ccd53a9a964250c3414c3656d9/numerica-3.0.0/src/domains/backend/float.rs:17:22
  2357. 474.09 s > |
  2358. 474.09 s > 15 | #[cfg(feature = "float-mpfr")]
  2359. 474.09 s > | ---------------------- the item is gated behind the `float-mpfr` feature
  2360. 474.09 s > 16 | pub use rug::{
  2361. 474.09 s > 17 | Assign, Float as MultiPrecisionFloat, Rational as BackendRational,
  2362. 474.09 s > | ^^^^^^^^^^^^^^^^^^^
  2363. 474.09 s > note: found an item that was configured out
  2364. 474.09 s > --> /nix/store/9rqk4093qnvgswmdk1pbxk9najcrjn7a-vendor-cargo-deps/bc87b2b0f37b9a43ffdd82e8f11f3e864d9447ccd53a9a964250c3414c3656d9/numerica-3.0.0/src/domains/backend/float.rs:1578:80
  2365. 474.09 s > |
  2366. 474.09 s > 1576 | #[cfg(feature = "float-astro")]
  2367. 474.09 s > | ----------------------- the item is gated behind the `float-astro` feature
  2368. 474.09 s > 1577 | pub use astro::{
  2369. 474.09 s > 1578 | Assign, BackendRational, CompleteRound, Constant, IntoMultiPrecisionFloat, MultiPrecisionFloat,
  2370. 474.09 s > | ^^^^^^^^^^^^^^^^^^^
  2371. 474.09 s > note: found an item that was configured out
  2372. 474.09 s > --> /nix/store/9rqk4093qnvgswmdk1pbxk9najcrjn7a-vendor-cargo-deps/bc87b2b0f37b9a43ffdd82e8f11f3e864d9447ccd53a9a964250c3414c3656d9/numerica-3.0.0/src/domains/backend/float.rs:19:26
  2373. 474.09 s > |
  2374. 474.09 s > 15 | #[cfg(feature = "float-mpfr")]
  2375. 474.09 s > | ---------------------- the item is gated behind the `float-mpfr` feature
  2376. 474.09 s > ...
  2377. 474.09 s > 19 | ops::{CompleteRound, Pow},
  2378. 474.09 s > | ^^^
  2379. 474.09 s > note: found an item that was configured out
  2380. 474.09 s > --> /nix/store/9rqk4093qnvgswmdk1pbxk9najcrjn7a-vendor-cargo-deps/bc87b2b0f37b9a43ffdd82e8f11f3e864d9447ccd53a9a964250c3414c3656d9/numerica-3.0.0/src/domains/backend/float.rs:1579:5
  2381. 474.09 s > |
  2382. 474.09 s > 1576 | #[cfg(feature = "float-astro")]
  2383. 474.09 s > | ----------------------- the item is gated behind the `float-astro` feature
  2384. 474.09 s > ...
  2385. 474.09 s > 1579 | Pow,
  2386. 474.09 s > | ^^^
  2387. 474.09 s >
  2388. 474.09 s > error[E0425]: cannot find type `RawMultiPrecisionInteger` in this scope
  2389. 474.09 s > --> /nix/store/9rqk4093qnvgswmdk1pbxk9najcrjn7a-vendor-cargo-deps/bc87b2b0f37b9a43ffdd82e8f11f3e864d9447ccd53a9a964250c3414c3656d9/numerica-3.0.0/src/domains/backend/integer.rs:52:38
  2390. 474.09 s > |
  2391. 474.09 s > 52 | pub struct MultiPrecisionInteger(RawMultiPrecisionInteger);
  2392. 474.09 s > | ^^^^^^^^^^^^^^^^^^^^^^^^ not found in this scope
  2393. 474.09 s >
  2394. 474.09 s > error[E0425]: cannot find type `RawMultiPrecisionInteger` in this scope
  2395. 474.09 s > --> /nix/store/9rqk4093qnvgswmdk1pbxk9najcrjn7a-vendor-cargo-deps/bc87b2b0f37b9a43ffdd82e8f11f3e864d9447ccd53a9a964250c3414c3656d9/numerica-3.0.0/src/domains/backend/integer.rs:52:38
  2396. 474.09 s > |
  2397. 474.09 s > 52 | pub struct MultiPrecisionInteger(RawMultiPrecisionInteger);
  2398. 474.09 s > | ^^^^^^^^^^^^^^^^^^^^^^^^ not found in this scope
  2399. 474.09 s > |
  2400. 474.09 s > help: you might be missing a type parameter
  2401. 474.09 s > |
  2402. 474.09 s > 52 | pub struct MultiPrecisionInteger<RawMultiPrecisionInteger>(RawMultiPrecisionInteger);
  2403. 474.09 s > | ++++++++++++++++++++++++++
  2404. 474.09 s >
  2405. 474.09 s > error[E0425]: cannot find type `RawMultiPrecisionInteger` in this scope
  2406. 474.09 s > --> /nix/store/9rqk4093qnvgswmdk1pbxk9najcrjn7a-vendor-cargo-deps/bc87b2b0f37b9a43ffdd82e8f11f3e864d9447ccd53a9a964250c3414c3656d9/numerica-3.0.0/src/domains/backend/integer.rs:149:32
  2407. 474.09 s > |
  2408. 474.09 s > 52 | pub struct MultiPrecisionInteger(RawMultiPrecisionInteger);
  2409. 474.09 s > | ----------------------------------------------------------- similarly named struct `MultiPrecisionInteger` defined here
  2410. 474.09 s > ...
  2411. 474.09 s > 149 | pub fn from_raw(value: RawMultiPrecisionInteger) -> Self {
  2412. 474.09 s > | ^^^^^^^^^^^^^^^^^^^^^^^^
  2413. 474.09 s > |
  2414. 474.09 s > help: a struct with a similar name exists
  2415. 474.09 s > |
  2416. 474.09 s > 149 - pub fn from_raw(value: RawMultiPrecisionInteger) -> Self {
  2417. 474.09 s > 149 + pub fn from_raw(value: MultiPrecisionInteger) -> Self {
  2418. 474.09 s > |
  2419. 474.09 s >
  2420. 474.09 s > error[E0425]: cannot find type `RawMultiPrecisionInteger` in this scope
  2421. 474.09 s > --> /nix/store/9rqk4093qnvgswmdk1pbxk9najcrjn7a-vendor-cargo-deps/bc87b2b0f37b9a43ffdd82e8f11f3e864d9447ccd53a9a964250c3414c3656d9/numerica-3.0.0/src/domains/backend/integer.rs:187:34
  2422. 474.09 s > |
  2423. 474.09 s > 52 | pub struct MultiPrecisionInteger(RawMultiPrecisionInteger);
  2424. 474.09 s > | ----------------------------------------------------------- similarly named struct `MultiPrecisionInteger` defined here
  2425. 474.09 s > ...
  2426. 474.09 s > 187 | pub fn as_raw(&self) -> &RawMultiPrecisionInteger {
  2427. 474.09 s > | ^^^^^^^^^^^^^^^^^^^^^^^^
  2428. 474.09 s > |
  2429. 474.09 s > help: a struct with a similar name exists
  2430. 474.09 s > |
  2431. 474.09 s > 187 - pub fn as_raw(&self) -> &RawMultiPrecisionInteger {
  2432. 474.09 s > 187 + pub fn as_raw(&self) -> &MultiPrecisionInteger {
  2433. 474.09 s > |
  2434. 474.09 s >
  2435. 474.09 s > error[E0425]: cannot find type `RawMultiPrecisionInteger` in this scope
  2436. 474.09 s > --> /nix/store/9rqk4093qnvgswmdk1pbxk9najcrjn7a-vendor-cargo-deps/bc87b2b0f37b9a43ffdd82e8f11f3e864d9447ccd53a9a964250c3414c3656d9/numerica-3.0.0/src/domains/backend/integer.rs:193:33
  2437. 474.09 s > |
  2438. 474.09 s > 52 | pub struct MultiPrecisionInteger(RawMultiPrecisionInteger);
  2439. 474.09 s > | ----------------------------------------------------------- similarly named struct `MultiPrecisionInteger` defined here
  2440. 474.09 s > ...
  2441. 474.09 s > 193 | pub fn to_raw(&self) -> RawMultiPrecisionInteger {
  2442. 474.09 s > | ^^^^^^^^^^^^^^^^^^^^^^^^
  2443. 474.09 s > |
  2444. 474.09 s > help: a struct with a similar name exists
  2445. 474.09 s > |
  2446. 474.09 s > 193 - pub fn to_raw(&self) -> RawMultiPrecisionInteger {
  2447. 474.09 s > 193 + pub fn to_raw(&self) -> MultiPrecisionInteger {
  2448. 474.09 s > |
  2449. 474.09 s >
  2450. 474.09 s > error[E0425]: cannot find type `RawMultiPrecisionInteger` in this scope
  2451. 474.09 s > --> /nix/store/9rqk4093qnvgswmdk1pbxk9najcrjn7a-vendor-cargo-deps/bc87b2b0f37b9a43ffdd82e8f11f3e864d9447ccd53a9a964250c3414c3656d9/numerica-3.0.0/src/domains/backend/integer.rs:199:34
  2452. 474.09 s > |
  2453. 474.09 s > 52 | pub struct MultiPrecisionInteger(RawMultiPrecisionInteger);
  2454. 474.09 s > | ----------------------------------------------------------- similarly named struct `MultiPrecisionInteger` defined here
  2455. 474.09 s > ...
  2456. 474.09 s > 199 | pub fn into_raw(self) -> RawMultiPrecisionInteger {
  2457. 474.09 s > | ^^^^^^^^^^^^^^^^^^^^^^^^
  2458. 474.09 s > |
  2459. 474.09 s > help: a struct with a similar name exists
  2460. 474.09 s > |
  2461. 474.09 s > 199 - pub fn into_raw(self) -> RawMultiPrecisionInteger {
  2462. 474.09 s > 199 + pub fn into_raw(self) -> MultiPrecisionInteger {
  2463. 474.09 s > |
  2464. 474.09 s >
  2465. 474.09 s > error[E0425]: cannot find type `RawMultiPrecisionInteger` in this scope
  2466. 474.09 s > --> /nix/store/9rqk4093qnvgswmdk1pbxk9najcrjn7a-vendor-cargo-deps/bc87b2b0f37b9a43ffdd82e8f11f3e864d9447ccd53a9a964250c3414c3656d9/numerica-3.0.0/src/domains/backend/integer.rs:567:27
  2467. 474.09 s > |
  2468. 474.09 s > 52 | pub struct MultiPrecisionInteger(RawMultiPrecisionInteger);
  2469. 474.09 s > | ----------------------------------------------------------- similarly named struct `MultiPrecisionInteger` defined here
  2470. 474.09 s > ...
  2471. 474.09 s > 567 | fn rem_trunc(lhs: RawMultiPrecisionInteger, rhs: RawMultiPrecisionInteger) -> Self {
  2472. 474.09 s > | ^^^^^^^^^^^^^^^^^^^^^^^^
  2473. 474.09 s > |
  2474. 474.09 s > help: a struct with a similar name exists
  2475. 474.09 s > |
  2476. 474.09 s > 567 - fn rem_trunc(lhs: RawMultiPrecisionInteger, rhs: RawMultiPrecisionInteger) -> Self {
  2477. 474.09 s > 567 + fn rem_trunc(lhs: MultiPrecisionInteger, rhs: RawMultiPrecisionInteger) -> Self {
  2478. 474.09 s > |
  2479. 474.09 s >
  2480. 474.09 s > error[E0425]: cannot find type `RawMultiPrecisionInteger` in this scope
  2481. 474.09 s > --> /nix/store/9rqk4093qnvgswmdk1pbxk9najcrjn7a-vendor-cargo-deps/bc87b2b0f37b9a43ffdd82e8f11f3e864d9447ccd53a9a964250c3414c3656d9/numerica-3.0.0/src/domains/backend/integer.rs:567:58
  2482. 474.09 s > |
  2483. 474.09 s > 52 | pub struct MultiPrecisionInteger(RawMultiPrecisionInteger);
  2484. 474.09 s > | ----------------------------------------------------------- similarly named struct `MultiPrecisionInteger` defined here
  2485. 474.09 s > ...
  2486. 474.09 s > 567 | fn rem_trunc(lhs: RawMultiPrecisionInteger, rhs: RawMultiPrecisionInteger) -> Self {
  2487. 474.09 s > | ^^^^^^^^^^^^^^^^^^^^^^^^
  2488. 474.09 s > |
  2489. 474.09 s > help: a struct with a similar name exists
  2490. 474.09 s > |
  2491. 474.09 s > 567 - fn rem_trunc(lhs: RawMultiPrecisionInteger, rhs: RawMultiPrecisionInteger) -> Self {
  2492. 474.09 s > 567 + fn rem_trunc(lhs: RawMultiPrecisionInteger, rhs: MultiPrecisionInteger) -> Self {
  2493. 474.09 s > |
  2494. 474.09 s >
  2495. 474.09 s > error[E0425]: cannot find type `RawMultiPrecisionInteger` in this scope
  2496. 474.09 s > --> /nix/store/9rqk4093qnvgswmdk1pbxk9najcrjn7a-vendor-cargo-deps/bc87b2b0f37b9a43ffdd82e8f11f3e864d9447ccd53a9a964250c3414c3656d9/numerica-3.0.0/src/domains/backend/integer.rs:582:27
  2497. 474.09 s > |
  2498. 474.09 s > 52 | pub struct MultiPrecisionInteger(RawMultiPrecisionInteger);
  2499. 474.09 s > | ----------------------------------------------------------- similarly named struct `MultiPrecisionInteger` defined here
  2500. 474.09 s > ...
  2501. 474.09 s > 582 | fn shl_raw(value: RawMultiPrecisionInteger, rhs: u64) -> RawMultiPrecisionInteger {
  2502. 474.09 s > | ^^^^^^^^^^^^^^^^^^^^^^^^
  2503. 474.09 s > |
  2504. 474.09 s > help: a struct with a similar name exists
  2505. 474.09 s > |
  2506. 474.09 s > 582 - fn shl_raw(value: RawMultiPrecisionInteger, rhs: u64) -> RawMultiPrecisionInteger {
  2507. 474.09 s > 582 + fn shl_raw(value: MultiPrecisionInteger, rhs: u64) -> RawMultiPrecisionInteger {
  2508. 474.09 s > |
  2509. 474.09 s >
  2510. 474.09 s > error[E0425]: cannot find type `RawMultiPrecisionInteger` in this scope
  2511. 474.09 s > --> /nix/store/9rqk4093qnvgswmdk1pbxk9najcrjn7a-vendor-cargo-deps/bc87b2b0f37b9a43ffdd82e8f11f3e864d9447ccd53a9a964250c3414c3656d9/numerica-3.0.0/src/domains/backend/integer.rs:582:66
  2512. 474.09 s > |
  2513. 474.09 s > 52 | pub struct MultiPrecisionInteger(RawMultiPrecisionInteger);
  2514. 474.09 s > | ----------------------------------------------------------- similarly named struct `MultiPrecisionInteger` defined here
  2515. 474.09 s > ...
  2516. 474.09 s > 582 | fn shl_raw(value: RawMultiPrecisionInteger, rhs: u64) -> RawMultiPrecisionInteger {
  2517. 474.09 s > | ^^^^^^^^^^^^^^^^^^^^^^^^
  2518. 474.09 s > |
  2519. 474.09 s > help: a struct with a similar name exists
  2520. 474.09 s > |
  2521. 474.09 s > 582 - fn shl_raw(value: RawMultiPrecisionInteger, rhs: u64) -> RawMultiPrecisionInteger {
  2522. 474.09 s > 582 + fn shl_raw(value: RawMultiPrecisionInteger, rhs: u64) -> MultiPrecisionInteger {
  2523. 474.09 s > |
  2524. 474.09 s >
  2525. 474.09 s > error[E0425]: cannot find type `RawMultiPrecisionInteger` in this scope
  2526. 474.09 s > --> /nix/store/9rqk4093qnvgswmdk1pbxk9najcrjn7a-vendor-cargo-deps/bc87b2b0f37b9a43ffdd82e8f11f3e864d9447ccd53a9a964250c3414c3656d9/numerica-3.0.0/src/domains/backend/integer.rs:590:27
  2527. 474.09 s > |
  2528. 474.09 s > 52 | pub struct MultiPrecisionInteger(RawMultiPrecisionInteger);
  2529. 474.09 s > | ----------------------------------------------------------- similarly named struct `MultiPrecisionInteger` defined here
  2530. 474.09 s > ...
  2531. 474.09 s > 590 | fn shr_raw(value: RawMultiPrecisionInteger, rhs: u64) -> RawMultiPrecisionInteger {
  2532. 474.09 s > | ^^^^^^^^^^^^^^^^^^^^^^^^
  2533. 474.09 s > |
  2534. 474.09 s > help: a struct with a similar name exists
  2535. 474.09 s > |
  2536. 474.09 s > 590 - fn shr_raw(value: RawMultiPrecisionInteger, rhs: u64) -> RawMultiPrecisionInteger {
  2537. 474.09 s > 590 + fn shr_raw(value: MultiPrecisionInteger, rhs: u64) -> RawMultiPrecisionInteger {
  2538. 474.09 s > |
  2539. 474.09 s >
  2540. 474.09 s > error[E0425]: cannot find type `RawMultiPrecisionInteger` in this scope
  2541. 474.09 s > --> /nix/store/9rqk4093qnvgswmdk1pbxk9najcrjn7a-vendor-cargo-deps/bc87b2b0f37b9a43ffdd82e8f11f3e864d9447ccd53a9a964250c3414c3656d9/numerica-3.0.0/src/domains/backend/integer.rs:590:66
  2542. 474.09 s > |
  2543. 474.09 s > 52 | pub struct MultiPrecisionInteger(RawMultiPrecisionInteger);
  2544. 474.09 s > | ----------------------------------------------------------- similarly named struct `MultiPrecisionInteger` defined here
  2545. 474.09 s > ...
  2546. 474.09 s > 590 | fn shr_raw(value: RawMultiPrecisionInteger, rhs: u64) -> RawMultiPrecisionInteger {
  2547. 474.09 s > | ^^^^^^^^^^^^^^^^^^^^^^^^
  2548. 474.09 s > |
  2549. 474.09 s > help: a struct with a similar name exists
  2550. 474.09 s > |
  2551. 474.09 s > 590 - fn shr_raw(value: RawMultiPrecisionInteger, rhs: u64) -> RawMultiPrecisionInteger {
  2552. 474.09 s > 590 + fn shr_raw(value: RawMultiPrecisionInteger, rhs: u64) -> MultiPrecisionInteger {
  2553. 474.09 s > |
  2554. 474.09 s >
  2555. 474.09 s > error[E0425]: cannot find type `RawMultiPrecisionInteger` in this scope
  2556. 474.09 s > --> /nix/store/9rqk4093qnvgswmdk1pbxk9najcrjn7a-vendor-cargo-deps/bc87b2b0f37b9a43ffdd82e8f11f3e864d9447ccd53a9a964250c3414c3656d9/numerica-3.0.0/src/domains/backend/integer.rs:654:15
  2557. 474.09 s > |
  2558. 474.09 s > 52 | pub struct MultiPrecisionInteger(RawMultiPrecisionInteger);
  2559. 474.09 s > | ----------------------------------------------------------- similarly named struct `MultiPrecisionInteger` defined here
  2560. 474.09 s > ...
  2561. 474.09 s > 654 | impl From<RawMultiPrecisionInteger> for MultiPrecisionInteger {
  2562. 474.09 s > | ^^^^^^^^^^^^^^^^^^^^^^^^
  2563. 474.09 s > |
  2564. 474.09 s > help: a struct with a similar name exists
  2565. 474.09 s > |
  2566. 474.09 s > 654 - impl From<RawMultiPrecisionInteger> for MultiPrecisionInteger {
  2567. 474.09 s > 654 + impl From<MultiPrecisionInteger> for MultiPrecisionInteger {
  2568. 474.09 s > |
  2569. 474.09 s > help: you might be missing a type parameter
  2570. 474.09 s > |
  2571. 474.09 s > 654 | impl<RawMultiPrecisionInteger> From<RawMultiPrecisionInteger> for MultiPrecisionInteger {
  2572. 474.09 s > | ++++++++++++++++++++++++++
  2573. 474.09 s >
  2574. 474.09 s > error[E0425]: cannot find type `RawMultiPrecisionInteger` in this scope
  2575. 474.09 s > --> /nix/store/9rqk4093qnvgswmdk1pbxk9najcrjn7a-vendor-cargo-deps/bc87b2b0f37b9a43ffdd82e8f11f3e864d9447ccd53a9a964250c3414c3656d9/numerica-3.0.0/src/domains/backend/integer.rs:656:24
  2576. 474.09 s > |
  2577. 474.09 s > 52 | pub struct MultiPrecisionInteger(RawMultiPrecisionInteger);
  2578. 474.09 s > | ----------------------------------------------------------- similarly named struct `MultiPrecisionInteger` defined here
  2579. 474.09 s > ...
  2580. 474.09 s > 656 | fn from(value: RawMultiPrecisionInteger) -> Self {
  2581. 474.09 s > | ^^^^^^^^^^^^^^^^^^^^^^^^
  2582. 474.09 s > |
  2583. 474.09 s > help: a struct with a similar name exists
  2584. 474.09 s > |
  2585. 474.09 s > 656 - fn from(value: RawMultiPrecisionInteger) -> Self {
  2586. 474.09 s > 656 + fn from(value: MultiPrecisionInteger) -> Self {
  2587. 474.09 s > |
  2588. 474.09 s >
  2589. 474.09 s > error[E0425]: cannot find type `RawMultiPrecisionInteger` in this scope
  2590. 474.09 s > --> /nix/store/9rqk4093qnvgswmdk1pbxk9najcrjn7a-vendor-cargo-deps/bc87b2b0f37b9a43ffdd82e8f11f3e864d9447ccd53a9a964250c3414c3656d9/numerica-3.0.0/src/domains/backend/integer.rs:661:42
  2591. 474.09 s > |
  2592. 474.09 s > 52 | pub struct MultiPrecisionInteger(RawMultiPrecisionInteger);
  2593. 474.09 s > | ----------------------------------------------------------- similarly named struct `MultiPrecisionInteger` defined here
  2594. 474.09 s > ...
  2595. 474.09 s > 661 | impl From<MultiPrecisionInteger> for RawMultiPrecisionInteger {
  2596. 474.09 s > | ^^^^^^^^^^^^^^^^^^^^^^^^
  2597. 474.09 s > |
  2598. 474.09 s > help: a struct with a similar name exists
  2599. 474.09 s > |
  2600. 474.09 s > 661 - impl From<MultiPrecisionInteger> for RawMultiPrecisionInteger {
  2601. 474.09 s > 661 + impl From<MultiPrecisionInteger> for MultiPrecisionInteger {
  2602. 474.09 s > |
  2603. 474.09 s >
  2604. 474.09 s > error[E0433]: cannot find type `RawMultiPrecisionInteger` in this scope
  2605. 474.09 s > --> /nix/store/9rqk4093qnvgswmdk1pbxk9najcrjn7a-vendor-cargo-deps/bc87b2b0f37b9a43ffdd82e8f11f3e864d9447ccd53a9a964250c3414c3656d9/numerica-3.0.0/src/domains/backend/integer.rs:620:13
  2606. 474.09 s > |
  2607. 474.09 s > 620 | RawMultiPrecisionInteger::from_str(s)
  2608. 474.09 s > | ^^^^^^^^^^^^^^^^^^^^^^^^ use of undeclared type `RawMultiPrecisionInteger`
  2609. 474.09 s > |
  2610. 474.09 s > help: a struct with a similar name exists
  2611. 474.09 s > |
  2612. 474.09 s > 620 - RawMultiPrecisionInteger::from_str(s)
  2613. 474.09 s > 620 + MultiPrecisionInteger::from_str(s)
  2614. 474.09 s > |
  2615. 474.09 s >
  2616. 474.09 s > error[E0433]: cannot find type `RawMultiPrecisionInteger` in this scope
  2617. 474.09 s > --> /nix/store/9rqk4093qnvgswmdk1pbxk9najcrjn7a-vendor-cargo-deps/bc87b2b0f37b9a43ffdd82e8f11f3e864d9447ccd53a9a964250c3414c3656d9/numerica-3.0.0/src/domains/backend/integer.rs:674:35
  2618. 474.09 s > |
  2619. 474.09 s > 674 | self.0 == RawMultiPrecisionInteger::from(*other)
  2620. 474.09 s > | ^^^^^^^^^^^^^^^^^^^^^^^^ use of undeclared type `RawMultiPrecisionInteger`
  2621. 474.09 s > ...
  2622. 474.09 s > 702 | impl_cmp_primitive!(i32, i64, i128, u32, u64, u128);
  2623. 474.09 s > | --------------------------------------------------- in this macro invocation
  2624. 474.09 s > |
  2625. 474.09 s > = note: this error originates in the macro `impl_cmp_primitive` (in Nightly builds, run with -Z macro-backtrace for more info)
  2626. 474.09 s > help: a struct with a similar name exists
  2627. 474.09 s > |
  2628. 474.09 s > 674 - self.0 == RawMultiPrecisionInteger::from(*other)
  2629. 474.09 s > 674 + self.0 == MultiPrecisionInteger::from(*other)
  2630. 474.09 s > |
  2631. 474.09 s >
  2632. 474.09 s > error[E0433]: cannot find type `RawMultiPrecisionInteger` in this scope
  2633. 474.09 s > --> /nix/store/9rqk4093qnvgswmdk1pbxk9najcrjn7a-vendor-cargo-deps/bc87b2b0f37b9a43ffdd82e8f11f3e864d9447ccd53a9a964250c3414c3656d9/numerica-3.0.0/src/domains/backend/integer.rs:681:25
  2634. 474.09 s > |
  2635. 474.09 s > 681 | RawMultiPrecisionInteger::from(*self) == other.0
  2636. 474.09 s > | ^^^^^^^^^^^^^^^^^^^^^^^^ use of undeclared type `RawMultiPrecisionInteger`
  2637. 474.09 s > ...
  2638. 474.09 s > 702 | impl_cmp_primitive!(i32, i64, i128, u32, u64, u128);
  2639. 474.09 s > | --------------------------------------------------- in this macro invocation
  2640. 474.09 s > |
  2641. 474.09 s > = note: this error originates in the macro `impl_cmp_primitive` (in Nightly builds, run with -Z macro-backtrace for more info)
  2642. 474.09 s > help: a struct with a similar name exists
  2643. 474.09 s > |
  2644. 474.09 s > 681 - RawMultiPrecisionInteger::from(*self) == other.0
  2645. 474.09 s > 681 + MultiPrecisionInteger::from(*self) == other.0
  2646. 474.09 s > |
  2647. 474.09 s >
  2648. 474.09 s > error[E0433]: cannot find type `RawMultiPrecisionInteger` in this scope
  2649. 474.09 s > --> /nix/store/9rqk4093qnvgswmdk1pbxk9najcrjn7a-vendor-cargo-deps/bc87b2b0f37b9a43ffdd82e8f11f3e864d9447ccd53a9a964250c3414c3656d9/numerica-3.0.0/src/domains/backend/integer.rs:688:45
  2650. 474.09 s > |
  2651. 474.09 s > 688 | self.0.partial_cmp(&RawMultiPrecisionInteger::from(*other))
  2652. 474.09 s > | ^^^^^^^^^^^^^^^^^^^^^^^^ use of undeclared type `RawMultiPrecisionInteger`
  2653. 474.09 s > ...
  2654. 474.09 s > 702 | impl_cmp_primitive!(i32, i64, i128, u32, u64, u128);
  2655. 474.09 s > | --------------------------------------------------- in this macro invocation
  2656. 474.09 s > |
  2657. 474.09 s > = note: this error originates in the macro `impl_cmp_primitive` (in Nightly builds, run with -Z macro-backtrace for more info)
  2658. 474.09 s > help: a struct with a similar name exists
  2659. 474.09 s > |
  2660. 474.09 s > 688 - self.0.partial_cmp(&RawMultiPrecisionInteger::from(*other))
  2661. 474.09 s > 688 + self.0.partial_cmp(&MultiPrecisionInteger::from(*other))
  2662. 474.09 s > |
  2663. 474.09 s >
  2664. 474.09 s > error[E0433]: cannot find type `RawMultiPrecisionInteger` in this scope
  2665. 474.09 s > --> /nix/store/9rqk4093qnvgswmdk1pbxk9najcrjn7a-vendor-cargo-deps/bc87b2b0f37b9a43ffdd82e8f11f3e864d9447ccd53a9a964250c3414c3656d9/numerica-3.0.0/src/domains/backend/integer.rs:695:25
  2666. 474.09 s > |
  2667. 474.09 s > 695 | RawMultiPrecisionInteger::from(*self).partial_cmp(&other.0)
  2668. 474.09 s > | ^^^^^^^^^^^^^^^^^^^^^^^^ use of undeclared type `RawMultiPrecisionInteger`
  2669. 474.09 s > ...
  2670. 474.09 s > 702 | impl_cmp_primitive!(i32, i64, i128, u32, u64, u128);
  2671. 474.09 s > | --------------------------------------------------- in this macro invocation
  2672. 474.09 s > |
  2673. 474.09 s > = note: this error originates in the macro `impl_cmp_primitive` (in Nightly builds, run with -Z macro-backtrace for more info)
  2674. 474.09 s > help: a struct with a similar name exists
  2675. 474.09 s > |
  2676. 474.09 s > 695 - RawMultiPrecisionInteger::from(*self).partial_cmp(&other.0)
  2677. 474.09 s > 695 + MultiPrecisionInteger::from(*self).partial_cmp(&other.0)
  2678. 474.09 s > |
  2679. 474.09 s >
  2680. 474.09 s > error[E0433]: cannot find type `RawMultiPrecisionInteger` in this scope
  2681. 474.09 s > --> /nix/store/9rqk4093qnvgswmdk1pbxk9najcrjn7a-vendor-cargo-deps/bc87b2b0f37b9a43ffdd82e8f11f3e864d9447ccd53a9a964250c3414c3656d9/numerica-3.0.0/src/domains/backend/integer.rs:1180:35
  2682. 474.09 s > |
  2683. 474.09 s > 1180 | MultiPrecisionInteger(RawMultiPrecisionInteger::from((&self.0) & &rhs.0))
  2684. 474.09 s > | ^^^^^^^^^^^^^^^^^^^^^^^^ use of undeclared type `RawMultiPrecisionInteger`
  2685. 474.09 s > |
  2686. 474.09 s > help: a struct with a similar name exists
  2687. 474.09 s > |
  2688. 474.09 s > 1180 - MultiPrecisionInteger(RawMultiPrecisionInteger::from((&self.0) & &rhs.0))
  2689. 474.09 s > 1180 + MultiPrecisionInteger(MultiPrecisionInteger::from((&self.0) & &rhs.0))
  2690. 474.09 s > |
  2691. 474.09 s >
  2692. 474.09 s > error[E0433]: cannot find type `RawMultiPrecisionInteger` in this scope
  2693. 474.09 s > --> /nix/store/9rqk4093qnvgswmdk1pbxk9najcrjn7a-vendor-cargo-deps/bc87b2b0f37b9a43ffdd82e8f11f3e864d9447ccd53a9a964250c3414c3656d9/numerica-3.0.0/src/domains/backend/integer.rs:1212:35
  2694. 474.09 s > |
  2695. 474.09 s > 1212 | MultiPrecisionInteger(RawMultiPrecisionInteger::from(-&self.0))
  2696. 474.09 s > | ^^^^^^^^^^^^^^^^^^^^^^^^ use of undeclared type `RawMultiPrecisionInteger`
  2697. 474.09 s > |
  2698. 474.09 s > help: a struct with a similar name exists
  2699. 474.09 s > |
  2700. 474.09 s > 1212 - MultiPrecisionInteger(RawMultiPrecisionInteger::from(-&self.0))
  2701. 474.09 s > 1212 + MultiPrecisionInteger(MultiPrecisionInteger::from(-&self.0))
  2702. 474.09 s > |
  2703. 474.09 s >
  2704. 474.09 s > error[E0425]: cannot find function `write_lsf_bytes` in this scope
  2705. 474.09 s > --> /nix/store/9rqk4093qnvgswmdk1pbxk9najcrjn7a-vendor-cargo-deps/bc87b2b0f37b9a43ffdd82e8f11f3e864d9447ccd53a9a964250c3414c3656d9/numerica-3.0.0/src/domains/backend/integer.rs:1682:5
  2706. 474.09 s > |
  2707. 474.09 s > 1682 | write_lsf_bytes(value, &mut bytes);
  2708. 474.09 s > | ^^^^^^^^^^^^^^^ not found in this scope
  2709. 474.09 s >
  2710. 474.09 s > Some errors have detailed explanations: E0425, E0432, E0433.
  2711. 474.09 s > For more information about an error, try `rustc --explain E0425`.
  2712. 474.09 s > error: could not compile `numerica` (lib) due to 29 previous errors
  2713. 474.09 s > warning: build failed, waiting for other jobs to finish...
  2714. 474.09 s For full logs, run:
  2715. 474.09 s nix log /nix/store/8y99gpj1qs95jysr3c6kccvh7lrd78i4-alphal00p-docs-cargo-0.1.0.drv
  2716. 474.12 s Build failed.