0.00 s
$ /nix/store/9ypz3flqsrl5xl495mm8h645gadjsxi1-coreutils-9.11/bin/timeout --kill-after=15s 7200s /nix/store/23zk8sgzamrbmj1fday15szf7f2279s8-nix-2.34.7/bin/nix --extra-experimental-features nix-command --extra-experimental-features flakes flake clone git+https://github.com/alphal00p/gammaloop --dest /tmp/nix-ci-worker/stable-pwd/repo/
0.12 s
Cloning into '/tmp/nix-ci-worker/stable-pwd/repo'...
1.65 s
remote: Enumerating objects: 83696, done.
1.89 s
remote: Counting objects: 0% (1/9893)
remote: Counting objects: 1% (99/9893)
remote: Counting objects: 2% (198/9893)
remote: Counting objects: 3% (297/9893)
remote: Counting objects: 4% (396/9893)
remote: Counting objects: 5% (495/9893)
remote: Counting objects: 6% (594/9893)
remote: Counting objects: 7% (693/9893)
remote: Counting objects: 8% (792/9893)
remote: Counting objects: 9% (891/9893)
remote: Counting objects: 10% (990/9893)
remote: Counting objects: 11% (1089/9893)
remote: Counting objects: 12% (1188/9893)
remote: Counting objects: 13% (1287/9893)
remote: Counting objects: 14% (1386/9893)
remote: Counting objects: 15% (1484/9893)
remote: Counting objects: 16% (1583/9893)
remote: Counting objects: 17% (1682/9893)
remote: Counting objects: 18% (1781/9893)
remote: Counting objects: 19% (1880/9893)
remote: Counting objects: 20% (1979/9893)
remote: Counting objects: 21% (2078/9893)
remote: Counting objects: 22% (2177/9893)
remote: Counting objects: 23% (2276/9893)
remote: Counting objects: 24% (2375/9893)
remote: Counting objects: 25% (2474/9893)
remote: Counting objects: 26% (2573/9893)
remote: Counting objects: 27% (2672/9893)
remote: Counting objects: 28% (2771/9893)
remote: Counting objects: 29% (2869/9893)
remote: Counting objects: 30% (2968/9893)
remote: Counting objects: 31% (3067/9893)
remote: Counting objects: 32% (3166/9893)
remote: Counting objects: 33% (3265/9893)
remote: Counting objects: 34% (3364/9893)
remote: Counting objects: 35% (3463/9893)
remote: Counting objects: 36% (3562/9893)
remote: Counting objects: 37% (3661/9893)
remote: Counting objects: 38% (3760/9893)
remote: Counting objects: 39% (3859/9893)
remote: Counting objects: 40% (3958/9893)
remote: Counting objects: 41% (4057/9893)
remote: Counting objects: 42% (4156/9893)
remote: Counting objects: 43% (4254/9893)
remote: Counting objects: 44% (4353/9893)
remote: Counting objects: 45% (4452/9893)
remote: Counting objects: 46% (4551/9893)
remote: Counting objects: 47% (4650/9893)
remote: Counting objects: 48% (4749/9893)
remote: Counting objects: 49% (4848/9893)
remote: Counting objects: 50% (4947/9893)
remote: Counting objects: 51% (5046/9893)
remote: Counting objects: 52% (5145/9893)
remote: Counting objects: 53% (5244/9893)
remote: Counting objects: 54% (5343/9893)
remote: Counting objects: 55% (5442/9893)
remote: Counting objects: 56% (5541/9893)
remote: Counting objects: 57% (5640/9893)
remote: Counting objects: 58% (5738/9893)
remote: Counting objects: 59% (5837/9893)
remote: Counting objects: 60% (5936/9893)
remote: Counting objects: 61% (6035/9893)
remote: Counting objects: 62% (6134/9893)
remote: Counting objects: 63% (6233/9893)
remote: Counting objects: 64% (6332/9893)
remote: Counting objects: 65% (6431/9893)
remote: Counting objects: 66% (6530/9893)
remote: Counting objects: 67% (6629/9893)
remote: Counting objects: 68% (6728/9893)
remote: Counting objects: 69% (6827/9893)
remote: Counting objects: 70% (6926/9893)
remote: Counting objects: 71% (7025/9893)
remote: Counting objects: 72% (7123/9893)
remote: Counting objects: 73% (7222/9893)
remote: Counting objects: 74% (7321/9893)
remote: Counting objects: 75% (7420/9893)
remote: Counting objects: 76% (7519/9893)
remote: Counting objects: 77% (7618/9893)
remote: Counting objects: 78% (7717/9893)
remote: Counting objects: 79% (7816/9893)
remote: Counting objects: 80% (7915/9893)
remote: Counting objects: 81% (8014/9893)
remote: Counting objects: 82% (8113/9893)
remote: Counting objects: 83% (8212/9893)
remote: Counting objects: 84% (8311/9893)
remote: Counting objects: 85% (8410/9893)
remote: Counting objects: 86% (8508/9893)
remote: Counting objects: 87% (8607/9893)
remote: Counting objects: 88% (8706/9893)
remote: Counting objects: 89% (8805/9893)
remote: Counting objects: 90% (8904/9893)
remote: Counting objects: 91% (9003/9893)
remote: Counting objects: 92% (9102/9893)
remote: Counting objects: 93% (9201/9893)
remote: Counting objects: 94% (9300/9893)
remote: Counting objects: 95% (9399/9893)
remote: Counting objects: 96% (9498/9893)
remote: Counting objects: 97% (9597/9893)
remote: Counting objects: 98% (9696/9893)
remote: Counting objects: 99% (9795/9893)
remote: Counting objects: 100% (9893/9893)
remote: Counting objects: 100% (9893/9893), done.
4.63 s
remote: Compressing objects: 0% (1/2138)
remote: Compressing objects: 1% (22/2138)
remote: Compressing objects: 2% (43/2138)
remote: Compressing objects: 3% (65/2138)
remote: Compressing objects: 4% (86/2138)
remote: Compressing objects: 5% (107/2138)
remote: Compressing objects: 6% (129/2138)
remote: Compressing objects: 7% (150/2138)
remote: Compressing objects: 8% (172/2138)
remote: Compressing objects: 9% (193/2138)
remote: Compressing objects: 10% (214/2138)
remote: Compressing objects: 11% (236/2138)
remote: Compressing objects: 12% (257/2138)
remote: Compressing objects: 13% (278/2138)
remote: Compressing objects: 14% (300/2138)
remote: Compressing objects: 15% (321/2138)
remote: Compressing objects: 15% (332/2138)
remote: Compressing objects: 16% (343/2138)
remote: Compressing objects: 17% (364/2138)
remote: Compressing objects: 18% (385/2138)
remote: Compressing objects: 19% (407/2138)
remote: Compressing objects: 19% (421/2138)
remote: Compressing objects: 20% (428/2138)
remote: Compressing objects: 21% (449/2138)
remote: Compressing objects: 22% (471/2138)
remote: Compressing objects: 23% (492/2138)
remote: Compressing objects: 24% (514/2138)
remote: Compressing objects: 25% (535/2138)
remote: Compressing objects: 26% (556/2138)
remote: Compressing objects: 27% (578/2138)
remote: Compressing objects: 28% (599/2138)
remote: Compressing objects: 29% (621/2138)
remote: Compressing objects: 30% (642/2138)
remote: Compressing objects: 31% (663/2138)
remote: Compressing objects: 32% (685/2138)
remote: Compressing objects: 33% (706/2138)
remote: Compressing objects: 34% (727/2138)
remote: Compressing objects: 35% (749/2138)
remote: Compressing objects: 36% (770/2138)
remote: Compressing objects: 37% (792/2138)
remote: Compressing objects: 38% (813/2138)
remote: Compressing objects: 39% (834/2138)
remote: Compressing objects: 40% (856/2138)
remote: Compressing objects: 41% (877/2138)
remote: Compressing objects: 42% (898/2138)
remote: Compressing objects: 43% (920/2138)
remote: Compressing objects: 44% (941/2138)
remote: Compressing objects: 45% (963/2138)
remote: Compressing objects: 46% (984/2138)
remote: Compressing objects: 47% (1005/2138)
remote: Compressing objects: 48% (1027/2138)
remote: Compressing objects: 49% (1048/2138)
remote: Compressing objects: 50% (1069/2138)
remote: Compressing objects: 51% (1091/2138)
remote: Compressing objects: 52% (1112/2138)
remote: Compressing objects: 53% (1134/2138)
remote: Compressing objects: 54% (1155/2138)
remote: Compressing objects: 55% (1176/2138)
remote: Compressing objects: 56% (1198/2138)
remote: Compressing objects: 57% (1219/2138)
remote: Compressing objects: 58% (1241/2138)
remote: Compressing objects: 59% (1262/2138)
remote: Compressing objects: 60% (1283/2138)
remote: Compressing objects: 61% (1305/2138)
remote: Compressing objects: 62% (1326/2138)
remote: Compressing objects: 63% (1347/2138)
remote: Compressing objects: 64% (1369/2138)
remote: Compressing objects: 65% (1390/2138)
remote: Compressing objects: 66% (1412/2138)
remote: Compressing objects: 67% (1433/2138)
remote: Compressing objects: 68% (1454/2138)
remote: Compressing objects: 69% (1476/2138)
remote: Compressing objects: 70% (1497/2138)
remote: Compressing objects: 71% (1518/2138)
remote: Compressing objects: 72% (1540/2138)
remote: Compressing objects: 73% (1561/2138)
remote: Compressing objects: 74% (1583/2138)
remote: Compressing objects: 75% (1604/2138)
remote: Compressing objects: 76% (1625/2138)
remote: Compressing objects: 77% (1647/2138)
remote: Compressing objects: 78% (1668/2138)
remote: Compressing objects: 79% (1690/2138)
remote: Compressing objects: 80% (1711/2138)
remote: Compressing objects: 81% (1732/2138)
remote: Compressing objects: 82% (1754/2138)
remote: Compressing objects: 83% (1775/2138)
remote: Compressing objects: 84% (1796/2138)
remote: Compressing objects: 85% (1818/2138)
remote: Compressing objects: 86% (1839/2138)
remote: Compressing objects: 87% (1861/2138)
remote: Compressing objects: 88% (1882/2138)
remote: Compressing objects: 89% (1903/2138)
remote: Compressing objects: 90% (1925/2138)
remote: Compressing objects: 91% (1946/2138)
remote: Compressing objects: 92% (1967/2138)
remote: Compressing objects: 93% (1989/2138)
remote: Compressing objects: 94% (2010/2138)
remote: Compressing objects: 95% (2032/2138)
remote: Compressing objects: 96% (2053/2138)
remote: Compressing objects: 97% (2074/2138)
remote: Compressing objects: 98% (2096/2138)
remote: Compressing objects: 99% (2117/2138)
remote: Compressing objects: 100% (2138/2138)
remote: Compressing objects: 100% (2138/2138), done.
8.98 s
Receiving objects: 0% (1/83696)
Receiving objects: 1% (837/83696)
Receiving objects: 2% (1674/83696)
Receiving objects: 3% (2511/83696)
Receiving objects: 4% (3348/83696)
Receiving objects: 5% (4185/83696)
Receiving objects: 6% (5022/83696), 8.97 MiB | 17.93 MiB/s
Receiving objects: 7% (5859/83696), 8.97 MiB | 17.93 MiB/s
Receiving objects: 8% (6696/83696), 8.97 MiB | 17.93 MiB/s
Receiving objects: 9% (7533/83696), 8.97 MiB | 17.93 MiB/s
Receiving objects: 10% (8370/83696), 8.97 MiB | 17.93 MiB/s
Receiving objects: 11% (9207/83696), 8.97 MiB | 17.93 MiB/s
Receiving objects: 12% (10044/83696), 8.97 MiB | 17.93 MiB/s
Receiving objects: 13% (10881/83696), 8.97 MiB | 17.93 MiB/s
Receiving objects: 14% (11718/83696), 8.97 MiB | 17.93 MiB/s
Receiving objects: 15% (12555/83696), 8.97 MiB | 17.93 MiB/s
Receiving objects: 16% (13392/83696), 8.97 MiB | 17.93 MiB/s
Receiving objects: 17% (14229/83696), 8.97 MiB | 17.93 MiB/s
Receiving objects: 18% (15066/83696), 8.97 MiB | 17.93 MiB/s
Receiving objects: 19% (15903/83696), 8.97 MiB | 17.93 MiB/s
Receiving objects: 20% (16740/83696), 8.97 MiB | 17.93 MiB/s
Receiving objects: 21% (17577/83696), 8.97 MiB | 17.93 MiB/s
Receiving objects: 22% (18414/83696), 8.97 MiB | 17.93 MiB/s
Receiving objects: 23% (19251/83696), 8.97 MiB | 17.93 MiB/s
Receiving objects: 24% (20088/83696), 8.97 MiB | 17.93 MiB/s
Receiving objects: 25% (20924/83696), 8.97 MiB | 17.93 MiB/s
Receiving objects: 26% (21761/83696), 8.97 MiB | 17.93 MiB/s
Receiving objects: 27% (22598/83696), 8.97 MiB | 17.93 MiB/s
Receiving objects: 28% (23435/83696), 8.97 MiB | 17.93 MiB/s
Receiving objects: 29% (24272/83696), 8.97 MiB | 17.93 MiB/s
Receiving objects: 30% (25109/83696), 8.97 MiB | 17.93 MiB/s
Receiving objects: 30% (25529/83696), 26.29 MiB | 26.28 MiB/s
Receiving objects: 31% (25946/83696), 26.29 MiB | 26.28 MiB/s
Receiving objects: 32% (26783/83696), 26.29 MiB | 26.28 MiB/s
Receiving objects: 33% (27620/83696), 26.29 MiB | 26.28 MiB/s
Receiving objects: 34% (28457/83696), 26.29 MiB | 26.28 MiB/s
Receiving objects: 35% (29294/83696), 26.29 MiB | 26.28 MiB/s
Receiving objects: 36% (30131/83696), 26.29 MiB | 26.28 MiB/s
Receiving objects: 37% (30968/83696), 26.29 MiB | 26.28 MiB/s
Receiving objects: 38% (31805/83696), 26.29 MiB | 26.28 MiB/s
Receiving objects: 39% (32642/83696), 26.29 MiB | 26.28 MiB/s
Receiving objects: 40% (33479/83696), 26.29 MiB | 26.28 MiB/s
Receiving objects: 41% (34316/83696), 26.29 MiB | 26.28 MiB/s
Receiving objects: 42% (35153/83696), 26.29 MiB | 26.28 MiB/s
Receiving objects: 43% (35990/83696), 26.29 MiB | 26.28 MiB/s
Receiving objects: 44% (36827/83696), 26.29 MiB | 26.28 MiB/s
Receiving objects: 45% (37664/83696), 26.29 MiB | 26.28 MiB/s
Receiving objects: 46% (38501/83696), 26.29 MiB | 26.28 MiB/s
Receiving objects: 47% (39338/83696), 26.29 MiB | 26.28 MiB/s
Receiving objects: 48% (40175/83696), 45.79 MiB | 30.52 MiB/s
Receiving objects: 49% (41012/83696), 45.79 MiB | 30.52 MiB/s
Receiving objects: 50% (41848/83696), 45.79 MiB | 30.52 MiB/s
Receiving objects: 51% (42685/83696), 45.79 MiB | 30.52 MiB/s
Receiving objects: 52% (43522/83696), 45.79 MiB | 30.52 MiB/s
Receiving objects: 53% (44359/83696), 45.79 MiB | 30.52 MiB/s
Receiving objects: 54% (45196/83696), 45.79 MiB | 30.52 MiB/s
Receiving objects: 55% (46033/83696), 45.79 MiB | 30.52 MiB/s
Receiving objects: 56% (46870/83696), 45.79 MiB | 30.52 MiB/s
Receiving objects: 57% (47707/83696), 45.79 MiB | 30.52 MiB/s
Receiving objects: 58% (48544/83696), 45.79 MiB | 30.52 MiB/s
Receiving objects: 58% (48725/83696), 61.80 MiB | 30.90 MiB/s
Receiving objects: 59% (49381/83696), 61.80 MiB | 30.90 MiB/s
Receiving objects: 60% (50218/83696), 61.80 MiB | 30.90 MiB/s
Receiving objects: 61% (51055/83696), 61.80 MiB | 30.90 MiB/s
Receiving objects: 62% (51892/83696), 61.80 MiB | 30.90 MiB/s
Receiving objects: 63% (52729/83696), 61.80 MiB | 30.90 MiB/s
Receiving objects: 64% (53566/83696), 61.80 MiB | 30.90 MiB/s
Receiving objects: 65% (54403/83696), 78.07 MiB | 31.23 MiB/s
Receiving objects: 66% (55240/83696), 78.07 MiB | 31.23 MiB/s
Receiving objects: 67% (56077/83696), 78.07 MiB | 31.23 MiB/s
Receiving objects: 68% (56914/83696), 78.07 MiB | 31.23 MiB/s
Receiving objects: 69% (57751/83696), 78.07 MiB | 31.23 MiB/s
Receiving objects: 70% (58588/83696), 78.07 MiB | 31.23 MiB/s
Receiving objects: 71% (59425/83696), 78.07 MiB | 31.23 MiB/s
Receiving objects: 72% (60262/83696), 78.07 MiB | 31.23 MiB/s
Receiving objects: 73% (61099/83696), 78.07 MiB | 31.23 MiB/s
Receiving objects: 73% (61530/83696), 78.07 MiB | 31.23 MiB/s
Receiving objects: 74% (61936/83696), 94.52 MiB | 31.50 MiB/s
Receiving objects: 75% (62772/83696), 94.52 MiB | 31.50 MiB/s
Receiving objects: 76% (63609/83696), 94.52 MiB | 31.50 MiB/s
Receiving objects: 77% (64446/83696), 94.52 MiB | 31.50 MiB/s
Receiving objects: 78% (65283/83696), 94.52 MiB | 31.50 MiB/s
Receiving objects: 79% (66120/83696), 94.52 MiB | 31.50 MiB/s
Receiving objects: 80% (66957/83696), 94.52 MiB | 31.50 MiB/s
Receiving objects: 81% (67794/83696), 111.45 MiB | 31.84 MiB/s
Receiving objects: 82% (68631/83696), 111.45 MiB | 31.84 MiB/s
Receiving objects: 83% (69468/83696), 111.45 MiB | 31.84 MiB/s
Receiving objects: 84% (70305/83696), 111.45 MiB | 31.84 MiB/s
Receiving objects: 85% (71142/83696), 111.45 MiB | 31.84 MiB/s
Receiving objects: 86% (71979/83696), 111.45 MiB | 31.84 MiB/s
Receiving objects: 87% (72816/83696), 111.45 MiB | 31.84 MiB/s
Receiving objects: 88% (73653/83696), 111.45 MiB | 31.84 MiB/s
Receiving objects: 89% (74490/83696), 111.45 MiB | 31.84 MiB/s
Receiving objects: 90% (75327/83696), 111.45 MiB | 31.84 MiB/s
Receiving objects: 91% (76164/83696), 111.45 MiB | 31.84 MiB/s
Receiving objects: 92% (77001/83696), 111.45 MiB | 31.84 MiB/s
Receiving objects: 93% (77838/83696), 111.45 MiB | 31.84 MiB/s
Receiving objects: 94% (78675/83696), 111.45 MiB | 31.84 MiB/s
Receiving objects: 95% (79512/83696), 111.45 MiB | 31.84 MiB/s
Receiving objects: 96% (80349/83696), 111.45 MiB | 31.84 MiB/s
Receiving objects: 97% (81186/83696), 111.45 MiB | 31.84 MiB/s
Receiving objects: 97% (81804/83696), 111.45 MiB | 31.84 MiB/s
Receiving objects: 98% (82023/83696), 127.47 MiB | 31.87 MiB/s
Receiving objects: 99% (82860/83696), 127.47 MiB | 31.87 MiB/s
remote: Total 83696 (delta 7944), reused 8038 (delta 7222), pack-reused 73803 (from 3)
8.98 s
Receiving objects: 100% (83696/83696), 127.47 MiB | 31.87 MiB/s
Receiving objects: 100% (83696/83696), 139.23 MiB | 32.05 MiB/s, done.
10.36 s
Resolving deltas: 0% (0/56218)
Resolving deltas: 1% (563/56218)
Resolving deltas: 2% (1125/56218)
Resolving deltas: 3% (1687/56218)
Resolving deltas: 4% (2249/56218)
Resolving deltas: 5% (2812/56218)
Resolving deltas: 6% (3374/56218)
Resolving deltas: 7% (3936/56218)
Resolving deltas: 8% (4498/56218)
Resolving deltas: 9% (5064/56218)
Resolving deltas: 10% (5622/56218)
Resolving deltas: 11% (6184/56218)
Resolving deltas: 12% (6747/56218)
Resolving deltas: 13% (7309/56218)
Resolving deltas: 14% (7871/56218)
Resolving deltas: 15% (8433/56218)
Resolving deltas: 16% (8996/56218)
Resolving deltas: 17% (9558/56218)
Resolving deltas: 18% (10120/56218)
Resolving deltas: 19% (10682/56218)
Resolving deltas: 20% (11244/56218)
Resolving deltas: 21% (11807/56218)
Resolving deltas: 22% (12368/56218)
Resolving deltas: 23% (12931/56218)
Resolving deltas: 24% (13493/56218)
Resolving deltas: 25% (14055/56218)
Resolving deltas: 26% (14617/56218)
Resolving deltas: 27% (15179/56218)
Resolving deltas: 28% (15742/56218)
Resolving deltas: 29% (16304/56218)
Resolving deltas: 30% (16866/56218)
Resolving deltas: 31% (17428/56218)
Resolving deltas: 32% (17990/56218)
Resolving deltas: 33% (18554/56218)
Resolving deltas: 34% (19115/56218)
Resolving deltas: 35% (19677/56218)
Resolving deltas: 36% (20239/56218)
Resolving deltas: 37% (20803/56218)
Resolving deltas: 38% (21363/56218)
Resolving deltas: 39% (21926/56218)
Resolving deltas: 40% (22488/56218)
Resolving deltas: 41% (23050/56218)
Resolving deltas: 42% (23612/56218)
Resolving deltas: 43% (24174/56218)
Resolving deltas: 44% (24736/56218)
Resolving deltas: 45% (25301/56218)
Resolving deltas: 46% (25861/56218)
Resolving deltas: 47% (26423/56218)
Resolving deltas: 48% (26986/56218)
Resolving deltas: 49% (27547/56218)
Resolving deltas: 50% (28109/56218)
Resolving deltas: 51% (28672/56218)
Resolving deltas: 52% (29235/56218)
Resolving deltas: 53% (29796/56218)
Resolving deltas: 54% (30358/56218)
Resolving deltas: 55% (30920/56218)
Resolving deltas: 56% (31483/56218)
Resolving deltas: 57% (32045/56218)
Resolving deltas: 58% (32607/56218)
Resolving deltas: 59% (33169/56218)
Resolving deltas: 60% (33734/56218)
Resolving deltas: 61% (34293/56218)
Resolving deltas: 62% (34856/56218)
Resolving deltas: 63% (35418/56218)
Resolving deltas: 64% (35980/56218)
Resolving deltas: 65% (36545/56218)
Resolving deltas: 66% (37104/56218)
Resolving deltas: 67% (37667/56218)
Resolving deltas: 68% (38229/56218)
Resolving deltas: 69% (38791/56218)
Resolving deltas: 70% (39353/56218)
Resolving deltas: 71% (39915/56218)
Resolving deltas: 72% (40477/56218)
Resolving deltas: 73% (41040/56218)
Resolving deltas: 74% (41602/56218)
Resolving deltas: 74% (42100/56218)
Resolving deltas: 75% (42164/56218)
Resolving deltas: 76% (42727/56218)
Resolving deltas: 77% (43288/56218)
Resolving deltas: 78% (43853/56218)
Resolving deltas: 79% (44413/56218)
Resolving deltas: 80% (44975/56218)
Resolving deltas: 81% (45537/56218)
Resolving deltas: 82% (46099/56218)
Resolving deltas: 83% (46662/56218)
Resolving deltas: 84% (47224/56218)
Resolving deltas: 85% (47786/56218)
Resolving deltas: 86% (48348/56218)
Resolving deltas: 87% (48910/56218)
Resolving deltas: 88% (49472/56218)
Resolving deltas: 89% (50035/56218)
Resolving deltas: 90% (50597/56218)
Resolving deltas: 91% (51159/56218)
Resolving deltas: 92% (51722/56218)
Resolving deltas: 93% (52283/56218)
Resolving deltas: 94% (52845/56218)
Resolving deltas: 95% (53408/56218)
Resolving deltas: 96% (53971/56218)
Resolving deltas: 97% (54532/56218)
Resolving deltas: 98% (55094/56218)
Resolving deltas: 99% (55656/56218)
Resolving deltas: 100% (56218/56218)
Resolving deltas: 100% (56218/56218), done.
12.80 s
Fetching commit 5aadd389efabb7b039af74edad02a90d486a1c07 for simplify-spenso-api ...
12.81 s
$ /nix/store/bcnisk3ydfgv26v2gw3zlky24g00yww2-git-2.54.0/bin/git fetch origin 5aadd389efabb7b039af74edad02a90d486a1c07
14.37 s
From https://github.com/alphal00p/gammaloop
14.37 s
* branch 5aadd389efabb7b039af74edad02a90d486a1c07 -> FETCH_HEAD
14.39 s
$ /nix/store/9ypz3flqsrl5xl495mm8h645gadjsxi1-coreutils-9.11/bin/timeout --kill-after=15s 7200s /nix/store/bcnisk3ydfgv26v2gw3zlky24g00yww2-git-2.54.0/bin/git -c advice.detachedHead=false checkout 5aadd389efabb7b039af74edad02a90d486a1c07
14.54 s
HEAD is now at 5aadd389e restore public gamma arguments to storage order
14.54 s
$ /nix/store/9ypz3flqsrl5xl495mm8h645gadjsxi1-coreutils-9.11/bin/timeout --kill-after=15s 7200s /nix/store/23zk8sgzamrbmj1fday15szf7f2279s8-nix-2.34.7/bin/nix --extra-experimental-features nix-command --extra-experimental-features flakes --log-format internal-json run .#packages.x86_64-linux.nix-ci-check-gammaloop-nextest-spenso --print-build-logs
30.11 s
32.80 s
Downloading cached gammaloop-nextest-binaries-spenso-idenso from https://cache.nix-ci.com
32.80 s
Downloading cached gammaloop-nextest-binaries-spenso-spenso-hep-lib from https://cache.nix-ci.com
32.80 s
Downloading cached gammaloop-nextest-binaries-spenso-spenso from https://cache.nix-ci.com
32.80 s
Downloading cached gammaloop-nextest-binaries-spenso-symbolica-utils from https://cache.nix-ci.com
32.80 s
Downloading cached gammaloop-nextest-binaries-spenso-spenso-macros from https://cache.nix-ci.com
32.81 s
Downloading cached busybox from https://cache.nix-ci.com
32.81 s
Downloading cached boehm-gc from https://cache.nix-ci.com
32.81 s
Downloading cached editline-1.17.1-unstable-2025-05 from https://cache.nix-ci.com
32.81 s
Downloading cached aws-c-common from https://cache.nix-ci.com
32.81 s
Downloading cached libcpuid from https://cache.nix-ci.com
32.81 s
Downloading cached brotli-1.2.0-lib from https://cache.nix-ci.com
32.81 s
Downloading cached icu4c from https://cache.nix-ci.com
32.81 s
Downloading cached publicsuffix-list-0-unstable-2026-05 from https://cache.nix-ci.com
32.81 s
Downloading cached lowdown-3.0.1-lib from https://cache.nix-ci.com
32.81 s
Downloading cached libsodium-1.0.22-unstable-2026-04 from https://cache.nix-ci.com
32.81 s
Downloading cached libseccomp-2.6.0-lib from https://cache.nix-ci.com
33.63 s
Downloaded cached editline-1.17.1-unstable-2025-05 (58 KiB) in 819ms
33.63 s
Progress: 0 of 1 built, 1 of 56 downloaded from cache (15 downloading)
33.63 s
Downloading cached hwloc-2.14.0-lib from https://cache.nix-ci.com
33.64 s
Downloaded cached libseccomp-2.6.0-lib (193 KiB) in 821ms
33.64 s
Downloaded cached libcpuid (326 KiB) in 827ms
33.64 s
Progress: 0 of 1 built, 2 of 56 downloaded from cache (15 downloading)
33.64 s
Progress: 0 of 1 built, 3 of 56 downloaded from cache (15 downloading)
33.64 s
Downloading cached libssh2 from https://cache.nix-ci.com
33.64 s
Downloaded cached publicsuffix-list-0-unstable-2026-05 (329 KiB) in 826ms
33.64 s
Progress: 0 of 1 built, 4 of 56 downloaded from cache (15 downloading)
33.64 s
Downloading cached keyutils-1.6.3-lib from https://cache.nix-ci.com
33.64 s
Downloading cached libxml2 from https://cache.nix-ci.com
33.65 s
Downloaded cached lowdown-3.0.1-lib (341 KiB) in 838ms
33.65 s
Progress: 0 of 1 built, 5 of 56 downloaded from cache (15 downloading)
33.65 s
Downloading cached libpsl from https://cache.nix-ci.com
33.65 s
Downloaded cached busybox (230 KiB) in 845ms
33.65 s
Progress: 0 of 1 built, 6 of 56 downloaded from cache (15 downloading)
33.65 s
Downloading cached llhttp from https://cache.nix-ci.com
33.66 s
Downloaded cached aws-c-common (1.1 MiB) in 853ms
33.66 s
Progress: 0 of 1 built, 7 of 56 downloaded from cache (15 downloading)
33.66 s
Downloading cached nghttp2-1.69.0-lib from https://cache.nix-ci.com
33.68 s
Downloaded cached libsodium-1.0.22-unstable-2026-04 (666 KiB) in 871ms
33.68 s
Progress: 0 of 1 built, 8 of 56 downloaded from cache (15 downloading)
33.68 s
Downloaded cached brotli-1.2.0-lib (961 KiB) in 871ms
33.68 s
Progress: 0 of 1 built, 9 of 56 downloaded from cache (15 downloading)
33.68 s
Downloading cached aws-c-cal from https://cache.nix-ci.com
33.69 s
Downloading cached aws-c-compression from https://cache.nix-ci.com
33.71 s
Downloaded cached boehm-gc (312 KiB) in 904ms
33.71 s
Progress: 0 of 1 built, 10 of 56 downloaded from cache (15 downloading)
33.73 s
Downloading cached aws-c-sdkutils from https://cache.nix-ci.com
34.28 s
Downloaded cached icu4c (38.2 MiB) in 1.4s
34.28 s
Progress: 0 of 1 built, 11 of 56 downloaded from cache (15 downloading)
34.28 s
Downloading cached aws-checksums from https://cache.nix-ci.com
34.37 s
Downloaded cached libssh2 (330 KiB) in 734ms
34.37 s
Progress: 0 of 1 built, 12 of 56 downloaded from cache (15 downloading)
34.37 s
Downloading cached boost from https://cache.nix-ci.com
34.38 s
Downloaded cached keyutils-1.6.3-lib (41 KiB) in 737ms
34.38 s
Progress: 0 of 1 built, 13 of 56 downloaded from cache (15 downloading)
34.38 s
Downloading cached nghttp3 from https://cache.nix-ci.com
34.39 s
Downloaded cached hwloc-2.14.0-lib (459 KiB) in 761ms
34.39 s
Progress: 0 of 1 built, 14 of 56 downloaded from cache (15 downloading)
34.39 s
Downloading cached krb5-1.22.2-lib from https://cache.nix-ci.com
34.40 s
Downloaded cached llhttp (89 KiB) in 747ms
34.40 s
Progress: 0 of 1 built, 15 of 56 downloaded from cache (15 downloading)
34.40 s
Downloading cached ngtcp2 from https://cache.nix-ci.com
34.40 s
Downloaded cached aws-c-cal (158 KiB) in 722ms
34.40 s
Progress: 0 of 1 built, 16 of 56 downloaded from cache (15 downloading)
34.41 s
Downloading cached libgit2-1.9.4-lib from https://cache.nix-ci.com
34.41 s
Downloaded cached libpsl (114 KiB) in 761ms
34.41 s
Progress: 0 of 1 built, 17 of 56 downloaded from cache (15 downloading)
34.41 s
Downloading cached onetbb from https://cache.nix-ci.com
34.42 s
Downloaded cached nghttp2-1.69.0-lib (225 KiB) in 758ms
34.43 s
Progress: 0 of 1 built, 18 of 56 downloaded from cache (15 downloading)
34.43 s
Downloading cached s2n-tls from https://cache.nix-ci.com
34.43 s
Downloaded cached aws-c-compression (31 KiB) in 735ms
34.43 s
Progress: 0 of 1 built, 19 of 56 downloaded from cache (15 downloading)
34.43 s
Downloaded cached aws-c-sdkutils (155 KiB) in 704ms
34.43 s
Progress: 0 of 1 built, 20 of 56 downloaded from cache (14 downloading)
34.43 s
Downloaded cached aws-checksums (86 KiB) in 152ms
34.44 s
Progress: 0 of 1 built, 21 of 56 downloaded from cache (13 downloading)
34.44 s
Downloaded cached libxml2 (1.4 MiB) in 794ms
34.44 s
Progress: 0 of 1 built, 22 of 56 downloaded from cache (12 downloading)
34.44 s
Downloading cached libarchive-3.8.8-lib from https://cache.nix-ci.com
34.71 s
Downloaded cached boost (14.5 MiB) in 332ms
34.71 s
Progress: 0 of 1 built, 23 of 56 downloaded from cache (12 downloading)
35.20 s
Downloaded cached nghttp3 (228 KiB) in 820ms
35.20 s
Progress: 0 of 1 built, 24 of 56 downloaded from cache (11 downloading)
35.26 s
Downloaded cached onetbb (626 KiB) in 842ms
35.26 s
Progress: 0 of 1 built, 25 of 56 downloaded from cache (10 downloading)
35.26 s
Downloading cached libblake3 from https://cache.nix-ci.com
35.27 s
Downloaded cached libgit2-1.9.4-lib (1.6 MiB) in 867ms
35.27 s
Progress: 0 of 1 built, 26 of 56 downloaded from cache (10 downloading)
35.29 s
Downloaded cached s2n-tls (1.3 MiB) in 859ms
35.29 s
Progress: 0 of 1 built, 27 of 56 downloaded from cache (9 downloading)
35.29 s
Downloading cached aws-c-io from https://cache.nix-ci.com
35.29 s
Downloaded cached krb5-1.22.2-lib (2.7 MiB) in 898ms
35.29 s
Progress: 0 of 1 built, 28 of 56 downloaded from cache (9 downloading)
35.31 s
Downloaded cached libarchive-3.8.8-lib (953 KiB) in 867ms
35.31 s
Progress: 0 of 1 built, 29 of 56 downloaded from cache (8 downloading)
35.33 s
Downloaded cached ngtcp2 (515 KiB) in 930ms
35.33 s
Progress: 0 of 1 built, 30 of 56 downloaded from cache (7 downloading)
35.33 s
Downloading cached curl from https://cache.nix-ci.com
36.01 s
Downloaded cached libblake3 (117 KiB) in 751ms
36.01 s
Progress: 0 of 1 built, 31 of 56 downloaded from cache (7 downloading)
36.01 s
Downloading cached nix-util from https://cache.nix-ci.com
36.05 s
Downloaded cached aws-c-io (648 KiB) in 760ms
36.05 s
Progress: 0 of 1 built, 32 of 56 downloaded from cache (7 downloading)
36.05 s
Downloading cached aws-c-event-stream from https://cache.nix-ci.com
36.05 s
Downloading cached aws-c-http from https://cache.nix-ci.com
36.07 s
Downloaded cached curl (1.2 MiB) in 738ms
36.07 s
Progress: 0 of 1 built, 33 of 56 downloaded from cache (8 downloading)
36.12 s
Downloaded cached nix-util (2.4 MiB) in 107ms
36.12 s
Progress: 0 of 1 built, 34 of 56 downloaded from cache (7 downloading)
36.12 s
Downloading cached nix-nswrapper from https://cache.nix-ci.com
36.88 s
Downloaded cached aws-c-event-stream (176 KiB) in 826ms
36.88 s
Progress: 0 of 1 built, 35 of 56 downloaded from cache (7 downloading)
36.88 s
Downloaded cached aws-c-http (641 KiB) in 825ms
36.88 s
Progress: 0 of 1 built, 36 of 56 downloaded from cache (6 downloading)
36.88 s
Downloaded cached nix-nswrapper (131 KiB) in 760ms
36.88 s
Progress: 0 of 1 built, 37 of 56 downloaded from cache (7 downloading)
36.88 s
Downloading cached aws-c-auth from https://cache.nix-ci.com
36.88 s
Downloading cached aws-c-mqtt from https://cache.nix-ci.com
37.64 s
Downloaded cached aws-c-auth (387 KiB) in 755ms
37.64 s
Progress: 0 of 1 built, 38 of 56 downloaded from cache (6 downloading)
37.64 s
Downloading cached aws-c-s3 from https://cache.nix-ci.com
37.65 s
Downloaded cached aws-c-mqtt (557 KiB) in 763ms
37.65 s
Progress: 0 of 1 built, 39 of 56 downloaded from cache (6 downloading)
38.31 s
Downloaded cached gammaloop-nextest-binaries-spenso-symbolica-utils (7.6 MiB) in 5.5s
38.31 s
Progress: 0 of 1 built, 40 of 56 downloaded from cache (5 downloading)
38.31 s
Downloaded cached gammaloop-nextest-binaries-spenso-spenso-macros (7.9 MiB) in 5.5s
38.32 s
Progress: 0 of 1 built, 41 of 56 downloaded from cache (4 downloading)
38.35 s
Downloaded cached aws-c-s3 (384 KiB) in 706ms
38.35 s
Progress: 0 of 1 built, 42 of 56 downloaded from cache (3 downloading)
38.35 s
Downloading cached aws-crt-cpp from https://cache.nix-ci.com
39.10 s
Downloaded cached aws-crt-cpp (979 KiB) in 742ms
39.10 s
Progress: 0 of 1 built, 43 of 56 downloaded from cache (3 downloading)
39.10 s
Downloading cached nix-store from https://cache.nix-ci.com
39.85 s
Downloaded cached gammaloop-nextest-binaries-spenso-spenso (11.1 MiB) in 7.0s
39.85 s
Progress: 0 of 1 built, 44 of 56 downloaded from cache (3 downloading)
39.92 s
Downloaded cached nix-store (5.8 MiB) in 818ms
39.92 s
Progress: 0 of 1 built, 45 of 56 downloaded from cache (2 downloading)
39.92 s
Downloading cached nix-fetchers from https://cache.nix-ci.com
39.92 s
Downloading cached nix-main from https://cache.nix-ci.com
40.64 s
Downloaded cached nix-main (393 KiB) in 725ms
40.65 s
Progress: 0 of 1 built, 46 of 56 downloaded from cache (3 downloading)
40.65 s
Downloaded cached nix-fetchers (1.5 MiB) in 728ms
40.65 s
Progress: 0 of 1 built, 47 of 56 downloaded from cache (2 downloading)
40.65 s
Downloading cached nix-expr from https://cache.nix-ci.com
41.37 s
Downloaded cached nix-expr (3.3 MiB) in 725ms
41.37 s
Progress: 0 of 1 built, 48 of 56 downloaded from cache (2 downloading)
41.37 s
Downloading cached nix-flake from https://cache.nix-ci.com
42.06 s
Downloaded cached nix-flake (956 KiB) in 683ms
42.06 s
Progress: 0 of 1 built, 49 of 56 downloaded from cache (2 downloading)
42.06 s
Downloading cached nix-cmd from https://cache.nix-ci.com
42.63 s
Downloaded cached nix-cmd (1 MiB) in 572ms
42.63 s
Progress: 0 of 1 built, 50 of 56 downloaded from cache (2 downloading)
42.63 s
Downloading cached nix from https://cache.nix-ci.com
43.39 s
Downloaded cached nix (3.9 MiB) in 758ms
43.39 s
Progress: 0 of 1 built, 51 of 56 downloaded from cache (2 downloading)
43.39 s
Downloading cached nix from https://cache.nix-ci.com
44.06 s
Downloaded cached nix (8848 B) in 668ms
44.06 s
Progress: 0 of 1 built, 52 of 56 downloaded from cache (2 downloading)
46.39 s
Downloaded cached gammaloop-nextest-binaries-spenso-idenso (31.6 MiB) in 13.5s
46.39 s
Progress: 0 of 1 built, 53 of 56 downloaded from cache (1 downloading)
46.48 s
Downloaded cached gammaloop-nextest-binaries-spenso-spenso-hep-lib (38.2 MiB) in 13.6s
46.48 s
Progress: 0 of 1 built, 54 of 56 downloaded from cache
46.48 s
Downloading cached gammaloop-nextest-binaries-spenso from https://cache.nix-ci.com
46.48 s
Downloaded cached gammaloop-nextest-binaries-spenso (1920 B) in 5ms
46.48 s
Progress: 0 of 1 built, 55 of 56 downloaded from cache
46.48 s
Downloading cached nix-ci-check-gammaloop-nextest-spenso from https://cache.nix-ci.com
46.49 s
Downloaded cached nix-ci-check-gammaloop-nextest-spenso (1016 B) in 5ms
46.49 s
Progress: 0 of 1 built, 56 of 56 downloaded from cache
57.61 s
evaluating derivation 'g
copying '/nix/store/qism
evaluating derivation 'g
copying '/nix/store/qism
evaluating derivation 'g
copying '/nix/store/qism
evaluating derivation 'g
copying '/nix/store/qism
evaluating derivation 'g
querying gammaloop-nexte
[0.0 KiB DL] querying ca
[0.6 KiB DL] querying ca
[2.2 KiB DL] querying fl
[4.8 KiB DL] querying in
[4.8 KiB DL] querying gf
[6.2 KiB DL] querying gf
[6.8 KiB DL]
[0 /4 built, 4 /0 /9 copied
[0 /3 built, 3 /1 /9 copied
[0 /3 built, 3 /3 /9 copied
[0 /2 built, 2 /4 /9 copied
[0 /2 built, 1 /6 /9 copied
[0 /2 built, 1 /7 /9 copied
[0 /2 built, 1 /8 /9 copied
[0 /1 built, 9 copied (10
[1 /0 /1 built, 9 copied (gammaloop-nextest-spenso> Extracting 5 binaries and 2 linked paths to /build/nextest-archive-UAHuUS
57.84 s
gammaloop-nextest-spenso> Extracted 19 files to /build/nextest-archive-UAHuUS in 0.23s
57.86 s
gammaloop-nextest-spenso> ------------
57.86 s
gammaloop-nextest-spenso> Nextest run ID 235f27c3-8714-4e3f-bb75-4c5376b0da5e with nextest profile: ci_gammaloop
57.86 s
gammaloop-nextest-spenso> Starting 232 tests across 5 binaries (26 tests skipped , including 2 tests via profile.ci_gammaloop.default-filter )
58.11 s
gammaloop-nextest-spenso> FAIL [ 0.019s] ( 91/232) idenso dirac::test::feyncalc_reference :: dirac_simplify_id40_repeated_gamma_and_two_trace
58.11 s
gammaloop-nextest-spenso> stdout ---
58.11 s
gammaloop-nextest-spenso>
58.11 s
gammaloop-nextest-spenso> running 1 test
58.11 s
gammaloop-nextest-spenso> test dirac::test::feyncalc_reference::dirac_simplify_id40_repeated_gamma_and_two_trace ... FAILED
58.11 s
gammaloop-nextest-spenso>
58.11 s
gammaloop-nextest-spenso> failures:
58.11 s
gammaloop-nextest-spenso>
58.11 s
gammaloop-nextest-spenso> failures:
58.11 s
gammaloop-nextest-spenso> dirac::test::feyncalc_reference::dirac_simplify_id40_repeated_gamma_and_two_trace
58.11 s
gammaloop-nextest-spenso>
58.11 s
gammaloop-nextest-spenso> test result: FAILED. 0 passed; 1 failed; 0 ignored; 0 measured; 248 filtered out; finished in 0.01s
58.11 s
gammaloop-nextest-spenso>
58.11 s
gammaloop-nextest-spenso> stderr ---
58.11 s
gammaloop-nextest-spenso>
58.11 s
gammaloop-nextest-spenso> thread 'dirac::test::feyncalc_reference::dirac_simplify_id40_repeated_gamma_and_two_trace' (491) panicked at crates/idenso/src/dirac/mod.rs:360:5:
58.11 s
gammaloop-nextest-spenso> gamma third argument must be a Minkowski slot
58.11 s
gammaloop-nextest-spenso> stack backtrace:
58.11 s
gammaloop-nextest-spenso> 0: __rustc::rust_begin_unwind
58.11 s
gammaloop-nextest-spenso> 1: core::panicking::panic_fmt
58.11 s
gammaloop-nextest-spenso> 2: idenso::dirac::require_gamma_port
58.11 s
gammaloop-nextest-spenso> 3: idenso::dirac::gamma_tensor
58.11 s
gammaloop-nextest-spenso> 4: idenso::dirac::test::feyncalc_reference::dirac_simplify_id40_repeated_gamma_and_two_trace
58.11 s
gammaloop-nextest-spenso> 5: <idenso::dirac::test::feyncalc_reference::dirac_simplify_id40_repeated_gamma_and_two_trace::{closure#0} as core::ops::function::FnOnce<()>>::call_once
58.11 s
gammaloop-nextest-spenso> note: Some details are omitted, run with `RUST_BACKTRACE=full` for a verbose backtrace.
58.11 s
gammaloop-nextest-spenso>
58.12 s
gammaloop-nextest-spenso> FAIL [ 0.022s] ( 92/232) idenso dirac::test::feyncalc_reference :: dirac_simplify_id46_d_dim_repeated_gamma_slash_sum
58.12 s
gammaloop-nextest-spenso> stdout ---
58.12 s
gammaloop-nextest-spenso>
58.12 s
gammaloop-nextest-spenso> running 1 test
58.12 s
gammaloop-nextest-spenso> test dirac::test::feyncalc_reference::dirac_simplify_id46_d_dim_repeated_gamma_slash_sum ... FAILED
58.12 s
gammaloop-nextest-spenso>
58.12 s
gammaloop-nextest-spenso> failures:
58.12 s
gammaloop-nextest-spenso>
58.12 s
gammaloop-nextest-spenso> failures:
58.12 s
gammaloop-nextest-spenso> dirac::test::feyncalc_reference::dirac_simplify_id46_d_dim_repeated_gamma_slash_sum
58.12 s
gammaloop-nextest-spenso>
58.12 s
gammaloop-nextest-spenso> test result: FAILED. 0 passed; 1 failed; 0 ignored; 0 measured; 248 filtered out; finished in 0.00s
58.12 s
gammaloop-nextest-spenso>
58.12 s
gammaloop-nextest-spenso> stderr ---
58.12 s
gammaloop-nextest-spenso>
58.12 s
gammaloop-nextest-spenso> thread 'dirac::test::feyncalc_reference::dirac_simplify_id46_d_dim_repeated_gamma_slash_sum' (504) panicked at crates/idenso/src/dirac/mod.rs:360:5:
58.12 s
gammaloop-nextest-spenso> gamma third argument must be a Minkowski slot
58.12 s
gammaloop-nextest-spenso> stack backtrace:
58.12 s
gammaloop-nextest-spenso> 0: __rustc::rust_begin_unwind
58.12 s
gammaloop-nextest-spenso> 1: core::panicking::panic_fmt
58.12 s
gammaloop-nextest-spenso> 2: idenso::dirac::require_gamma_port
58.12 s
gammaloop-nextest-spenso> 3: idenso::dirac::gamma_tensor
58.12 s
gammaloop-nextest-spenso> 4: idenso::dirac::test::feyncalc_reference::dirac_simplify_id46_d_dim_repeated_gamma_slash_sum
58.12 s
gammaloop-nextest-spenso> 5: <idenso::dirac::test::feyncalc_reference::dirac_simplify_id46_d_dim_repeated_gamma_slash_sum::{closure#0} as core::ops::function::FnOnce<()>>::call_once
58.12 s
gammaloop-nextest-spenso> note: Some details are omitted, run with `RUST_BACKTRACE=full` for a verbose backtrace.
58.12 s
gammaloop-nextest-spenso>
58.13 s
gammaloop-nextest-spenso> FAIL [ 0.028s] ( 94/232) idenso dirac::test::feyncalc_reference :: dirac_simplify_id4_slash_sandwich
58.13 s
gammaloop-nextest-spenso> stdout ---
58.13 s
gammaloop-nextest-spenso>
58.13 s
gammaloop-nextest-spenso> running 1 test
58.13 s
gammaloop-nextest-spenso> test dirac::test::feyncalc_reference::dirac_simplify_id4_slash_sandwich ... FAILED
58.13 s
gammaloop-nextest-spenso>
58.13 s
gammaloop-nextest-spenso> failures:
58.13 s
gammaloop-nextest-spenso>
58.13 s
gammaloop-nextest-spenso> failures:
58.13 s
gammaloop-nextest-spenso> dirac::test::feyncalc_reference::dirac_simplify_id4_slash_sandwich
58.13 s
gammaloop-nextest-spenso>
58.13 s
gammaloop-nextest-spenso> test result: FAILED. 0 passed; 1 failed; 0 ignored; 0 measured; 248 filtered out; finished in 0.01s
58.13 s
gammaloop-nextest-spenso>
58.13 s
gammaloop-nextest-spenso> stderr ---
58.13 s
gammaloop-nextest-spenso>
58.13 s
gammaloop-nextest-spenso> thread 'dirac::test::feyncalc_reference::dirac_simplify_id4_slash_sandwich' (511) panicked at crates/idenso/src/dirac/mod.rs:360:5:
58.13 s
gammaloop-nextest-spenso> gamma third argument must be a Minkowski slot
58.13 s
gammaloop-nextest-spenso> stack backtrace:
58.13 s
gammaloop-nextest-spenso> 0: __rustc::rust_begin_unwind
58.13 s
gammaloop-nextest-spenso> 1: core::panicking::panic_fmt
58.13 s
gammaloop-nextest-spenso> 2: idenso::dirac::require_gamma_port
58.13 s
gammaloop-nextest-spenso> 3: idenso::dirac::gamma_tensor
58.13 s
gammaloop-nextest-spenso> 4: idenso::dirac::test::feyncalc_reference::dirac_simplify_id4_slash_sandwich
58.13 s
gammaloop-nextest-spenso> 5: <idenso::dirac::test::feyncalc_reference::dirac_simplify_id4_slash_sandwich::{closure#0} as core::ops::function::FnOnce<()>>::call_once
58.13 s
gammaloop-nextest-spenso> note: Some details are omitted, run with `RUST_BACKTRACE=full` for a verbose backtrace.
58.13 s
gammaloop-nextest-spenso>
58.27 s
gammaloop-nextest-spenso> FAIL [ 0.025s] (143/232) idenso reference_cases::tests :: reference_case_simplification_snapshots
58.27 s
gammaloop-nextest-spenso> stdout ---
58.27 s
gammaloop-nextest-spenso>
58.27 s
gammaloop-nextest-spenso> running 1 test
58.27 s
gammaloop-nextest-spenso> test reference_cases::tests::reference_case_simplification_snapshots ... FAILED
58.27 s
gammaloop-nextest-spenso>
58.27 s
gammaloop-nextest-spenso> failures:
58.27 s
gammaloop-nextest-spenso>
58.27 s
gammaloop-nextest-spenso> failures:
58.27 s
gammaloop-nextest-spenso> reference_cases::tests::reference_case_simplification_snapshots
58.27 s
gammaloop-nextest-spenso>
58.27 s
gammaloop-nextest-spenso> test result: FAILED. 0 passed; 1 failed; 0 ignored; 0 measured; 248 filtered out; finished in 0.01s
58.27 s
gammaloop-nextest-spenso>
58.27 s
gammaloop-nextest-spenso> stderr ---
58.27 s
gammaloop-nextest-spenso>
58.27 s
gammaloop-nextest-spenso> thread 'reference_cases::tests::reference_case_simplification_snapshots' (684) panicked at crates/idenso/src/dirac/mod.rs:360:5:
58.27 s
gammaloop-nextest-spenso> gamma third argument must be a Minkowski slot
58.27 s
gammaloop-nextest-spenso> stack backtrace:
58.27 s
gammaloop-nextest-spenso> 0: __rustc::rust_begin_unwind
58.27 s
gammaloop-nextest-spenso> 1: core::panicking::panic_fmt
58.27 s
gammaloop-nextest-spenso> 2: idenso::dirac::require_gamma_port
58.27 s
gammaloop-nextest-spenso> 3: idenso::dirac::gamma_tensor
58.27 s
gammaloop-nextest-spenso> 4: idenso::reference_cases::dirac_feyncalc_slash_sandwich_id4
58.27 s
gammaloop-nextest-spenso> 5: <idenso::reference_cases::ReferenceCase>::simplified
58.27 s
gammaloop-nextest-spenso> 6: <core::iter::adapters::map::Map<core::slice::iter::Iter<idenso::reference_cases::ReferenceCase>, idenso::reference_cases::tests::reference_case_simplification_snapshots::{closure#0}> as core::iter::traits::iterator::Iterator>::fold::<(), core::iter::traits::iterator::Iterator::for_each::call<alloc::string::String, <alloc::vec::Vec<alloc::string::String>>::extend_trusted<core::iter::adapters::map::Map<core::slice::iter::Iter<idenso::reference_cases::ReferenceCase>, idenso::reference_cases::tests::reference_case_simplification_snapshots::{closure#0}>>::{closure#0}>::{closure#0}>
58.27 s
gammaloop-nextest-spenso> 7: <alloc::vec::Vec<alloc::string::String> as alloc::vec::spec_from_iter_nested::SpecFromIterNested<alloc::string::String, core::iter::adapters::map::Map<core::slice::iter::Iter<idenso::reference_cases::ReferenceCase>, idenso::reference_cases::tests::reference_case_simplification_snapshots::{closure#0}>>>::from_iter
58.27 s
gammaloop-nextest-spenso> 8: idenso::reference_cases::tests::reference_case_simplification_snapshots
58.27 s
gammaloop-nextest-spenso> 9: <idenso::reference_cases::tests::reference_case_simplification_snapshots::{closure#0} as core::ops::function::FnOnce<()>>::call_once
58.27 s
gammaloop-nextest-spenso> note: Some details are omitted, run with `RUST_BACKTRACE=full` for a verbose backtrace.
58.27 s
gammaloop-nextest-spenso>
58.43 s
gammaloop-nextest-spenso> FAIL [ 0.076s] (228/232) idenso tensor::tests::parsing :: infinite_execution
58.43 s
gammaloop-nextest-spenso> stdout ---
58.43 s
gammaloop-nextest-spenso>
58.43 s
gammaloop-nextest-spenso> running 1 test
58.43 s
gammaloop-nextest-spenso> ━━━━━━━━━━━━━━━━━━━━━━━━━━━━━━━ Snapshot Summary ━━━━━━━━━━━━━━━━━━━━━━━━━━━━━━━
58.43 s
gammaloop-nextest-spenso> Snapshot: infinite_execution
58.43 s
gammaloop-nextest-spenso> Source: crates/idenso/src/tensor/tests/parsing.rs:905
58.43 s
gammaloop-nextest-spenso> ────────────────────────────────────────────────────────────────────────────────
58.43 s
gammaloop-nextest-spenso> Expression: net_iter.snapshot_dot()
58.43 s
gammaloop-nextest-spenso> ────────────────────────────────────────────────────────────────────────────────
58.43 s
gammaloop-nextest-spenso> -old snapshot
58.43 s
gammaloop-nextest-spenso> +new results
58.43 s
gammaloop-nextest-spenso> ────────────┬───────────────────────────────────────────────────────────────────
58.43 s
gammaloop-nextest-spenso> 8 8 │ 0:0:s -> ext0 [id=0 color="red"];
58.43 s
gammaloop-nextest-spenso> 9 9 │ ext1 [style=invis];
58.43 s
gammaloop-nextest-spenso> 10 10 │ 0:5:s -> ext1 [id=1 dir=none color="red" label="mink4|l_0"];
58.43 s
gammaloop-nextest-spenso> 11 11 │ ext2 [style=invis];
58.43 s
gammaloop-nextest-spenso> 12 │- 0:4:s -> ext2 [id=2 dir=none color="red" label="bis4|l_2"];
58.43 s
gammaloop-nextest-spenso> 12 │+ 0:3:s -> ext2 [id=2 dir=none color="red" label="mink4|l_1"];
58.43 s
gammaloop-nextest-spenso> 13 13 │ ext3 [style=invis];
58.43 s
gammaloop-nextest-spenso> 14 │- 0:3:s -> ext3 [id=3 dir=none color="red" label="bis4|l_3"];
58.43 s
gammaloop-nextest-spenso> 14 │+ 0:1:s -> ext3 [id=3 dir=none color="red" label="bis4|l_2"];
58.43 s
gammaloop-nextest-spenso> 15 15 │ ext4 [style=invis];
58.43 s
gammaloop-nextest-spenso> 16 │- 0:1:s -> ext4 [id=4 dir=none color="red" label="mink4|l_1"];
58.43 s
gammaloop-nextest-spenso> 16 │+ 0:2:s -> ext4 [id=4 dir=none color="red" label="mink4|l_4"];
58.43 s
gammaloop-nextest-spenso> 17 17 │ ext5 [style=invis];
58.43 s
gammaloop-nextest-spenso> 18 │- 0:2:s -> ext5 [id=5 dir=none color="red" label="mink4|l_4"];
58.43 s
gammaloop-nextest-spenso> 18 │+ 0:4:s -> ext5 [id=5 dir=none color="red" label="bis4|l_3"];
58.43 s
gammaloop-nextest-spenso> 19 19 │ }
58.43 s
gammaloop-nextest-spenso> ────────────┴───────────────────────────────────────────────────────────────────
58.43 s
gammaloop-nextest-spenso> To update snapshots run `cargo insta review`
58.43 s
gammaloop-nextest-spenso> Stopped on the first failure. Run `cargo insta test` to run all snapshots.
58.43 s
gammaloop-nextest-spenso> test tensor::tests::parsing::infinite_execution ... FAILED
58.43 s
gammaloop-nextest-spenso>
58.43 s
gammaloop-nextest-spenso> failures:
58.43 s
gammaloop-nextest-spenso>
58.43 s
gammaloop-nextest-spenso> failures:
58.43 s
gammaloop-nextest-spenso> tensor::tests::parsing::infinite_execution
58.43 s
gammaloop-nextest-spenso>
58.43 s
gammaloop-nextest-spenso> test result: FAILED. 0 passed; 1 failed; 0 ignored; 0 measured; 248 filtered out; finished in 0.06s
58.43 s
gammaloop-nextest-spenso>
58.43 s
gammaloop-nextest-spenso> stderr ---
58.43 s
gammaloop-nextest-spenso>
58.43 s
gammaloop-nextest-spenso> thread 'tensor::tests::parsing::infinite_execution' (849) panicked at /nix/store/g4vv637bgwmy4qf4lv8w7s6sghivpa09-vendor-cargo-deps/c19b7c6f923b580ac259164a89f2577984ad5ab09ee9d583b888f934adbbe8d0/insta-1.47.2/src/runtime.rs:719:13:
58.43 s
gammaloop-nextest-spenso> snapshot assertion for 'infinite_execution' failed in line 905
58.43 s
gammaloop-nextest-spenso> stack backtrace:
58.43 s
gammaloop-nextest-spenso> 0: __rustc::rust_begin_unwind
58.43 s
gammaloop-nextest-spenso> 1: core::panicking::panic_fmt
58.43 s
gammaloop-nextest-spenso> 2: insta::runtime::assert_snapshot
58.43 s
gammaloop-nextest-spenso> 3: idenso::tensor::tests::parsing::infinite_execution
58.43 s
gammaloop-nextest-spenso> 4: <idenso::tensor::tests::parsing::infinite_execution::{closure#0} as core::ops::function::FnOnce<()>>::call_once
58.43 s
gammaloop-nextest-spenso> note: Some details are omitted, run with `RUST_BACKTRACE=full` for a verbose backtrace.
58.43 s
gammaloop-nextest-spenso>
59.95 s
gammaloop-nextest-spenso> ------------
59.95 s
gammaloop-nextest-spenso> Summary [ 2.088s] 232 tests run: 227 passed , 5 failed , 26 skipped
59.95 s
gammaloop-nextest-spenso> FAIL [ 0.019s] ( 91/232) idenso dirac::test::feyncalc_reference :: dirac_simplify_id40_repeated_gamma_and_two_trace
59.95 s
gammaloop-nextest-spenso> stdout ---
59.95 s
gammaloop-nextest-spenso>
59.95 s
gammaloop-nextest-spenso> running 1 test
59.95 s
gammaloop-nextest-spenso> test dirac::test::feyncalc_reference::dirac_simplify_id40_repeated_gamma_and_two_trace ... FAILED
59.95 s
gammaloop-nextest-spenso>
59.95 s
gammaloop-nextest-spenso> failures:
59.95 s
gammaloop-nextest-spenso>
59.95 s
gammaloop-nextest-spenso> failures:
59.95 s
gammaloop-nextest-spenso> dirac::test::feyncalc_reference::dirac_simplify_id40_repeated_gamma_and_two_trace
59.95 s
gammaloop-nextest-spenso>
59.95 s
gammaloop-nextest-spenso> test result: FAILED. 0 passed; 1 failed; 0 ignored; 0 measured; 248 filtered out; finished in 0.01s
59.95 s
gammaloop-nextest-spenso>
59.95 s
gammaloop-nextest-spenso> stderr ---
59.95 s
gammaloop-nextest-spenso>
59.95 s
gammaloop-nextest-spenso> thread 'dirac::test::feyncalc_reference::dirac_simplify_id40_repeated_gamma_and_two_trace' (491) panicked at crates/idenso/src/dirac/mod.rs:360:5:
59.95 s
gammaloop-nextest-spenso> gamma third argument must be a Minkowski slot
59.95 s
gammaloop-nextest-spenso> stack backtrace:
59.95 s
gammaloop-nextest-spenso> 0: __rustc::rust_begin_unwind
59.95 s
gammaloop-nextest-spenso> 1: core::panicking::panic_fmt
59.95 s
gammaloop-nextest-spenso> 2: idenso::dirac::require_gamma_port
59.95 s
gammaloop-nextest-spenso> 3: idenso::dirac::gamma_tensor
59.95 s
gammaloop-nextest-spenso> 4: idenso::dirac::test::feyncalc_reference::dirac_simplify_id40_repeated_gamma_and_two_trace
59.95 s
gammaloop-nextest-spenso> 5: <idenso::dirac::test::feyncalc_reference::dirac_simplify_id40_repeated_gamma_and_two_trace::{closure#0} as core::ops::function::FnOnce<()>>::call_once
59.95 s
gammaloop-nextest-spenso> note: Some details are omitted, run with `RUST_BACKTRACE=full` for a verbose backtrace.
59.95 s
gammaloop-nextest-spenso>
59.95 s
gammaloop-nextest-spenso> FAIL [ 0.022s] ( 92/232) idenso dirac::test::feyncalc_reference :: dirac_simplify_id46_d_dim_repeated_gamma_slash_sum
59.95 s
gammaloop-nextest-spenso> stdout ---
59.95 s
gammaloop-nextest-spenso>
59.95 s
gammaloop-nextest-spenso> running 1 test
59.95 s
gammaloop-nextest-spenso> test dirac::test::feyncalc_reference::dirac_simplify_id46_d_dim_repeated_gamma_slash_sum ... FAILED
59.95 s
gammaloop-nextest-spenso>
59.95 s
gammaloop-nextest-spenso> failures:
59.95 s
gammaloop-nextest-spenso>
59.95 s
gammaloop-nextest-spenso> failures:
59.95 s
gammaloop-nextest-spenso> dirac::test::feyncalc_reference::dirac_simplify_id46_d_dim_repeated_gamma_slash_sum
59.95 s
gammaloop-nextest-spenso>
59.95 s
gammaloop-nextest-spenso> test result: FAILED. 0 passed; 1 failed; 0 ignored; 0 measured; 248 filtered out; finished in 0.00s
59.95 s
gammaloop-nextest-spenso>
59.95 s
gammaloop-nextest-spenso> stderr ---
59.95 s
gammaloop-nextest-spenso>
59.95 s
gammaloop-nextest-spenso> thread 'dirac::test::feyncalc_reference::dirac_simplify_id46_d_dim_repeated_gamma_slash_sum' (504) panicked at crates/idenso/src/dirac/mod.rs:360:5:
59.95 s
gammaloop-nextest-spenso> gamma third argument must be a Minkowski slot
59.95 s
gammaloop-nextest-spenso> stack backtrace:
59.95 s
gammaloop-nextest-spenso> 0: __rustc::rust_begin_unwind
59.95 s
gammaloop-nextest-spenso> 1: core::panicking::panic_fmt
59.95 s
gammaloop-nextest-spenso> 2: idenso::dirac::require_gamma_port
59.95 s
gammaloop-nextest-spenso> 3: idenso::dirac::gamma_tensor
59.95 s
gammaloop-nextest-spenso> 4: idenso::dirac::test::feyncalc_reference::dirac_simplify_id46_d_dim_repeated_gamma_slash_sum
59.95 s
gammaloop-nextest-spenso> 5: <idenso::dirac::test::feyncalc_reference::dirac_simplify_id46_d_dim_repeated_gamma_slash_sum::{closure#0} as core::ops::function::FnOnce<()>>::call_once
59.95 s
gammaloop-nextest-spenso> note: Some details are omitted, run with `RUST_BACKTRACE=full` for a verbose backtrace.
59.95 s
gammaloop-nextest-spenso>
59.95 s
gammaloop-nextest-spenso> FAIL [ 0.028s] ( 94/232) idenso dirac::test::feyncalc_reference :: dirac_simplify_id4_slash_sandwich
59.95 s
gammaloop-nextest-spenso> stdout ---
59.95 s
gammaloop-nextest-spenso>
59.95 s
gammaloop-nextest-spenso> running 1 test
59.95 s
gammaloop-nextest-spenso> test dirac::test::feyncalc_reference::dirac_simplify_id4_slash_sandwich ... FAILED
59.95 s
gammaloop-nextest-spenso>
59.95 s
gammaloop-nextest-spenso> failures:
59.95 s
gammaloop-nextest-spenso>
59.95 s
gammaloop-nextest-spenso> failures:
59.95 s
gammaloop-nextest-spenso> dirac::test::feyncalc_reference::dirac_simplify_id4_slash_sandwich
59.95 s
gammaloop-nextest-spenso>
59.95 s
gammaloop-nextest-spenso> test result: FAILED. 0 passed; 1 failed; 0 ignored; 0 measured; 248 filtered out; finished in 0.01s
59.95 s
gammaloop-nextest-spenso>
59.95 s
gammaloop-nextest-spenso> stderr ---
59.95 s
gammaloop-nextest-spenso>
59.95 s
gammaloop-nextest-spenso> thread 'dirac::test::feyncalc_reference::dirac_simplify_id4_slash_sandwich' (511) panicked at crates/idenso/src/dirac/mod.rs:360:5:
59.95 s
gammaloop-nextest-spenso> gamma third argument must be a Minkowski slot
59.95 s
gammaloop-nextest-spenso> stack backtrace:
59.95 s
gammaloop-nextest-spenso> 0: __rustc::rust_begin_unwind
59.95 s
gammaloop-nextest-spenso> 1: core::panicking::panic_fmt
59.95 s
gammaloop-nextest-spenso> 2: idenso::dirac::require_gamma_port
59.95 s
gammaloop-nextest-spenso> 3: idenso::dirac::gamma_tensor
59.95 s
gammaloop-nextest-spenso> 4: idenso::dirac::test::feyncalc_reference::dirac_simplify_id4_slash_sandwich
59.95 s
gammaloop-nextest-spenso> 5: <idenso::dirac::test::feyncalc_reference::dirac_simplify_id4_slash_sandwich::{closure#0} as core::ops::function::FnOnce<()>>::call_once
59.95 s
gammaloop-nextest-spenso> note: Some details are omitted, run with `RUST_BACKTRACE=full` for a verbose backtrace.
59.95 s
gammaloop-nextest-spenso>
59.95 s
gammaloop-nextest-spenso> FAIL [ 0.025s] (143/232) idenso reference_cases::tests :: reference_case_simplification_snapshots
59.95 s
gammaloop-nextest-spenso> stdout ---
59.95 s
gammaloop-nextest-spenso>
59.95 s
gammaloop-nextest-spenso> running 1 test
59.95 s
gammaloop-nextest-spenso> test reference_cases::tests::reference_case_simplification_snapshots ... FAILED
59.95 s
gammaloop-nextest-spenso>
59.95 s
gammaloop-nextest-spenso> failures:
59.95 s
gammaloop-nextest-spenso>
59.95 s
gammaloop-nextest-spenso> failures:
59.95 s
gammaloop-nextest-spenso> reference_cases::tests::reference_case_simplification_snapshots
59.95 s
gammaloop-nextest-spenso>
59.95 s
gammaloop-nextest-spenso> test result: FAILED. 0 passed; 1 failed; 0 ignored; 0 measured; 248 filtered out; finished in 0.01s
59.95 s
gammaloop-nextest-spenso>
59.95 s
gammaloop-nextest-spenso> stderr ---
59.95 s
gammaloop-nextest-spenso>
59.95 s
gammaloop-nextest-spenso> thread 'reference_cases::tests::reference_case_simplification_snapshots' (684) panicked at crates/idenso/src/dirac/mod.rs:360:5:
59.95 s
gammaloop-nextest-spenso> gamma third argument must be a Minkowski slot
59.95 s
gammaloop-nextest-spenso> stack backtrace:
59.95 s
gammaloop-nextest-spenso> 0: __rustc::rust_begin_unwind
59.95 s
gammaloop-nextest-spenso> 1: core::panicking::panic_fmt
59.95 s
gammaloop-nextest-spenso> 2: idenso::dirac::require_gamma_port
59.95 s
gammaloop-nextest-spenso> 3: idenso::dirac::gamma_tensor
59.95 s
gammaloop-nextest-spenso> 4: idenso::reference_cases::dirac_feyncalc_slash_sandwich_id4
59.95 s
gammaloop-nextest-spenso> 5: <idenso::reference_cases::ReferenceCase>::simplified
59.95 s
gammaloop-nextest-spenso> 6: <core::iter::adapters::map::Map<core::slice::iter::Iter<idenso::reference_cases::ReferenceCase>, idenso::reference_cases::tests::reference_case_simplification_snapshots::{closure#0}> as core::iter::traits::iterator::Iterator>::fold::<(), core::iter::traits::iterator::Iterator::for_each::call<alloc::string::String, <alloc::vec::Vec<alloc::string::String>>::extend_trusted<core::iter::adapters::map::Map<core::slice::iter::Iter<idenso::reference_cases::ReferenceCase>, idenso::reference_cases::tests::reference_case_simplification_snapshots::{closure#0}>>::{closure#0}>::{closure#0}>
59.95 s
gammaloop-nextest-spenso> 7: <alloc::vec::Vec<alloc::string::String> as alloc::vec::spec_from_iter_nested::SpecFromIterNested<alloc::string::String, core::iter::adapters::map::Map<core::slice::iter::Iter<idenso::reference_cases::ReferenceCase>, idenso::reference_cases::tests::reference_case_simplification_snapshots::{closure#0}>>>::from_iter
59.95 s
gammaloop-nextest-spenso> 8: idenso::reference_cases::tests::reference_case_simplification_snapshots
59.95 s
gammaloop-nextest-spenso> 9: <idenso::reference_cases::tests::reference_case_simplification_snapshots::{closure#0} as core::ops::function::FnOnce<()>>::call_once
59.95 s
gammaloop-nextest-spenso> note: Some details are omitted, run with `RUST_BACKTRACE=full` for a verbose backtrace.
59.95 s
gammaloop-nextest-spenso>
59.95 s
gammaloop-nextest-spenso> FAIL [ 0.076s] (228/232) idenso tensor::tests::parsing :: infinite_execution
59.95 s
gammaloop-nextest-spenso> stdout ---
59.95 s
gammaloop-nextest-spenso>
59.95 s
gammaloop-nextest-spenso> running 1 test
59.95 s
gammaloop-nextest-spenso> ━━━━━━━━━━━━━━━━━━━━━━━━━━━━━━━ Snapshot Summary ━━━━━━━━━━━━━━━━━━━━━━━━━━━━━━━
59.95 s
gammaloop-nextest-spenso> Snapshot: infinite_execution
59.95 s
gammaloop-nextest-spenso> Source: crates/idenso/src/tensor/tests/parsing.rs:905
59.95 s
gammaloop-nextest-spenso> ────────────────────────────────────────────────────────────────────────────────
59.95 s
gammaloop-nextest-spenso> Expression: net_iter.snapshot_dot()
59.95 s
gammaloop-nextest-spenso> ────────────────────────────────────────────────────────────────────────────────
59.95 s
gammaloop-nextest-spenso> -old snapshot
59.95 s
gammaloop-nextest-spenso> +new results
59.95 s
gammaloop-nextest-spenso> ────────────┬───────────────────────────────────────────────────────────────────
59.95 s
gammaloop-nextest-spenso> 8 8 │ 0:0:s -> ext0 [id=0 color="red"];
59.95 s
gammaloop-nextest-spenso> 9 9 │ ext1 [style=invis];
59.95 s
gammaloop-nextest-spenso> 10 10 │ 0:5:s -> ext1 [id=1 dir=none color="red" label="mink4|l_0"];
59.95 s
gammaloop-nextest-spenso> 11 11 │ ext2 [style=invis];
59.95 s
gammaloop-nextest-spenso> 12 │- 0:4:s -> ext2 [id=2 dir=none color="red" label="bis4|l_2"];
59.95 s
gammaloop-nextest-spenso> 12 │+ 0:3:s -> ext2 [id=2 dir=none color="red" label="mink4|l_1"];
59.95 s
gammaloop-nextest-spenso> 13 13 │ ext3 [style=invis];
59.95 s
gammaloop-nextest-spenso> 14 │- 0:3:s -> ext3 [id=3 dir=none color="red" label="bis4|l_3"];
59.95 s
gammaloop-nextest-spenso> 14 │+ 0:1:s -> ext3 [id=3 dir=none color="red" label="bis4|l_2"];
59.95 s
gammaloop-nextest-spenso> 15 15 │ ext4 [style=invis];
59.95 s
gammaloop-nextest-spenso> 16 │- 0:1:s -> ext4 [id=4 dir=none color="red" label="mink4|l_1"];
59.95 s
gammaloop-nextest-spenso> 16 │+ 0:2:s -> ext4 [id=4 dir=none color="red" label="mink4|l_4"];
59.95 s
gammaloop-nextest-spenso> 17 17 │ ext5 [style=invis];
59.95 s
gammaloop-nextest-spenso> 18 │- 0:2:s -> ext5 [id=5 dir=none color="red" label="mink4|l_4"];
59.95 s
gammaloop-nextest-spenso> 18 │+ 0:4:s -> ext5 [id=5 dir=none color="red" label="bis4|l_3"];
59.95 s
gammaloop-nextest-spenso> 19 19 │ }
59.95 s
gammaloop-nextest-spenso> ────────────┴───────────────────────────────────────────────────────────────────
59.95 s
gammaloop-nextest-spenso> To update snapshots run `cargo insta review`
59.95 s
gammaloop-nextest-spenso> Stopped on the first failure. Run `cargo insta test` to run all snapshots.
59.95 s
gammaloop-nextest-spenso> test tensor::tests::parsing::infinite_execution ... FAILED
59.95 s
gammaloop-nextest-spenso>
59.95 s
gammaloop-nextest-spenso> failures:
59.95 s
gammaloop-nextest-spenso>
59.95 s
gammaloop-nextest-spenso> failures:
59.95 s
gammaloop-nextest-spenso> tensor::tests::parsing::infinite_execution
59.95 s
gammaloop-nextest-spenso>
59.95 s
gammaloop-nextest-spenso> test result: FAILED. 0 passed; 1 failed; 0 ignored; 0 measured; 248 filtered out; finished in 0.06s
59.95 s
gammaloop-nextest-spenso>
59.95 s
gammaloop-nextest-spenso> stderr ---
59.95 s
gammaloop-nextest-spenso>
59.95 s
gammaloop-nextest-spenso> thread 'tensor::tests::parsing::infinite_execution' (849) panicked at /nix/store/g4vv637bgwmy4qf4lv8w7s6sghivpa09-vendor-cargo-deps/c19b7c6f923b580ac259164a89f2577984ad5ab09ee9d583b888f934adbbe8d0/insta-1.47.2/src/runtime.rs:719:13:
59.95 s
gammaloop-nextest-spenso> snapshot assertion for 'infinite_execution' failed in line 905
59.95 s
gammaloop-nextest-spenso> stack backtrace:
59.95 s
gammaloop-nextest-spenso> 0: __rustc::rust_begin_unwind
59.95 s
gammaloop-nextest-spenso> 1: core::panicking::panic_fmt
59.95 s
gammaloop-nextest-spenso> 2: insta::runtime::assert_snapshot
59.95 s
gammaloop-nextest-spenso> 3: idenso::tensor::tests::parsing::infinite_execution
59.95 s
gammaloop-nextest-spenso> 4: <idenso::tensor::tests::parsing::infinite_execution::{closure#0} as core::ops::function::FnOnce<()>>::call_once
59.95 s
gammaloop-nextest-spenso> note: Some details are omitted, run with `RUST_BACKTRACE=full` for a verbose backtrace.
59.95 s
gammaloop-nextest-spenso>
59.98 s
gammaloop-nextest-spenso> error : test run failed
60.01 s
gammaloop-nextest-spenso>
60.01 s
gammaloop-nextest-spenso> ========== nextest test summary ==========
60.01 s
gammaloop-nextest-spenso> report: target/nextest/ci_gammaloop/junit.xml
60.01 s
gammaloop-nextest-spenso> tests: 232, failures: 5, errors: 0
60.01 s
gammaloop-nextest-spenso>
60.01 s
gammaloop-nextest-spenso> 1. idenso::dirac::test::feyncalc_reference::dirac_simplify_id40_repeated_gamma_and_two_trace
60.01 s
gammaloop-nextest-spenso> failure: test failure with exit code 101
60.01 s
gammaloop-nextest-spenso> thread 'dirac::test::feyncalc_reference::dirac_simplify_id40_repeated_gamma_and_two_trace' (491) panicked at crates/idenso/src/dirac/mod.rs:360:5:
60.01 s
gammaloop-nextest-spenso> gamma third argument must be a Minkowski slot
60.01 s
gammaloop-nextest-spenso> stack backtrace:
60.01 s
gammaloop-nextest-spenso> 0: __rustc::rust_begin_unwind
60.01 s
gammaloop-nextest-spenso> 1: core::panicking::panic_fmt
60.01 s
gammaloop-nextest-spenso> 2: idenso::dirac::require_gamma_port
60.01 s
gammaloop-nextest-spenso> 3: idenso::dirac::gamma_tensor
60.01 s
gammaloop-nextest-spenso> 4: idenso::dirac::test::feyncalc_reference::dirac_simplify_id40_repeated_gamma_and_two_trace
60.01 s
gammaloop-nextest-spenso> 5: <idenso::dirac::test::feyncalc_reference::dirac_simplify_id40_repeated_gamma_and_two_trace::{closure#0} as core::ops::function::FnOnce<()>>::call_once
60.01 s
gammaloop-nextest-spenso> note: Some details are omitted, run with `RUST_BACKTRACE=full` for a verbose backtrace.
60.01 s
gammaloop-nextest-spenso> system-out
60.01 s
gammaloop-nextest-spenso> running 1 test
60.01 s
gammaloop-nextest-spenso> test dirac::test::feyncalc_reference::dirac_simplify_id40_repeated_gamma_and_two_trace ... FAILED
60.01 s
gammaloop-nextest-spenso>
60.01 s
gammaloop-nextest-spenso> failures:
60.01 s
gammaloop-nextest-spenso>
60.01 s
gammaloop-nextest-spenso> failures:
60.01 s
gammaloop-nextest-spenso> dirac::test::feyncalc_reference::dirac_simplify_id40_repeated_gamma_and_two_trace
60.01 s
gammaloop-nextest-spenso>
60.01 s
gammaloop-nextest-spenso> test result: FAILED. 0 passed; 1 failed; 0 ignored; 0 measured; 248 filtered out; finished in 0.01s
60.01 s
gammaloop-nextest-spenso> system-err
60.01 s
gammaloop-nextest-spenso> thread 'dirac::test::feyncalc_reference::dirac_simplify_id40_repeated_gamma_and_two_trace' (491) panicked at crates/idenso/src/dirac/mod.rs:360:5:
60.01 s
gammaloop-nextest-spenso> gamma third argument must be a Minkowski slot
60.01 s
gammaloop-nextest-spenso> stack backtrace:
60.01 s
gammaloop-nextest-spenso> 0: __rustc::rust_begin_unwind
60.01 s
gammaloop-nextest-spenso> 1: core::panicking::panic_fmt
60.01 s
gammaloop-nextest-spenso> 2: idenso::dirac::require_gamma_port
60.01 s
gammaloop-nextest-spenso> 3: idenso::dirac::gamma_tensor
60.01 s
gammaloop-nextest-spenso> 4: idenso::dirac::test::feyncalc_reference::dirac_simplify_id40_repeated_gamma_and_two_trace
60.01 s
gammaloop-nextest-spenso> 5: <idenso::dirac::test::feyncalc_reference::dirac_simplify_id40_repeated_gamma_and_two_trace::{closure#0} as core::ops::function::FnOnce<()>>::call_once
60.01 s
gammaloop-nextest-spenso> note: Some details are omitted, run with `RUST_BACKTRACE=full` for a verbose backtrace.
60.01 s
gammaloop-nextest-spenso>
60.01 s
gammaloop-nextest-spenso> 2. idenso::dirac::test::feyncalc_reference::dirac_simplify_id46_d_dim_repeated_gamma_slash_sum
60.01 s
gammaloop-nextest-spenso> failure: test failure with exit code 101
60.01 s
gammaloop-nextest-spenso> thread 'dirac::test::feyncalc_reference::dirac_simplify_id46_d_dim_repeated_gamma_slash_sum' (504) panicked at crates/idenso/src/dirac/mod.rs:360:5:
60.01 s
gammaloop-nextest-spenso> gamma third argument must be a Minkowski slot
60.01 s
gammaloop-nextest-spenso> stack backtrace:
60.01 s
gammaloop-nextest-spenso> 0: __rustc::rust_begin_unwind
60.01 s
gammaloop-nextest-spenso> 1: core::panicking::panic_fmt
60.01 s
gammaloop-nextest-spenso> 2: idenso::dirac::require_gamma_port
60.01 s
gammaloop-nextest-spenso> 3: idenso::dirac::gamma_tensor
60.01 s
gammaloop-nextest-spenso> 4: idenso::dirac::test::feyncalc_reference::dirac_simplify_id46_d_dim_repeated_gamma_slash_sum
60.01 s
gammaloop-nextest-spenso> 5: <idenso::dirac::test::feyncalc_reference::dirac_simplify_id46_d_dim_repeated_gamma_slash_sum::{closure#0} as core::ops::function::FnOnce<()>>::call_once
60.01 s
gammaloop-nextest-spenso> note: Some details are omitted, run with `RUST_BACKTRACE=full` for a verbose backtrace.
60.01 s
gammaloop-nextest-spenso> system-out
60.01 s
gammaloop-nextest-spenso> running 1 test
60.01 s
gammaloop-nextest-spenso> test dirac::test::feyncalc_reference::dirac_simplify_id46_d_dim_repeated_gamma_slash_sum ... FAILED
60.01 s
gammaloop-nextest-spenso>
60.01 s
gammaloop-nextest-spenso> failures:
60.01 s
gammaloop-nextest-spenso>
60.01 s
gammaloop-nextest-spenso> failures:
60.01 s
gammaloop-nextest-spenso> dirac::test::feyncalc_reference::dirac_simplify_id46_d_dim_repeated_gamma_slash_sum
60.01 s
gammaloop-nextest-spenso>
60.01 s
gammaloop-nextest-spenso> test result: FAILED. 0 passed; 1 failed; 0 ignored; 0 measured; 248 filtered out; finished in 0.00s
60.01 s
gammaloop-nextest-spenso> system-err
60.01 s
gammaloop-nextest-spenso> thread 'dirac::test::feyncalc_reference::dirac_simplify_id46_d_dim_repeated_gamma_slash_sum' (504) panicked at crates/idenso/src/dirac/mod.rs:360:5:
60.01 s
gammaloop-nextest-spenso> gamma third argument must be a Minkowski slot
60.01 s
gammaloop-nextest-spenso> stack backtrace:
60.01 s
gammaloop-nextest-spenso> 0: __rustc::rust_begin_unwind
60.01 s
gammaloop-nextest-spenso> 1: core::panicking::panic_fmt
60.01 s
gammaloop-nextest-spenso> 2: idenso::dirac::require_gamma_port
60.01 s
gammaloop-nextest-spenso> 3: idenso::dirac::gamma_tensor
60.01 s
gammaloop-nextest-spenso> 4: idenso::dirac::test::feyncalc_reference::dirac_simplify_id46_d_dim_repeated_gamma_slash_sum
60.01 s
gammaloop-nextest-spenso> 5: <idenso::dirac::test::feyncalc_reference::dirac_simplify_id46_d_dim_repeated_gamma_slash_sum::{closure#0} as core::ops::function::FnOnce<()>>::call_once
60.01 s
gammaloop-nextest-spenso> note: Some details are omitted, run with `RUST_BACKTRACE=full` for a verbose backtrace.
60.01 s
gammaloop-nextest-spenso>
60.01 s
gammaloop-nextest-spenso> 3. idenso::dirac::test::feyncalc_reference::dirac_simplify_id4_slash_sandwich
60.01 s
gammaloop-nextest-spenso> failure: test failure with exit code 101
60.01 s
gammaloop-nextest-spenso> thread 'dirac::test::feyncalc_reference::dirac_simplify_id4_slash_sandwich' (511) panicked at crates/idenso/src/dirac/mod.rs:360:5:
60.01 s
gammaloop-nextest-spenso> gamma third argument must be a Minkowski slot
60.01 s
gammaloop-nextest-spenso> stack backtrace:
60.01 s
gammaloop-nextest-spenso> 0: __rustc::rust_begin_unwind
60.01 s
gammaloop-nextest-spenso> 1: core::panicking::panic_fmt
60.01 s
gammaloop-nextest-spenso> 2: idenso::dirac::require_gamma_port
60.01 s
gammaloop-nextest-spenso> 3: idenso::dirac::gamma_tensor
60.01 s
gammaloop-nextest-spenso> 4: idenso::dirac::test::feyncalc_reference::dirac_simplify_id4_slash_sandwich
60.01 s
gammaloop-nextest-spenso> 5: <idenso::dirac::test::feyncalc_reference::dirac_simplify_id4_slash_sandwich::{closure#0} as core::ops::function::FnOnce<()>>::call_once
60.01 s
gammaloop-nextest-spenso> note: Some details are omitted, run with `RUST_BACKTRACE=full` for a verbose backtrace.
60.01 s
gammaloop-nextest-spenso> system-out
60.01 s
gammaloop-nextest-spenso> running 1 test
60.01 s
gammaloop-nextest-spenso> test dirac::test::feyncalc_reference::dirac_simplify_id4_slash_sandwich ... FAILED
60.01 s
gammaloop-nextest-spenso>
60.01 s
gammaloop-nextest-spenso> failures:
60.01 s
gammaloop-nextest-spenso>
60.01 s
gammaloop-nextest-spenso> failures:
60.01 s
gammaloop-nextest-spenso> dirac::test::feyncalc_reference::dirac_simplify_id4_slash_sandwich
60.01 s
gammaloop-nextest-spenso>
60.01 s
gammaloop-nextest-spenso> test result: FAILED. 0 passed; 1 failed; 0 ignored; 0 measured; 248 filtered out; finished in 0.01s
60.01 s
gammaloop-nextest-spenso> system-err
60.01 s
gammaloop-nextest-spenso> thread 'dirac::test::feyncalc_reference::dirac_simplify_id4_slash_sandwich' (511) panicked at crates/idenso/src/dirac/mod.rs:360:5:
60.01 s
gammaloop-nextest-spenso> gamma third argument must be a Minkowski slot
60.01 s
gammaloop-nextest-spenso> stack backtrace:
60.01 s
gammaloop-nextest-spenso> 0: __rustc::rust_begin_unwind
60.01 s
gammaloop-nextest-spenso> 1: core::panicking::panic_fmt
60.01 s
gammaloop-nextest-spenso> 2: idenso::dirac::require_gamma_port
60.01 s
gammaloop-nextest-spenso> 3: idenso::dirac::gamma_tensor
60.01 s
gammaloop-nextest-spenso> 4: idenso::dirac::test::feyncalc_reference::dirac_simplify_id4_slash_sandwich
60.01 s
gammaloop-nextest-spenso> 5: <idenso::dirac::test::feyncalc_reference::dirac_simplify_id4_slash_sandwich::{closure#0} as core::ops::function::FnOnce<()>>::call_once
60.01 s
gammaloop-nextest-spenso> note: Some details are omitted, run with `RUST_BACKTRACE=full` for a verbose backtrace.
60.01 s
gammaloop-nextest-spenso>
60.01 s
gammaloop-nextest-spenso> 4. idenso::reference_cases::tests::reference_case_simplification_snapshots
60.01 s
gammaloop-nextest-spenso> failure: test failure with exit code 101
60.01 s
gammaloop-nextest-spenso> thread 'reference_cases::tests::reference_case_simplification_snapshots' (684) panicked at crates/idenso/src/dirac/mod.rs:360:5:
60.01 s
gammaloop-nextest-spenso> gamma third argument must be a Minkowski slot
60.01 s
gammaloop-nextest-spenso> stack backtrace:
60.01 s
gammaloop-nextest-spenso> 0: __rustc::rust_begin_unwind
60.01 s
gammaloop-nextest-spenso> 1: core::panicking::panic_fmt
60.01 s
gammaloop-nextest-spenso> 2: idenso::dirac::require_gamma_port
60.01 s
gammaloop-nextest-spenso> 3: idenso::dirac::gamma_tensor
60.01 s
gammaloop-nextest-spenso> 4: idenso::reference_cases::dirac_feyncalc_slash_sandwich_id4
60.01 s
gammaloop-nextest-spenso> 5: <idenso::reference_cases::ReferenceCase>::simplified
60.01 s
gammaloop-nextest-spenso> 6: <core::iter::adapters::map::Map<core::slice::iter::Iter<idenso::reference_cases::ReferenceCase>, idenso::reference_cases::tests::reference_case_simplification_snapshots::{closure#0}> as core::iter::traits::iterator::Iterator>::fold::<(), core::iter::traits::iterator::Iterator::for_each::call<alloc::string::String, <alloc::vec::Vec<alloc::string::String>>::extend_trusted<core::iter::adapters::map::Map<core::slice::iter::Iter<idenso::reference_cases::ReferenceCase>, idenso::reference_cases::tests::reference_case_simplification_snapshots::{closure#0}>>::{closure#0}>::{closure#0}>
60.01 s
gammaloop-nextest-spenso> 7: <alloc::vec::Vec<alloc::string::String> as alloc::vec::spec_from_iter_nested::SpecFromIterNested<alloc::string::String, core::iter::adapters::map::Map<core::slice::iter::Iter<idenso::reference_cases::ReferenceCase>, idenso::reference_cases::tests::reference_case_simplification_snapshots::{closure#0}>>>::from_iter
60.01 s
gammaloop-nextest-spenso> 8: idenso::reference_cases::tests::reference_case_simplification_snapshots
60.01 s
gammaloop-nextest-spenso> 9: <idenso::reference_cases::tests::reference_case_simplification_snapshots::{closure#0} as core::ops::function::FnOnce<()>>::call_once
60.01 s
gammaloop-nextest-spenso> note: Some details are omitted, run with `RUST_BACKTRACE=full` for a verbose backtrace.
60.01 s
gammaloop-nextest-spenso> system-out
60.01 s
gammaloop-nextest-spenso> running 1 test
60.01 s
gammaloop-nextest-spenso> test reference_cases::tests::reference_case_simplification_snapshots ... FAILED
60.01 s
gammaloop-nextest-spenso>
60.01 s
gammaloop-nextest-spenso> failures:
60.01 s
gammaloop-nextest-spenso>
60.01 s
gammaloop-nextest-spenso> failures:
60.01 s
gammaloop-nextest-spenso> reference_cases::tests::reference_case_simplification_snapshots
60.01 s
gammaloop-nextest-spenso>
60.01 s
gammaloop-nextest-spenso> test result: FAILED. 0 passed; 1 failed; 0 ignored; 0 measured; 248 filtered out; finished in 0.01s
60.01 s
gammaloop-nextest-spenso> system-err
60.01 s
gammaloop-nextest-spenso> thread 'reference_cases::tests::reference_case_simplification_snapshots' (684) panicked at crates/idenso/src/dirac/mod.rs:360:5:
60.01 s
gammaloop-nextest-spenso> gamma third argument must be a Minkowski slot
60.01 s
gammaloop-nextest-spenso> stack backtrace:
60.01 s
gammaloop-nextest-spenso> 0: __rustc::rust_begin_unwind
60.01 s
gammaloop-nextest-spenso> 1: core::panicking::panic_fmt
60.01 s
gammaloop-nextest-spenso> 2: idenso::dirac::require_gamma_port
60.01 s
gammaloop-nextest-spenso> 3: idenso::dirac::gamma_tensor
60.01 s
gammaloop-nextest-spenso> 4: idenso::reference_cases::dirac_feyncalc_slash_sandwich_id4
60.01 s
gammaloop-nextest-spenso> 5: <idenso::reference_cases::ReferenceCase>::simplified
60.01 s
gammaloop-nextest-spenso> 6: <core::iter::adapters::map::Map<core::slice::iter::Iter<idenso::reference_cases::ReferenceCase>, idenso::reference_cases::tests::reference_case_simplification_snapshots::{closure#0}> as core::iter::traits::iterator::Iterator>::fold::<(), core::iter::traits::iterator::Iterator::for_each::call<alloc::string::String, <alloc::vec::Vec<alloc::string::String>>::extend_trusted<core::iter::adapters::map::Map<core::slice::iter::Iter<idenso::reference_cases::ReferenceCase>, idenso::reference_cases::tests::reference_case_simplification_snapshots::{closure#0}>>::{closure#0}>::{closure#0}>
60.01 s
gammaloop-nextest-spenso> 7: <alloc::vec::Vec<alloc::string::String> as alloc::vec::spec_from_iter_nested::SpecFromIterNested<alloc::string::String, core::iter::adapters::map::Map<core::slice::iter::Iter<idenso::reference_cases::ReferenceCase>, idenso::reference_cases::tests::reference_case_simplification_snapshots::{closure#0}>>>::from_iter
60.01 s
gammaloop-nextest-spenso> 8: idenso::reference_cases::tests::reference_case_simplification_snapshots
60.01 s
gammaloop-nextest-spenso> 9: <idenso::reference_cases::tests::reference_case_simplification_snapshots::{closure#0} as core::ops::function::FnOnce<()>>::call_once
60.01 s
gammaloop-nextest-spenso> note: Some details are omitted, run with `RUST_BACKTRACE=full` for a verbose backtrace.
60.01 s
gammaloop-nextest-spenso>
60.01 s
gammaloop-nextest-spenso> 5. idenso::tensor::tests::parsing::infinite_execution
60.01 s
gammaloop-nextest-spenso> failure: test failure with exit code 101
60.01 s
gammaloop-nextest-spenso> thread 'tensor::tests::parsing::infinite_execution' (849) panicked at /nix/store/g4vv637bgwmy4qf4lv8w7s6sghivpa09-vendor-cargo-deps/c19b7c6f923b580ac259164a89f2577984ad5ab09ee9d583b888f934adbbe8d0/insta-1.47.2/src/runtime.rs:719:13:
60.01 s
gammaloop-nextest-spenso> snapshot assertion for 'infinite_execution' failed in line 905
60.01 s
gammaloop-nextest-spenso> stack backtrace:
60.01 s
gammaloop-nextest-spenso> 0: __rustc::rust_begin_unwind
60.01 s
gammaloop-nextest-spenso> 1: core::panicking::panic_fmt
60.01 s
gammaloop-nextest-spenso> 2: insta::runtime::assert_snapshot
60.01 s
gammaloop-nextest-spenso> 3: idenso::tensor::tests::parsing::infinite_execution
60.01 s
gammaloop-nextest-spenso> 4: <idenso::tensor::tests::parsing::infinite_execution::{closure#0} as core::ops::function::FnOnce<()>>::call_once
60.01 s
gammaloop-nextest-spenso> note: Some details are omitted, run with `RUST_BACKTRACE=full` for a verbose backtrace.
60.01 s
gammaloop-nextest-spenso> system-out
60.01 s
gammaloop-nextest-spenso> running 1 test
60.01 s
gammaloop-nextest-spenso> ━━━━━━━━━━━━━━━━━━━━━━━━━━━━━━━ Snapshot Summary ━━━━━━━━━━━━━━━━━━━━━━━━━━━━━━━
60.01 s
gammaloop-nextest-spenso> Snapshot: infinite_execution
60.01 s
gammaloop-nextest-spenso> Source: crates/idenso/src/tensor/tests/parsing.rs:905
60.01 s
gammaloop-nextest-spenso> ────────────────────────────────────────────────────────────────────────────────
60.01 s
gammaloop-nextest-spenso> Expression: net_iter.snapshot_dot()
60.01 s
gammaloop-nextest-spenso> ────────────────────────────────────────────────────────────────────────────────
60.01 s
gammaloop-nextest-spenso> -old snapshot
60.01 s
gammaloop-nextest-spenso> +new results
60.01 s
gammaloop-nextest-spenso> ────────────┬───────────────────────────────────────────────────────────────────
60.01 s
gammaloop-nextest-spenso> 8 8 │ 0:0:s-> ext0 [id=0 color="red"];
60.01 s
gammaloop-nextest-spenso> 9 9 │ ext1 [style=invis];
60.01 s
gammaloop-nextest-spenso> 10 10 │ 0:5:s-> ext1 [id=1 dir=none color="red" label="mink4|l_0"];
60.01 s
gammaloop-nextest-spenso> 11 11 │ ext2 [style=invis];
60.01 s
gammaloop-nextest-spenso> 12 │- 0:4:s-> ext2 [id=2 dir=none color="red" label="bis4|l_2"];
60.01 s
gammaloop-nextest-spenso> 12 │+ 0:3:s-> ext2 [id=2 dir=none color="red" label="mink4|l_1"];
60.01 s
gammaloop-nextest-spenso> 13 13 │ ext3 [style=invis];
60.01 s
gammaloop-nextest-spenso> 14 │- 0:3:s-> ext3 [id=3 dir=none color="red" label="bis4|l_3"];
60.01 s
gammaloop-nextest-spenso> 14 │+ 0:1:s-> ext3 [id=3 dir=none color="red" label="bis4|l_2"];
60.01 s
gammaloop-nextest-spenso> 15 15 │ ext4 [style=invis];
60.01 s
gammaloop-nextest-spenso> 16 │- 0:1:s-> ext4 [id=4 dir=none color="red" label="mink4|l_1"];
60.01 s
gammaloop-nextest-spenso> 16 │+ 0:2:s-> ext4 [id=4 dir=none color="red" label="mink4|l_4"];
60.01 s
gammaloop-nextest-spenso> 17 17 │ ext5 [style=invis];
60.01 s
gammaloop-nextest-spenso> 18 │- 0:2:s-> ext5 [id=5 dir=none color="red" label="mink4|l_4"];
60.01 s
gammaloop-nextest-spenso> 18 │+ 0:4:s-> ext5 [id=5 dir=none color="red" label="bis4|l_3"];
60.01 s
gammaloop-nextest-spenso> 19 19 │ }
60.01 s
gammaloop-nextest-spenso> ────────────┴───────────────────────────────────────────────────────────────────
60.01 s
gammaloop-nextest-spenso> To update snapshots run `cargo insta review`
60.01 s
gammaloop-nextest-spenso> Stopped on the first failure. Run `cargo insta test` to run all snapshots.
60.01 s
gammaloop-nextest-spenso> test tensor::tests::parsing::infinite_execution ... FAILED
60.01 s
gammaloop-nextest-spenso>
60.01 s
gammaloop-nextest-spenso> failures:
60.01 s
gammaloop-nextest-spenso>
60.01 s
gammaloop-nextest-spenso> failures:
60.01 s
gammaloop-nextest-spenso> tensor::tests::parsing::infinite_execution
60.01 s
gammaloop-nextest-spenso>
60.01 s
gammaloop-nextest-spenso> test result: FAILED. 0 passed; 1 failed; 0 ignored; 0 measured; 248 filtered out; finished in 0.06s
60.01 s
gammaloop-nextest-spenso> system-err
60.01 s
gammaloop-nextest-spenso> thread 'tensor::tests::parsing::infinite_execution' (849) panicked at /nix/store/g4vv637bgwmy4qf4lv8w7s6sghivpa09-vendor-cargo-deps/c19b7c6f923b580ac259164a89f2577984ad5ab09ee9d583b888f934adbbe8d0/insta-1.47.2/src/runtime.rs:719:13:
60.01 s
gammaloop-nextest-spenso> snapshot assertion for 'infinite_execution' failed in line 905
60.01 s
gammaloop-nextest-spenso> stack backtrace:
60.01 s
gammaloop-nextest-spenso> 0: __rustc::rust_begin_unwind
60.01 s
gammaloop-nextest-spenso> 1: core::panicking::panic_fmt
60.01 s
gammaloop-nextest-spenso> 2: insta::runtime::assert_snapshot
60.01 s
gammaloop-nextest-spenso> 3: idenso::tensor::tests::parsing::infinite_execution
60.01 s
gammaloop-nextest-spenso> 4: <idenso::tensor::tests::parsing::infinite_execution::{closure#0} as core::ops::function::FnOnce<()>>::call_once
60.01 s
gammaloop-nextest-spenso> note: Some details are omitted, run with `RUST_BACKTRACE=full` for a verbose backtrace.
60.01 s
gammaloop-nextest-spenso> =========================================
60.02 s
gammaloop-nextest-spenso> Extracting 2 binaries and 1 linked path to /build/nextest-archive-z2TOkC
60.11 s
gammaloop-nextest-spenso> Extracted 8 files to /build/nextest-archive-z2TOkC in 0.09s
60.12 s
gammaloop-nextest-spenso> ------------
60.12 s
gammaloop-nextest-spenso> Nextest run ID 89549e82-ad79-49f8-bb26-a301b45ede72 with nextest profile: ci_gammaloop
60.12 s
gammaloop-nextest-spenso> Starting 195 tests across 2 binaries
60.23 s
gammaloop-nextest-spenso> ------------
60.23 s
gammaloop-nextest-spenso> Summary [ 0.111s] 195 tests run: 195 passed , 0 skipped
60.28 s
gammaloop-nextest-spenso>
60.28 s
gammaloop-nextest-spenso> ========== nextest test summary ==========
60.28 s
gammaloop-nextest-spenso> report: target/nextest/ci_gammaloop/junit.xml
60.28 s
gammaloop-nextest-spenso> tests: 195, failures: 0, errors: 0
60.28 s
gammaloop-nextest-spenso> No failing testcases found.
60.28 s
gammaloop-nextest-spenso> =========================================
60.29 s
gammaloop-nextest-spenso> Extracting 5 binaries and 2 linked paths to /build/nextest-archive-Ru85v4
60.53 s
gammaloop-nextest-spenso> Extracted 19 files to /build/nextest-archive-Ru85v4 in 0.24s
60.54 s
gammaloop-nextest-spenso> ------------
60.54 s
gammaloop-nextest-spenso> Nextest run ID a8cc015b-bdb6-4884-8d59-500b44da45f9 with nextest profile: ci_gammaloop
60.54 s
gammaloop-nextest-spenso> Starting 27 tests across 5 binaries (1 test skipped via profile.ci_gammaloop.default-filter )
60.62 s
gammaloop-nextest-spenso> FAIL [ 0.056s] (24/27) spenso-hep-lib::idenso_validation enabled_idenso_reference_cases_validate_against_explicit_tensors
60.62 s
gammaloop-nextest-spenso> stdout ---
60.62 s
gammaloop-nextest-spenso>
60.62 s
gammaloop-nextest-spenso> running 1 test
60.62 s
gammaloop-nextest-spenso> test enabled_idenso_reference_cases_validate_against_explicit_tensors ... FAILED
60.62 s
gammaloop-nextest-spenso>
60.62 s
gammaloop-nextest-spenso> failures:
60.62 s
gammaloop-nextest-spenso>
60.62 s
gammaloop-nextest-spenso> failures:
60.62 s
gammaloop-nextest-spenso> enabled_idenso_reference_cases_validate_against_explicit_tensors
60.62 s
gammaloop-nextest-spenso>
60.62 s
gammaloop-nextest-spenso> test result: FAILED. 0 passed; 1 failed; 0 ignored; 0 measured; 14 filtered out; finished in 0.05s
60.62 s
gammaloop-nextest-spenso>
60.62 s
gammaloop-nextest-spenso> stderr ---
60.62 s
gammaloop-nextest-spenso>
60.62 s
gammaloop-nextest-spenso> thread 'enabled_idenso_reference_cases_validate_against_explicit_tensors' (1668) panicked at crates/idenso/src/dirac/mod.rs:360:5:
60.62 s
gammaloop-nextest-spenso> gamma third argument must be a Minkowski slot
60.62 s
gammaloop-nextest-spenso> stack backtrace:
60.62 s
gammaloop-nextest-spenso> 0: __rustc::rust_begin_unwind
60.62 s
gammaloop-nextest-spenso> 1: core::panicking::panic_fmt
60.62 s
gammaloop-nextest-spenso> 2: idenso::dirac::require_gamma_port
60.62 s
gammaloop-nextest-spenso> 3: idenso::dirac::gamma_tensor
60.62 s
gammaloop-nextest-spenso> 4: idenso::reference_cases::dirac_feyncalc_slash_sandwich_id4
60.62 s
gammaloop-nextest-spenso> 5: <idenso_validation::enabled_idenso_reference_cases_validate_against_explicit_tensors::{closure#0} as core::ops::function::FnOnce<()>>::call_once
60.62 s
gammaloop-nextest-spenso> note: Some details are omitted, run with `RUST_BACKTRACE=full` for a verbose backtrace.
60.62 s
gammaloop-nextest-spenso>
60.66 s
gammaloop-nextest-spenso> ------------
60.66 s
gammaloop-nextest-spenso> Summary [ 0.120s] 27 tests run: 26 passed , 1 failed , 1 skipped
60.66 s
gammaloop-nextest-spenso> FAIL [ 0.056s] (24/27) spenso-hep-lib::idenso_validation enabled_idenso_reference_cases_validate_against_explicit_tensors
60.66 s
gammaloop-nextest-spenso> stdout ---
60.66 s
gammaloop-nextest-spenso>
60.66 s
gammaloop-nextest-spenso> running 1 test
60.66 s
gammaloop-nextest-spenso> test enabled_idenso_reference_cases_validate_against_explicit_tensors ... FAILED
60.66 s
gammaloop-nextest-spenso>
60.66 s
gammaloop-nextest-spenso> failures:
60.66 s
gammaloop-nextest-spenso>
60.66 s
gammaloop-nextest-spenso> failures:
60.66 s
gammaloop-nextest-spenso> enabled_idenso_reference_cases_validate_against_explicit_tensors
60.66 s
gammaloop-nextest-spenso>
60.66 s
gammaloop-nextest-spenso> test result: FAILED. 0 passed; 1 failed; 0 ignored; 0 measured; 14 filtered out; finished in 0.05s
60.66 s
gammaloop-nextest-spenso>
60.66 s
gammaloop-nextest-spenso> stderr ---
60.66 s
gammaloop-nextest-spenso>
60.66 s
gammaloop-nextest-spenso> thread 'enabled_idenso_reference_cases_validate_against_explicit_tensors' (1668) panicked at crates/idenso/src/dirac/mod.rs:360:5:
60.66 s
gammaloop-nextest-spenso> gamma third argument must be a Minkowski slot
60.66 s
gammaloop-nextest-spenso> stack backtrace:
60.66 s
gammaloop-nextest-spenso> 0: __rustc::rust_begin_unwind
60.66 s
gammaloop-nextest-spenso> 1: core::panicking::panic_fmt
60.66 s
gammaloop-nextest-spenso> 2: idenso::dirac::require_gamma_port
60.66 s
gammaloop-nextest-spenso> 3: idenso::dirac::gamma_tensor
60.66 s
gammaloop-nextest-spenso> 4: idenso::reference_cases::dirac_feyncalc_slash_sandwich_id4
60.66 s
gammaloop-nextest-spenso> 5: <idenso_validation::enabled_idenso_reference_cases_validate_against_explicit_tensors::{closure#0} as core::ops::function::FnOnce<()>>::call_once
60.66 s
gammaloop-nextest-spenso> note: Some details are omitted, run with `RUST_BACKTRACE=full` for a verbose backtrace.
60.66 s
gammaloop-nextest-spenso>
60.70 s
gammaloop-nextest-spenso> error : test run failed
60.73 s
gammaloop-nextest-spenso>
60.73 s
gammaloop-nextest-spenso> ========== nextest test summary ==========
60.73 s
gammaloop-nextest-spenso> report: target/nextest/ci_gammaloop/junit.xml
60.73 s
gammaloop-nextest-spenso> tests: 27, failures: 1, errors: 0
60.73 s
gammaloop-nextest-spenso>
60.73 s
gammaloop-nextest-spenso> 1. spenso-hep-lib::idenso_validation::enabled_idenso_reference_cases_validate_against_explicit_tensors
60.73 s
gammaloop-nextest-spenso> failure: test failure with exit code 101
60.73 s
gammaloop-nextest-spenso> thread 'enabled_idenso_reference_cases_validate_against_explicit_tensors' (1668) panicked at crates/idenso/src/dirac/mod.rs:360:5:
60.73 s
gammaloop-nextest-spenso> gamma third argument must be a Minkowski slot
60.73 s
gammaloop-nextest-spenso> stack backtrace:
60.73 s
gammaloop-nextest-spenso> 0: __rustc::rust_begin_unwind
60.73 s
gammaloop-nextest-spenso> 1: core::panicking::panic_fmt
60.73 s
gammaloop-nextest-spenso> 2: idenso::dirac::require_gamma_port
60.73 s
gammaloop-nextest-spenso> 3: idenso::dirac::gamma_tensor
60.73 s
gammaloop-nextest-spenso> 4: idenso::reference_cases::dirac_feyncalc_slash_sandwich_id4
60.73 s
gammaloop-nextest-spenso> 5: <idenso_validation::enabled_idenso_reference_cases_validate_against_explicit_tensors::{closure#0} as core::ops::function::FnOnce<()>>::call_once
60.73 s
gammaloop-nextest-spenso> note: Some details are omitted, run with `RUST_BACKTRACE=full` for a verbose backtrace.
60.73 s
gammaloop-nextest-spenso> system-out
60.73 s
gammaloop-nextest-spenso> running 1 test
60.73 s
gammaloop-nextest-spenso> test enabled_idenso_reference_cases_validate_against_explicit_tensors ... FAILED
60.73 s
gammaloop-nextest-spenso>
60.73 s
gammaloop-nextest-spenso> failures:
60.73 s
gammaloop-nextest-spenso>
60.73 s
gammaloop-nextest-spenso> failures:
60.73 s
gammaloop-nextest-spenso> enabled_idenso_reference_cases_validate_against_explicit_tensors
60.73 s
gammaloop-nextest-spenso>
60.73 s
gammaloop-nextest-spenso> test result: FAILED. 0 passed; 1 failed; 0 ignored; 0 measured; 14 filtered out; finished in 0.05s
60.73 s
gammaloop-nextest-spenso> system-err
60.73 s
gammaloop-nextest-spenso> thread 'enabled_idenso_reference_cases_validate_against_explicit_tensors' (1668) panicked at crates/idenso/src/dirac/mod.rs:360:5:
60.73 s
gammaloop-nextest-spenso> gamma third argument must be a Minkowski slot
60.73 s
gammaloop-nextest-spenso> stack backtrace:
60.73 s
gammaloop-nextest-spenso> 0: __rustc::rust_begin_unwind
60.73 s
gammaloop-nextest-spenso> 1: core::panicking::panic_fmt
60.73 s
gammaloop-nextest-spenso> 2: idenso::dirac::require_gamma_port
60.73 s
gammaloop-nextest-spenso> 3: idenso::dirac::gamma_tensor
60.73 s
gammaloop-nextest-spenso> 4: idenso::reference_cases::dirac_feyncalc_slash_sandwich_id4
60.73 s
gammaloop-nextest-spenso> 5: <idenso_validation::enabled_idenso_reference_cases_validate_against_explicit_tensors::{closure#0} as core::ops::function::FnOnce<()>>::call_once
60.73 s
gammaloop-nextest-spenso> note: Some details are omitted, run with `RUST_BACKTRACE=full` for a verbose backtrace.
60.73 s
gammaloop-nextest-spenso> =========================================
60.74 s
gammaloop-nextest-spenso> Extracting 2 binaries and 1 linked path to /build/nextest-archive-lGxak8
60.81 s
gammaloop-nextest-spenso> Extracted 8 files to /build/nextest-archive-lGxak8 in 0.07s
60.82 s
gammaloop-nextest-spenso> ------------
60.82 s
gammaloop-nextest-spenso> Nextest run ID 53d1d928-8461-494d-a3ae-5d2df03da1bc with nextest profile: ci_gammaloop
60.82 s
gammaloop-nextest-spenso> Starting 1 test across 2 binaries
60.82 s
gammaloop-nextest-spenso> ------------
60.82 s
gammaloop-nextest-spenso> Summary [ 0.005s] 1 test run: 1 passed , 0 skipped
60.86 s
gammaloop-nextest-spenso>
60.86 s
gammaloop-nextest-spenso> ========== nextest test summary ==========
60.86 s
gammaloop-nextest-spenso> report: target/nextest/ci_gammaloop/junit.xml
60.87 s
gammaloop-nextest-spenso> tests: 1, failures: 0, errors: 0
60.87 s
gammaloop-nextest-spenso> No failing testcases found.
60.87 s
gammaloop-nextest-spenso> =========================================
60.88 s
gammaloop-nextest-spenso> Extracting 1 binary and 1 linked path to /build/nextest-archive-CPHOWb
60.99 s
gammaloop-nextest-spenso> Extracted 7 files to /build/nextest-archive-CPHOWb in 0.07s
60.99 s
gammaloop-nextest-spenso> ------------
60.99 s
gammaloop-nextest-spenso> Nextest run ID 39a3ad9a-a5c3-46c4-a37b-c154c604571c with nextest profile: ci_gammaloop
60.99 s
gammaloop-nextest-spenso> Starting 0 tests across 1 binary
60.99 s
gammaloop-nextest-spenso> ------------
60.99 s
gammaloop-nextest-spenso> Summary [ 0.000s] 0 tests run: 0 passed , 0 skipped
61.00 s
gammaloop-nextest-spenso>
61.00 s
gammaloop-nextest-spenso> ========== nextest test summary ==========
61.00 s
gammaloop-nextest-spenso> report: target/nextest/ci_gammaloop/junit.xml
61.00 s
gammaloop-nextest-spenso> tests: 0, failures: 0, errors: 0
61.00 s
gammaloop-nextest-spenso> No failing testcases found.
61.00 s
gammaloop-nextest-spenso> =========================================
61.08 s
error: Cannot build '/nix/store/pcw901lvh10nhiz9sizq4ncxl7hk2sj8-gammaloop-nextest-spenso.drv '.
61.08 s
Reason: builder failed with exit code 100 .
61.08 s
Output paths:
61.08 s
/nix/store/svfvfmdbxmky2ygprd3qgwr8zggj7a43-gammaloop-nextest-spenso
61.08 s
Last 677 log lines:
61.08 s
> Extracting 5 binaries and 2 linked paths to /build/nextest-archive-UAHuUS
61.08 s
> Extracted 19 files to /build/nextest-archive-UAHuUS in 0.23s
61.08 s
> ------------
61.08 s
> Nextest run ID 235f27c3-8714-4e3f-bb75-4c5376b0da5e with nextest profile: ci_gammaloop
61.08 s
> Starting 232 tests across 5 binaries (26 tests skipped , including 2 tests via profile.ci_gammaloop.default-filter )
61.08 s
> FAIL [ 0.019s] ( 91/232) idenso dirac::test::feyncalc_reference :: dirac_simplify_id40_repeated_gamma_and_two_trace
61.08 s
> stdout ---
61.08 s
>
61.08 s
> running 1 test
61.08 s
> test dirac::test::feyncalc_reference::dirac_simplify_id40_repeated_gamma_and_two_trace ... FAILED
61.08 s
>
61.08 s
> failures:
61.08 s
>
61.08 s
> failures:
61.08 s
> dirac::test::feyncalc_reference::dirac_simplify_id40_repeated_gamma_and_two_trace
61.08 s
>
61.08 s
> test result: FAILED. 0 passed; 1 failed; 0 ignored; 0 measured; 248 filtered out; finished in 0.01s
61.08 s
>
61.08 s
> stderr ---
61.08 s
>
61.08 s
> thread 'dirac::test::feyncalc_reference::dirac_simplify_id40_repeated_gamma_and_two_trace' (491) panicked at crates/idenso/src/dirac/mod.rs:360:5:
61.08 s
> gamma third argument must be a Minkowski slot
61.08 s
> stack backtrace:
61.08 s
> 0: __rustc::rust_begin_unwind
61.08 s
> 1: core::panicking::panic_fmt
61.08 s
> 2: idenso::dirac::require_gamma_port
61.08 s
> 3: idenso::dirac::gamma_tensor
61.08 s
> 4: idenso::dirac::test::feyncalc_reference::dirac_simplify_id40_repeated_gamma_and_two_trace
61.08 s
> 5: <idenso::dirac::test::feyncalc_reference::dirac_simplify_id40_repeated_gamma_and_two_trace::{closure#0} as core::ops::function::FnOnce<()>>::call_once
61.08 s
> note: Some details are omitted, run with `RUST_BACKTRACE=full` for a verbose backtrace.
61.08 s
>
61.08 s
> FAIL [ 0.022s] ( 92/232) idenso dirac::test::feyncalc_reference :: dirac_simplify_id46_d_dim_repeated_gamma_slash_sum
61.08 s
> stdout ---
61.08 s
>
61.08 s
> running 1 test
61.08 s
> test dirac::test::feyncalc_reference::dirac_simplify_id46_d_dim_repeated_gamma_slash_sum ... FAILED
61.08 s
>
61.08 s
> failures:
61.08 s
>
61.08 s
> failures:
61.08 s
> dirac::test::feyncalc_reference::dirac_simplify_id46_d_dim_repeated_gamma_slash_sum
61.08 s
>
61.08 s
> test result: FAILED. 0 passed; 1 failed; 0 ignored; 0 measured; 248 filtered out; finished in 0.00s
61.08 s
>
61.08 s
> stderr ---
61.08 s
>
61.08 s
> thread 'dirac::test::feyncalc_reference::dirac_simplify_id46_d_dim_repeated_gamma_slash_sum' (504) panicked at crates/idenso/src/dirac/mod.rs:360:5:
61.08 s
> gamma third argument must be a Minkowski slot
61.08 s
> stack backtrace:
61.08 s
> 0: __rustc::rust_begin_unwind
61.08 s
> 1: core::panicking::panic_fmt
61.08 s
> 2: idenso::dirac::require_gamma_port
61.08 s
> 3: idenso::dirac::gamma_tensor
61.08 s
> 4: idenso::dirac::test::feyncalc_reference::dirac_simplify_id46_d_dim_repeated_gamma_slash_sum
61.08 s
> 5: <idenso::dirac::test::feyncalc_reference::dirac_simplify_id46_d_dim_repeated_gamma_slash_sum::{closure#0} as core::ops::function::FnOnce<()>>::call_once
61.08 s
> note: Some details are omitted, run with `RUST_BACKTRACE=full` for a verbose backtrace.
61.08 s
>
61.08 s
> FAIL [ 0.028s] ( 94/232) idenso dirac::test::feyncalc_reference :: dirac_simplify_id4_slash_sandwich
61.08 s
> stdout ---
61.08 s
>
61.08 s
> running 1 test
61.08 s
> test dirac::test::feyncalc_reference::dirac_simplify_id4_slash_sandwich ... FAILED
61.08 s
>
61.08 s
> failures:
61.08 s
>
61.08 s
> failures:
61.08 s
> dirac::test::feyncalc_reference::dirac_simplify_id4_slash_sandwich
61.08 s
>
61.08 s
> test result: FAILED. 0 passed; 1 failed; 0 ignored; 0 measured; 248 filtered out; finished in 0.01s
61.08 s
>
61.08 s
> stderr ---
61.08 s
>
61.08 s
> thread 'dirac::test::feyncalc_reference::dirac_simplify_id4_slash_sandwich' (511) panicked at crates/idenso/src/dirac/mod.rs:360:5:
61.08 s
> gamma third argument must be a Minkowski slot
61.08 s
> stack backtrace:
61.08 s
> 0: __rustc::rust_begin_unwind
61.08 s
> 1: core::panicking::panic_fmt
61.08 s
> 2: idenso::dirac::require_gamma_port
61.08 s
> 3: idenso::dirac::gamma_tensor
61.08 s
> 4: idenso::dirac::test::feyncalc_reference::dirac_simplify_id4_slash_sandwich
61.08 s
> 5: <idenso::dirac::test::feyncalc_reference::dirac_simplify_id4_slash_sandwich::{closure#0} as core::ops::function::FnOnce<()>>::call_once
61.08 s
> note: Some details are omitted, run with `RUST_BACKTRACE=full` for a verbose backtrace.
61.08 s
>
61.08 s
> FAIL [ 0.025s] (143/232) idenso reference_cases::tests :: reference_case_simplification_snapshots
61.08 s
> stdout ---
61.08 s
>
61.08 s
> running 1 test
61.08 s
> test reference_cases::tests::reference_case_simplification_snapshots ... FAILED
61.08 s
>
61.08 s
> failures:
61.08 s
>
61.08 s
> failures:
61.08 s
> reference_cases::tests::reference_case_simplification_snapshots
61.08 s
>
61.08 s
> test result: FAILED. 0 passed; 1 failed; 0 ignored; 0 measured; 248 filtered out; finished in 0.01s
61.08 s
>
61.08 s
> stderr ---
61.08 s
>
61.08 s
> thread 'reference_cases::tests::reference_case_simplification_snapshots' (684) panicked at crates/idenso/src/dirac/mod.rs:360:5:
61.08 s
> gamma third argument must be a Minkowski slot
61.08 s
> stack backtrace:
61.08 s
> 0: __rustc::rust_begin_unwind
61.08 s
> 1: core::panicking::panic_fmt
61.08 s
> 2: idenso::dirac::require_gamma_port
61.08 s
> 3: idenso::dirac::gamma_tensor
61.08 s
> 4: idenso::reference_cases::dirac_feyncalc_slash_sandwich_id4
61.08 s
> 5: <idenso::reference_cases::ReferenceCase>::simplified
61.08 s
> 6: <core::iter::adapters::map::Map<core::slice::iter::Iter<idenso::reference_cases::ReferenceCase>, idenso::reference_cases::tests::reference_case_simplification_snapshots::{closure#0}> as core::iter::traits::iterator::Iterator>::fold::<(), core::iter::traits::iterator::Iterator::for_each::call<alloc::string::String, <alloc::vec::Vec<alloc::string::String>>::extend_trusted<core::iter::adapters::map::Map<core::slice::iter::Iter<idenso::reference_cases::ReferenceCase>, idenso::reference_cases::tests::reference_case_simplification_snapshots::{closure#0}>>::{closure#0}>::{closure#0}>
61.08 s
> 7: <alloc::vec::Vec<alloc::string::String> as alloc::vec::spec_from_iter_nested::SpecFromIterNested<alloc::string::String, core::iter::adapters::map::Map<core::slice::iter::Iter<idenso::reference_cases::ReferenceCase>, idenso::reference_cases::tests::reference_case_simplification_snapshots::{closure#0}>>>::from_iter
61.08 s
> 8: idenso::reference_cases::tests::reference_case_simplification_snapshots
61.09 s
> 9: <idenso::reference_cases::tests::reference_case_simplification_snapshots::{closure#0} as core::ops::function::FnOnce<()>>::call_once
61.09 s
> note: Some details are omitted, run with `RUST_BACKTRACE=full` for a verbose backtrace.
61.09 s
>
61.09 s
> FAIL [ 0.076s] (228/232) idenso tensor::tests::parsing :: infinite_execution
61.09 s
> stdout ---
61.09 s
>
61.09 s
> running 1 test
61.09 s
> ━━━━━━━━━━━━━━━━━━━━━━━━━━━━━━━ Snapshot Summary ━━━━━━━━━━━━━━━━━━━━━━━━━━━━━━━
61.09 s
> Snapshot: infinite_execution
61.09 s
> Source: crates/idenso/src/tensor/tests/parsing.rs:905
61.09 s
> ────────────────────────────────────────────────────────────────────────────────
61.09 s
> Expression: net_iter.snapshot_dot()
61.09 s
> ────────────────────────────────────────────────────────────────────────────────
61.09 s
> -old snapshot
61.09 s
> +new results
61.09 s
> ────────────┬───────────────────────────────────────────────────────────────────
61.09 s
> 8 8 │ 0:0:s -> ext0 [id=0 color="red"];
61.09 s
> 9 9 │ ext1 [style=invis];
61.09 s
> 10 10 │ 0:5:s -> ext1 [id=1 dir=none color="red" label="mink4|l_0"];
61.09 s
> 11 11 │ ext2 [style=invis];
61.09 s
> 12 │- 0:4:s -> ext2 [id=2 dir=none color="red" label="bis4|l_2"];
61.09 s
> 12 │+ 0:3:s -> ext2 [id=2 dir=none color="red" label="mink4|l_1"];
61.09 s
> 13 13 │ ext3 [style=invis];
61.09 s
> 14 │- 0:3:s -> ext3 [id=3 dir=none color="red" label="bis4|l_3"];
61.09 s
> 14 │+ 0:1:s -> ext3 [id=3 dir=none color="red" label="bis4|l_2"];
61.09 s
> 15 15 │ ext4 [style=invis];
61.09 s
> 16 │- 0:1:s -> ext4 [id=4 dir=none color="red" label="mink4|l_1"];
61.09 s
> 16 │+ 0:2:s -> ext4 [id=4 dir=none color="red" label="mink4|l_4"];
61.09 s
> 17 17 │ ext5 [style=invis];
61.09 s
> 18 │- 0:2:s -> ext5 [id=5 dir=none color="red" label="mink4|l_4"];
61.09 s
> 18 │+ 0:4:s -> ext5 [id=5 dir=none color="red" label="bis4|l_3"];
61.09 s
> 19 19 │ }
61.09 s
> ────────────┴───────────────────────────────────────────────────────────────────
61.09 s
> To update snapshots run `cargo insta review`
61.09 s
> Stopped on the first failure. Run `cargo insta test` to run all snapshots.
61.09 s
> test tensor::tests::parsing::infinite_execution ... FAILED
61.09 s
>
61.09 s
> failures:
61.09 s
>
61.09 s
> failures:
61.09 s
> tensor::tests::parsing::infinite_execution
61.09 s
>
61.09 s
> test result: FAILED. 0 passed; 1 failed; 0 ignored; 0 measured; 248 filtered out; finished in 0.06s
61.09 s
>
61.09 s
> stderr ---
61.09 s
>
61.09 s
> thread 'tensor::tests::parsing::infinite_execution' (849) panicked at /nix/store/g4vv637bgwmy4qf4lv8w7s6sghivpa09-vendor-cargo-deps/c19b7c6f923b580ac259164a89f2577984ad5ab09ee9d583b888f934adbbe8d0/insta-1.47.2/src/runtime.rs:719:13:
61.09 s
> snapshot assertion for 'infinite_execution' failed in line 905
61.09 s
> stack backtrace:
61.09 s
> 0: __rustc::rust_begin_unwind
61.09 s
> 1: core::panicking::panic_fmt
61.09 s
> 2: insta::runtime::assert_snapshot
61.09 s
> 3: idenso::tensor::tests::parsing::infinite_execution
61.09 s
> 4: <idenso::tensor::tests::parsing::infinite_execution::{closure#0} as core::ops::function::FnOnce<()>>::call_once
61.09 s
> note: Some details are omitted, run with `RUST_BACKTRACE=full` for a verbose backtrace.
61.09 s
>
61.09 s
> ------------
61.09 s
> Summary [ 2.088s] 232 tests run: 227 passed , 5 failed , 26 skipped
61.09 s
> FAIL [ 0.019s] ( 91/232) idenso dirac::test::feyncalc_reference :: dirac_simplify_id40_repeated_gamma_and_two_trace
61.09 s
> stdout ---
61.09 s
>
61.09 s
> running 1 test
61.09 s
> test dirac::test::feyncalc_reference::dirac_simplify_id40_repeated_gamma_and_two_trace ... FAILED
61.09 s
>
61.09 s
> failures:
61.09 s
>
61.09 s
> failures:
61.09 s
> dirac::test::feyncalc_reference::dirac_simplify_id40_repeated_gamma_and_two_trace
61.09 s
>
61.09 s
> test result: FAILED. 0 passed; 1 failed; 0 ignored; 0 measured; 248 filtered out; finished in 0.01s
61.09 s
>
61.09 s
> stderr ---
61.09 s
>
61.09 s
> thread 'dirac::test::feyncalc_reference::dirac_simplify_id40_repeated_gamma_and_two_trace' (491) panicked at crates/idenso/src/dirac/mod.rs:360:5:
61.09 s
> gamma third argument must be a Minkowski slot
61.09 s
> stack backtrace:
61.09 s
> 0: __rustc::rust_begin_unwind
61.09 s
> 1: core::panicking::panic_fmt
61.09 s
> 2: idenso::dirac::require_gamma_port
61.09 s
> 3: idenso::dirac::gamma_tensor
61.09 s
> 4: idenso::dirac::test::feyncalc_reference::dirac_simplify_id40_repeated_gamma_and_two_trace
61.09 s
> 5: <idenso::dirac::test::feyncalc_reference::dirac_simplify_id40_repeated_gamma_and_two_trace::{closure#0} as core::ops::function::FnOnce<()>>::call_once
61.09 s
> note: Some details are omitted, run with `RUST_BACKTRACE=full` for a verbose backtrace.
61.09 s
>
61.09 s
> FAIL [ 0.022s] ( 92/232) idenso dirac::test::feyncalc_reference :: dirac_simplify_id46_d_dim_repeated_gamma_slash_sum
61.09 s
> stdout ---
61.09 s
>
61.09 s
> running 1 test
61.09 s
> test dirac::test::feyncalc_reference::dirac_simplify_id46_d_dim_repeated_gamma_slash_sum ... FAILED
61.09 s
>
61.09 s
> failures:
61.09 s
>
61.09 s
> failures:
61.09 s
> dirac::test::feyncalc_reference::dirac_simplify_id46_d_dim_repeated_gamma_slash_sum
61.09 s
>
61.09 s
> test result: FAILED. 0 passed; 1 failed; 0 ignored; 0 measured; 248 filtered out; finished in 0.00s
61.09 s
>
61.09 s
> stderr ---
61.09 s
>
61.09 s
> thread 'dirac::test::feyncalc_reference::dirac_simplify_id46_d_dim_repeated_gamma_slash_sum' (504) panicked at crates/idenso/src/dirac/mod.rs:360:5:
61.09 s
> gamma third argument must be a Minkowski slot
61.09 s
> stack backtrace:
61.09 s
> 0: __rustc::rust_begin_unwind
61.09 s
> 1: core::panicking::panic_fmt
61.09 s
> 2: idenso::dirac::require_gamma_port
61.09 s
> 3: idenso::dirac::gamma_tensor
61.09 s
> 4: idenso::dirac::test::feyncalc_reference::dirac_simplify_id46_d_dim_repeated_gamma_slash_sum
61.09 s
> 5: <idenso::dirac::test::feyncalc_reference::dirac_simplify_id46_d_dim_repeated_gamma_slash_sum::{closure#0} as core::ops::function::FnOnce<()>>::call_once
61.09 s
> note: Some details are omitted, run with `RUST_BACKTRACE=full` for a verbose backtrace.
61.09 s
>
61.09 s
> FAIL [ 0.028s] ( 94/232) idenso dirac::test::feyncalc_reference :: dirac_simplify_id4_slash_sandwich
61.09 s
> stdout ---
61.09 s
>
61.09 s
> running 1 test
61.09 s
> test dirac::test::feyncalc_reference::dirac_simplify_id4_slash_sandwich ... FAILED
61.09 s
>
61.09 s
> failures:
61.09 s
>
61.09 s
> failures:
61.09 s
> dirac::test::feyncalc_reference::dirac_simplify_id4_slash_sandwich
61.09 s
>
61.09 s
> test result: FAILED. 0 passed; 1 failed; 0 ignored; 0 measured; 248 filtered out; finished in 0.01s
61.09 s
>
61.09 s
> stderr ---
61.09 s
>
61.09 s
> thread 'dirac::test::feyncalc_reference::dirac_simplify_id4_slash_sandwich' (511) panicked at crates/idenso/src/dirac/mod.rs:360:5:
61.09 s
> gamma third argument must be a Minkowski slot
61.09 s
> stack backtrace:
61.09 s
> 0: __rustc::rust_begin_unwind
61.09 s
> 1: core::panicking::panic_fmt
61.09 s
> 2: idenso::dirac::require_gamma_port
61.09 s
> 3: idenso::dirac::gamma_tensor
61.09 s
> 4: idenso::dirac::test::feyncalc_reference::dirac_simplify_id4_slash_sandwich
61.09 s
> 5: <idenso::dirac::test::feyncalc_reference::dirac_simplify_id4_slash_sandwich::{closure#0} as core::ops::function::FnOnce<()>>::call_once
61.09 s
> note: Some details are omitted, run with `RUST_BACKTRACE=full` for a verbose backtrace.
61.09 s
>
61.09 s
> FAIL [ 0.025s] (143/232) idenso reference_cases::tests :: reference_case_simplification_snapshots
61.09 s
> stdout ---
61.09 s
>
61.09 s
> running 1 test
61.09 s
> test reference_cases::tests::reference_case_simplification_snapshots ... FAILED
61.09 s
>
61.09 s
> failures:
61.09 s
>
61.09 s
> failures:
61.09 s
> reference_cases::tests::reference_case_simplification_snapshots
61.09 s
>
61.09 s
> test result: FAILED. 0 passed; 1 failed; 0 ignored; 0 measured; 248 filtered out; finished in 0.01s
61.09 s
>
61.09 s
> stderr ---
61.09 s
>
61.09 s
> thread 'reference_cases::tests::reference_case_simplification_snapshots' (684) panicked at crates/idenso/src/dirac/mod.rs:360:5:
61.09 s
> gamma third argument must be a Minkowski slot
61.09 s
> stack backtrace:
61.09 s
> 0: __rustc::rust_begin_unwind
61.09 s
> 1: core::panicking::panic_fmt
61.09 s
> 2: idenso::dirac::require_gamma_port
61.09 s
> 3: idenso::dirac::gamma_tensor
61.09 s
> 4: idenso::reference_cases::dirac_feyncalc_slash_sandwich_id4
61.09 s
> 5: <idenso::reference_cases::ReferenceCase>::simplified
61.09 s
> 6: <core::iter::adapters::map::Map<core::slice::iter::Iter<idenso::reference_cases::ReferenceCase>, idenso::reference_cases::tests::reference_case_simplification_snapshots::{closure#0}> as core::iter::traits::iterator::Iterator>::fold::<(), core::iter::traits::iterator::Iterator::for_each::call<alloc::string::String, <alloc::vec::Vec<alloc::string::String>>::extend_trusted<core::iter::adapters::map::Map<core::slice::iter::Iter<idenso::reference_cases::ReferenceCase>, idenso::reference_cases::tests::reference_case_simplification_snapshots::{closure#0}>>::{closure#0}>::{closure#0}>
61.09 s
> 7: <alloc::vec::Vec<alloc::string::String> as alloc::vec::spec_from_iter_nested::SpecFromIterNested<alloc::string::String, core::iter::adapters::map::Map<core::slice::iter::Iter<idenso::reference_cases::ReferenceCase>, idenso::reference_cases::tests::reference_case_simplification_snapshots::{closure#0}>>>::from_iter
61.09 s
> 8: idenso::reference_cases::tests::reference_case_simplification_snapshots
61.09 s
> 9: <idenso::reference_cases::tests::reference_case_simplification_snapshots::{closure#0} as core::ops::function::FnOnce<()>>::call_once
61.09 s
> note: Some details are omitted, run with `RUST_BACKTRACE=full` for a verbose backtrace.
61.09 s
>
61.09 s
> FAIL [ 0.076s] (228/232) idenso tensor::tests::parsing :: infinite_execution
61.09 s
> stdout ---
61.09 s
>
61.09 s
> running 1 test
61.09 s
> ━━━━━━━━━━━━━━━━━━━━━━━━━━━━━━━ Snapshot Summary ━━━━━━━━━━━━━━━━━━━━━━━━━━━━━━━
61.09 s
> Snapshot: infinite_execution
61.09 s
> Source: crates/idenso/src/tensor/tests/parsing.rs:905
61.09 s
> ────────────────────────────────────────────────────────────────────────────────
61.09 s
> Expression: net_iter.snapshot_dot()
61.09 s
> ────────────────────────────────────────────────────────────────────────────────
61.09 s
> -old snapshot
61.09 s
> +new results
61.09 s
> ────────────┬───────────────────────────────────────────────────────────────────
61.09 s
> 8 8 │ 0:0:s -> ext0 [id=0 color="red"];
61.09 s
> 9 9 │ ext1 [style=invis];
61.09 s
> 10 10 │ 0:5:s -> ext1 [id=1 dir=none color="red" label="mink4|l_0"];
61.09 s
> 11 11 │ ext2 [style=invis];
61.09 s
> 12 │- 0:4:s -> ext2 [id=2 dir=none color="red" label="bis4|l_2"];
61.09 s
> 12 │+ 0:3:s -> ext2 [id=2 dir=none color="red" label="mink4|l_1"];
61.09 s
> 13 13 │ ext3 [style=invis];
61.09 s
> 14 │- 0:3:s -> ext3 [id=3 dir=none color="red" label="bis4|l_3"];
61.09 s
> 14 │+ 0:1:s -> ext3 [id=3 dir=none color="red" label="bis4|l_2"];
61.09 s
> 15 15 │ ext4 [style=invis];
61.09 s
> 16 │- 0:1:s -> ext4 [id=4 dir=none color="red" label="mink4|l_1"];
61.09 s
> 16 │+ 0:2:s -> ext4 [id=4 dir=none color="red" label="mink4|l_4"];
61.09 s
> 17 17 │ ext5 [style=invis];
61.09 s
> 18 │- 0:2:s -> ext5 [id=5 dir=none color="red" label="mink4|l_4"];
61.09 s
> 18 │+ 0:4:s -> ext5 [id=5 dir=none color="red" label="bis4|l_3"];
61.09 s
> 19 19 │ }
61.09 s
> ────────────┴───────────────────────────────────────────────────────────────────
61.09 s
> To update snapshots run `cargo insta review`
61.09 s
> Stopped on the first failure. Run `cargo insta test` to run all snapshots.
61.09 s
> test tensor::tests::parsing::infinite_execution ... FAILED
61.09 s
>
61.09 s
> failures:
61.09 s
>
61.09 s
> failures:
61.09 s
> tensor::tests::parsing::infinite_execution
61.09 s
>
61.09 s
> test result: FAILED. 0 passed; 1 failed; 0 ignored; 0 measured; 248 filtered out; finished in 0.06s
61.09 s
>
61.09 s
> stderr ---
61.09 s
>
61.09 s
> thread 'tensor::tests::parsing::infinite_execution' (849) panicked at /nix/store/g4vv637bgwmy4qf4lv8w7s6sghivpa09-vendor-cargo-deps/c19b7c6f923b580ac259164a89f2577984ad5ab09ee9d583b888f934adbbe8d0/insta-1.47.2/src/runtime.rs:719:13:
61.09 s
> snapshot assertion for 'infinite_execution' failed in line 905
61.09 s
> stack backtrace:
61.09 s
> 0: __rustc::rust_begin_unwind
61.09 s
> 1: core::panicking::panic_fmt
61.09 s
> 2: insta::runtime::assert_snapshot
61.09 s
> 3: idenso::tensor::tests::parsing::infinite_execution
61.09 s
> 4: <idenso::tensor::tests::parsing::infinite_execution::{closure#0} as core::ops::function::FnOnce<()>>::call_once
61.09 s
> note: Some details are omitted, run with `RUST_BACKTRACE=full` for a verbose backtrace.
61.09 s
>
61.09 s
> error : test run failed
61.09 s
>
61.09 s
> ========== nextest test summary ==========
61.09 s
> report: target/nextest/ci_gammaloop/junit.xml
61.09 s
> tests: 232, failures: 5, errors: 0
61.09 s
>
61.09 s
> 1. idenso::dirac::test::feyncalc_reference::dirac_simplify_id40_repeated_gamma_and_two_trace
61.09 s
> failure: test failure with exit code 101
61.09 s
> thread 'dirac::test::feyncalc_reference::dirac_simplify_id40_repeated_gamma_and_two_trace' (491) panicked at crates/idenso/src/dirac/mod.rs:360:5:
61.09 s
> gamma third argument must be a Minkowski slot
61.09 s
> stack backtrace:
61.09 s
> 0: __rustc::rust_begin_unwind
61.09 s
> 1: core::panicking::panic_fmt
61.09 s
> 2: idenso::dirac::require_gamma_port
61.09 s
> 3: idenso::dirac::gamma_tensor
61.09 s
> 4: idenso::dirac::test::feyncalc_reference::dirac_simplify_id40_repeated_gamma_and_two_trace
61.09 s
> 5: <idenso::dirac::test::feyncalc_reference::dirac_simplify_id40_repeated_gamma_and_two_trace::{closure#0} as core::ops::function::FnOnce<()>>::call_once
61.09 s
> note: Some details are omitted, run with `RUST_BACKTRACE=full` for a verbose backtrace.
61.09 s
> system-out
61.09 s
> running 1 test
61.09 s
> test dirac::test::feyncalc_reference::dirac_simplify_id40_repeated_gamma_and_two_trace ... FAILED
61.09 s
>
61.09 s
> failures:
61.09 s
>
61.09 s
> failures:
61.09 s
> dirac::test::feyncalc_reference::dirac_simplify_id40_repeated_gamma_and_two_trace
61.09 s
>
61.09 s
> test result: FAILED. 0 passed; 1 failed; 0 ignored; 0 measured; 248 filtered out; finished in 0.01s
61.09 s
> system-err
61.09 s
> thread 'dirac::test::feyncalc_reference::dirac_simplify_id40_repeated_gamma_and_two_trace' (491) panicked at crates/idenso/src/dirac/mod.rs:360:5:
61.09 s
> gamma third argument must be a Minkowski slot
61.09 s
> stack backtrace:
61.09 s
> 0: __rustc::rust_begin_unwind
61.09 s
> 1: core::panicking::panic_fmt
61.09 s
> 2: idenso::dirac::require_gamma_port
61.09 s
> 3: idenso::dirac::gamma_tensor
61.09 s
> 4: idenso::dirac::test::feyncalc_reference::dirac_simplify_id40_repeated_gamma_and_two_trace
61.09 s
> 5: <idenso::dirac::test::feyncalc_reference::dirac_simplify_id40_repeated_gamma_and_two_trace::{closure#0} as core::ops::function::FnOnce<()>>::call_once
61.09 s
> note: Some details are omitted, run with `RUST_BACKTRACE=full` for a verbose backtrace.
61.09 s
>
61.09 s
> 2. idenso::dirac::test::feyncalc_reference::dirac_simplify_id46_d_dim_repeated_gamma_slash_sum
61.09 s
> failure: test failure with exit code 101
61.09 s
> thread 'dirac::test::feyncalc_reference::dirac_simplify_id46_d_dim_repeated_gamma_slash_sum' (504) panicked at crates/idenso/src/dirac/mod.rs:360:5:
61.09 s
> gamma third argument must be a Minkowski slot
61.09 s
> stack backtrace:
61.09 s
> 0: __rustc::rust_begin_unwind
61.09 s
> 1: core::panicking::panic_fmt
61.09 s
> 2: idenso::dirac::require_gamma_port
61.09 s
> 3: idenso::dirac::gamma_tensor
61.09 s
> 4: idenso::dirac::test::feyncalc_reference::dirac_simplify_id46_d_dim_repeated_gamma_slash_sum
61.09 s
> 5: <idenso::dirac::test::feyncalc_reference::dirac_simplify_id46_d_dim_repeated_gamma_slash_sum::{closure#0} as core::ops::function::FnOnce<()>>::call_once
61.09 s
> note: Some details are omitted, run with `RUST_BACKTRACE=full` for a verbose backtrace.
61.09 s
> system-out
61.09 s
> running 1 test
61.09 s
> test dirac::test::feyncalc_reference::dirac_simplify_id46_d_dim_repeated_gamma_slash_sum ... FAILED
61.09 s
>
61.09 s
> failures:
61.09 s
>
61.09 s
> failures:
61.09 s
> dirac::test::feyncalc_reference::dirac_simplify_id46_d_dim_repeated_gamma_slash_sum
61.09 s
>
61.09 s
> test result: FAILED. 0 passed; 1 failed; 0 ignored; 0 measured; 248 filtered out; finished in 0.00s
61.09 s
> system-err
61.09 s
> thread 'dirac::test::feyncalc_reference::dirac_simplify_id46_d_dim_repeated_gamma_slash_sum' (504) panicked at crates/idenso/src/dirac/mod.rs:360:5:
61.09 s
> gamma third argument must be a Minkowski slot
61.09 s
> stack backtrace:
61.09 s
> 0: __rustc::rust_begin_unwind
61.09 s
> 1: core::panicking::panic_fmt
61.09 s
> 2: idenso::dirac::require_gamma_port
61.09 s
> 3: idenso::dirac::gamma_tensor
61.09 s
> 4: idenso::dirac::test::feyncalc_reference::dirac_simplify_id46_d_dim_repeated_gamma_slash_sum
61.09 s
> 5: <idenso::dirac::test::feyncalc_reference::dirac_simplify_id46_d_dim_repeated_gamma_slash_sum::{closure#0} as core::ops::function::FnOnce<()>>::call_once
61.09 s
> note: Some details are omitted, run with `RUST_BACKTRACE=full` for a verbose backtrace.
61.09 s
>
61.09 s
> 3. idenso::dirac::test::feyncalc_reference::dirac_simplify_id4_slash_sandwich
61.09 s
> failure: test failure with exit code 101
61.09 s
> thread 'dirac::test::feyncalc_reference::dirac_simplify_id4_slash_sandwich' (511) panicked at crates/idenso/src/dirac/mod.rs:360:5:
61.09 s
> gamma third argument must be a Minkowski slot
61.09 s
> stack backtrace:
61.09 s
> 0: __rustc::rust_begin_unwind
61.09 s
> 1: core::panicking::panic_fmt
61.09 s
> 2: idenso::dirac::require_gamma_port
61.09 s
> 3: idenso::dirac::gamma_tensor
61.09 s
> 4: idenso::dirac::test::feyncalc_reference::dirac_simplify_id4_slash_sandwich
61.09 s
> 5: <idenso::dirac::test::feyncalc_reference::dirac_simplify_id4_slash_sandwich::{closure#0} as core::ops::function::FnOnce<()>>::call_once
61.09 s
> note: Some details are omitted, run with `RUST_BACKTRACE=full` for a verbose backtrace.
61.09 s
> system-out
61.09 s
> running 1 test
61.09 s
> test dirac::test::feyncalc_reference::dirac_simplify_id4_slash_sandwich ... FAILED
61.09 s
>
61.09 s
> failures:
61.09 s
>
61.09 s
> failures:
61.09 s
> dirac::test::feyncalc_reference::dirac_simplify_id4_slash_sandwich
61.09 s
>
61.09 s
> test result: FAILED. 0 passed; 1 failed; 0 ignored; 0 measured; 248 filtered out; finished in 0.01s
61.09 s
> system-err
61.09 s
> thread 'dirac::test::feyncalc_reference::dirac_simplify_id4_slash_sandwich' (511) panicked at crates/idenso/src/dirac/mod.rs:360:5:
61.09 s
> gamma third argument must be a Minkowski slot
61.09 s
> stack backtrace:
61.09 s
> 0: __rustc::rust_begin_unwind
61.09 s
> 1: core::panicking::panic_fmt
61.09 s
> 2: idenso::dirac::require_gamma_port
61.09 s
> 3: idenso::dirac::gamma_tensor
61.09 s
> 4: idenso::dirac::test::feyncalc_reference::dirac_simplify_id4_slash_sandwich
61.09 s
> 5: <idenso::dirac::test::feyncalc_reference::dirac_simplify_id4_slash_sandwich::{closure#0} as core::ops::function::FnOnce<()>>::call_once
61.09 s
> note: Some details are omitted, run with `RUST_BACKTRACE=full` for a verbose backtrace.
61.09 s
>
61.09 s
> 4. idenso::reference_cases::tests::reference_case_simplification_snapshots
61.09 s
> failure: test failure with exit code 101
61.09 s
> thread 'reference_cases::tests::reference_case_simplification_snapshots' (684) panicked at crates/idenso/src/dirac/mod.rs:360:5:
61.09 s
> gamma third argument must be a Minkowski slot
61.09 s
> stack backtrace:
61.09 s
> 0: __rustc::rust_begin_unwind
61.09 s
> 1: core::panicking::panic_fmt
61.09 s
> 2: idenso::dirac::require_gamma_port
61.09 s
> 3: idenso::dirac::gamma_tensor
61.09 s
> 4: idenso::reference_cases::dirac_feyncalc_slash_sandwich_id4
61.09 s
> 5: <idenso::reference_cases::ReferenceCase>::simplified
61.09 s
> 6: <core::iter::adapters::map::Map<core::slice::iter::Iter<idenso::reference_cases::ReferenceCase>, idenso::reference_cases::tests::reference_case_simplification_snapshots::{closure#0}> as core::iter::traits::iterator::Iterator>::fold::<(), core::iter::traits::iterator::Iterator::for_each::call<alloc::string::String, <alloc::vec::Vec<alloc::string::String>>::extend_trusted<core::iter::adapters::map::Map<core::slice::iter::Iter<idenso::reference_cases::ReferenceCase>, idenso::reference_cases::tests::reference_case_simplification_snapshots::{closure#0}>>::{closure#0}>::{closure#0}>
61.09 s
> 7: <alloc::vec::Vec<alloc::string::String> as alloc::vec::spec_from_iter_nested::SpecFromIterNested<alloc::string::String, core::iter::adapters::map::Map<core::slice::iter::Iter<idenso::reference_cases::ReferenceCase>, idenso::reference_cases::tests::reference_case_simplification_snapshots::{closure#0}>>>::from_iter
61.09 s
> 8: idenso::reference_cases::tests::reference_case_simplification_snapshots
61.09 s
> 9: <idenso::reference_cases::tests::reference_case_simplification_snapshots::{closure#0} as core::ops::function::FnOnce<()>>::call_once
61.09 s
> note: Some details are omitted, run with `RUST_BACKTRACE=full` for a verbose backtrace.
61.09 s
> system-out
61.09 s
> running 1 test
61.09 s
> test reference_cases::tests::reference_case_simplification_snapshots ... FAILED
61.09 s
>
61.09 s
> failures:
61.09 s
>
61.09 s
> failures:
61.09 s
> reference_cases::tests::reference_case_simplification_snapshots
61.09 s
>
61.09 s
> test result: FAILED. 0 passed; 1 failed; 0 ignored; 0 measured; 248 filtered out; finished in 0.01s
61.09 s
> system-err
61.09 s
> thread 'reference_cases::tests::reference_case_simplification_snapshots' (684) panicked at crates/idenso/src/dirac/mod.rs:360:5:
61.09 s
> gamma third argument must be a Minkowski slot
61.09 s
> stack backtrace:
61.09 s
> 0: __rustc::rust_begin_unwind
61.09 s
> 1: core::panicking::panic_fmt
61.09 s
> 2: idenso::dirac::require_gamma_port
61.09 s
> 3: idenso::dirac::gamma_tensor
61.09 s
> 4: idenso::reference_cases::dirac_feyncalc_slash_sandwich_id4
61.09 s
> 5: <idenso::reference_cases::ReferenceCase>::simplified
61.09 s
> 6: <core::iter::adapters::map::Map<core::slice::iter::Iter<idenso::reference_cases::ReferenceCase>, idenso::reference_cases::tests::reference_case_simplification_snapshots::{closure#0}> as core::iter::traits::iterator::Iterator>::fold::<(), core::iter::traits::iterator::Iterator::for_each::call<alloc::string::String, <alloc::vec::Vec<alloc::string::String>>::extend_trusted<core::iter::adapters::map::Map<core::slice::iter::Iter<idenso::reference_cases::ReferenceCase>, idenso::reference_cases::tests::reference_case_simplification_snapshots::{closure#0}>>::{closure#0}>::{closure#0}>
61.09 s
> 7: <alloc::vec::Vec<alloc::string::String> as alloc::vec::spec_from_iter_nested::SpecFromIterNested<alloc::string::String, core::iter::adapters::map::Map<core::slice::iter::Iter<idenso::reference_cases::ReferenceCase>, idenso::reference_cases::tests::reference_case_simplification_snapshots::{closure#0}>>>::from_iter
61.09 s
> 8: idenso::reference_cases::tests::reference_case_simplification_snapshots
61.09 s
> 9: <idenso::reference_cases::tests::reference_case_simplification_snapshots::{closure#0} as core::ops::function::FnOnce<()>>::call_once
61.09 s
> note: Some details are omitted, run with `RUST_BACKTRACE=full` for a verbose backtrace.
61.09 s
>
61.09 s
> 5. idenso::tensor::tests::parsing::infinite_execution
61.09 s
> failure: test failure with exit code 101
61.09 s
> thread 'tensor::tests::parsing::infinite_execution' (849) panicked at /nix/store/g4vv637bgwmy4qf4lv8w7s6sghivpa09-vendor-cargo-deps/c19b7c6f923b580ac259164a89f2577984ad5ab09ee9d583b888f934adbbe8d0/insta-1.47.2/src/runtime.rs:719:13:
61.09 s
> snapshot assertion for 'infinite_execution' failed in line 905
61.09 s
> stack backtrace:
61.09 s
> 0: __rustc::rust_begin_unwind
61.09 s
> 1: core::panicking::panic_fmt
61.09 s
> 2: insta::runtime::assert_snapshot
61.09 s
> 3: idenso::tensor::tests::parsing::infinite_execution
61.09 s
> 4: <idenso::tensor::tests::parsing::infinite_execution::{closure#0} as core::ops::function::FnOnce<()>>::call_once
61.09 s
> note: Some details are omitted, run with `RUST_BACKTRACE=full` for a verbose backtrace.
61.09 s
> system-out
61.09 s
> running 1 test
61.09 s
> ━━━━━━━━━━━━━━━━━━━━━━━━━━━━━━━ Snapshot Summary ━━━━━━━━━━━━━━━━━━━━━━━━━━━━━━━
61.09 s
> Snapshot: infinite_execution
61.09 s
> Source: crates/idenso/src/tensor/tests/parsing.rs:905
61.09 s
> ────────────────────────────────────────────────────────────────────────────────
61.09 s
> Expression: net_iter.snapshot_dot()
61.09 s
> ────────────────────────────────────────────────────────────────────────────────
61.09 s
> -old snapshot
61.09 s
> +new results
61.09 s
> ────────────┬───────────────────────────────────────────────────────────────────
61.09 s
> 8 8 │ 0:0:s-> ext0 [id=0 color="red"];
61.09 s
> 9 9 │ ext1 [style=invis];
61.09 s
> 10 10 │ 0:5:s-> ext1 [id=1 dir=none color="red" label="mink4|l_0"];
61.09 s
> 11 11 │ ext2 [style=invis];
61.09 s
> 12 │- 0:4:s-> ext2 [id=2 dir=none color="red" label="bis4|l_2"];
61.09 s
> 12 │+ 0:3:s-> ext2 [id=2 dir=none color="red" label="mink4|l_1"];
61.09 s
> 13 13 │ ext3 [style=invis];
61.09 s
> 14 │- 0:3:s-> ext3 [id=3 dir=none color="red" label="bis4|l_3"];
61.09 s
> 14 │+ 0:1:s-> ext3 [id=3 dir=none color="red" label="bis4|l_2"];
61.09 s
> 15 15 │ ext4 [style=invis];
61.09 s
> 16 │- 0:1:s-> ext4 [id=4 dir=none color="red" label="mink4|l_1"];
61.09 s
> 16 │+ 0:2:s-> ext4 [id=4 dir=none color="red" label="mink4|l_4"];
61.09 s
> 17 17 │ ext5 [style=invis];
61.09 s
> 18 │- 0:2:s-> ext5 [id=5 dir=none color="red" label="mink4|l_4"];
61.09 s
> 18 │+ 0:4:s-> ext5 [id=5 dir=none color="red" label="bis4|l_3"];
61.09 s
> 19 19 │ }
61.09 s
> ────────────┴───────────────────────────────────────────────────────────────────
61.09 s
> To update snapshots run `cargo insta review`
61.09 s
> Stopped on the first failure. Run `cargo insta test` to run all snapshots.
61.09 s
> test tensor::tests::parsing::infinite_execution ... FAILED
61.09 s
>
61.09 s
> failures:
61.09 s
>
61.09 s
> failures:
61.09 s
> tensor::tests::parsing::infinite_execution
61.09 s
>
61.09 s
> test result: FAILED. 0 passed; 1 failed; 0 ignored; 0 measured; 248 filtered out; finished in 0.06s
61.09 s
> system-err
61.09 s
> thread 'tensor::tests::parsing::infinite_execution' (849) panicked at /nix/store/g4vv637bgwmy4qf4lv8w7s6sghivpa09-vendor-cargo-deps/c19b7c6f923b580ac259164a89f2577984ad5ab09ee9d583b888f934adbbe8d0/insta-1.47.2/src/runtime.rs:719:13:
61.09 s
> snapshot assertion for 'infinite_execution' failed in line 905
61.09 s
> stack backtrace:
61.09 s
> 0: __rustc::rust_begin_unwind
61.09 s
> 1: core::panicking::panic_fmt
61.09 s
> 2: insta::runtime::assert_snapshot
61.09 s
> 3: idenso::tensor::tests::parsing::infinite_execution
61.09 s
> 4: <idenso::tensor::tests::parsing::infinite_execution::{closure#0} as core::ops::function::FnOnce<()>>::call_once
61.09 s
> note: Some details are omitted, run with `RUST_BACKTRACE=full` for a verbose backtrace.
61.09 s
> =========================================
61.09 s
> Extracting 2 binaries and 1 linked path to /build/nextest-archive-z2TOkC
61.09 s
> Extracted 8 files to /build/nextest-archive-z2TOkC in 0.09s
61.09 s
> ------------
61.09 s
> Nextest run ID 89549e82-ad79-49f8-bb26-a301b45ede72 with nextest profile: ci_gammaloop
61.09 s
> Starting 195 tests across 2 binaries
61.09 s
> ------------
61.09 s
> Summary [ 0.111s] 195 tests run: 195 passed , 0 skipped
61.09 s
>
61.09 s
> ========== nextest test summary ==========
61.09 s
> report: target/nextest/ci_gammaloop/junit.xml
61.09 s
> tests: 195, failures: 0, errors: 0
61.09 s
> No failing testcases found.
61.09 s
> =========================================
61.09 s
> Extracting 5 binaries and 2 linked paths to /build/nextest-archive-Ru85v4
61.09 s
> Extracted 19 files to /build/nextest-archive-Ru85v4 in 0.24s
61.09 s
> ------------
61.09 s
> Nextest run ID a8cc015b-bdb6-4884-8d59-500b44da45f9 with nextest profile: ci_gammaloop
61.09 s
> Starting 27 tests across 5 binaries (1 test skipped via profile.ci_gammaloop.default-filter )
61.09 s
> FAIL [ 0.056s] (24/27) spenso-hep-lib::idenso_validation enabled_idenso_reference_cases_validate_against_explicit_tensors
61.09 s
> stdout ---
61.09 s
>
61.09 s
> running 1 test
61.09 s
> test enabled_idenso_reference_cases_validate_against_explicit_tensors ... FAILED
61.09 s
>
61.09 s
> failures:
61.09 s
>
61.09 s
> failures:
61.09 s
> enabled_idenso_reference_cases_validate_against_explicit_tensors
61.09 s
>
61.09 s
> test result: FAILED. 0 passed; 1 failed; 0 ignored; 0 measured; 14 filtered out; finished in 0.05s
61.09 s
>
61.09 s
> stderr ---
61.09 s
>
61.09 s
> thread 'enabled_idenso_reference_cases_validate_against_explicit_tensors' (1668) panicked at crates/idenso/src/dirac/mod.rs:360:5:
61.09 s
> gamma third argument must be a Minkowski slot
61.09 s
> stack backtrace:
61.09 s
> 0: __rustc::rust_begin_unwind
61.09 s
> 1: core::panicking::panic_fmt
61.09 s
> 2: idenso::dirac::require_gamma_port
61.09 s
> 3: idenso::dirac::gamma_tensor
61.09 s
> 4: idenso::reference_cases::dirac_feyncalc_slash_sandwich_id4
61.09 s
> 5: <idenso_validation::enabled_idenso_reference_cases_validate_against_explicit_tensors::{closure#0} as core::ops::function::FnOnce<()>>::call_once
61.09 s
> note: Some details are omitted, run with `RUST_BACKTRACE=full` for a verbose backtrace.
61.09 s
>
61.09 s
> ------------
61.09 s
> Summary [ 0.120s] 27 tests run: 26 passed , 1 failed , 1 skipped
61.09 s
> FAIL [ 0.056s] (24/27) spenso-hep-lib::idenso_validation enabled_idenso_reference_cases_validate_against_explicit_tensors
61.09 s
> stdout ---
61.09 s
>
61.09 s
> running 1 test
61.09 s
> test enabled_idenso_reference_cases_validate_against_explicit_tensors ... FAILED
61.09 s
>
61.09 s
> failures:
61.09 s
>
61.09 s
> failures:
61.09 s
> enabled_idenso_reference_cases_validate_against_explicit_tensors
61.09 s
>
61.09 s
> test result: FAILED. 0 passed; 1 failed; 0 ignored; 0 measured; 14 filtered out; finished in 0.05s
61.09 s
>
61.09 s
> stderr ---
61.09 s
>
61.09 s
> thread 'enabled_idenso_reference_cases_validate_against_explicit_tensors' (1668) panicked at crates/idenso/src/dirac/mod.rs:360:5:
61.09 s
> gamma third argument must be a Minkowski slot
61.09 s
> stack backtrace:
61.09 s
> 0: __rustc::rust_begin_unwind
61.09 s
> 1: core::panicking::panic_fmt
61.09 s
> 2: idenso::dirac::require_gamma_port
61.09 s
> 3: idenso::dirac::gamma_tensor
61.09 s
> 4: idenso::reference_cases::dirac_feyncalc_slash_sandwich_id4
61.09 s
> 5: <idenso_validation::enabled_idenso_reference_cases_validate_against_explicit_tensors::{closure#0} as core::ops::function::FnOnce<()>>::call_once
61.09 s
> note: Some details are omitted, run with `RUST_BACKTRACE=full` for a verbose backtrace.
61.09 s
>
61.09 s
> error : test run failed
61.09 s
>
61.09 s
> ========== nextest test summary ==========
61.09 s
> report: target/nextest/ci_gammaloop/junit.xml
61.09 s
> tests: 27, failures: 1, errors: 0
61.09 s
>
61.09 s
> 1. spenso-hep-lib::idenso_validation::enabled_idenso_reference_cases_validate_against_explicit_tensors
61.09 s
> failure: test failure with exit code 101
61.09 s
> thread 'enabled_idenso_reference_cases_validate_against_explicit_tensors' (1668) panicked at crates/idenso/src/dirac/mod.rs:360:5:
61.09 s
> gamma third argument must be a Minkowski slot
61.09 s
> stack backtrace:
61.09 s
> 0: __rustc::rust_begin_unwind
61.09 s
> 1: core::panicking::panic_fmt
61.09 s
> 2: idenso::dirac::require_gamma_port
61.09 s
> 3: idenso::dirac::gamma_tensor
61.09 s
> 4: idenso::reference_cases::dirac_feyncalc_slash_sandwich_id4
61.09 s
> 5: <idenso_validation::enabled_idenso_reference_cases_validate_against_explicit_tensors::{closure#0} as core::ops::function::FnOnce<()>>::call_once
61.09 s
> note: Some details are omitted, run with `RUST_BACKTRACE=full` for a verbose backtrace.
61.09 s
> system-out
61.09 s
> running 1 test
61.09 s
> test enabled_idenso_reference_cases_validate_against_explicit_tensors ... FAILED
61.09 s
>
61.09 s
> failures:
61.09 s
>
61.09 s
> failures:
61.09 s
> enabled_idenso_reference_cases_validate_against_explicit_tensors
61.09 s
>
61.09 s
> test result: FAILED. 0 passed; 1 failed; 0 ignored; 0 measured; 14 filtered out; finished in 0.05s
61.09 s
> system-err
61.09 s
> thread 'enabled_idenso_reference_cases_validate_against_explicit_tensors' (1668) panicked at crates/idenso/src/dirac/mod.rs:360:5:
61.09 s
> gamma third argument must be a Minkowski slot
61.09 s
> stack backtrace:
61.09 s
> 0: __rustc::rust_begin_unwind
61.09 s
> 1: core::panicking::panic_fmt
61.09 s
> 2: idenso::dirac::require_gamma_port
61.09 s
> 3: idenso::dirac::gamma_tensor
61.09 s
> 4: idenso::reference_cases::dirac_feyncalc_slash_sandwich_id4
61.09 s
> 5: <idenso_validation::enabled_idenso_reference_cases_validate_against_explicit_tensors::{closure#0} as core::ops::function::FnOnce<()>>::call_once
61.09 s
> note: Some details are omitted, run with `RUST_BACKTRACE=full` for a verbose backtrace.
61.09 s
> =========================================
61.09 s
> Extracting 2 binaries and 1 linked path to /build/nextest-archive-lGxak8
61.09 s
> Extracted 8 files to /build/nextest-archive-lGxak8 in 0.07s
61.09 s
> ------------
61.09 s
> Nextest run ID 53d1d928-8461-494d-a3ae-5d2df03da1bc with nextest profile: ci_gammaloop
61.09 s
> Starting 1 test across 2 binaries
61.09 s
> ------------
61.09 s
> Summary [ 0.005s] 1 test run: 1 passed , 0 skipped
61.09 s
>
61.09 s
> ========== nextest test summary ==========
61.09 s
> report: target/nextest/ci_gammaloop/junit.xml
61.09 s
> tests: 1, failures: 0, errors: 0
61.09 s
> No failing testcases found.
61.09 s
> =========================================
61.09 s
> Extracting 1 binary and 1 linked path to /build/nextest-archive-CPHOWb
61.09 s
> Extracted 7 files to /build/nextest-archive-CPHOWb in 0.07s
61.09 s
> ------------
61.09 s
> Nextest run ID 39a3ad9a-a5c3-46c4-a37b-c154c604571c with nextest profile: ci_gammaloop
61.09 s
> Starting 0 tests across 1 binary
61.09 s
> ------------
61.09 s
> Summary [ 0.000s] 0 tests run: 0 passed , 0 skipped
61.09 s
>
61.09 s
> ========== nextest test summary ==========
61.09 s
> report: target/nextest/ci_gammaloop/junit.xml
61.09 s
> tests: 0, failures: 0, errors: 0
61.09 s
> No failing testcases found.
61.09 s
> =========================================
61.09 s
For full logs, run:
61.09 s
nix log /nix/store/pcw901lvh10nhiz9sizq4ncxl7hk2sj8-gammaloop-nextest-spenso.drv
61.30 s
[0 built (1 failed ), 9 cRun failed.