test packages.x86_64-linux.nix-ci-check-gammaloop-nextest-spenso

Reproduce this run
Retry Run
  1. 0.00 s $ /nix/store/9ypz3flqsrl5xl495mm8h645gadjsxi1-coreutils-9.11/bin/timeout --kill-after=15s 7200s /nix/store/23zk8sgzamrbmj1fday15szf7f2279s8-nix-2.34.7/bin/nix --extra-experimental-features nix-command --extra-experimental-features flakes flake clone git+https://github.com/alphal00p/gammaloop --dest /tmp/nix-ci-worker/stable-pwd/repo/
  2. 0.12 s Cloning into '/tmp/nix-ci-worker/stable-pwd/repo'...
  3. 1.65 s remote: Enumerating objects: 83696, done.
  4. 1.89 s remote: Counting objects: 0% (1/9893) remote: Counting objects: 1% (99/9893) remote: Counting objects: 2% (198/9893) remote: Counting objects: 3% (297/9893) remote: Counting objects: 4% (396/9893) remote: Counting objects: 5% (495/9893) remote: Counting objects: 6% (594/9893) remote: Counting objects: 7% (693/9893) remote: Counting objects: 8% (792/9893) remote: Counting objects: 9% (891/9893) remote: Counting objects: 10% (990/9893) remote: Counting objects: 11% (1089/9893) remote: Counting objects: 12% (1188/9893) remote: Counting objects: 13% (1287/9893) remote: Counting objects: 14% (1386/9893) remote: Counting objects: 15% (1484/9893) remote: Counting objects: 16% (1583/9893) remote: Counting objects: 17% (1682/9893) remote: Counting objects: 18% (1781/9893) remote: Counting objects: 19% (1880/9893) remote: Counting objects: 20% (1979/9893) remote: Counting objects: 21% (2078/9893) remote: Counting objects: 22% (2177/9893) remote: Counting objects: 23% (2276/9893) remote: Counting objects: 24% (2375/9893) remote: Counting objects: 25% (2474/9893) remote: Counting objects: 26% (2573/9893) remote: Counting objects: 27% (2672/9893) remote: Counting objects: 28% (2771/9893) remote: Counting objects: 29% (2869/9893) remote: Counting objects: 30% (2968/9893) remote: Counting objects: 31% (3067/9893) remote: Counting objects: 32% (3166/9893) remote: Counting objects: 33% (3265/9893) remote: Counting objects: 34% (3364/9893) remote: Counting objects: 35% (3463/9893) remote: Counting objects: 36% (3562/9893) remote: Counting objects: 37% (3661/9893) remote: Counting objects: 38% (3760/9893) remote: Counting objects: 39% (3859/9893) remote: Counting objects: 40% (3958/9893) remote: Counting objects: 41% (4057/9893) remote: Counting objects: 42% (4156/9893) remote: Counting objects: 43% (4254/9893) remote: Counting objects: 44% (4353/9893) remote: Counting objects: 45% (4452/9893) remote: Counting objects: 46% (4551/9893) remote: Counting objects: 47% (4650/9893) remote: Counting objects: 48% (4749/9893) remote: Counting objects: 49% (4848/9893) remote: Counting objects: 50% (4947/9893) remote: Counting objects: 51% (5046/9893) remote: Counting objects: 52% (5145/9893) remote: Counting objects: 53% (5244/9893) remote: Counting objects: 54% (5343/9893) remote: Counting objects: 55% (5442/9893) remote: Counting objects: 56% (5541/9893) remote: Counting objects: 57% (5640/9893) remote: Counting objects: 58% (5738/9893) remote: Counting objects: 59% (5837/9893) remote: Counting objects: 60% (5936/9893) remote: Counting objects: 61% (6035/9893) remote: Counting objects: 62% (6134/9893) remote: Counting objects: 63% (6233/9893) remote: Counting objects: 64% (6332/9893) remote: Counting objects: 65% (6431/9893) remote: Counting objects: 66% (6530/9893) remote: Counting objects: 67% (6629/9893) remote: Counting objects: 68% (6728/9893) remote: Counting objects: 69% (6827/9893) remote: Counting objects: 70% (6926/9893) remote: Counting objects: 71% (7025/9893) remote: Counting objects: 72% (7123/9893) remote: Counting objects: 73% (7222/9893) remote: Counting objects: 74% (7321/9893) remote: Counting objects: 75% (7420/9893) remote: Counting objects: 76% (7519/9893) remote: Counting objects: 77% (7618/9893) remote: Counting objects: 78% (7717/9893) remote: Counting objects: 79% (7816/9893) remote: Counting objects: 80% (7915/9893) remote: Counting objects: 81% (8014/9893) remote: Counting objects: 82% (8113/9893) remote: Counting objects: 83% (8212/9893) remote: Counting objects: 84% (8311/9893) remote: Counting objects: 85% (8410/9893) remote: Counting objects: 86% (8508/9893) remote: Counting objects: 87% (8607/9893) remote: Counting objects: 88% (8706/9893) remote: Counting objects: 89% (8805/9893) remote: Counting objects: 90% (8904/9893) remote: Counting objects: 91% (9003/9893) remote: Counting objects: 92% (9102/9893) remote: Counting objects: 93% (9201/9893) remote: Counting objects: 94% (9300/9893) remote: Counting objects: 95% (9399/9893) remote: Counting objects: 96% (9498/9893) remote: Counting objects: 97% (9597/9893) remote: Counting objects: 98% (9696/9893) remote: Counting objects: 99% (9795/9893) remote: Counting objects: 100% (9893/9893) remote: Counting objects: 100% (9893/9893), done.
  5. 4.63 s remote: Compressing objects: 0% (1/2138) remote: Compressing objects: 1% (22/2138) remote: Compressing objects: 2% (43/2138) remote: Compressing objects: 3% (65/2138) remote: Compressing objects: 4% (86/2138) remote: Compressing objects: 5% (107/2138) remote: Compressing objects: 6% (129/2138) remote: Compressing objects: 7% (150/2138) remote: Compressing objects: 8% (172/2138) remote: Compressing objects: 9% (193/2138) remote: Compressing objects: 10% (214/2138) remote: Compressing objects: 11% (236/2138) remote: Compressing objects: 12% (257/2138) remote: Compressing objects: 13% (278/2138) remote: Compressing objects: 14% (300/2138) remote: Compressing objects: 15% (321/2138) remote: Compressing objects: 15% (332/2138) remote: Compressing objects: 16% (343/2138) remote: Compressing objects: 17% (364/2138) remote: Compressing objects: 18% (385/2138) remote: Compressing objects: 19% (407/2138) remote: Compressing objects: 19% (421/2138) remote: Compressing objects: 20% (428/2138) remote: Compressing objects: 21% (449/2138) remote: Compressing objects: 22% (471/2138) remote: Compressing objects: 23% (492/2138) remote: Compressing objects: 24% (514/2138) remote: Compressing objects: 25% (535/2138) remote: Compressing objects: 26% (556/2138) remote: Compressing objects: 27% (578/2138) remote: Compressing objects: 28% (599/2138) remote: Compressing objects: 29% (621/2138) remote: Compressing objects: 30% (642/2138) remote: Compressing objects: 31% (663/2138) remote: Compressing objects: 32% (685/2138) remote: Compressing objects: 33% (706/2138) remote: Compressing objects: 34% (727/2138) remote: Compressing objects: 35% (749/2138) remote: Compressing objects: 36% (770/2138) remote: Compressing objects: 37% (792/2138) remote: Compressing objects: 38% (813/2138) remote: Compressing objects: 39% (834/2138) remote: Compressing objects: 40% (856/2138) remote: Compressing objects: 41% (877/2138) remote: Compressing objects: 42% (898/2138) remote: Compressing objects: 43% (920/2138) remote: Compressing objects: 44% (941/2138) remote: Compressing objects: 45% (963/2138) remote: Compressing objects: 46% (984/2138) remote: Compressing objects: 47% (1005/2138) remote: Compressing objects: 48% (1027/2138) remote: Compressing objects: 49% (1048/2138) remote: Compressing objects: 50% (1069/2138) remote: Compressing objects: 51% (1091/2138) remote: Compressing objects: 52% (1112/2138) remote: Compressing objects: 53% (1134/2138) remote: Compressing objects: 54% (1155/2138) remote: Compressing objects: 55% (1176/2138) remote: Compressing objects: 56% (1198/2138) remote: Compressing objects: 57% (1219/2138) remote: Compressing objects: 58% (1241/2138) remote: Compressing objects: 59% (1262/2138) remote: Compressing objects: 60% (1283/2138) remote: Compressing objects: 61% (1305/2138) remote: Compressing objects: 62% (1326/2138) remote: Compressing objects: 63% (1347/2138) remote: Compressing objects: 64% (1369/2138) remote: Compressing objects: 65% (1390/2138) remote: Compressing objects: 66% (1412/2138) remote: Compressing objects: 67% (1433/2138) remote: Compressing objects: 68% (1454/2138) remote: Compressing objects: 69% (1476/2138) remote: Compressing objects: 70% (1497/2138) remote: Compressing objects: 71% (1518/2138) remote: Compressing objects: 72% (1540/2138) remote: Compressing objects: 73% (1561/2138) remote: Compressing objects: 74% (1583/2138) remote: Compressing objects: 75% (1604/2138) remote: Compressing objects: 76% (1625/2138) remote: Compressing objects: 77% (1647/2138) remote: Compressing objects: 78% (1668/2138) remote: Compressing objects: 79% (1690/2138) remote: Compressing objects: 80% (1711/2138) remote: Compressing objects: 81% (1732/2138) remote: Compressing objects: 82% (1754/2138) remote: Compressing objects: 83% (1775/2138) remote: Compressing objects: 84% (1796/2138) remote: Compressing objects: 85% (1818/2138) remote: Compressing objects: 86% (1839/2138) remote: Compressing objects: 87% (1861/2138) remote: Compressing objects: 88% (1882/2138) remote: Compressing objects: 89% (1903/2138) remote: Compressing objects: 90% (1925/2138) remote: Compressing objects: 91% (1946/2138) remote: Compressing objects: 92% (1967/2138) remote: Compressing objects: 93% (1989/2138) remote: Compressing objects: 94% (2010/2138) remote: Compressing objects: 95% (2032/2138) remote: Compressing objects: 96% (2053/2138) remote: Compressing objects: 97% (2074/2138) remote: Compressing objects: 98% (2096/2138) remote: Compressing objects: 99% (2117/2138) remote: Compressing objects: 100% (2138/2138) remote: Compressing objects: 100% (2138/2138), done.
  6. 8.98 s Receiving objects: 0% (1/83696) Receiving objects: 1% (837/83696) Receiving objects: 2% (1674/83696) Receiving objects: 3% (2511/83696) Receiving objects: 4% (3348/83696) Receiving objects: 5% (4185/83696) Receiving objects: 6% (5022/83696), 8.97 MiB | 17.93 MiB/s Receiving objects: 7% (5859/83696), 8.97 MiB | 17.93 MiB/s Receiving objects: 8% (6696/83696), 8.97 MiB | 17.93 MiB/s Receiving objects: 9% (7533/83696), 8.97 MiB | 17.93 MiB/s Receiving objects: 10% (8370/83696), 8.97 MiB | 17.93 MiB/s Receiving objects: 11% (9207/83696), 8.97 MiB | 17.93 MiB/s Receiving objects: 12% (10044/83696), 8.97 MiB | 17.93 MiB/s Receiving objects: 13% (10881/83696), 8.97 MiB | 17.93 MiB/s Receiving objects: 14% (11718/83696), 8.97 MiB | 17.93 MiB/s Receiving objects: 15% (12555/83696), 8.97 MiB | 17.93 MiB/s Receiving objects: 16% (13392/83696), 8.97 MiB | 17.93 MiB/s Receiving objects: 17% (14229/83696), 8.97 MiB | 17.93 MiB/s Receiving objects: 18% (15066/83696), 8.97 MiB | 17.93 MiB/s Receiving objects: 19% (15903/83696), 8.97 MiB | 17.93 MiB/s Receiving objects: 20% (16740/83696), 8.97 MiB | 17.93 MiB/s Receiving objects: 21% (17577/83696), 8.97 MiB | 17.93 MiB/s Receiving objects: 22% (18414/83696), 8.97 MiB | 17.93 MiB/s Receiving objects: 23% (19251/83696), 8.97 MiB | 17.93 MiB/s Receiving objects: 24% (20088/83696), 8.97 MiB | 17.93 MiB/s Receiving objects: 25% (20924/83696), 8.97 MiB | 17.93 MiB/s Receiving objects: 26% (21761/83696), 8.97 MiB | 17.93 MiB/s Receiving objects: 27% (22598/83696), 8.97 MiB | 17.93 MiB/s Receiving objects: 28% (23435/83696), 8.97 MiB | 17.93 MiB/s Receiving objects: 29% (24272/83696), 8.97 MiB | 17.93 MiB/s Receiving objects: 30% (25109/83696), 8.97 MiB | 17.93 MiB/s Receiving objects: 30% (25529/83696), 26.29 MiB | 26.28 MiB/s Receiving objects: 31% (25946/83696), 26.29 MiB | 26.28 MiB/s Receiving objects: 32% (26783/83696), 26.29 MiB | 26.28 MiB/s Receiving objects: 33% (27620/83696), 26.29 MiB | 26.28 MiB/s Receiving objects: 34% (28457/83696), 26.29 MiB | 26.28 MiB/s Receiving objects: 35% (29294/83696), 26.29 MiB | 26.28 MiB/s Receiving objects: 36% (30131/83696), 26.29 MiB | 26.28 MiB/s Receiving objects: 37% (30968/83696), 26.29 MiB | 26.28 MiB/s Receiving objects: 38% (31805/83696), 26.29 MiB | 26.28 MiB/s Receiving objects: 39% (32642/83696), 26.29 MiB | 26.28 MiB/s Receiving objects: 40% (33479/83696), 26.29 MiB | 26.28 MiB/s Receiving objects: 41% (34316/83696), 26.29 MiB | 26.28 MiB/s Receiving objects: 42% (35153/83696), 26.29 MiB | 26.28 MiB/s Receiving objects: 43% (35990/83696), 26.29 MiB | 26.28 MiB/s Receiving objects: 44% (36827/83696), 26.29 MiB | 26.28 MiB/s Receiving objects: 45% (37664/83696), 26.29 MiB | 26.28 MiB/s Receiving objects: 46% (38501/83696), 26.29 MiB | 26.28 MiB/s Receiving objects: 47% (39338/83696), 26.29 MiB | 26.28 MiB/s Receiving objects: 48% (40175/83696), 45.79 MiB | 30.52 MiB/s Receiving objects: 49% (41012/83696), 45.79 MiB | 30.52 MiB/s Receiving objects: 50% (41848/83696), 45.79 MiB | 30.52 MiB/s Receiving objects: 51% (42685/83696), 45.79 MiB | 30.52 MiB/s Receiving objects: 52% (43522/83696), 45.79 MiB | 30.52 MiB/s Receiving objects: 53% (44359/83696), 45.79 MiB | 30.52 MiB/s Receiving objects: 54% (45196/83696), 45.79 MiB | 30.52 MiB/s Receiving objects: 55% (46033/83696), 45.79 MiB | 30.52 MiB/s Receiving objects: 56% (46870/83696), 45.79 MiB | 30.52 MiB/s Receiving objects: 57% (47707/83696), 45.79 MiB | 30.52 MiB/s Receiving objects: 58% (48544/83696), 45.79 MiB | 30.52 MiB/s Receiving objects: 58% (48725/83696), 61.80 MiB | 30.90 MiB/s Receiving objects: 59% (49381/83696), 61.80 MiB | 30.90 MiB/s Receiving objects: 60% (50218/83696), 61.80 MiB | 30.90 MiB/s Receiving objects: 61% (51055/83696), 61.80 MiB | 30.90 MiB/s Receiving objects: 62% (51892/83696), 61.80 MiB | 30.90 MiB/s Receiving objects: 63% (52729/83696), 61.80 MiB | 30.90 MiB/s Receiving objects: 64% (53566/83696), 61.80 MiB | 30.90 MiB/s Receiving objects: 65% (54403/83696), 78.07 MiB | 31.23 MiB/s Receiving objects: 66% (55240/83696), 78.07 MiB | 31.23 MiB/s Receiving objects: 67% (56077/83696), 78.07 MiB | 31.23 MiB/s Receiving objects: 68% (56914/83696), 78.07 MiB | 31.23 MiB/s Receiving objects: 69% (57751/83696), 78.07 MiB | 31.23 MiB/s Receiving objects: 70% (58588/83696), 78.07 MiB | 31.23 MiB/s Receiving objects: 71% (59425/83696), 78.07 MiB | 31.23 MiB/s Receiving objects: 72% (60262/83696), 78.07 MiB | 31.23 MiB/s Receiving objects: 73% (61099/83696), 78.07 MiB | 31.23 MiB/s Receiving objects: 73% (61530/83696), 78.07 MiB | 31.23 MiB/s Receiving objects: 74% (61936/83696), 94.52 MiB | 31.50 MiB/s Receiving objects: 75% (62772/83696), 94.52 MiB | 31.50 MiB/s Receiving objects: 76% (63609/83696), 94.52 MiB | 31.50 MiB/s Receiving objects: 77% (64446/83696), 94.52 MiB | 31.50 MiB/s Receiving objects: 78% (65283/83696), 94.52 MiB | 31.50 MiB/s Receiving objects: 79% (66120/83696), 94.52 MiB | 31.50 MiB/s Receiving objects: 80% (66957/83696), 94.52 MiB | 31.50 MiB/s Receiving objects: 81% (67794/83696), 111.45 MiB | 31.84 MiB/s Receiving objects: 82% (68631/83696), 111.45 MiB | 31.84 MiB/s Receiving objects: 83% (69468/83696), 111.45 MiB | 31.84 MiB/s Receiving objects: 84% (70305/83696), 111.45 MiB | 31.84 MiB/s Receiving objects: 85% (71142/83696), 111.45 MiB | 31.84 MiB/s Receiving objects: 86% (71979/83696), 111.45 MiB | 31.84 MiB/s Receiving objects: 87% (72816/83696), 111.45 MiB | 31.84 MiB/s Receiving objects: 88% (73653/83696), 111.45 MiB | 31.84 MiB/s Receiving objects: 89% (74490/83696), 111.45 MiB | 31.84 MiB/s Receiving objects: 90% (75327/83696), 111.45 MiB | 31.84 MiB/s Receiving objects: 91% (76164/83696), 111.45 MiB | 31.84 MiB/s Receiving objects: 92% (77001/83696), 111.45 MiB | 31.84 MiB/s Receiving objects: 93% (77838/83696), 111.45 MiB | 31.84 MiB/s Receiving objects: 94% (78675/83696), 111.45 MiB | 31.84 MiB/s Receiving objects: 95% (79512/83696), 111.45 MiB | 31.84 MiB/s Receiving objects: 96% (80349/83696), 111.45 MiB | 31.84 MiB/s Receiving objects: 97% (81186/83696), 111.45 MiB | 31.84 MiB/s Receiving objects: 97% (81804/83696), 111.45 MiB | 31.84 MiB/s Receiving objects: 98% (82023/83696), 127.47 MiB | 31.87 MiB/s Receiving objects: 99% (82860/83696), 127.47 MiB | 31.87 MiB/s remote: Total 83696 (delta 7944), reused 8038 (delta 7222), pack-reused 73803 (from 3)
  7. 8.98 s Receiving objects: 100% (83696/83696), 127.47 MiB | 31.87 MiB/s Receiving objects: 100% (83696/83696), 139.23 MiB | 32.05 MiB/s, done.
  8. 10.36 s Resolving deltas: 0% (0/56218) Resolving deltas: 1% (563/56218) Resolving deltas: 2% (1125/56218) Resolving deltas: 3% (1687/56218) Resolving deltas: 4% (2249/56218) Resolving deltas: 5% (2812/56218) Resolving deltas: 6% (3374/56218) Resolving deltas: 7% (3936/56218) Resolving deltas: 8% (4498/56218) Resolving deltas: 9% (5064/56218) Resolving deltas: 10% (5622/56218) Resolving deltas: 11% (6184/56218) Resolving deltas: 12% (6747/56218) Resolving deltas: 13% (7309/56218) Resolving deltas: 14% (7871/56218) Resolving deltas: 15% (8433/56218) Resolving deltas: 16% (8996/56218) Resolving deltas: 17% (9558/56218) Resolving deltas: 18% (10120/56218) Resolving deltas: 19% (10682/56218) Resolving deltas: 20% (11244/56218) Resolving deltas: 21% (11807/56218) Resolving deltas: 22% (12368/56218) Resolving deltas: 23% (12931/56218) Resolving deltas: 24% (13493/56218) Resolving deltas: 25% (14055/56218) Resolving deltas: 26% (14617/56218) Resolving deltas: 27% (15179/56218) Resolving deltas: 28% (15742/56218) Resolving deltas: 29% (16304/56218) Resolving deltas: 30% (16866/56218) Resolving deltas: 31% (17428/56218) Resolving deltas: 32% (17990/56218) Resolving deltas: 33% (18554/56218) Resolving deltas: 34% (19115/56218) Resolving deltas: 35% (19677/56218) Resolving deltas: 36% (20239/56218) Resolving deltas: 37% (20803/56218) Resolving deltas: 38% (21363/56218) Resolving deltas: 39% (21926/56218) Resolving deltas: 40% (22488/56218) Resolving deltas: 41% (23050/56218) Resolving deltas: 42% (23612/56218) Resolving deltas: 43% (24174/56218) Resolving deltas: 44% (24736/56218) Resolving deltas: 45% (25301/56218) Resolving deltas: 46% (25861/56218) Resolving deltas: 47% (26423/56218) Resolving deltas: 48% (26986/56218) Resolving deltas: 49% (27547/56218) Resolving deltas: 50% (28109/56218) Resolving deltas: 51% (28672/56218) Resolving deltas: 52% (29235/56218) Resolving deltas: 53% (29796/56218) Resolving deltas: 54% (30358/56218) Resolving deltas: 55% (30920/56218) Resolving deltas: 56% (31483/56218) Resolving deltas: 57% (32045/56218) Resolving deltas: 58% (32607/56218) Resolving deltas: 59% (33169/56218) Resolving deltas: 60% (33734/56218) Resolving deltas: 61% (34293/56218) Resolving deltas: 62% (34856/56218) Resolving deltas: 63% (35418/56218) Resolving deltas: 64% (35980/56218) Resolving deltas: 65% (36545/56218) Resolving deltas: 66% (37104/56218) Resolving deltas: 67% (37667/56218) Resolving deltas: 68% (38229/56218) Resolving deltas: 69% (38791/56218) Resolving deltas: 70% (39353/56218) Resolving deltas: 71% (39915/56218) Resolving deltas: 72% (40477/56218) Resolving deltas: 73% (41040/56218) Resolving deltas: 74% (41602/56218) Resolving deltas: 74% (42100/56218) Resolving deltas: 75% (42164/56218) Resolving deltas: 76% (42727/56218) Resolving deltas: 77% (43288/56218) Resolving deltas: 78% (43853/56218) Resolving deltas: 79% (44413/56218) Resolving deltas: 80% (44975/56218) Resolving deltas: 81% (45537/56218) Resolving deltas: 82% (46099/56218) Resolving deltas: 83% (46662/56218) Resolving deltas: 84% (47224/56218) Resolving deltas: 85% (47786/56218) Resolving deltas: 86% (48348/56218) Resolving deltas: 87% (48910/56218) Resolving deltas: 88% (49472/56218) Resolving deltas: 89% (50035/56218) Resolving deltas: 90% (50597/56218) Resolving deltas: 91% (51159/56218) Resolving deltas: 92% (51722/56218) Resolving deltas: 93% (52283/56218) Resolving deltas: 94% (52845/56218) Resolving deltas: 95% (53408/56218) Resolving deltas: 96% (53971/56218) Resolving deltas: 97% (54532/56218) Resolving deltas: 98% (55094/56218) Resolving deltas: 99% (55656/56218) Resolving deltas: 100% (56218/56218) Resolving deltas: 100% (56218/56218), done.
  9. 12.80 s Fetching commit 5aadd389efabb7b039af74edad02a90d486a1c07 for simplify-spenso-api ...
  10. 12.81 s $ /nix/store/bcnisk3ydfgv26v2gw3zlky24g00yww2-git-2.54.0/bin/git fetch origin 5aadd389efabb7b039af74edad02a90d486a1c07
  11. 14.37 s From https://github.com/alphal00p/gammaloop
  12. 14.37 s * branch 5aadd389efabb7b039af74edad02a90d486a1c07 -> FETCH_HEAD
  13. 14.39 s $ /nix/store/9ypz3flqsrl5xl495mm8h645gadjsxi1-coreutils-9.11/bin/timeout --kill-after=15s 7200s /nix/store/bcnisk3ydfgv26v2gw3zlky24g00yww2-git-2.54.0/bin/git -c advice.detachedHead=false checkout 5aadd389efabb7b039af74edad02a90d486a1c07
  14. 14.54 s HEAD is now at 5aadd389e restore public gamma arguments to storage order
  15. 14.54 s $ /nix/store/9ypz3flqsrl5xl495mm8h645gadjsxi1-coreutils-9.11/bin/timeout --kill-after=15s 7200s /nix/store/23zk8sgzamrbmj1fday15szf7f2279s8-nix-2.34.7/bin/nix --extra-experimental-features nix-command --extra-experimental-features flakes --log-format internal-json run .#packages.x86_64-linux.nix-ci-check-gammaloop-nextest-spenso --print-build-logs
  16. 30.11 s
  17. 32.80 s Downloading cached gammaloop-nextest-binaries-spenso-idenso from https://cache.nix-ci.com
  18. 32.80 s Downloading cached gammaloop-nextest-binaries-spenso-spenso-hep-lib from https://cache.nix-ci.com
  19. 32.80 s Downloading cached gammaloop-nextest-binaries-spenso-spenso from https://cache.nix-ci.com
  20. 32.80 s Downloading cached gammaloop-nextest-binaries-spenso-symbolica-utils from https://cache.nix-ci.com
  21. 32.80 s Downloading cached gammaloop-nextest-binaries-spenso-spenso-macros from https://cache.nix-ci.com
  22. 32.81 s Downloading cached busybox from https://cache.nix-ci.com
  23. 32.81 s Downloading cached boehm-gc from https://cache.nix-ci.com
  24. 32.81 s Downloading cached editline-1.17.1-unstable-2025-05 from https://cache.nix-ci.com
  25. 32.81 s Downloading cached aws-c-common from https://cache.nix-ci.com
  26. 32.81 s Downloading cached libcpuid from https://cache.nix-ci.com
  27. 32.81 s Downloading cached brotli-1.2.0-lib from https://cache.nix-ci.com
  28. 32.81 s Downloading cached icu4c from https://cache.nix-ci.com
  29. 32.81 s Downloading cached publicsuffix-list-0-unstable-2026-05 from https://cache.nix-ci.com
  30. 32.81 s Downloading cached lowdown-3.0.1-lib from https://cache.nix-ci.com
  31. 32.81 s Downloading cached libsodium-1.0.22-unstable-2026-04 from https://cache.nix-ci.com
  32. 32.81 s Downloading cached libseccomp-2.6.0-lib from https://cache.nix-ci.com
  33. 33.63 s Downloaded cached editline-1.17.1-unstable-2025-05 (58 KiB) in 819ms
  34. 33.63 s Progress: 0 of 1 built, 1 of 56 downloaded from cache (15 downloading)
  35. 33.63 s Downloading cached hwloc-2.14.0-lib from https://cache.nix-ci.com
  36. 33.64 s Downloaded cached libseccomp-2.6.0-lib (193 KiB) in 821ms
  37. 33.64 s Downloaded cached libcpuid (326 KiB) in 827ms
  38. 33.64 s Progress: 0 of 1 built, 2 of 56 downloaded from cache (15 downloading)
  39. 33.64 s Progress: 0 of 1 built, 3 of 56 downloaded from cache (15 downloading)
  40. 33.64 s Downloading cached libssh2 from https://cache.nix-ci.com
  41. 33.64 s Downloaded cached publicsuffix-list-0-unstable-2026-05 (329 KiB) in 826ms
  42. 33.64 s Progress: 0 of 1 built, 4 of 56 downloaded from cache (15 downloading)
  43. 33.64 s Downloading cached keyutils-1.6.3-lib from https://cache.nix-ci.com
  44. 33.64 s Downloading cached libxml2 from https://cache.nix-ci.com
  45. 33.65 s Downloaded cached lowdown-3.0.1-lib (341 KiB) in 838ms
  46. 33.65 s Progress: 0 of 1 built, 5 of 56 downloaded from cache (15 downloading)
  47. 33.65 s Downloading cached libpsl from https://cache.nix-ci.com
  48. 33.65 s Downloaded cached busybox (230 KiB) in 845ms
  49. 33.65 s Progress: 0 of 1 built, 6 of 56 downloaded from cache (15 downloading)
  50. 33.65 s Downloading cached llhttp from https://cache.nix-ci.com
  51. 33.66 s Downloaded cached aws-c-common (1.1 MiB) in 853ms
  52. 33.66 s Progress: 0 of 1 built, 7 of 56 downloaded from cache (15 downloading)
  53. 33.66 s Downloading cached nghttp2-1.69.0-lib from https://cache.nix-ci.com
  54. 33.68 s Downloaded cached libsodium-1.0.22-unstable-2026-04 (666 KiB) in 871ms
  55. 33.68 s Progress: 0 of 1 built, 8 of 56 downloaded from cache (15 downloading)
  56. 33.68 s Downloaded cached brotli-1.2.0-lib (961 KiB) in 871ms
  57. 33.68 s Progress: 0 of 1 built, 9 of 56 downloaded from cache (15 downloading)
  58. 33.68 s Downloading cached aws-c-cal from https://cache.nix-ci.com
  59. 33.69 s Downloading cached aws-c-compression from https://cache.nix-ci.com
  60. 33.71 s Downloaded cached boehm-gc (312 KiB) in 904ms
  61. 33.71 s Progress: 0 of 1 built, 10 of 56 downloaded from cache (15 downloading)
  62. 33.73 s Downloading cached aws-c-sdkutils from https://cache.nix-ci.com
  63. 34.28 s Downloaded cached icu4c (38.2 MiB) in 1.4s
  64. 34.28 s Progress: 0 of 1 built, 11 of 56 downloaded from cache (15 downloading)
  65. 34.28 s Downloading cached aws-checksums from https://cache.nix-ci.com
  66. 34.37 s Downloaded cached libssh2 (330 KiB) in 734ms
  67. 34.37 s Progress: 0 of 1 built, 12 of 56 downloaded from cache (15 downloading)
  68. 34.37 s Downloading cached boost from https://cache.nix-ci.com
  69. 34.38 s Downloaded cached keyutils-1.6.3-lib (41 KiB) in 737ms
  70. 34.38 s Progress: 0 of 1 built, 13 of 56 downloaded from cache (15 downloading)
  71. 34.38 s Downloading cached nghttp3 from https://cache.nix-ci.com
  72. 34.39 s Downloaded cached hwloc-2.14.0-lib (459 KiB) in 761ms
  73. 34.39 s Progress: 0 of 1 built, 14 of 56 downloaded from cache (15 downloading)
  74. 34.39 s Downloading cached krb5-1.22.2-lib from https://cache.nix-ci.com
  75. 34.40 s Downloaded cached llhttp (89 KiB) in 747ms
  76. 34.40 s Progress: 0 of 1 built, 15 of 56 downloaded from cache (15 downloading)
  77. 34.40 s Downloading cached ngtcp2 from https://cache.nix-ci.com
  78. 34.40 s Downloaded cached aws-c-cal (158 KiB) in 722ms
  79. 34.40 s Progress: 0 of 1 built, 16 of 56 downloaded from cache (15 downloading)
  80. 34.41 s Downloading cached libgit2-1.9.4-lib from https://cache.nix-ci.com
  81. 34.41 s Downloaded cached libpsl (114 KiB) in 761ms
  82. 34.41 s Progress: 0 of 1 built, 17 of 56 downloaded from cache (15 downloading)
  83. 34.41 s Downloading cached onetbb from https://cache.nix-ci.com
  84. 34.42 s Downloaded cached nghttp2-1.69.0-lib (225 KiB) in 758ms
  85. 34.43 s Progress: 0 of 1 built, 18 of 56 downloaded from cache (15 downloading)
  86. 34.43 s Downloading cached s2n-tls from https://cache.nix-ci.com
  87. 34.43 s Downloaded cached aws-c-compression (31 KiB) in 735ms
  88. 34.43 s Progress: 0 of 1 built, 19 of 56 downloaded from cache (15 downloading)
  89. 34.43 s Downloaded cached aws-c-sdkutils (155 KiB) in 704ms
  90. 34.43 s Progress: 0 of 1 built, 20 of 56 downloaded from cache (14 downloading)
  91. 34.43 s Downloaded cached aws-checksums (86 KiB) in 152ms
  92. 34.44 s Progress: 0 of 1 built, 21 of 56 downloaded from cache (13 downloading)
  93. 34.44 s Downloaded cached libxml2 (1.4 MiB) in 794ms
  94. 34.44 s Progress: 0 of 1 built, 22 of 56 downloaded from cache (12 downloading)
  95. 34.44 s Downloading cached libarchive-3.8.8-lib from https://cache.nix-ci.com
  96. 34.71 s Downloaded cached boost (14.5 MiB) in 332ms
  97. 34.71 s Progress: 0 of 1 built, 23 of 56 downloaded from cache (12 downloading)
  98. 35.20 s Downloaded cached nghttp3 (228 KiB) in 820ms
  99. 35.20 s Progress: 0 of 1 built, 24 of 56 downloaded from cache (11 downloading)
  100. 35.26 s Downloaded cached onetbb (626 KiB) in 842ms
  101. 35.26 s Progress: 0 of 1 built, 25 of 56 downloaded from cache (10 downloading)
  102. 35.26 s Downloading cached libblake3 from https://cache.nix-ci.com
  103. 35.27 s Downloaded cached libgit2-1.9.4-lib (1.6 MiB) in 867ms
  104. 35.27 s Progress: 0 of 1 built, 26 of 56 downloaded from cache (10 downloading)
  105. 35.29 s Downloaded cached s2n-tls (1.3 MiB) in 859ms
  106. 35.29 s Progress: 0 of 1 built, 27 of 56 downloaded from cache (9 downloading)
  107. 35.29 s Downloading cached aws-c-io from https://cache.nix-ci.com
  108. 35.29 s Downloaded cached krb5-1.22.2-lib (2.7 MiB) in 898ms
  109. 35.29 s Progress: 0 of 1 built, 28 of 56 downloaded from cache (9 downloading)
  110. 35.31 s Downloaded cached libarchive-3.8.8-lib (953 KiB) in 867ms
  111. 35.31 s Progress: 0 of 1 built, 29 of 56 downloaded from cache (8 downloading)
  112. 35.33 s Downloaded cached ngtcp2 (515 KiB) in 930ms
  113. 35.33 s Progress: 0 of 1 built, 30 of 56 downloaded from cache (7 downloading)
  114. 35.33 s Downloading cached curl from https://cache.nix-ci.com
  115. 36.01 s Downloaded cached libblake3 (117 KiB) in 751ms
  116. 36.01 s Progress: 0 of 1 built, 31 of 56 downloaded from cache (7 downloading)
  117. 36.01 s Downloading cached nix-util from https://cache.nix-ci.com
  118. 36.05 s Downloaded cached aws-c-io (648 KiB) in 760ms
  119. 36.05 s Progress: 0 of 1 built, 32 of 56 downloaded from cache (7 downloading)
  120. 36.05 s Downloading cached aws-c-event-stream from https://cache.nix-ci.com
  121. 36.05 s Downloading cached aws-c-http from https://cache.nix-ci.com
  122. 36.07 s Downloaded cached curl (1.2 MiB) in 738ms
  123. 36.07 s Progress: 0 of 1 built, 33 of 56 downloaded from cache (8 downloading)
  124. 36.12 s Downloaded cached nix-util (2.4 MiB) in 107ms
  125. 36.12 s Progress: 0 of 1 built, 34 of 56 downloaded from cache (7 downloading)
  126. 36.12 s Downloading cached nix-nswrapper from https://cache.nix-ci.com
  127. 36.88 s Downloaded cached aws-c-event-stream (176 KiB) in 826ms
  128. 36.88 s Progress: 0 of 1 built, 35 of 56 downloaded from cache (7 downloading)
  129. 36.88 s Downloaded cached aws-c-http (641 KiB) in 825ms
  130. 36.88 s Progress: 0 of 1 built, 36 of 56 downloaded from cache (6 downloading)
  131. 36.88 s Downloaded cached nix-nswrapper (131 KiB) in 760ms
  132. 36.88 s Progress: 0 of 1 built, 37 of 56 downloaded from cache (7 downloading)
  133. 36.88 s Downloading cached aws-c-auth from https://cache.nix-ci.com
  134. 36.88 s Downloading cached aws-c-mqtt from https://cache.nix-ci.com
  135. 37.64 s Downloaded cached aws-c-auth (387 KiB) in 755ms
  136. 37.64 s Progress: 0 of 1 built, 38 of 56 downloaded from cache (6 downloading)
  137. 37.64 s Downloading cached aws-c-s3 from https://cache.nix-ci.com
  138. 37.65 s Downloaded cached aws-c-mqtt (557 KiB) in 763ms
  139. 37.65 s Progress: 0 of 1 built, 39 of 56 downloaded from cache (6 downloading)
  140. 38.31 s Downloaded cached gammaloop-nextest-binaries-spenso-symbolica-utils (7.6 MiB) in 5.5s
  141. 38.31 s Progress: 0 of 1 built, 40 of 56 downloaded from cache (5 downloading)
  142. 38.31 s Downloaded cached gammaloop-nextest-binaries-spenso-spenso-macros (7.9 MiB) in 5.5s
  143. 38.32 s Progress: 0 of 1 built, 41 of 56 downloaded from cache (4 downloading)
  144. 38.35 s Downloaded cached aws-c-s3 (384 KiB) in 706ms
  145. 38.35 s Progress: 0 of 1 built, 42 of 56 downloaded from cache (3 downloading)
  146. 38.35 s Downloading cached aws-crt-cpp from https://cache.nix-ci.com
  147. 39.10 s Downloaded cached aws-crt-cpp (979 KiB) in 742ms
  148. 39.10 s Progress: 0 of 1 built, 43 of 56 downloaded from cache (3 downloading)
  149. 39.10 s Downloading cached nix-store from https://cache.nix-ci.com
  150. 39.85 s Downloaded cached gammaloop-nextest-binaries-spenso-spenso (11.1 MiB) in 7.0s
  151. 39.85 s Progress: 0 of 1 built, 44 of 56 downloaded from cache (3 downloading)
  152. 39.92 s Downloaded cached nix-store (5.8 MiB) in 818ms
  153. 39.92 s Progress: 0 of 1 built, 45 of 56 downloaded from cache (2 downloading)
  154. 39.92 s Downloading cached nix-fetchers from https://cache.nix-ci.com
  155. 39.92 s Downloading cached nix-main from https://cache.nix-ci.com
  156. 40.64 s Downloaded cached nix-main (393 KiB) in 725ms
  157. 40.65 s Progress: 0 of 1 built, 46 of 56 downloaded from cache (3 downloading)
  158. 40.65 s Downloaded cached nix-fetchers (1.5 MiB) in 728ms
  159. 40.65 s Progress: 0 of 1 built, 47 of 56 downloaded from cache (2 downloading)
  160. 40.65 s Downloading cached nix-expr from https://cache.nix-ci.com
  161. 41.37 s Downloaded cached nix-expr (3.3 MiB) in 725ms
  162. 41.37 s Progress: 0 of 1 built, 48 of 56 downloaded from cache (2 downloading)
  163. 41.37 s Downloading cached nix-flake from https://cache.nix-ci.com
  164. 42.06 s Downloaded cached nix-flake (956 KiB) in 683ms
  165. 42.06 s Progress: 0 of 1 built, 49 of 56 downloaded from cache (2 downloading)
  166. 42.06 s Downloading cached nix-cmd from https://cache.nix-ci.com
  167. 42.63 s Downloaded cached nix-cmd (1 MiB) in 572ms
  168. 42.63 s Progress: 0 of 1 built, 50 of 56 downloaded from cache (2 downloading)
  169. 42.63 s Downloading cached nix from https://cache.nix-ci.com
  170. 43.39 s Downloaded cached nix (3.9 MiB) in 758ms
  171. 43.39 s Progress: 0 of 1 built, 51 of 56 downloaded from cache (2 downloading)
  172. 43.39 s Downloading cached nix from https://cache.nix-ci.com
  173. 44.06 s Downloaded cached nix (8848 B) in 668ms
  174. 44.06 s Progress: 0 of 1 built, 52 of 56 downloaded from cache (2 downloading)
  175. 46.39 s Downloaded cached gammaloop-nextest-binaries-spenso-idenso (31.6 MiB) in 13.5s
  176. 46.39 s Progress: 0 of 1 built, 53 of 56 downloaded from cache (1 downloading)
  177. 46.48 s Downloaded cached gammaloop-nextest-binaries-spenso-spenso-hep-lib (38.2 MiB) in 13.6s
  178. 46.48 s Progress: 0 of 1 built, 54 of 56 downloaded from cache
  179. 46.48 s Downloading cached gammaloop-nextest-binaries-spenso from https://cache.nix-ci.com
  180. 46.48 s Downloaded cached gammaloop-nextest-binaries-spenso (1920 B) in 5ms
  181. 46.48 s Progress: 0 of 1 built, 55 of 56 downloaded from cache
  182. 46.48 s Downloading cached nix-ci-check-gammaloop-nextest-spenso from https://cache.nix-ci.com
  183. 46.49 s Downloaded cached nix-ci-check-gammaloop-nextest-spenso (1016 B) in 5ms
  184. 46.49 s Progress: 0 of 1 built, 56 of 56 downloaded from cache
  185. 57.61 s evaluating derivation 'g copying '/nix/store/qism evaluating derivation 'g copying '/nix/store/qism evaluating derivation 'g copying '/nix/store/qism evaluating derivation 'g copying '/nix/store/qism evaluating derivation 'g querying gammaloop-nexte [0.0 KiB DL] querying ca [0.6 KiB DL] querying ca [2.2 KiB DL] querying fl [4.8 KiB DL] querying in [4.8 KiB DL] querying gf [6.2 KiB DL] querying gf [6.8 KiB DL] [0/4 built, 4/0/9 copied [0/3 built, 3/1/9 copied [0/3 built, 3/3/9 copied [0/2 built, 2/4/9 copied [0/2 built, 1/6/9 copied [0/2 built, 1/7/9 copied [0/2 built, 1/8/9 copied [0/1 built, 9 copied (10 [1/0/1 built, 9 copied (gammaloop-nextest-spenso> Extracting 5 binaries and 2 linked paths to /build/nextest-archive-UAHuUS
  186. 57.84 s gammaloop-nextest-spenso> Extracted 19 files to /build/nextest-archive-UAHuUS in 0.23s
  187. 57.86 s gammaloop-nextest-spenso> ------------
  188. 57.86 s gammaloop-nextest-spenso> Nextest run ID 235f27c3-8714-4e3f-bb75-4c5376b0da5e with nextest profile: ci_gammaloop
  189. 57.86 s gammaloop-nextest-spenso> Starting 232 tests across 5 binaries (26 tests skipped, including 2 tests via profile.ci_gammaloop.default-filter)
  190. 58.11 s gammaloop-nextest-spenso> FAIL [ 0.019s] ( 91/232) idenso dirac::test::feyncalc_reference::dirac_simplify_id40_repeated_gamma_and_two_trace
  191. 58.11 s gammaloop-nextest-spenso> stdout ---
  192. 58.11 s gammaloop-nextest-spenso>
  193. 58.11 s gammaloop-nextest-spenso> running 1 test
  194. 58.11 s gammaloop-nextest-spenso> test dirac::test::feyncalc_reference::dirac_simplify_id40_repeated_gamma_and_two_trace ... FAILED
  195. 58.11 s gammaloop-nextest-spenso>
  196. 58.11 s gammaloop-nextest-spenso> failures:
  197. 58.11 s gammaloop-nextest-spenso>
  198. 58.11 s gammaloop-nextest-spenso> failures:
  199. 58.11 s gammaloop-nextest-spenso> dirac::test::feyncalc_reference::dirac_simplify_id40_repeated_gamma_and_two_trace
  200. 58.11 s gammaloop-nextest-spenso>
  201. 58.11 s gammaloop-nextest-spenso> test result: FAILED. 0 passed; 1 failed; 0 ignored; 0 measured; 248 filtered out; finished in 0.01s
  202. 58.11 s gammaloop-nextest-spenso>
  203. 58.11 s gammaloop-nextest-spenso> stderr ---
  204. 58.11 s gammaloop-nextest-spenso>
  205. 58.11 s gammaloop-nextest-spenso> thread 'dirac::test::feyncalc_reference::dirac_simplify_id40_repeated_gamma_and_two_trace' (491) panicked at crates/idenso/src/dirac/mod.rs:360:5:
  206. 58.11 s gammaloop-nextest-spenso> gamma third argument must be a Minkowski slot
  207. 58.11 s gammaloop-nextest-spenso> stack backtrace:
  208. 58.11 s gammaloop-nextest-spenso> 0: __rustc::rust_begin_unwind
  209. 58.11 s gammaloop-nextest-spenso> 1: core::panicking::panic_fmt
  210. 58.11 s gammaloop-nextest-spenso> 2: idenso::dirac::require_gamma_port
  211. 58.11 s gammaloop-nextest-spenso> 3: idenso::dirac::gamma_tensor
  212. 58.11 s gammaloop-nextest-spenso> 4: idenso::dirac::test::feyncalc_reference::dirac_simplify_id40_repeated_gamma_and_two_trace
  213. 58.11 s gammaloop-nextest-spenso> 5: <idenso::dirac::test::feyncalc_reference::dirac_simplify_id40_repeated_gamma_and_two_trace::{closure#0} as core::ops::function::FnOnce<()>>::call_once
  214. 58.11 s gammaloop-nextest-spenso> note: Some details are omitted, run with `RUST_BACKTRACE=full` for a verbose backtrace.
  215. 58.11 s gammaloop-nextest-spenso>
  216. 58.12 s gammaloop-nextest-spenso> FAIL [ 0.022s] ( 92/232) idenso dirac::test::feyncalc_reference::dirac_simplify_id46_d_dim_repeated_gamma_slash_sum
  217. 58.12 s gammaloop-nextest-spenso> stdout ---
  218. 58.12 s gammaloop-nextest-spenso>
  219. 58.12 s gammaloop-nextest-spenso> running 1 test
  220. 58.12 s gammaloop-nextest-spenso> test dirac::test::feyncalc_reference::dirac_simplify_id46_d_dim_repeated_gamma_slash_sum ... FAILED
  221. 58.12 s gammaloop-nextest-spenso>
  222. 58.12 s gammaloop-nextest-spenso> failures:
  223. 58.12 s gammaloop-nextest-spenso>
  224. 58.12 s gammaloop-nextest-spenso> failures:
  225. 58.12 s gammaloop-nextest-spenso> dirac::test::feyncalc_reference::dirac_simplify_id46_d_dim_repeated_gamma_slash_sum
  226. 58.12 s gammaloop-nextest-spenso>
  227. 58.12 s gammaloop-nextest-spenso> test result: FAILED. 0 passed; 1 failed; 0 ignored; 0 measured; 248 filtered out; finished in 0.00s
  228. 58.12 s gammaloop-nextest-spenso>
  229. 58.12 s gammaloop-nextest-spenso> stderr ---
  230. 58.12 s gammaloop-nextest-spenso>
  231. 58.12 s gammaloop-nextest-spenso> thread 'dirac::test::feyncalc_reference::dirac_simplify_id46_d_dim_repeated_gamma_slash_sum' (504) panicked at crates/idenso/src/dirac/mod.rs:360:5:
  232. 58.12 s gammaloop-nextest-spenso> gamma third argument must be a Minkowski slot
  233. 58.12 s gammaloop-nextest-spenso> stack backtrace:
  234. 58.12 s gammaloop-nextest-spenso> 0: __rustc::rust_begin_unwind
  235. 58.12 s gammaloop-nextest-spenso> 1: core::panicking::panic_fmt
  236. 58.12 s gammaloop-nextest-spenso> 2: idenso::dirac::require_gamma_port
  237. 58.12 s gammaloop-nextest-spenso> 3: idenso::dirac::gamma_tensor
  238. 58.12 s gammaloop-nextest-spenso> 4: idenso::dirac::test::feyncalc_reference::dirac_simplify_id46_d_dim_repeated_gamma_slash_sum
  239. 58.12 s gammaloop-nextest-spenso> 5: <idenso::dirac::test::feyncalc_reference::dirac_simplify_id46_d_dim_repeated_gamma_slash_sum::{closure#0} as core::ops::function::FnOnce<()>>::call_once
  240. 58.12 s gammaloop-nextest-spenso> note: Some details are omitted, run with `RUST_BACKTRACE=full` for a verbose backtrace.
  241. 58.12 s gammaloop-nextest-spenso>
  242. 58.13 s gammaloop-nextest-spenso> FAIL [ 0.028s] ( 94/232) idenso dirac::test::feyncalc_reference::dirac_simplify_id4_slash_sandwich
  243. 58.13 s gammaloop-nextest-spenso> stdout ---
  244. 58.13 s gammaloop-nextest-spenso>
  245. 58.13 s gammaloop-nextest-spenso> running 1 test
  246. 58.13 s gammaloop-nextest-spenso> test dirac::test::feyncalc_reference::dirac_simplify_id4_slash_sandwich ... FAILED
  247. 58.13 s gammaloop-nextest-spenso>
  248. 58.13 s gammaloop-nextest-spenso> failures:
  249. 58.13 s gammaloop-nextest-spenso>
  250. 58.13 s gammaloop-nextest-spenso> failures:
  251. 58.13 s gammaloop-nextest-spenso> dirac::test::feyncalc_reference::dirac_simplify_id4_slash_sandwich
  252. 58.13 s gammaloop-nextest-spenso>
  253. 58.13 s gammaloop-nextest-spenso> test result: FAILED. 0 passed; 1 failed; 0 ignored; 0 measured; 248 filtered out; finished in 0.01s
  254. 58.13 s gammaloop-nextest-spenso>
  255. 58.13 s gammaloop-nextest-spenso> stderr ---
  256. 58.13 s gammaloop-nextest-spenso>
  257. 58.13 s gammaloop-nextest-spenso> thread 'dirac::test::feyncalc_reference::dirac_simplify_id4_slash_sandwich' (511) panicked at crates/idenso/src/dirac/mod.rs:360:5:
  258. 58.13 s gammaloop-nextest-spenso> gamma third argument must be a Minkowski slot
  259. 58.13 s gammaloop-nextest-spenso> stack backtrace:
  260. 58.13 s gammaloop-nextest-spenso> 0: __rustc::rust_begin_unwind
  261. 58.13 s gammaloop-nextest-spenso> 1: core::panicking::panic_fmt
  262. 58.13 s gammaloop-nextest-spenso> 2: idenso::dirac::require_gamma_port
  263. 58.13 s gammaloop-nextest-spenso> 3: idenso::dirac::gamma_tensor
  264. 58.13 s gammaloop-nextest-spenso> 4: idenso::dirac::test::feyncalc_reference::dirac_simplify_id4_slash_sandwich
  265. 58.13 s gammaloop-nextest-spenso> 5: <idenso::dirac::test::feyncalc_reference::dirac_simplify_id4_slash_sandwich::{closure#0} as core::ops::function::FnOnce<()>>::call_once
  266. 58.13 s gammaloop-nextest-spenso> note: Some details are omitted, run with `RUST_BACKTRACE=full` for a verbose backtrace.
  267. 58.13 s gammaloop-nextest-spenso>
  268. 58.27 s gammaloop-nextest-spenso> FAIL [ 0.025s] (143/232) idenso reference_cases::tests::reference_case_simplification_snapshots
  269. 58.27 s gammaloop-nextest-spenso> stdout ---
  270. 58.27 s gammaloop-nextest-spenso>
  271. 58.27 s gammaloop-nextest-spenso> running 1 test
  272. 58.27 s gammaloop-nextest-spenso> test reference_cases::tests::reference_case_simplification_snapshots ... FAILED
  273. 58.27 s gammaloop-nextest-spenso>
  274. 58.27 s gammaloop-nextest-spenso> failures:
  275. 58.27 s gammaloop-nextest-spenso>
  276. 58.27 s gammaloop-nextest-spenso> failures:
  277. 58.27 s gammaloop-nextest-spenso> reference_cases::tests::reference_case_simplification_snapshots
  278. 58.27 s gammaloop-nextest-spenso>
  279. 58.27 s gammaloop-nextest-spenso> test result: FAILED. 0 passed; 1 failed; 0 ignored; 0 measured; 248 filtered out; finished in 0.01s
  280. 58.27 s gammaloop-nextest-spenso>
  281. 58.27 s gammaloop-nextest-spenso> stderr ---
  282. 58.27 s gammaloop-nextest-spenso>
  283. 58.27 s gammaloop-nextest-spenso> thread 'reference_cases::tests::reference_case_simplification_snapshots' (684) panicked at crates/idenso/src/dirac/mod.rs:360:5:
  284. 58.27 s gammaloop-nextest-spenso> gamma third argument must be a Minkowski slot
  285. 58.27 s gammaloop-nextest-spenso> stack backtrace:
  286. 58.27 s gammaloop-nextest-spenso> 0: __rustc::rust_begin_unwind
  287. 58.27 s gammaloop-nextest-spenso> 1: core::panicking::panic_fmt
  288. 58.27 s gammaloop-nextest-spenso> 2: idenso::dirac::require_gamma_port
  289. 58.27 s gammaloop-nextest-spenso> 3: idenso::dirac::gamma_tensor
  290. 58.27 s gammaloop-nextest-spenso> 4: idenso::reference_cases::dirac_feyncalc_slash_sandwich_id4
  291. 58.27 s gammaloop-nextest-spenso> 5: <idenso::reference_cases::ReferenceCase>::simplified
  292. 58.27 s gammaloop-nextest-spenso> 6: <core::iter::adapters::map::Map<core::slice::iter::Iter<idenso::reference_cases::ReferenceCase>, idenso::reference_cases::tests::reference_case_simplification_snapshots::{closure#0}> as core::iter::traits::iterator::Iterator>::fold::<(), core::iter::traits::iterator::Iterator::for_each::call<alloc::string::String, <alloc::vec::Vec<alloc::string::String>>::extend_trusted<core::iter::adapters::map::Map<core::slice::iter::Iter<idenso::reference_cases::ReferenceCase>, idenso::reference_cases::tests::reference_case_simplification_snapshots::{closure#0}>>::{closure#0}>::{closure#0}>
  293. 58.27 s gammaloop-nextest-spenso> 7: <alloc::vec::Vec<alloc::string::String> as alloc::vec::spec_from_iter_nested::SpecFromIterNested<alloc::string::String, core::iter::adapters::map::Map<core::slice::iter::Iter<idenso::reference_cases::ReferenceCase>, idenso::reference_cases::tests::reference_case_simplification_snapshots::{closure#0}>>>::from_iter
  294. 58.27 s gammaloop-nextest-spenso> 8: idenso::reference_cases::tests::reference_case_simplification_snapshots
  295. 58.27 s gammaloop-nextest-spenso> 9: <idenso::reference_cases::tests::reference_case_simplification_snapshots::{closure#0} as core::ops::function::FnOnce<()>>::call_once
  296. 58.27 s gammaloop-nextest-spenso> note: Some details are omitted, run with `RUST_BACKTRACE=full` for a verbose backtrace.
  297. 58.27 s gammaloop-nextest-spenso>
  298. 58.43 s gammaloop-nextest-spenso> FAIL [ 0.076s] (228/232) idenso tensor::tests::parsing::infinite_execution
  299. 58.43 s gammaloop-nextest-spenso> stdout ---
  300. 58.43 s gammaloop-nextest-spenso>
  301. 58.43 s gammaloop-nextest-spenso> running 1 test
  302. 58.43 s gammaloop-nextest-spenso> ━━━━━━━━━━━━━━━━━━━━━━━━━━━━━━━ Snapshot Summary ━━━━━━━━━━━━━━━━━━━━━━━━━━━━━━━
  303. 58.43 s gammaloop-nextest-spenso> Snapshot: infinite_execution
  304. 58.43 s gammaloop-nextest-spenso> Source: crates/idenso/src/tensor/tests/parsing.rs:905
  305. 58.43 s gammaloop-nextest-spenso> ────────────────────────────────────────────────────────────────────────────────
  306. 58.43 s gammaloop-nextest-spenso> Expression: net_iter.snapshot_dot()
  307. 58.43 s gammaloop-nextest-spenso> ────────────────────────────────────────────────────────────────────────────────
  308. 58.43 s gammaloop-nextest-spenso> -old snapshot
  309. 58.43 s gammaloop-nextest-spenso> +new results
  310. 58.43 s gammaloop-nextest-spenso> ────────────┬───────────────────────────────────────────────────────────────────
  311. 58.43 s gammaloop-nextest-spenso> 8 8 │ 0:0:s -> ext0 [id=0 color="red"];
  312. 58.43 s gammaloop-nextest-spenso> 9 9 │ ext1 [style=invis];
  313. 58.43 s gammaloop-nextest-spenso> 10 10 │ 0:5:s -> ext1 [id=1 dir=none color="red" label="mink4|l_0"];
  314. 58.43 s gammaloop-nextest-spenso> 11 11 │ ext2 [style=invis];
  315. 58.43 s gammaloop-nextest-spenso> 12 │- 0:4:s -> ext2 [id=2 dir=none color="red" label="bis4|l_2"];
  316. 58.43 s gammaloop-nextest-spenso> 12 │+ 0:3:s -> ext2 [id=2 dir=none color="red" label="mink4|l_1"];
  317. 58.43 s gammaloop-nextest-spenso> 13 13 │ ext3 [style=invis];
  318. 58.43 s gammaloop-nextest-spenso> 14 │- 0:3:s -> ext3 [id=3 dir=none color="red" label="bis4|l_3"];
  319. 58.43 s gammaloop-nextest-spenso> 14 │+ 0:1:s -> ext3 [id=3 dir=none color="red" label="bis4|l_2"];
  320. 58.43 s gammaloop-nextest-spenso> 15 15 │ ext4 [style=invis];
  321. 58.43 s gammaloop-nextest-spenso> 16 │- 0:1:s -> ext4 [id=4 dir=none color="red" label="mink4|l_1"];
  322. 58.43 s gammaloop-nextest-spenso> 16 │+ 0:2:s -> ext4 [id=4 dir=none color="red" label="mink4|l_4"];
  323. 58.43 s gammaloop-nextest-spenso> 17 17 │ ext5 [style=invis];
  324. 58.43 s gammaloop-nextest-spenso> 18 │- 0:2:s -> ext5 [id=5 dir=none color="red" label="mink4|l_4"];
  325. 58.43 s gammaloop-nextest-spenso> 18 │+ 0:4:s -> ext5 [id=5 dir=none color="red" label="bis4|l_3"];
  326. 58.43 s gammaloop-nextest-spenso> 19 19 │ }
  327. 58.43 s gammaloop-nextest-spenso> ────────────┴───────────────────────────────────────────────────────────────────
  328. 58.43 s gammaloop-nextest-spenso> To update snapshots run `cargo insta review`
  329. 58.43 s gammaloop-nextest-spenso> Stopped on the first failure. Run `cargo insta test` to run all snapshots.
  330. 58.43 s gammaloop-nextest-spenso> test tensor::tests::parsing::infinite_execution ... FAILED
  331. 58.43 s gammaloop-nextest-spenso>
  332. 58.43 s gammaloop-nextest-spenso> failures:
  333. 58.43 s gammaloop-nextest-spenso>
  334. 58.43 s gammaloop-nextest-spenso> failures:
  335. 58.43 s gammaloop-nextest-spenso> tensor::tests::parsing::infinite_execution
  336. 58.43 s gammaloop-nextest-spenso>
  337. 58.43 s gammaloop-nextest-spenso> test result: FAILED. 0 passed; 1 failed; 0 ignored; 0 measured; 248 filtered out; finished in 0.06s
  338. 58.43 s gammaloop-nextest-spenso>
  339. 58.43 s gammaloop-nextest-spenso> stderr ---
  340. 58.43 s gammaloop-nextest-spenso>
  341. 58.43 s gammaloop-nextest-spenso> thread 'tensor::tests::parsing::infinite_execution' (849) panicked at /nix/store/g4vv637bgwmy4qf4lv8w7s6sghivpa09-vendor-cargo-deps/c19b7c6f923b580ac259164a89f2577984ad5ab09ee9d583b888f934adbbe8d0/insta-1.47.2/src/runtime.rs:719:13:
  342. 58.43 s gammaloop-nextest-spenso> snapshot assertion for 'infinite_execution' failed in line 905
  343. 58.43 s gammaloop-nextest-spenso> stack backtrace:
  344. 58.43 s gammaloop-nextest-spenso> 0: __rustc::rust_begin_unwind
  345. 58.43 s gammaloop-nextest-spenso> 1: core::panicking::panic_fmt
  346. 58.43 s gammaloop-nextest-spenso> 2: insta::runtime::assert_snapshot
  347. 58.43 s gammaloop-nextest-spenso> 3: idenso::tensor::tests::parsing::infinite_execution
  348. 58.43 s gammaloop-nextest-spenso> 4: <idenso::tensor::tests::parsing::infinite_execution::{closure#0} as core::ops::function::FnOnce<()>>::call_once
  349. 58.43 s gammaloop-nextest-spenso> note: Some details are omitted, run with `RUST_BACKTRACE=full` for a verbose backtrace.
  350. 58.43 s gammaloop-nextest-spenso>
  351. 59.95 s gammaloop-nextest-spenso> ------------
  352. 59.95 s gammaloop-nextest-spenso> Summary [ 2.088s] 232 tests run: 227 passed, 5 failed, 26 skipped
  353. 59.95 s gammaloop-nextest-spenso> FAIL [ 0.019s] ( 91/232) idenso dirac::test::feyncalc_reference::dirac_simplify_id40_repeated_gamma_and_two_trace
  354. 59.95 s gammaloop-nextest-spenso> stdout ---
  355. 59.95 s gammaloop-nextest-spenso>
  356. 59.95 s gammaloop-nextest-spenso> running 1 test
  357. 59.95 s gammaloop-nextest-spenso> test dirac::test::feyncalc_reference::dirac_simplify_id40_repeated_gamma_and_two_trace ... FAILED
  358. 59.95 s gammaloop-nextest-spenso>
  359. 59.95 s gammaloop-nextest-spenso> failures:
  360. 59.95 s gammaloop-nextest-spenso>
  361. 59.95 s gammaloop-nextest-spenso> failures:
  362. 59.95 s gammaloop-nextest-spenso> dirac::test::feyncalc_reference::dirac_simplify_id40_repeated_gamma_and_two_trace
  363. 59.95 s gammaloop-nextest-spenso>
  364. 59.95 s gammaloop-nextest-spenso> test result: FAILED. 0 passed; 1 failed; 0 ignored; 0 measured; 248 filtered out; finished in 0.01s
  365. 59.95 s gammaloop-nextest-spenso>
  366. 59.95 s gammaloop-nextest-spenso> stderr ---
  367. 59.95 s gammaloop-nextest-spenso>
  368. 59.95 s gammaloop-nextest-spenso> thread 'dirac::test::feyncalc_reference::dirac_simplify_id40_repeated_gamma_and_two_trace' (491) panicked at crates/idenso/src/dirac/mod.rs:360:5:
  369. 59.95 s gammaloop-nextest-spenso> gamma third argument must be a Minkowski slot
  370. 59.95 s gammaloop-nextest-spenso> stack backtrace:
  371. 59.95 s gammaloop-nextest-spenso> 0: __rustc::rust_begin_unwind
  372. 59.95 s gammaloop-nextest-spenso> 1: core::panicking::panic_fmt
  373. 59.95 s gammaloop-nextest-spenso> 2: idenso::dirac::require_gamma_port
  374. 59.95 s gammaloop-nextest-spenso> 3: idenso::dirac::gamma_tensor
  375. 59.95 s gammaloop-nextest-spenso> 4: idenso::dirac::test::feyncalc_reference::dirac_simplify_id40_repeated_gamma_and_two_trace
  376. 59.95 s gammaloop-nextest-spenso> 5: <idenso::dirac::test::feyncalc_reference::dirac_simplify_id40_repeated_gamma_and_two_trace::{closure#0} as core::ops::function::FnOnce<()>>::call_once
  377. 59.95 s gammaloop-nextest-spenso> note: Some details are omitted, run with `RUST_BACKTRACE=full` for a verbose backtrace.
  378. 59.95 s gammaloop-nextest-spenso>
  379. 59.95 s gammaloop-nextest-spenso> FAIL [ 0.022s] ( 92/232) idenso dirac::test::feyncalc_reference::dirac_simplify_id46_d_dim_repeated_gamma_slash_sum
  380. 59.95 s gammaloop-nextest-spenso> stdout ---
  381. 59.95 s gammaloop-nextest-spenso>
  382. 59.95 s gammaloop-nextest-spenso> running 1 test
  383. 59.95 s gammaloop-nextest-spenso> test dirac::test::feyncalc_reference::dirac_simplify_id46_d_dim_repeated_gamma_slash_sum ... FAILED
  384. 59.95 s gammaloop-nextest-spenso>
  385. 59.95 s gammaloop-nextest-spenso> failures:
  386. 59.95 s gammaloop-nextest-spenso>
  387. 59.95 s gammaloop-nextest-spenso> failures:
  388. 59.95 s gammaloop-nextest-spenso> dirac::test::feyncalc_reference::dirac_simplify_id46_d_dim_repeated_gamma_slash_sum
  389. 59.95 s gammaloop-nextest-spenso>
  390. 59.95 s gammaloop-nextest-spenso> test result: FAILED. 0 passed; 1 failed; 0 ignored; 0 measured; 248 filtered out; finished in 0.00s
  391. 59.95 s gammaloop-nextest-spenso>
  392. 59.95 s gammaloop-nextest-spenso> stderr ---
  393. 59.95 s gammaloop-nextest-spenso>
  394. 59.95 s gammaloop-nextest-spenso> thread 'dirac::test::feyncalc_reference::dirac_simplify_id46_d_dim_repeated_gamma_slash_sum' (504) panicked at crates/idenso/src/dirac/mod.rs:360:5:
  395. 59.95 s gammaloop-nextest-spenso> gamma third argument must be a Minkowski slot
  396. 59.95 s gammaloop-nextest-spenso> stack backtrace:
  397. 59.95 s gammaloop-nextest-spenso> 0: __rustc::rust_begin_unwind
  398. 59.95 s gammaloop-nextest-spenso> 1: core::panicking::panic_fmt
  399. 59.95 s gammaloop-nextest-spenso> 2: idenso::dirac::require_gamma_port
  400. 59.95 s gammaloop-nextest-spenso> 3: idenso::dirac::gamma_tensor
  401. 59.95 s gammaloop-nextest-spenso> 4: idenso::dirac::test::feyncalc_reference::dirac_simplify_id46_d_dim_repeated_gamma_slash_sum
  402. 59.95 s gammaloop-nextest-spenso> 5: <idenso::dirac::test::feyncalc_reference::dirac_simplify_id46_d_dim_repeated_gamma_slash_sum::{closure#0} as core::ops::function::FnOnce<()>>::call_once
  403. 59.95 s gammaloop-nextest-spenso> note: Some details are omitted, run with `RUST_BACKTRACE=full` for a verbose backtrace.
  404. 59.95 s gammaloop-nextest-spenso>
  405. 59.95 s gammaloop-nextest-spenso> FAIL [ 0.028s] ( 94/232) idenso dirac::test::feyncalc_reference::dirac_simplify_id4_slash_sandwich
  406. 59.95 s gammaloop-nextest-spenso> stdout ---
  407. 59.95 s gammaloop-nextest-spenso>
  408. 59.95 s gammaloop-nextest-spenso> running 1 test
  409. 59.95 s gammaloop-nextest-spenso> test dirac::test::feyncalc_reference::dirac_simplify_id4_slash_sandwich ... FAILED
  410. 59.95 s gammaloop-nextest-spenso>
  411. 59.95 s gammaloop-nextest-spenso> failures:
  412. 59.95 s gammaloop-nextest-spenso>
  413. 59.95 s gammaloop-nextest-spenso> failures:
  414. 59.95 s gammaloop-nextest-spenso> dirac::test::feyncalc_reference::dirac_simplify_id4_slash_sandwich
  415. 59.95 s gammaloop-nextest-spenso>
  416. 59.95 s gammaloop-nextest-spenso> test result: FAILED. 0 passed; 1 failed; 0 ignored; 0 measured; 248 filtered out; finished in 0.01s
  417. 59.95 s gammaloop-nextest-spenso>
  418. 59.95 s gammaloop-nextest-spenso> stderr ---
  419. 59.95 s gammaloop-nextest-spenso>
  420. 59.95 s gammaloop-nextest-spenso> thread 'dirac::test::feyncalc_reference::dirac_simplify_id4_slash_sandwich' (511) panicked at crates/idenso/src/dirac/mod.rs:360:5:
  421. 59.95 s gammaloop-nextest-spenso> gamma third argument must be a Minkowski slot
  422. 59.95 s gammaloop-nextest-spenso> stack backtrace:
  423. 59.95 s gammaloop-nextest-spenso> 0: __rustc::rust_begin_unwind
  424. 59.95 s gammaloop-nextest-spenso> 1: core::panicking::panic_fmt
  425. 59.95 s gammaloop-nextest-spenso> 2: idenso::dirac::require_gamma_port
  426. 59.95 s gammaloop-nextest-spenso> 3: idenso::dirac::gamma_tensor
  427. 59.95 s gammaloop-nextest-spenso> 4: idenso::dirac::test::feyncalc_reference::dirac_simplify_id4_slash_sandwich
  428. 59.95 s gammaloop-nextest-spenso> 5: <idenso::dirac::test::feyncalc_reference::dirac_simplify_id4_slash_sandwich::{closure#0} as core::ops::function::FnOnce<()>>::call_once
  429. 59.95 s gammaloop-nextest-spenso> note: Some details are omitted, run with `RUST_BACKTRACE=full` for a verbose backtrace.
  430. 59.95 s gammaloop-nextest-spenso>
  431. 59.95 s gammaloop-nextest-spenso> FAIL [ 0.025s] (143/232) idenso reference_cases::tests::reference_case_simplification_snapshots
  432. 59.95 s gammaloop-nextest-spenso> stdout ---
  433. 59.95 s gammaloop-nextest-spenso>
  434. 59.95 s gammaloop-nextest-spenso> running 1 test
  435. 59.95 s gammaloop-nextest-spenso> test reference_cases::tests::reference_case_simplification_snapshots ... FAILED
  436. 59.95 s gammaloop-nextest-spenso>
  437. 59.95 s gammaloop-nextest-spenso> failures:
  438. 59.95 s gammaloop-nextest-spenso>
  439. 59.95 s gammaloop-nextest-spenso> failures:
  440. 59.95 s gammaloop-nextest-spenso> reference_cases::tests::reference_case_simplification_snapshots
  441. 59.95 s gammaloop-nextest-spenso>
  442. 59.95 s gammaloop-nextest-spenso> test result: FAILED. 0 passed; 1 failed; 0 ignored; 0 measured; 248 filtered out; finished in 0.01s
  443. 59.95 s gammaloop-nextest-spenso>
  444. 59.95 s gammaloop-nextest-spenso> stderr ---
  445. 59.95 s gammaloop-nextest-spenso>
  446. 59.95 s gammaloop-nextest-spenso> thread 'reference_cases::tests::reference_case_simplification_snapshots' (684) panicked at crates/idenso/src/dirac/mod.rs:360:5:
  447. 59.95 s gammaloop-nextest-spenso> gamma third argument must be a Minkowski slot
  448. 59.95 s gammaloop-nextest-spenso> stack backtrace:
  449. 59.95 s gammaloop-nextest-spenso> 0: __rustc::rust_begin_unwind
  450. 59.95 s gammaloop-nextest-spenso> 1: core::panicking::panic_fmt
  451. 59.95 s gammaloop-nextest-spenso> 2: idenso::dirac::require_gamma_port
  452. 59.95 s gammaloop-nextest-spenso> 3: idenso::dirac::gamma_tensor
  453. 59.95 s gammaloop-nextest-spenso> 4: idenso::reference_cases::dirac_feyncalc_slash_sandwich_id4
  454. 59.95 s gammaloop-nextest-spenso> 5: <idenso::reference_cases::ReferenceCase>::simplified
  455. 59.95 s gammaloop-nextest-spenso> 6: <core::iter::adapters::map::Map<core::slice::iter::Iter<idenso::reference_cases::ReferenceCase>, idenso::reference_cases::tests::reference_case_simplification_snapshots::{closure#0}> as core::iter::traits::iterator::Iterator>::fold::<(), core::iter::traits::iterator::Iterator::for_each::call<alloc::string::String, <alloc::vec::Vec<alloc::string::String>>::extend_trusted<core::iter::adapters::map::Map<core::slice::iter::Iter<idenso::reference_cases::ReferenceCase>, idenso::reference_cases::tests::reference_case_simplification_snapshots::{closure#0}>>::{closure#0}>::{closure#0}>
  456. 59.95 s gammaloop-nextest-spenso> 7: <alloc::vec::Vec<alloc::string::String> as alloc::vec::spec_from_iter_nested::SpecFromIterNested<alloc::string::String, core::iter::adapters::map::Map<core::slice::iter::Iter<idenso::reference_cases::ReferenceCase>, idenso::reference_cases::tests::reference_case_simplification_snapshots::{closure#0}>>>::from_iter
  457. 59.95 s gammaloop-nextest-spenso> 8: idenso::reference_cases::tests::reference_case_simplification_snapshots
  458. 59.95 s gammaloop-nextest-spenso> 9: <idenso::reference_cases::tests::reference_case_simplification_snapshots::{closure#0} as core::ops::function::FnOnce<()>>::call_once
  459. 59.95 s gammaloop-nextest-spenso> note: Some details are omitted, run with `RUST_BACKTRACE=full` for a verbose backtrace.
  460. 59.95 s gammaloop-nextest-spenso>
  461. 59.95 s gammaloop-nextest-spenso> FAIL [ 0.076s] (228/232) idenso tensor::tests::parsing::infinite_execution
  462. 59.95 s gammaloop-nextest-spenso> stdout ---
  463. 59.95 s gammaloop-nextest-spenso>
  464. 59.95 s gammaloop-nextest-spenso> running 1 test
  465. 59.95 s gammaloop-nextest-spenso> ━━━━━━━━━━━━━━━━━━━━━━━━━━━━━━━ Snapshot Summary ━━━━━━━━━━━━━━━━━━━━━━━━━━━━━━━
  466. 59.95 s gammaloop-nextest-spenso> Snapshot: infinite_execution
  467. 59.95 s gammaloop-nextest-spenso> Source: crates/idenso/src/tensor/tests/parsing.rs:905
  468. 59.95 s gammaloop-nextest-spenso> ────────────────────────────────────────────────────────────────────────────────
  469. 59.95 s gammaloop-nextest-spenso> Expression: net_iter.snapshot_dot()
  470. 59.95 s gammaloop-nextest-spenso> ────────────────────────────────────────────────────────────────────────────────
  471. 59.95 s gammaloop-nextest-spenso> -old snapshot
  472. 59.95 s gammaloop-nextest-spenso> +new results
  473. 59.95 s gammaloop-nextest-spenso> ────────────┬───────────────────────────────────────────────────────────────────
  474. 59.95 s gammaloop-nextest-spenso> 8 8 │ 0:0:s -> ext0 [id=0 color="red"];
  475. 59.95 s gammaloop-nextest-spenso> 9 9 │ ext1 [style=invis];
  476. 59.95 s gammaloop-nextest-spenso> 10 10 │ 0:5:s -> ext1 [id=1 dir=none color="red" label="mink4|l_0"];
  477. 59.95 s gammaloop-nextest-spenso> 11 11 │ ext2 [style=invis];
  478. 59.95 s gammaloop-nextest-spenso> 12 │- 0:4:s -> ext2 [id=2 dir=none color="red" label="bis4|l_2"];
  479. 59.95 s gammaloop-nextest-spenso> 12 │+ 0:3:s -> ext2 [id=2 dir=none color="red" label="mink4|l_1"];
  480. 59.95 s gammaloop-nextest-spenso> 13 13 │ ext3 [style=invis];
  481. 59.95 s gammaloop-nextest-spenso> 14 │- 0:3:s -> ext3 [id=3 dir=none color="red" label="bis4|l_3"];
  482. 59.95 s gammaloop-nextest-spenso> 14 │+ 0:1:s -> ext3 [id=3 dir=none color="red" label="bis4|l_2"];
  483. 59.95 s gammaloop-nextest-spenso> 15 15 │ ext4 [style=invis];
  484. 59.95 s gammaloop-nextest-spenso> 16 │- 0:1:s -> ext4 [id=4 dir=none color="red" label="mink4|l_1"];
  485. 59.95 s gammaloop-nextest-spenso> 16 │+ 0:2:s -> ext4 [id=4 dir=none color="red" label="mink4|l_4"];
  486. 59.95 s gammaloop-nextest-spenso> 17 17 │ ext5 [style=invis];
  487. 59.95 s gammaloop-nextest-spenso> 18 │- 0:2:s -> ext5 [id=5 dir=none color="red" label="mink4|l_4"];
  488. 59.95 s gammaloop-nextest-spenso> 18 │+ 0:4:s -> ext5 [id=5 dir=none color="red" label="bis4|l_3"];
  489. 59.95 s gammaloop-nextest-spenso> 19 19 │ }
  490. 59.95 s gammaloop-nextest-spenso> ────────────┴───────────────────────────────────────────────────────────────────
  491. 59.95 s gammaloop-nextest-spenso> To update snapshots run `cargo insta review`
  492. 59.95 s gammaloop-nextest-spenso> Stopped on the first failure. Run `cargo insta test` to run all snapshots.
  493. 59.95 s gammaloop-nextest-spenso> test tensor::tests::parsing::infinite_execution ... FAILED
  494. 59.95 s gammaloop-nextest-spenso>
  495. 59.95 s gammaloop-nextest-spenso> failures:
  496. 59.95 s gammaloop-nextest-spenso>
  497. 59.95 s gammaloop-nextest-spenso> failures:
  498. 59.95 s gammaloop-nextest-spenso> tensor::tests::parsing::infinite_execution
  499. 59.95 s gammaloop-nextest-spenso>
  500. 59.95 s gammaloop-nextest-spenso> test result: FAILED. 0 passed; 1 failed; 0 ignored; 0 measured; 248 filtered out; finished in 0.06s
  501. 59.95 s gammaloop-nextest-spenso>
  502. 59.95 s gammaloop-nextest-spenso> stderr ---
  503. 59.95 s gammaloop-nextest-spenso>
  504. 59.95 s gammaloop-nextest-spenso> thread 'tensor::tests::parsing::infinite_execution' (849) panicked at /nix/store/g4vv637bgwmy4qf4lv8w7s6sghivpa09-vendor-cargo-deps/c19b7c6f923b580ac259164a89f2577984ad5ab09ee9d583b888f934adbbe8d0/insta-1.47.2/src/runtime.rs:719:13:
  505. 59.95 s gammaloop-nextest-spenso> snapshot assertion for 'infinite_execution' failed in line 905
  506. 59.95 s gammaloop-nextest-spenso> stack backtrace:
  507. 59.95 s gammaloop-nextest-spenso> 0: __rustc::rust_begin_unwind
  508. 59.95 s gammaloop-nextest-spenso> 1: core::panicking::panic_fmt
  509. 59.95 s gammaloop-nextest-spenso> 2: insta::runtime::assert_snapshot
  510. 59.95 s gammaloop-nextest-spenso> 3: idenso::tensor::tests::parsing::infinite_execution
  511. 59.95 s gammaloop-nextest-spenso> 4: <idenso::tensor::tests::parsing::infinite_execution::{closure#0} as core::ops::function::FnOnce<()>>::call_once
  512. 59.95 s gammaloop-nextest-spenso> note: Some details are omitted, run with `RUST_BACKTRACE=full` for a verbose backtrace.
  513. 59.95 s gammaloop-nextest-spenso>
  514. 59.98 s gammaloop-nextest-spenso> error: test run failed
  515. 60.01 s gammaloop-nextest-spenso>
  516. 60.01 s gammaloop-nextest-spenso> ========== nextest test summary ==========
  517. 60.01 s gammaloop-nextest-spenso> report: target/nextest/ci_gammaloop/junit.xml
  518. 60.01 s gammaloop-nextest-spenso> tests: 232, failures: 5, errors: 0
  519. 60.01 s gammaloop-nextest-spenso>
  520. 60.01 s gammaloop-nextest-spenso> 1. idenso::dirac::test::feyncalc_reference::dirac_simplify_id40_repeated_gamma_and_two_trace
  521. 60.01 s gammaloop-nextest-spenso> failure: test failure with exit code 101
  522. 60.01 s gammaloop-nextest-spenso> thread 'dirac::test::feyncalc_reference::dirac_simplify_id40_repeated_gamma_and_two_trace' (491) panicked at crates/idenso/src/dirac/mod.rs:360:5:
  523. 60.01 s gammaloop-nextest-spenso> gamma third argument must be a Minkowski slot
  524. 60.01 s gammaloop-nextest-spenso> stack backtrace:
  525. 60.01 s gammaloop-nextest-spenso> 0: __rustc::rust_begin_unwind
  526. 60.01 s gammaloop-nextest-spenso> 1: core::panicking::panic_fmt
  527. 60.01 s gammaloop-nextest-spenso> 2: idenso::dirac::require_gamma_port
  528. 60.01 s gammaloop-nextest-spenso> 3: idenso::dirac::gamma_tensor
  529. 60.01 s gammaloop-nextest-spenso> 4: idenso::dirac::test::feyncalc_reference::dirac_simplify_id40_repeated_gamma_and_two_trace
  530. 60.01 s gammaloop-nextest-spenso> 5: <idenso::dirac::test::feyncalc_reference::dirac_simplify_id40_repeated_gamma_and_two_trace::{closure#0} as core::ops::function::FnOnce<()>>::call_once
  531. 60.01 s gammaloop-nextest-spenso> note: Some details are omitted, run with `RUST_BACKTRACE=full` for a verbose backtrace.
  532. 60.01 s gammaloop-nextest-spenso> system-out
  533. 60.01 s gammaloop-nextest-spenso> running 1 test
  534. 60.01 s gammaloop-nextest-spenso> test dirac::test::feyncalc_reference::dirac_simplify_id40_repeated_gamma_and_two_trace ... FAILED
  535. 60.01 s gammaloop-nextest-spenso>
  536. 60.01 s gammaloop-nextest-spenso> failures:
  537. 60.01 s gammaloop-nextest-spenso>
  538. 60.01 s gammaloop-nextest-spenso> failures:
  539. 60.01 s gammaloop-nextest-spenso> dirac::test::feyncalc_reference::dirac_simplify_id40_repeated_gamma_and_two_trace
  540. 60.01 s gammaloop-nextest-spenso>
  541. 60.01 s gammaloop-nextest-spenso> test result: FAILED. 0 passed; 1 failed; 0 ignored; 0 measured; 248 filtered out; finished in 0.01s
  542. 60.01 s gammaloop-nextest-spenso> system-err
  543. 60.01 s gammaloop-nextest-spenso> thread 'dirac::test::feyncalc_reference::dirac_simplify_id40_repeated_gamma_and_two_trace' (491) panicked at crates/idenso/src/dirac/mod.rs:360:5:
  544. 60.01 s gammaloop-nextest-spenso> gamma third argument must be a Minkowski slot
  545. 60.01 s gammaloop-nextest-spenso> stack backtrace:
  546. 60.01 s gammaloop-nextest-spenso> 0: __rustc::rust_begin_unwind
  547. 60.01 s gammaloop-nextest-spenso> 1: core::panicking::panic_fmt
  548. 60.01 s gammaloop-nextest-spenso> 2: idenso::dirac::require_gamma_port
  549. 60.01 s gammaloop-nextest-spenso> 3: idenso::dirac::gamma_tensor
  550. 60.01 s gammaloop-nextest-spenso> 4: idenso::dirac::test::feyncalc_reference::dirac_simplify_id40_repeated_gamma_and_two_trace
  551. 60.01 s gammaloop-nextest-spenso> 5: <idenso::dirac::test::feyncalc_reference::dirac_simplify_id40_repeated_gamma_and_two_trace::{closure#0} as core::ops::function::FnOnce<()>>::call_once
  552. 60.01 s gammaloop-nextest-spenso> note: Some details are omitted, run with `RUST_BACKTRACE=full` for a verbose backtrace.
  553. 60.01 s gammaloop-nextest-spenso>
  554. 60.01 s gammaloop-nextest-spenso> 2. idenso::dirac::test::feyncalc_reference::dirac_simplify_id46_d_dim_repeated_gamma_slash_sum
  555. 60.01 s gammaloop-nextest-spenso> failure: test failure with exit code 101
  556. 60.01 s gammaloop-nextest-spenso> thread 'dirac::test::feyncalc_reference::dirac_simplify_id46_d_dim_repeated_gamma_slash_sum' (504) panicked at crates/idenso/src/dirac/mod.rs:360:5:
  557. 60.01 s gammaloop-nextest-spenso> gamma third argument must be a Minkowski slot
  558. 60.01 s gammaloop-nextest-spenso> stack backtrace:
  559. 60.01 s gammaloop-nextest-spenso> 0: __rustc::rust_begin_unwind
  560. 60.01 s gammaloop-nextest-spenso> 1: core::panicking::panic_fmt
  561. 60.01 s gammaloop-nextest-spenso> 2: idenso::dirac::require_gamma_port
  562. 60.01 s gammaloop-nextest-spenso> 3: idenso::dirac::gamma_tensor
  563. 60.01 s gammaloop-nextest-spenso> 4: idenso::dirac::test::feyncalc_reference::dirac_simplify_id46_d_dim_repeated_gamma_slash_sum
  564. 60.01 s gammaloop-nextest-spenso> 5: <idenso::dirac::test::feyncalc_reference::dirac_simplify_id46_d_dim_repeated_gamma_slash_sum::{closure#0} as core::ops::function::FnOnce<()>>::call_once
  565. 60.01 s gammaloop-nextest-spenso> note: Some details are omitted, run with `RUST_BACKTRACE=full` for a verbose backtrace.
  566. 60.01 s gammaloop-nextest-spenso> system-out
  567. 60.01 s gammaloop-nextest-spenso> running 1 test
  568. 60.01 s gammaloop-nextest-spenso> test dirac::test::feyncalc_reference::dirac_simplify_id46_d_dim_repeated_gamma_slash_sum ... FAILED
  569. 60.01 s gammaloop-nextest-spenso>
  570. 60.01 s gammaloop-nextest-spenso> failures:
  571. 60.01 s gammaloop-nextest-spenso>
  572. 60.01 s gammaloop-nextest-spenso> failures:
  573. 60.01 s gammaloop-nextest-spenso> dirac::test::feyncalc_reference::dirac_simplify_id46_d_dim_repeated_gamma_slash_sum
  574. 60.01 s gammaloop-nextest-spenso>
  575. 60.01 s gammaloop-nextest-spenso> test result: FAILED. 0 passed; 1 failed; 0 ignored; 0 measured; 248 filtered out; finished in 0.00s
  576. 60.01 s gammaloop-nextest-spenso> system-err
  577. 60.01 s gammaloop-nextest-spenso> thread 'dirac::test::feyncalc_reference::dirac_simplify_id46_d_dim_repeated_gamma_slash_sum' (504) panicked at crates/idenso/src/dirac/mod.rs:360:5:
  578. 60.01 s gammaloop-nextest-spenso> gamma third argument must be a Minkowski slot
  579. 60.01 s gammaloop-nextest-spenso> stack backtrace:
  580. 60.01 s gammaloop-nextest-spenso> 0: __rustc::rust_begin_unwind
  581. 60.01 s gammaloop-nextest-spenso> 1: core::panicking::panic_fmt
  582. 60.01 s gammaloop-nextest-spenso> 2: idenso::dirac::require_gamma_port
  583. 60.01 s gammaloop-nextest-spenso> 3: idenso::dirac::gamma_tensor
  584. 60.01 s gammaloop-nextest-spenso> 4: idenso::dirac::test::feyncalc_reference::dirac_simplify_id46_d_dim_repeated_gamma_slash_sum
  585. 60.01 s gammaloop-nextest-spenso> 5: <idenso::dirac::test::feyncalc_reference::dirac_simplify_id46_d_dim_repeated_gamma_slash_sum::{closure#0} as core::ops::function::FnOnce<()>>::call_once
  586. 60.01 s gammaloop-nextest-spenso> note: Some details are omitted, run with `RUST_BACKTRACE=full` for a verbose backtrace.
  587. 60.01 s gammaloop-nextest-spenso>
  588. 60.01 s gammaloop-nextest-spenso> 3. idenso::dirac::test::feyncalc_reference::dirac_simplify_id4_slash_sandwich
  589. 60.01 s gammaloop-nextest-spenso> failure: test failure with exit code 101
  590. 60.01 s gammaloop-nextest-spenso> thread 'dirac::test::feyncalc_reference::dirac_simplify_id4_slash_sandwich' (511) panicked at crates/idenso/src/dirac/mod.rs:360:5:
  591. 60.01 s gammaloop-nextest-spenso> gamma third argument must be a Minkowski slot
  592. 60.01 s gammaloop-nextest-spenso> stack backtrace:
  593. 60.01 s gammaloop-nextest-spenso> 0: __rustc::rust_begin_unwind
  594. 60.01 s gammaloop-nextest-spenso> 1: core::panicking::panic_fmt
  595. 60.01 s gammaloop-nextest-spenso> 2: idenso::dirac::require_gamma_port
  596. 60.01 s gammaloop-nextest-spenso> 3: idenso::dirac::gamma_tensor
  597. 60.01 s gammaloop-nextest-spenso> 4: idenso::dirac::test::feyncalc_reference::dirac_simplify_id4_slash_sandwich
  598. 60.01 s gammaloop-nextest-spenso> 5: <idenso::dirac::test::feyncalc_reference::dirac_simplify_id4_slash_sandwich::{closure#0} as core::ops::function::FnOnce<()>>::call_once
  599. 60.01 s gammaloop-nextest-spenso> note: Some details are omitted, run with `RUST_BACKTRACE=full` for a verbose backtrace.
  600. 60.01 s gammaloop-nextest-spenso> system-out
  601. 60.01 s gammaloop-nextest-spenso> running 1 test
  602. 60.01 s gammaloop-nextest-spenso> test dirac::test::feyncalc_reference::dirac_simplify_id4_slash_sandwich ... FAILED
  603. 60.01 s gammaloop-nextest-spenso>
  604. 60.01 s gammaloop-nextest-spenso> failures:
  605. 60.01 s gammaloop-nextest-spenso>
  606. 60.01 s gammaloop-nextest-spenso> failures:
  607. 60.01 s gammaloop-nextest-spenso> dirac::test::feyncalc_reference::dirac_simplify_id4_slash_sandwich
  608. 60.01 s gammaloop-nextest-spenso>
  609. 60.01 s gammaloop-nextest-spenso> test result: FAILED. 0 passed; 1 failed; 0 ignored; 0 measured; 248 filtered out; finished in 0.01s
  610. 60.01 s gammaloop-nextest-spenso> system-err
  611. 60.01 s gammaloop-nextest-spenso> thread 'dirac::test::feyncalc_reference::dirac_simplify_id4_slash_sandwich' (511) panicked at crates/idenso/src/dirac/mod.rs:360:5:
  612. 60.01 s gammaloop-nextest-spenso> gamma third argument must be a Minkowski slot
  613. 60.01 s gammaloop-nextest-spenso> stack backtrace:
  614. 60.01 s gammaloop-nextest-spenso> 0: __rustc::rust_begin_unwind
  615. 60.01 s gammaloop-nextest-spenso> 1: core::panicking::panic_fmt
  616. 60.01 s gammaloop-nextest-spenso> 2: idenso::dirac::require_gamma_port
  617. 60.01 s gammaloop-nextest-spenso> 3: idenso::dirac::gamma_tensor
  618. 60.01 s gammaloop-nextest-spenso> 4: idenso::dirac::test::feyncalc_reference::dirac_simplify_id4_slash_sandwich
  619. 60.01 s gammaloop-nextest-spenso> 5: <idenso::dirac::test::feyncalc_reference::dirac_simplify_id4_slash_sandwich::{closure#0} as core::ops::function::FnOnce<()>>::call_once
  620. 60.01 s gammaloop-nextest-spenso> note: Some details are omitted, run with `RUST_BACKTRACE=full` for a verbose backtrace.
  621. 60.01 s gammaloop-nextest-spenso>
  622. 60.01 s gammaloop-nextest-spenso> 4. idenso::reference_cases::tests::reference_case_simplification_snapshots
  623. 60.01 s gammaloop-nextest-spenso> failure: test failure with exit code 101
  624. 60.01 s gammaloop-nextest-spenso> thread 'reference_cases::tests::reference_case_simplification_snapshots' (684) panicked at crates/idenso/src/dirac/mod.rs:360:5:
  625. 60.01 s gammaloop-nextest-spenso> gamma third argument must be a Minkowski slot
  626. 60.01 s gammaloop-nextest-spenso> stack backtrace:
  627. 60.01 s gammaloop-nextest-spenso> 0: __rustc::rust_begin_unwind
  628. 60.01 s gammaloop-nextest-spenso> 1: core::panicking::panic_fmt
  629. 60.01 s gammaloop-nextest-spenso> 2: idenso::dirac::require_gamma_port
  630. 60.01 s gammaloop-nextest-spenso> 3: idenso::dirac::gamma_tensor
  631. 60.01 s gammaloop-nextest-spenso> 4: idenso::reference_cases::dirac_feyncalc_slash_sandwich_id4
  632. 60.01 s gammaloop-nextest-spenso> 5: <idenso::reference_cases::ReferenceCase>::simplified
  633. 60.01 s gammaloop-nextest-spenso> 6: <core::iter::adapters::map::Map<core::slice::iter::Iter<idenso::reference_cases::ReferenceCase>, idenso::reference_cases::tests::reference_case_simplification_snapshots::{closure#0}> as core::iter::traits::iterator::Iterator>::fold::<(), core::iter::traits::iterator::Iterator::for_each::call<alloc::string::String, <alloc::vec::Vec<alloc::string::String>>::extend_trusted<core::iter::adapters::map::Map<core::slice::iter::Iter<idenso::reference_cases::ReferenceCase>, idenso::reference_cases::tests::reference_case_simplification_snapshots::{closure#0}>>::{closure#0}>::{closure#0}>
  634. 60.01 s gammaloop-nextest-spenso> 7: <alloc::vec::Vec<alloc::string::String> as alloc::vec::spec_from_iter_nested::SpecFromIterNested<alloc::string::String, core::iter::adapters::map::Map<core::slice::iter::Iter<idenso::reference_cases::ReferenceCase>, idenso::reference_cases::tests::reference_case_simplification_snapshots::{closure#0}>>>::from_iter
  635. 60.01 s gammaloop-nextest-spenso> 8: idenso::reference_cases::tests::reference_case_simplification_snapshots
  636. 60.01 s gammaloop-nextest-spenso> 9: <idenso::reference_cases::tests::reference_case_simplification_snapshots::{closure#0} as core::ops::function::FnOnce<()>>::call_once
  637. 60.01 s gammaloop-nextest-spenso> note: Some details are omitted, run with `RUST_BACKTRACE=full` for a verbose backtrace.
  638. 60.01 s gammaloop-nextest-spenso> system-out
  639. 60.01 s gammaloop-nextest-spenso> running 1 test
  640. 60.01 s gammaloop-nextest-spenso> test reference_cases::tests::reference_case_simplification_snapshots ... FAILED
  641. 60.01 s gammaloop-nextest-spenso>
  642. 60.01 s gammaloop-nextest-spenso> failures:
  643. 60.01 s gammaloop-nextest-spenso>
  644. 60.01 s gammaloop-nextest-spenso> failures:
  645. 60.01 s gammaloop-nextest-spenso> reference_cases::tests::reference_case_simplification_snapshots
  646. 60.01 s gammaloop-nextest-spenso>
  647. 60.01 s gammaloop-nextest-spenso> test result: FAILED. 0 passed; 1 failed; 0 ignored; 0 measured; 248 filtered out; finished in 0.01s
  648. 60.01 s gammaloop-nextest-spenso> system-err
  649. 60.01 s gammaloop-nextest-spenso> thread 'reference_cases::tests::reference_case_simplification_snapshots' (684) panicked at crates/idenso/src/dirac/mod.rs:360:5:
  650. 60.01 s gammaloop-nextest-spenso> gamma third argument must be a Minkowski slot
  651. 60.01 s gammaloop-nextest-spenso> stack backtrace:
  652. 60.01 s gammaloop-nextest-spenso> 0: __rustc::rust_begin_unwind
  653. 60.01 s gammaloop-nextest-spenso> 1: core::panicking::panic_fmt
  654. 60.01 s gammaloop-nextest-spenso> 2: idenso::dirac::require_gamma_port
  655. 60.01 s gammaloop-nextest-spenso> 3: idenso::dirac::gamma_tensor
  656. 60.01 s gammaloop-nextest-spenso> 4: idenso::reference_cases::dirac_feyncalc_slash_sandwich_id4
  657. 60.01 s gammaloop-nextest-spenso> 5: <idenso::reference_cases::ReferenceCase>::simplified
  658. 60.01 s gammaloop-nextest-spenso> 6: <core::iter::adapters::map::Map<core::slice::iter::Iter<idenso::reference_cases::ReferenceCase>, idenso::reference_cases::tests::reference_case_simplification_snapshots::{closure#0}> as core::iter::traits::iterator::Iterator>::fold::<(), core::iter::traits::iterator::Iterator::for_each::call<alloc::string::String, <alloc::vec::Vec<alloc::string::String>>::extend_trusted<core::iter::adapters::map::Map<core::slice::iter::Iter<idenso::reference_cases::ReferenceCase>, idenso::reference_cases::tests::reference_case_simplification_snapshots::{closure#0}>>::{closure#0}>::{closure#0}>
  659. 60.01 s gammaloop-nextest-spenso> 7: <alloc::vec::Vec<alloc::string::String> as alloc::vec::spec_from_iter_nested::SpecFromIterNested<alloc::string::String, core::iter::adapters::map::Map<core::slice::iter::Iter<idenso::reference_cases::ReferenceCase>, idenso::reference_cases::tests::reference_case_simplification_snapshots::{closure#0}>>>::from_iter
  660. 60.01 s gammaloop-nextest-spenso> 8: idenso::reference_cases::tests::reference_case_simplification_snapshots
  661. 60.01 s gammaloop-nextest-spenso> 9: <idenso::reference_cases::tests::reference_case_simplification_snapshots::{closure#0} as core::ops::function::FnOnce<()>>::call_once
  662. 60.01 s gammaloop-nextest-spenso> note: Some details are omitted, run with `RUST_BACKTRACE=full` for a verbose backtrace.
  663. 60.01 s gammaloop-nextest-spenso>
  664. 60.01 s gammaloop-nextest-spenso> 5. idenso::tensor::tests::parsing::infinite_execution
  665. 60.01 s gammaloop-nextest-spenso> failure: test failure with exit code 101
  666. 60.01 s gammaloop-nextest-spenso> thread 'tensor::tests::parsing::infinite_execution' (849) panicked at /nix/store/g4vv637bgwmy4qf4lv8w7s6sghivpa09-vendor-cargo-deps/c19b7c6f923b580ac259164a89f2577984ad5ab09ee9d583b888f934adbbe8d0/insta-1.47.2/src/runtime.rs:719:13:
  667. 60.01 s gammaloop-nextest-spenso> snapshot assertion for 'infinite_execution' failed in line 905
  668. 60.01 s gammaloop-nextest-spenso> stack backtrace:
  669. 60.01 s gammaloop-nextest-spenso> 0: __rustc::rust_begin_unwind
  670. 60.01 s gammaloop-nextest-spenso> 1: core::panicking::panic_fmt
  671. 60.01 s gammaloop-nextest-spenso> 2: insta::runtime::assert_snapshot
  672. 60.01 s gammaloop-nextest-spenso> 3: idenso::tensor::tests::parsing::infinite_execution
  673. 60.01 s gammaloop-nextest-spenso> 4: <idenso::tensor::tests::parsing::infinite_execution::{closure#0} as core::ops::function::FnOnce<()>>::call_once
  674. 60.01 s gammaloop-nextest-spenso> note: Some details are omitted, run with `RUST_BACKTRACE=full` for a verbose backtrace.
  675. 60.01 s gammaloop-nextest-spenso> system-out
  676. 60.01 s gammaloop-nextest-spenso> running 1 test
  677. 60.01 s gammaloop-nextest-spenso> ━━━━━━━━━━━━━━━━━━━━━━━━━━━━━━━ Snapshot Summary ━━━━━━━━━━━━━━━━━━━━━━━━━━━━━━━
  678. 60.01 s gammaloop-nextest-spenso> Snapshot: infinite_execution
  679. 60.01 s gammaloop-nextest-spenso> Source: crates/idenso/src/tensor/tests/parsing.rs:905
  680. 60.01 s gammaloop-nextest-spenso> ────────────────────────────────────────────────────────────────────────────────
  681. 60.01 s gammaloop-nextest-spenso> Expression: net_iter.snapshot_dot()
  682. 60.01 s gammaloop-nextest-spenso> ────────────────────────────────────────────────────────────────────────────────
  683. 60.01 s gammaloop-nextest-spenso> -old snapshot
  684. 60.01 s gammaloop-nextest-spenso> +new results
  685. 60.01 s gammaloop-nextest-spenso> ────────────┬───────────────────────────────────────────────────────────────────
  686. 60.01 s gammaloop-nextest-spenso> 8 8 │ 0:0:s-> ext0 [id=0 color="red"];
  687. 60.01 s gammaloop-nextest-spenso> 9 9 │ ext1 [style=invis];
  688. 60.01 s gammaloop-nextest-spenso> 10 10 │ 0:5:s-> ext1 [id=1 dir=none color="red" label="mink4|l_0"];
  689. 60.01 s gammaloop-nextest-spenso> 11 11 │ ext2 [style=invis];
  690. 60.01 s gammaloop-nextest-spenso> 12 │- 0:4:s-> ext2 [id=2 dir=none color="red" label="bis4|l_2"];
  691. 60.01 s gammaloop-nextest-spenso> 12 │+ 0:3:s-> ext2 [id=2 dir=none color="red" label="mink4|l_1"];
  692. 60.01 s gammaloop-nextest-spenso> 13 13 │ ext3 [style=invis];
  693. 60.01 s gammaloop-nextest-spenso> 14 │- 0:3:s-> ext3 [id=3 dir=none color="red" label="bis4|l_3"];
  694. 60.01 s gammaloop-nextest-spenso> 14 │+ 0:1:s-> ext3 [id=3 dir=none color="red" label="bis4|l_2"];
  695. 60.01 s gammaloop-nextest-spenso> 15 15 │ ext4 [style=invis];
  696. 60.01 s gammaloop-nextest-spenso> 16 │- 0:1:s-> ext4 [id=4 dir=none color="red" label="mink4|l_1"];
  697. 60.01 s gammaloop-nextest-spenso> 16 │+ 0:2:s-> ext4 [id=4 dir=none color="red" label="mink4|l_4"];
  698. 60.01 s gammaloop-nextest-spenso> 17 17 │ ext5 [style=invis];
  699. 60.01 s gammaloop-nextest-spenso> 18 │- 0:2:s-> ext5 [id=5 dir=none color="red" label="mink4|l_4"];
  700. 60.01 s gammaloop-nextest-spenso> 18 │+ 0:4:s-> ext5 [id=5 dir=none color="red" label="bis4|l_3"];
  701. 60.01 s gammaloop-nextest-spenso> 19 19 │ }
  702. 60.01 s gammaloop-nextest-spenso> ────────────┴───────────────────────────────────────────────────────────────────
  703. 60.01 s gammaloop-nextest-spenso> To update snapshots run `cargo insta review`
  704. 60.01 s gammaloop-nextest-spenso> Stopped on the first failure. Run `cargo insta test` to run all snapshots.
  705. 60.01 s gammaloop-nextest-spenso> test tensor::tests::parsing::infinite_execution ... FAILED
  706. 60.01 s gammaloop-nextest-spenso>
  707. 60.01 s gammaloop-nextest-spenso> failures:
  708. 60.01 s gammaloop-nextest-spenso>
  709. 60.01 s gammaloop-nextest-spenso> failures:
  710. 60.01 s gammaloop-nextest-spenso> tensor::tests::parsing::infinite_execution
  711. 60.01 s gammaloop-nextest-spenso>
  712. 60.01 s gammaloop-nextest-spenso> test result: FAILED. 0 passed; 1 failed; 0 ignored; 0 measured; 248 filtered out; finished in 0.06s
  713. 60.01 s gammaloop-nextest-spenso> system-err
  714. 60.01 s gammaloop-nextest-spenso> thread 'tensor::tests::parsing::infinite_execution' (849) panicked at /nix/store/g4vv637bgwmy4qf4lv8w7s6sghivpa09-vendor-cargo-deps/c19b7c6f923b580ac259164a89f2577984ad5ab09ee9d583b888f934adbbe8d0/insta-1.47.2/src/runtime.rs:719:13:
  715. 60.01 s gammaloop-nextest-spenso> snapshot assertion for 'infinite_execution' failed in line 905
  716. 60.01 s gammaloop-nextest-spenso> stack backtrace:
  717. 60.01 s gammaloop-nextest-spenso> 0: __rustc::rust_begin_unwind
  718. 60.01 s gammaloop-nextest-spenso> 1: core::panicking::panic_fmt
  719. 60.01 s gammaloop-nextest-spenso> 2: insta::runtime::assert_snapshot
  720. 60.01 s gammaloop-nextest-spenso> 3: idenso::tensor::tests::parsing::infinite_execution
  721. 60.01 s gammaloop-nextest-spenso> 4: <idenso::tensor::tests::parsing::infinite_execution::{closure#0} as core::ops::function::FnOnce<()>>::call_once
  722. 60.01 s gammaloop-nextest-spenso> note: Some details are omitted, run with `RUST_BACKTRACE=full` for a verbose backtrace.
  723. 60.01 s gammaloop-nextest-spenso> =========================================
  724. 60.02 s gammaloop-nextest-spenso> Extracting 2 binaries and 1 linked path to /build/nextest-archive-z2TOkC
  725. 60.11 s gammaloop-nextest-spenso> Extracted 8 files to /build/nextest-archive-z2TOkC in 0.09s
  726. 60.12 s gammaloop-nextest-spenso> ------------
  727. 60.12 s gammaloop-nextest-spenso> Nextest run ID 89549e82-ad79-49f8-bb26-a301b45ede72 with nextest profile: ci_gammaloop
  728. 60.12 s gammaloop-nextest-spenso> Starting 195 tests across 2 binaries
  729. 60.23 s gammaloop-nextest-spenso> ------------
  730. 60.23 s gammaloop-nextest-spenso> Summary [ 0.111s] 195 tests run: 195 passed, 0 skipped
  731. 60.28 s gammaloop-nextest-spenso>
  732. 60.28 s gammaloop-nextest-spenso> ========== nextest test summary ==========
  733. 60.28 s gammaloop-nextest-spenso> report: target/nextest/ci_gammaloop/junit.xml
  734. 60.28 s gammaloop-nextest-spenso> tests: 195, failures: 0, errors: 0
  735. 60.28 s gammaloop-nextest-spenso> No failing testcases found.
  736. 60.28 s gammaloop-nextest-spenso> =========================================
  737. 60.29 s gammaloop-nextest-spenso> Extracting 5 binaries and 2 linked paths to /build/nextest-archive-Ru85v4
  738. 60.53 s gammaloop-nextest-spenso> Extracted 19 files to /build/nextest-archive-Ru85v4 in 0.24s
  739. 60.54 s gammaloop-nextest-spenso> ------------
  740. 60.54 s gammaloop-nextest-spenso> Nextest run ID a8cc015b-bdb6-4884-8d59-500b44da45f9 with nextest profile: ci_gammaloop
  741. 60.54 s gammaloop-nextest-spenso> Starting 27 tests across 5 binaries (1 test skipped via profile.ci_gammaloop.default-filter)
  742. 60.62 s gammaloop-nextest-spenso> FAIL [ 0.056s] (24/27) spenso-hep-lib::idenso_validation enabled_idenso_reference_cases_validate_against_explicit_tensors
  743. 60.62 s gammaloop-nextest-spenso> stdout ---
  744. 60.62 s gammaloop-nextest-spenso>
  745. 60.62 s gammaloop-nextest-spenso> running 1 test
  746. 60.62 s gammaloop-nextest-spenso> test enabled_idenso_reference_cases_validate_against_explicit_tensors ... FAILED
  747. 60.62 s gammaloop-nextest-spenso>
  748. 60.62 s gammaloop-nextest-spenso> failures:
  749. 60.62 s gammaloop-nextest-spenso>
  750. 60.62 s gammaloop-nextest-spenso> failures:
  751. 60.62 s gammaloop-nextest-spenso> enabled_idenso_reference_cases_validate_against_explicit_tensors
  752. 60.62 s gammaloop-nextest-spenso>
  753. 60.62 s gammaloop-nextest-spenso> test result: FAILED. 0 passed; 1 failed; 0 ignored; 0 measured; 14 filtered out; finished in 0.05s
  754. 60.62 s gammaloop-nextest-spenso>
  755. 60.62 s gammaloop-nextest-spenso> stderr ---
  756. 60.62 s gammaloop-nextest-spenso>
  757. 60.62 s gammaloop-nextest-spenso> thread 'enabled_idenso_reference_cases_validate_against_explicit_tensors' (1668) panicked at crates/idenso/src/dirac/mod.rs:360:5:
  758. 60.62 s gammaloop-nextest-spenso> gamma third argument must be a Minkowski slot
  759. 60.62 s gammaloop-nextest-spenso> stack backtrace:
  760. 60.62 s gammaloop-nextest-spenso> 0: __rustc::rust_begin_unwind
  761. 60.62 s gammaloop-nextest-spenso> 1: core::panicking::panic_fmt
  762. 60.62 s gammaloop-nextest-spenso> 2: idenso::dirac::require_gamma_port
  763. 60.62 s gammaloop-nextest-spenso> 3: idenso::dirac::gamma_tensor
  764. 60.62 s gammaloop-nextest-spenso> 4: idenso::reference_cases::dirac_feyncalc_slash_sandwich_id4
  765. 60.62 s gammaloop-nextest-spenso> 5: <idenso_validation::enabled_idenso_reference_cases_validate_against_explicit_tensors::{closure#0} as core::ops::function::FnOnce<()>>::call_once
  766. 60.62 s gammaloop-nextest-spenso> note: Some details are omitted, run with `RUST_BACKTRACE=full` for a verbose backtrace.
  767. 60.62 s gammaloop-nextest-spenso>
  768. 60.66 s gammaloop-nextest-spenso> ------------
  769. 60.66 s gammaloop-nextest-spenso> Summary [ 0.120s] 27 tests run: 26 passed, 1 failed, 1 skipped
  770. 60.66 s gammaloop-nextest-spenso> FAIL [ 0.056s] (24/27) spenso-hep-lib::idenso_validation enabled_idenso_reference_cases_validate_against_explicit_tensors
  771. 60.66 s gammaloop-nextest-spenso> stdout ---
  772. 60.66 s gammaloop-nextest-spenso>
  773. 60.66 s gammaloop-nextest-spenso> running 1 test
  774. 60.66 s gammaloop-nextest-spenso> test enabled_idenso_reference_cases_validate_against_explicit_tensors ... FAILED
  775. 60.66 s gammaloop-nextest-spenso>
  776. 60.66 s gammaloop-nextest-spenso> failures:
  777. 60.66 s gammaloop-nextest-spenso>
  778. 60.66 s gammaloop-nextest-spenso> failures:
  779. 60.66 s gammaloop-nextest-spenso> enabled_idenso_reference_cases_validate_against_explicit_tensors
  780. 60.66 s gammaloop-nextest-spenso>
  781. 60.66 s gammaloop-nextest-spenso> test result: FAILED. 0 passed; 1 failed; 0 ignored; 0 measured; 14 filtered out; finished in 0.05s
  782. 60.66 s gammaloop-nextest-spenso>
  783. 60.66 s gammaloop-nextest-spenso> stderr ---
  784. 60.66 s gammaloop-nextest-spenso>
  785. 60.66 s gammaloop-nextest-spenso> thread 'enabled_idenso_reference_cases_validate_against_explicit_tensors' (1668) panicked at crates/idenso/src/dirac/mod.rs:360:5:
  786. 60.66 s gammaloop-nextest-spenso> gamma third argument must be a Minkowski slot
  787. 60.66 s gammaloop-nextest-spenso> stack backtrace:
  788. 60.66 s gammaloop-nextest-spenso> 0: __rustc::rust_begin_unwind
  789. 60.66 s gammaloop-nextest-spenso> 1: core::panicking::panic_fmt
  790. 60.66 s gammaloop-nextest-spenso> 2: idenso::dirac::require_gamma_port
  791. 60.66 s gammaloop-nextest-spenso> 3: idenso::dirac::gamma_tensor
  792. 60.66 s gammaloop-nextest-spenso> 4: idenso::reference_cases::dirac_feyncalc_slash_sandwich_id4
  793. 60.66 s gammaloop-nextest-spenso> 5: <idenso_validation::enabled_idenso_reference_cases_validate_against_explicit_tensors::{closure#0} as core::ops::function::FnOnce<()>>::call_once
  794. 60.66 s gammaloop-nextest-spenso> note: Some details are omitted, run with `RUST_BACKTRACE=full` for a verbose backtrace.
  795. 60.66 s gammaloop-nextest-spenso>
  796. 60.70 s gammaloop-nextest-spenso> error: test run failed
  797. 60.73 s gammaloop-nextest-spenso>
  798. 60.73 s gammaloop-nextest-spenso> ========== nextest test summary ==========
  799. 60.73 s gammaloop-nextest-spenso> report: target/nextest/ci_gammaloop/junit.xml
  800. 60.73 s gammaloop-nextest-spenso> tests: 27, failures: 1, errors: 0
  801. 60.73 s gammaloop-nextest-spenso>
  802. 60.73 s gammaloop-nextest-spenso> 1. spenso-hep-lib::idenso_validation::enabled_idenso_reference_cases_validate_against_explicit_tensors
  803. 60.73 s gammaloop-nextest-spenso> failure: test failure with exit code 101
  804. 60.73 s gammaloop-nextest-spenso> thread 'enabled_idenso_reference_cases_validate_against_explicit_tensors' (1668) panicked at crates/idenso/src/dirac/mod.rs:360:5:
  805. 60.73 s gammaloop-nextest-spenso> gamma third argument must be a Minkowski slot
  806. 60.73 s gammaloop-nextest-spenso> stack backtrace:
  807. 60.73 s gammaloop-nextest-spenso> 0: __rustc::rust_begin_unwind
  808. 60.73 s gammaloop-nextest-spenso> 1: core::panicking::panic_fmt
  809. 60.73 s gammaloop-nextest-spenso> 2: idenso::dirac::require_gamma_port
  810. 60.73 s gammaloop-nextest-spenso> 3: idenso::dirac::gamma_tensor
  811. 60.73 s gammaloop-nextest-spenso> 4: idenso::reference_cases::dirac_feyncalc_slash_sandwich_id4
  812. 60.73 s gammaloop-nextest-spenso> 5: <idenso_validation::enabled_idenso_reference_cases_validate_against_explicit_tensors::{closure#0} as core::ops::function::FnOnce<()>>::call_once
  813. 60.73 s gammaloop-nextest-spenso> note: Some details are omitted, run with `RUST_BACKTRACE=full` for a verbose backtrace.
  814. 60.73 s gammaloop-nextest-spenso> system-out
  815. 60.73 s gammaloop-nextest-spenso> running 1 test
  816. 60.73 s gammaloop-nextest-spenso> test enabled_idenso_reference_cases_validate_against_explicit_tensors ... FAILED
  817. 60.73 s gammaloop-nextest-spenso>
  818. 60.73 s gammaloop-nextest-spenso> failures:
  819. 60.73 s gammaloop-nextest-spenso>
  820. 60.73 s gammaloop-nextest-spenso> failures:
  821. 60.73 s gammaloop-nextest-spenso> enabled_idenso_reference_cases_validate_against_explicit_tensors
  822. 60.73 s gammaloop-nextest-spenso>
  823. 60.73 s gammaloop-nextest-spenso> test result: FAILED. 0 passed; 1 failed; 0 ignored; 0 measured; 14 filtered out; finished in 0.05s
  824. 60.73 s gammaloop-nextest-spenso> system-err
  825. 60.73 s gammaloop-nextest-spenso> thread 'enabled_idenso_reference_cases_validate_against_explicit_tensors' (1668) panicked at crates/idenso/src/dirac/mod.rs:360:5:
  826. 60.73 s gammaloop-nextest-spenso> gamma third argument must be a Minkowski slot
  827. 60.73 s gammaloop-nextest-spenso> stack backtrace:
  828. 60.73 s gammaloop-nextest-spenso> 0: __rustc::rust_begin_unwind
  829. 60.73 s gammaloop-nextest-spenso> 1: core::panicking::panic_fmt
  830. 60.73 s gammaloop-nextest-spenso> 2: idenso::dirac::require_gamma_port
  831. 60.73 s gammaloop-nextest-spenso> 3: idenso::dirac::gamma_tensor
  832. 60.73 s gammaloop-nextest-spenso> 4: idenso::reference_cases::dirac_feyncalc_slash_sandwich_id4
  833. 60.73 s gammaloop-nextest-spenso> 5: <idenso_validation::enabled_idenso_reference_cases_validate_against_explicit_tensors::{closure#0} as core::ops::function::FnOnce<()>>::call_once
  834. 60.73 s gammaloop-nextest-spenso> note: Some details are omitted, run with `RUST_BACKTRACE=full` for a verbose backtrace.
  835. 60.73 s gammaloop-nextest-spenso> =========================================
  836. 60.74 s gammaloop-nextest-spenso> Extracting 2 binaries and 1 linked path to /build/nextest-archive-lGxak8
  837. 60.81 s gammaloop-nextest-spenso> Extracted 8 files to /build/nextest-archive-lGxak8 in 0.07s
  838. 60.82 s gammaloop-nextest-spenso> ------------
  839. 60.82 s gammaloop-nextest-spenso> Nextest run ID 53d1d928-8461-494d-a3ae-5d2df03da1bc with nextest profile: ci_gammaloop
  840. 60.82 s gammaloop-nextest-spenso> Starting 1 test across 2 binaries
  841. 60.82 s gammaloop-nextest-spenso> ------------
  842. 60.82 s gammaloop-nextest-spenso> Summary [ 0.005s] 1 test run: 1 passed, 0 skipped
  843. 60.86 s gammaloop-nextest-spenso>
  844. 60.86 s gammaloop-nextest-spenso> ========== nextest test summary ==========
  845. 60.86 s gammaloop-nextest-spenso> report: target/nextest/ci_gammaloop/junit.xml
  846. 60.87 s gammaloop-nextest-spenso> tests: 1, failures: 0, errors: 0
  847. 60.87 s gammaloop-nextest-spenso> No failing testcases found.
  848. 60.87 s gammaloop-nextest-spenso> =========================================
  849. 60.88 s gammaloop-nextest-spenso> Extracting 1 binary and 1 linked path to /build/nextest-archive-CPHOWb
  850. 60.99 s gammaloop-nextest-spenso> Extracted 7 files to /build/nextest-archive-CPHOWb in 0.07s
  851. 60.99 s gammaloop-nextest-spenso> ------------
  852. 60.99 s gammaloop-nextest-spenso> Nextest run ID 39a3ad9a-a5c3-46c4-a37b-c154c604571c with nextest profile: ci_gammaloop
  853. 60.99 s gammaloop-nextest-spenso> Starting 0 tests across 1 binary
  854. 60.99 s gammaloop-nextest-spenso> ------------
  855. 60.99 s gammaloop-nextest-spenso> Summary [ 0.000s] 0 tests run: 0 passed, 0 skipped
  856. 61.00 s gammaloop-nextest-spenso>
  857. 61.00 s gammaloop-nextest-spenso> ========== nextest test summary ==========
  858. 61.00 s gammaloop-nextest-spenso> report: target/nextest/ci_gammaloop/junit.xml
  859. 61.00 s gammaloop-nextest-spenso> tests: 0, failures: 0, errors: 0
  860. 61.00 s gammaloop-nextest-spenso> No failing testcases found.
  861. 61.00 s gammaloop-nextest-spenso> =========================================
  862. 61.08 s error: Cannot build '/nix/store/pcw901lvh10nhiz9sizq4ncxl7hk2sj8-gammaloop-nextest-spenso.drv'.
  863. 61.08 s Reason: builder failed with exit code 100.
  864. 61.08 s Output paths:
  865. 61.08 s /nix/store/svfvfmdbxmky2ygprd3qgwr8zggj7a43-gammaloop-nextest-spenso
  866. 61.08 s Last 677 log lines:
  867. 61.08 s > Extracting 5 binaries and 2 linked paths to /build/nextest-archive-UAHuUS
  868. 61.08 s > Extracted 19 files to /build/nextest-archive-UAHuUS in 0.23s
  869. 61.08 s > ------------
  870. 61.08 s > Nextest run ID 235f27c3-8714-4e3f-bb75-4c5376b0da5e with nextest profile: ci_gammaloop
  871. 61.08 s > Starting 232 tests across 5 binaries (26 tests skipped, including 2 tests via profile.ci_gammaloop.default-filter)
  872. 61.08 s > FAIL [ 0.019s] ( 91/232) idenso dirac::test::feyncalc_reference::dirac_simplify_id40_repeated_gamma_and_two_trace
  873. 61.08 s > stdout ---
  874. 61.08 s >
  875. 61.08 s > running 1 test
  876. 61.08 s > test dirac::test::feyncalc_reference::dirac_simplify_id40_repeated_gamma_and_two_trace ... FAILED
  877. 61.08 s >
  878. 61.08 s > failures:
  879. 61.08 s >
  880. 61.08 s > failures:
  881. 61.08 s > dirac::test::feyncalc_reference::dirac_simplify_id40_repeated_gamma_and_two_trace
  882. 61.08 s >
  883. 61.08 s > test result: FAILED. 0 passed; 1 failed; 0 ignored; 0 measured; 248 filtered out; finished in 0.01s
  884. 61.08 s >
  885. 61.08 s > stderr ---
  886. 61.08 s >
  887. 61.08 s > thread 'dirac::test::feyncalc_reference::dirac_simplify_id40_repeated_gamma_and_two_trace' (491) panicked at crates/idenso/src/dirac/mod.rs:360:5:
  888. 61.08 s > gamma third argument must be a Minkowski slot
  889. 61.08 s > stack backtrace:
  890. 61.08 s > 0: __rustc::rust_begin_unwind
  891. 61.08 s > 1: core::panicking::panic_fmt
  892. 61.08 s > 2: idenso::dirac::require_gamma_port
  893. 61.08 s > 3: idenso::dirac::gamma_tensor
  894. 61.08 s > 4: idenso::dirac::test::feyncalc_reference::dirac_simplify_id40_repeated_gamma_and_two_trace
  895. 61.08 s > 5: <idenso::dirac::test::feyncalc_reference::dirac_simplify_id40_repeated_gamma_and_two_trace::{closure#0} as core::ops::function::FnOnce<()>>::call_once
  896. 61.08 s > note: Some details are omitted, run with `RUST_BACKTRACE=full` for a verbose backtrace.
  897. 61.08 s >
  898. 61.08 s > FAIL [ 0.022s] ( 92/232) idenso dirac::test::feyncalc_reference::dirac_simplify_id46_d_dim_repeated_gamma_slash_sum
  899. 61.08 s > stdout ---
  900. 61.08 s >
  901. 61.08 s > running 1 test
  902. 61.08 s > test dirac::test::feyncalc_reference::dirac_simplify_id46_d_dim_repeated_gamma_slash_sum ... FAILED
  903. 61.08 s >
  904. 61.08 s > failures:
  905. 61.08 s >
  906. 61.08 s > failures:
  907. 61.08 s > dirac::test::feyncalc_reference::dirac_simplify_id46_d_dim_repeated_gamma_slash_sum
  908. 61.08 s >
  909. 61.08 s > test result: FAILED. 0 passed; 1 failed; 0 ignored; 0 measured; 248 filtered out; finished in 0.00s
  910. 61.08 s >
  911. 61.08 s > stderr ---
  912. 61.08 s >
  913. 61.08 s > thread 'dirac::test::feyncalc_reference::dirac_simplify_id46_d_dim_repeated_gamma_slash_sum' (504) panicked at crates/idenso/src/dirac/mod.rs:360:5:
  914. 61.08 s > gamma third argument must be a Minkowski slot
  915. 61.08 s > stack backtrace:
  916. 61.08 s > 0: __rustc::rust_begin_unwind
  917. 61.08 s > 1: core::panicking::panic_fmt
  918. 61.08 s > 2: idenso::dirac::require_gamma_port
  919. 61.08 s > 3: idenso::dirac::gamma_tensor
  920. 61.08 s > 4: idenso::dirac::test::feyncalc_reference::dirac_simplify_id46_d_dim_repeated_gamma_slash_sum
  921. 61.08 s > 5: <idenso::dirac::test::feyncalc_reference::dirac_simplify_id46_d_dim_repeated_gamma_slash_sum::{closure#0} as core::ops::function::FnOnce<()>>::call_once
  922. 61.08 s > note: Some details are omitted, run with `RUST_BACKTRACE=full` for a verbose backtrace.
  923. 61.08 s >
  924. 61.08 s > FAIL [ 0.028s] ( 94/232) idenso dirac::test::feyncalc_reference::dirac_simplify_id4_slash_sandwich
  925. 61.08 s > stdout ---
  926. 61.08 s >
  927. 61.08 s > running 1 test
  928. 61.08 s > test dirac::test::feyncalc_reference::dirac_simplify_id4_slash_sandwich ... FAILED
  929. 61.08 s >
  930. 61.08 s > failures:
  931. 61.08 s >
  932. 61.08 s > failures:
  933. 61.08 s > dirac::test::feyncalc_reference::dirac_simplify_id4_slash_sandwich
  934. 61.08 s >
  935. 61.08 s > test result: FAILED. 0 passed; 1 failed; 0 ignored; 0 measured; 248 filtered out; finished in 0.01s
  936. 61.08 s >
  937. 61.08 s > stderr ---
  938. 61.08 s >
  939. 61.08 s > thread 'dirac::test::feyncalc_reference::dirac_simplify_id4_slash_sandwich' (511) panicked at crates/idenso/src/dirac/mod.rs:360:5:
  940. 61.08 s > gamma third argument must be a Minkowski slot
  941. 61.08 s > stack backtrace:
  942. 61.08 s > 0: __rustc::rust_begin_unwind
  943. 61.08 s > 1: core::panicking::panic_fmt
  944. 61.08 s > 2: idenso::dirac::require_gamma_port
  945. 61.08 s > 3: idenso::dirac::gamma_tensor
  946. 61.08 s > 4: idenso::dirac::test::feyncalc_reference::dirac_simplify_id4_slash_sandwich
  947. 61.08 s > 5: <idenso::dirac::test::feyncalc_reference::dirac_simplify_id4_slash_sandwich::{closure#0} as core::ops::function::FnOnce<()>>::call_once
  948. 61.08 s > note: Some details are omitted, run with `RUST_BACKTRACE=full` for a verbose backtrace.
  949. 61.08 s >
  950. 61.08 s > FAIL [ 0.025s] (143/232) idenso reference_cases::tests::reference_case_simplification_snapshots
  951. 61.08 s > stdout ---
  952. 61.08 s >
  953. 61.08 s > running 1 test
  954. 61.08 s > test reference_cases::tests::reference_case_simplification_snapshots ... FAILED
  955. 61.08 s >
  956. 61.08 s > failures:
  957. 61.08 s >
  958. 61.08 s > failures:
  959. 61.08 s > reference_cases::tests::reference_case_simplification_snapshots
  960. 61.08 s >
  961. 61.08 s > test result: FAILED. 0 passed; 1 failed; 0 ignored; 0 measured; 248 filtered out; finished in 0.01s
  962. 61.08 s >
  963. 61.08 s > stderr ---
  964. 61.08 s >
  965. 61.08 s > thread 'reference_cases::tests::reference_case_simplification_snapshots' (684) panicked at crates/idenso/src/dirac/mod.rs:360:5:
  966. 61.08 s > gamma third argument must be a Minkowski slot
  967. 61.08 s > stack backtrace:
  968. 61.08 s > 0: __rustc::rust_begin_unwind
  969. 61.08 s > 1: core::panicking::panic_fmt
  970. 61.08 s > 2: idenso::dirac::require_gamma_port
  971. 61.08 s > 3: idenso::dirac::gamma_tensor
  972. 61.08 s > 4: idenso::reference_cases::dirac_feyncalc_slash_sandwich_id4
  973. 61.08 s > 5: <idenso::reference_cases::ReferenceCase>::simplified
  974. 61.08 s > 6: <core::iter::adapters::map::Map<core::slice::iter::Iter<idenso::reference_cases::ReferenceCase>, idenso::reference_cases::tests::reference_case_simplification_snapshots::{closure#0}> as core::iter::traits::iterator::Iterator>::fold::<(), core::iter::traits::iterator::Iterator::for_each::call<alloc::string::String, <alloc::vec::Vec<alloc::string::String>>::extend_trusted<core::iter::adapters::map::Map<core::slice::iter::Iter<idenso::reference_cases::ReferenceCase>, idenso::reference_cases::tests::reference_case_simplification_snapshots::{closure#0}>>::{closure#0}>::{closure#0}>
  975. 61.08 s > 7: <alloc::vec::Vec<alloc::string::String> as alloc::vec::spec_from_iter_nested::SpecFromIterNested<alloc::string::String, core::iter::adapters::map::Map<core::slice::iter::Iter<idenso::reference_cases::ReferenceCase>, idenso::reference_cases::tests::reference_case_simplification_snapshots::{closure#0}>>>::from_iter
  976. 61.08 s > 8: idenso::reference_cases::tests::reference_case_simplification_snapshots
  977. 61.09 s > 9: <idenso::reference_cases::tests::reference_case_simplification_snapshots::{closure#0} as core::ops::function::FnOnce<()>>::call_once
  978. 61.09 s > note: Some details are omitted, run with `RUST_BACKTRACE=full` for a verbose backtrace.
  979. 61.09 s >
  980. 61.09 s > FAIL [ 0.076s] (228/232) idenso tensor::tests::parsing::infinite_execution
  981. 61.09 s > stdout ---
  982. 61.09 s >
  983. 61.09 s > running 1 test
  984. 61.09 s > ━━━━━━━━━━━━━━━━━━━━━━━━━━━━━━━ Snapshot Summary ━━━━━━━━━━━━━━━━━━━━━━━━━━━━━━━
  985. 61.09 s > Snapshot: infinite_execution
  986. 61.09 s > Source: crates/idenso/src/tensor/tests/parsing.rs:905
  987. 61.09 s > ────────────────────────────────────────────────────────────────────────────────
  988. 61.09 s > Expression: net_iter.snapshot_dot()
  989. 61.09 s > ────────────────────────────────────────────────────────────────────────────────
  990. 61.09 s > -old snapshot
  991. 61.09 s > +new results
  992. 61.09 s > ────────────┬───────────────────────────────────────────────────────────────────
  993. 61.09 s > 8 8 │ 0:0:s -> ext0 [id=0 color="red"];
  994. 61.09 s > 9 9 │ ext1 [style=invis];
  995. 61.09 s > 10 10 │ 0:5:s -> ext1 [id=1 dir=none color="red" label="mink4|l_0"];
  996. 61.09 s > 11 11 │ ext2 [style=invis];
  997. 61.09 s > 12 │- 0:4:s -> ext2 [id=2 dir=none color="red" label="bis4|l_2"];
  998. 61.09 s > 12 │+ 0:3:s -> ext2 [id=2 dir=none color="red" label="mink4|l_1"];
  999. 61.09 s > 13 13 │ ext3 [style=invis];
  1000. 61.09 s > 14 │- 0:3:s -> ext3 [id=3 dir=none color="red" label="bis4|l_3"];
  1001. 61.09 s > 14 │+ 0:1:s -> ext3 [id=3 dir=none color="red" label="bis4|l_2"];
  1002. 61.09 s > 15 15 │ ext4 [style=invis];
  1003. 61.09 s > 16 │- 0:1:s -> ext4 [id=4 dir=none color="red" label="mink4|l_1"];
  1004. 61.09 s > 16 │+ 0:2:s -> ext4 [id=4 dir=none color="red" label="mink4|l_4"];
  1005. 61.09 s > 17 17 │ ext5 [style=invis];
  1006. 61.09 s > 18 │- 0:2:s -> ext5 [id=5 dir=none color="red" label="mink4|l_4"];
  1007. 61.09 s > 18 │+ 0:4:s -> ext5 [id=5 dir=none color="red" label="bis4|l_3"];
  1008. 61.09 s > 19 19 │ }
  1009. 61.09 s > ────────────┴───────────────────────────────────────────────────────────────────
  1010. 61.09 s > To update snapshots run `cargo insta review`
  1011. 61.09 s > Stopped on the first failure. Run `cargo insta test` to run all snapshots.
  1012. 61.09 s > test tensor::tests::parsing::infinite_execution ... FAILED
  1013. 61.09 s >
  1014. 61.09 s > failures:
  1015. 61.09 s >
  1016. 61.09 s > failures:
  1017. 61.09 s > tensor::tests::parsing::infinite_execution
  1018. 61.09 s >
  1019. 61.09 s > test result: FAILED. 0 passed; 1 failed; 0 ignored; 0 measured; 248 filtered out; finished in 0.06s
  1020. 61.09 s >
  1021. 61.09 s > stderr ---
  1022. 61.09 s >
  1023. 61.09 s > thread 'tensor::tests::parsing::infinite_execution' (849) panicked at /nix/store/g4vv637bgwmy4qf4lv8w7s6sghivpa09-vendor-cargo-deps/c19b7c6f923b580ac259164a89f2577984ad5ab09ee9d583b888f934adbbe8d0/insta-1.47.2/src/runtime.rs:719:13:
  1024. 61.09 s > snapshot assertion for 'infinite_execution' failed in line 905
  1025. 61.09 s > stack backtrace:
  1026. 61.09 s > 0: __rustc::rust_begin_unwind
  1027. 61.09 s > 1: core::panicking::panic_fmt
  1028. 61.09 s > 2: insta::runtime::assert_snapshot
  1029. 61.09 s > 3: idenso::tensor::tests::parsing::infinite_execution
  1030. 61.09 s > 4: <idenso::tensor::tests::parsing::infinite_execution::{closure#0} as core::ops::function::FnOnce<()>>::call_once
  1031. 61.09 s > note: Some details are omitted, run with `RUST_BACKTRACE=full` for a verbose backtrace.
  1032. 61.09 s >
  1033. 61.09 s > ------------
  1034. 61.09 s > Summary [ 2.088s] 232 tests run: 227 passed, 5 failed, 26 skipped
  1035. 61.09 s > FAIL [ 0.019s] ( 91/232) idenso dirac::test::feyncalc_reference::dirac_simplify_id40_repeated_gamma_and_two_trace
  1036. 61.09 s > stdout ---
  1037. 61.09 s >
  1038. 61.09 s > running 1 test
  1039. 61.09 s > test dirac::test::feyncalc_reference::dirac_simplify_id40_repeated_gamma_and_two_trace ... FAILED
  1040. 61.09 s >
  1041. 61.09 s > failures:
  1042. 61.09 s >
  1043. 61.09 s > failures:
  1044. 61.09 s > dirac::test::feyncalc_reference::dirac_simplify_id40_repeated_gamma_and_two_trace
  1045. 61.09 s >
  1046. 61.09 s > test result: FAILED. 0 passed; 1 failed; 0 ignored; 0 measured; 248 filtered out; finished in 0.01s
  1047. 61.09 s >
  1048. 61.09 s > stderr ---
  1049. 61.09 s >
  1050. 61.09 s > thread 'dirac::test::feyncalc_reference::dirac_simplify_id40_repeated_gamma_and_two_trace' (491) panicked at crates/idenso/src/dirac/mod.rs:360:5:
  1051. 61.09 s > gamma third argument must be a Minkowski slot
  1052. 61.09 s > stack backtrace:
  1053. 61.09 s > 0: __rustc::rust_begin_unwind
  1054. 61.09 s > 1: core::panicking::panic_fmt
  1055. 61.09 s > 2: idenso::dirac::require_gamma_port
  1056. 61.09 s > 3: idenso::dirac::gamma_tensor
  1057. 61.09 s > 4: idenso::dirac::test::feyncalc_reference::dirac_simplify_id40_repeated_gamma_and_two_trace
  1058. 61.09 s > 5: <idenso::dirac::test::feyncalc_reference::dirac_simplify_id40_repeated_gamma_and_two_trace::{closure#0} as core::ops::function::FnOnce<()>>::call_once
  1059. 61.09 s > note: Some details are omitted, run with `RUST_BACKTRACE=full` for a verbose backtrace.
  1060. 61.09 s >
  1061. 61.09 s > FAIL [ 0.022s] ( 92/232) idenso dirac::test::feyncalc_reference::dirac_simplify_id46_d_dim_repeated_gamma_slash_sum
  1062. 61.09 s > stdout ---
  1063. 61.09 s >
  1064. 61.09 s > running 1 test
  1065. 61.09 s > test dirac::test::feyncalc_reference::dirac_simplify_id46_d_dim_repeated_gamma_slash_sum ... FAILED
  1066. 61.09 s >
  1067. 61.09 s > failures:
  1068. 61.09 s >
  1069. 61.09 s > failures:
  1070. 61.09 s > dirac::test::feyncalc_reference::dirac_simplify_id46_d_dim_repeated_gamma_slash_sum
  1071. 61.09 s >
  1072. 61.09 s > test result: FAILED. 0 passed; 1 failed; 0 ignored; 0 measured; 248 filtered out; finished in 0.00s
  1073. 61.09 s >
  1074. 61.09 s > stderr ---
  1075. 61.09 s >
  1076. 61.09 s > thread 'dirac::test::feyncalc_reference::dirac_simplify_id46_d_dim_repeated_gamma_slash_sum' (504) panicked at crates/idenso/src/dirac/mod.rs:360:5:
  1077. 61.09 s > gamma third argument must be a Minkowski slot
  1078. 61.09 s > stack backtrace:
  1079. 61.09 s > 0: __rustc::rust_begin_unwind
  1080. 61.09 s > 1: core::panicking::panic_fmt
  1081. 61.09 s > 2: idenso::dirac::require_gamma_port
  1082. 61.09 s > 3: idenso::dirac::gamma_tensor
  1083. 61.09 s > 4: idenso::dirac::test::feyncalc_reference::dirac_simplify_id46_d_dim_repeated_gamma_slash_sum
  1084. 61.09 s > 5: <idenso::dirac::test::feyncalc_reference::dirac_simplify_id46_d_dim_repeated_gamma_slash_sum::{closure#0} as core::ops::function::FnOnce<()>>::call_once
  1085. 61.09 s > note: Some details are omitted, run with `RUST_BACKTRACE=full` for a verbose backtrace.
  1086. 61.09 s >
  1087. 61.09 s > FAIL [ 0.028s] ( 94/232) idenso dirac::test::feyncalc_reference::dirac_simplify_id4_slash_sandwich
  1088. 61.09 s > stdout ---
  1089. 61.09 s >
  1090. 61.09 s > running 1 test
  1091. 61.09 s > test dirac::test::feyncalc_reference::dirac_simplify_id4_slash_sandwich ... FAILED
  1092. 61.09 s >
  1093. 61.09 s > failures:
  1094. 61.09 s >
  1095. 61.09 s > failures:
  1096. 61.09 s > dirac::test::feyncalc_reference::dirac_simplify_id4_slash_sandwich
  1097. 61.09 s >
  1098. 61.09 s > test result: FAILED. 0 passed; 1 failed; 0 ignored; 0 measured; 248 filtered out; finished in 0.01s
  1099. 61.09 s >
  1100. 61.09 s > stderr ---
  1101. 61.09 s >
  1102. 61.09 s > thread 'dirac::test::feyncalc_reference::dirac_simplify_id4_slash_sandwich' (511) panicked at crates/idenso/src/dirac/mod.rs:360:5:
  1103. 61.09 s > gamma third argument must be a Minkowski slot
  1104. 61.09 s > stack backtrace:
  1105. 61.09 s > 0: __rustc::rust_begin_unwind
  1106. 61.09 s > 1: core::panicking::panic_fmt
  1107. 61.09 s > 2: idenso::dirac::require_gamma_port
  1108. 61.09 s > 3: idenso::dirac::gamma_tensor
  1109. 61.09 s > 4: idenso::dirac::test::feyncalc_reference::dirac_simplify_id4_slash_sandwich
  1110. 61.09 s > 5: <idenso::dirac::test::feyncalc_reference::dirac_simplify_id4_slash_sandwich::{closure#0} as core::ops::function::FnOnce<()>>::call_once
  1111. 61.09 s > note: Some details are omitted, run with `RUST_BACKTRACE=full` for a verbose backtrace.
  1112. 61.09 s >
  1113. 61.09 s > FAIL [ 0.025s] (143/232) idenso reference_cases::tests::reference_case_simplification_snapshots
  1114. 61.09 s > stdout ---
  1115. 61.09 s >
  1116. 61.09 s > running 1 test
  1117. 61.09 s > test reference_cases::tests::reference_case_simplification_snapshots ... FAILED
  1118. 61.09 s >
  1119. 61.09 s > failures:
  1120. 61.09 s >
  1121. 61.09 s > failures:
  1122. 61.09 s > reference_cases::tests::reference_case_simplification_snapshots
  1123. 61.09 s >
  1124. 61.09 s > test result: FAILED. 0 passed; 1 failed; 0 ignored; 0 measured; 248 filtered out; finished in 0.01s
  1125. 61.09 s >
  1126. 61.09 s > stderr ---
  1127. 61.09 s >
  1128. 61.09 s > thread 'reference_cases::tests::reference_case_simplification_snapshots' (684) panicked at crates/idenso/src/dirac/mod.rs:360:5:
  1129. 61.09 s > gamma third argument must be a Minkowski slot
  1130. 61.09 s > stack backtrace:
  1131. 61.09 s > 0: __rustc::rust_begin_unwind
  1132. 61.09 s > 1: core::panicking::panic_fmt
  1133. 61.09 s > 2: idenso::dirac::require_gamma_port
  1134. 61.09 s > 3: idenso::dirac::gamma_tensor
  1135. 61.09 s > 4: idenso::reference_cases::dirac_feyncalc_slash_sandwich_id4
  1136. 61.09 s > 5: <idenso::reference_cases::ReferenceCase>::simplified
  1137. 61.09 s > 6: <core::iter::adapters::map::Map<core::slice::iter::Iter<idenso::reference_cases::ReferenceCase>, idenso::reference_cases::tests::reference_case_simplification_snapshots::{closure#0}> as core::iter::traits::iterator::Iterator>::fold::<(), core::iter::traits::iterator::Iterator::for_each::call<alloc::string::String, <alloc::vec::Vec<alloc::string::String>>::extend_trusted<core::iter::adapters::map::Map<core::slice::iter::Iter<idenso::reference_cases::ReferenceCase>, idenso::reference_cases::tests::reference_case_simplification_snapshots::{closure#0}>>::{closure#0}>::{closure#0}>
  1138. 61.09 s > 7: <alloc::vec::Vec<alloc::string::String> as alloc::vec::spec_from_iter_nested::SpecFromIterNested<alloc::string::String, core::iter::adapters::map::Map<core::slice::iter::Iter<idenso::reference_cases::ReferenceCase>, idenso::reference_cases::tests::reference_case_simplification_snapshots::{closure#0}>>>::from_iter
  1139. 61.09 s > 8: idenso::reference_cases::tests::reference_case_simplification_snapshots
  1140. 61.09 s > 9: <idenso::reference_cases::tests::reference_case_simplification_snapshots::{closure#0} as core::ops::function::FnOnce<()>>::call_once
  1141. 61.09 s > note: Some details are omitted, run with `RUST_BACKTRACE=full` for a verbose backtrace.
  1142. 61.09 s >
  1143. 61.09 s > FAIL [ 0.076s] (228/232) idenso tensor::tests::parsing::infinite_execution
  1144. 61.09 s > stdout ---
  1145. 61.09 s >
  1146. 61.09 s > running 1 test
  1147. 61.09 s > ━━━━━━━━━━━━━━━━━━━━━━━━━━━━━━━ Snapshot Summary ━━━━━━━━━━━━━━━━━━━━━━━━━━━━━━━
  1148. 61.09 s > Snapshot: infinite_execution
  1149. 61.09 s > Source: crates/idenso/src/tensor/tests/parsing.rs:905
  1150. 61.09 s > ────────────────────────────────────────────────────────────────────────────────
  1151. 61.09 s > Expression: net_iter.snapshot_dot()
  1152. 61.09 s > ────────────────────────────────────────────────────────────────────────────────
  1153. 61.09 s > -old snapshot
  1154. 61.09 s > +new results
  1155. 61.09 s > ────────────┬───────────────────────────────────────────────────────────────────
  1156. 61.09 s > 8 8 │ 0:0:s -> ext0 [id=0 color="red"];
  1157. 61.09 s > 9 9 │ ext1 [style=invis];
  1158. 61.09 s > 10 10 │ 0:5:s -> ext1 [id=1 dir=none color="red" label="mink4|l_0"];
  1159. 61.09 s > 11 11 │ ext2 [style=invis];
  1160. 61.09 s > 12 │- 0:4:s -> ext2 [id=2 dir=none color="red" label="bis4|l_2"];
  1161. 61.09 s > 12 │+ 0:3:s -> ext2 [id=2 dir=none color="red" label="mink4|l_1"];
  1162. 61.09 s > 13 13 │ ext3 [style=invis];
  1163. 61.09 s > 14 │- 0:3:s -> ext3 [id=3 dir=none color="red" label="bis4|l_3"];
  1164. 61.09 s > 14 │+ 0:1:s -> ext3 [id=3 dir=none color="red" label="bis4|l_2"];
  1165. 61.09 s > 15 15 │ ext4 [style=invis];
  1166. 61.09 s > 16 │- 0:1:s -> ext4 [id=4 dir=none color="red" label="mink4|l_1"];
  1167. 61.09 s > 16 │+ 0:2:s -> ext4 [id=4 dir=none color="red" label="mink4|l_4"];
  1168. 61.09 s > 17 17 │ ext5 [style=invis];
  1169. 61.09 s > 18 │- 0:2:s -> ext5 [id=5 dir=none color="red" label="mink4|l_4"];
  1170. 61.09 s > 18 │+ 0:4:s -> ext5 [id=5 dir=none color="red" label="bis4|l_3"];
  1171. 61.09 s > 19 19 │ }
  1172. 61.09 s > ────────────┴───────────────────────────────────────────────────────────────────
  1173. 61.09 s > To update snapshots run `cargo insta review`
  1174. 61.09 s > Stopped on the first failure. Run `cargo insta test` to run all snapshots.
  1175. 61.09 s > test tensor::tests::parsing::infinite_execution ... FAILED
  1176. 61.09 s >
  1177. 61.09 s > failures:
  1178. 61.09 s >
  1179. 61.09 s > failures:
  1180. 61.09 s > tensor::tests::parsing::infinite_execution
  1181. 61.09 s >
  1182. 61.09 s > test result: FAILED. 0 passed; 1 failed; 0 ignored; 0 measured; 248 filtered out; finished in 0.06s
  1183. 61.09 s >
  1184. 61.09 s > stderr ---
  1185. 61.09 s >
  1186. 61.09 s > thread 'tensor::tests::parsing::infinite_execution' (849) panicked at /nix/store/g4vv637bgwmy4qf4lv8w7s6sghivpa09-vendor-cargo-deps/c19b7c6f923b580ac259164a89f2577984ad5ab09ee9d583b888f934adbbe8d0/insta-1.47.2/src/runtime.rs:719:13:
  1187. 61.09 s > snapshot assertion for 'infinite_execution' failed in line 905
  1188. 61.09 s > stack backtrace:
  1189. 61.09 s > 0: __rustc::rust_begin_unwind
  1190. 61.09 s > 1: core::panicking::panic_fmt
  1191. 61.09 s > 2: insta::runtime::assert_snapshot
  1192. 61.09 s > 3: idenso::tensor::tests::parsing::infinite_execution
  1193. 61.09 s > 4: <idenso::tensor::tests::parsing::infinite_execution::{closure#0} as core::ops::function::FnOnce<()>>::call_once
  1194. 61.09 s > note: Some details are omitted, run with `RUST_BACKTRACE=full` for a verbose backtrace.
  1195. 61.09 s >
  1196. 61.09 s > error: test run failed
  1197. 61.09 s >
  1198. 61.09 s > ========== nextest test summary ==========
  1199. 61.09 s > report: target/nextest/ci_gammaloop/junit.xml
  1200. 61.09 s > tests: 232, failures: 5, errors: 0
  1201. 61.09 s >
  1202. 61.09 s > 1. idenso::dirac::test::feyncalc_reference::dirac_simplify_id40_repeated_gamma_and_two_trace
  1203. 61.09 s > failure: test failure with exit code 101
  1204. 61.09 s > thread 'dirac::test::feyncalc_reference::dirac_simplify_id40_repeated_gamma_and_two_trace' (491) panicked at crates/idenso/src/dirac/mod.rs:360:5:
  1205. 61.09 s > gamma third argument must be a Minkowski slot
  1206. 61.09 s > stack backtrace:
  1207. 61.09 s > 0: __rustc::rust_begin_unwind
  1208. 61.09 s > 1: core::panicking::panic_fmt
  1209. 61.09 s > 2: idenso::dirac::require_gamma_port
  1210. 61.09 s > 3: idenso::dirac::gamma_tensor
  1211. 61.09 s > 4: idenso::dirac::test::feyncalc_reference::dirac_simplify_id40_repeated_gamma_and_two_trace
  1212. 61.09 s > 5: <idenso::dirac::test::feyncalc_reference::dirac_simplify_id40_repeated_gamma_and_two_trace::{closure#0} as core::ops::function::FnOnce<()>>::call_once
  1213. 61.09 s > note: Some details are omitted, run with `RUST_BACKTRACE=full` for a verbose backtrace.
  1214. 61.09 s > system-out
  1215. 61.09 s > running 1 test
  1216. 61.09 s > test dirac::test::feyncalc_reference::dirac_simplify_id40_repeated_gamma_and_two_trace ... FAILED
  1217. 61.09 s >
  1218. 61.09 s > failures:
  1219. 61.09 s >
  1220. 61.09 s > failures:
  1221. 61.09 s > dirac::test::feyncalc_reference::dirac_simplify_id40_repeated_gamma_and_two_trace
  1222. 61.09 s >
  1223. 61.09 s > test result: FAILED. 0 passed; 1 failed; 0 ignored; 0 measured; 248 filtered out; finished in 0.01s
  1224. 61.09 s > system-err
  1225. 61.09 s > thread 'dirac::test::feyncalc_reference::dirac_simplify_id40_repeated_gamma_and_two_trace' (491) panicked at crates/idenso/src/dirac/mod.rs:360:5:
  1226. 61.09 s > gamma third argument must be a Minkowski slot
  1227. 61.09 s > stack backtrace:
  1228. 61.09 s > 0: __rustc::rust_begin_unwind
  1229. 61.09 s > 1: core::panicking::panic_fmt
  1230. 61.09 s > 2: idenso::dirac::require_gamma_port
  1231. 61.09 s > 3: idenso::dirac::gamma_tensor
  1232. 61.09 s > 4: idenso::dirac::test::feyncalc_reference::dirac_simplify_id40_repeated_gamma_and_two_trace
  1233. 61.09 s > 5: <idenso::dirac::test::feyncalc_reference::dirac_simplify_id40_repeated_gamma_and_two_trace::{closure#0} as core::ops::function::FnOnce<()>>::call_once
  1234. 61.09 s > note: Some details are omitted, run with `RUST_BACKTRACE=full` for a verbose backtrace.
  1235. 61.09 s >
  1236. 61.09 s > 2. idenso::dirac::test::feyncalc_reference::dirac_simplify_id46_d_dim_repeated_gamma_slash_sum
  1237. 61.09 s > failure: test failure with exit code 101
  1238. 61.09 s > thread 'dirac::test::feyncalc_reference::dirac_simplify_id46_d_dim_repeated_gamma_slash_sum' (504) panicked at crates/idenso/src/dirac/mod.rs:360:5:
  1239. 61.09 s > gamma third argument must be a Minkowski slot
  1240. 61.09 s > stack backtrace:
  1241. 61.09 s > 0: __rustc::rust_begin_unwind
  1242. 61.09 s > 1: core::panicking::panic_fmt
  1243. 61.09 s > 2: idenso::dirac::require_gamma_port
  1244. 61.09 s > 3: idenso::dirac::gamma_tensor
  1245. 61.09 s > 4: idenso::dirac::test::feyncalc_reference::dirac_simplify_id46_d_dim_repeated_gamma_slash_sum
  1246. 61.09 s > 5: <idenso::dirac::test::feyncalc_reference::dirac_simplify_id46_d_dim_repeated_gamma_slash_sum::{closure#0} as core::ops::function::FnOnce<()>>::call_once
  1247. 61.09 s > note: Some details are omitted, run with `RUST_BACKTRACE=full` for a verbose backtrace.
  1248. 61.09 s > system-out
  1249. 61.09 s > running 1 test
  1250. 61.09 s > test dirac::test::feyncalc_reference::dirac_simplify_id46_d_dim_repeated_gamma_slash_sum ... FAILED
  1251. 61.09 s >
  1252. 61.09 s > failures:
  1253. 61.09 s >
  1254. 61.09 s > failures:
  1255. 61.09 s > dirac::test::feyncalc_reference::dirac_simplify_id46_d_dim_repeated_gamma_slash_sum
  1256. 61.09 s >
  1257. 61.09 s > test result: FAILED. 0 passed; 1 failed; 0 ignored; 0 measured; 248 filtered out; finished in 0.00s
  1258. 61.09 s > system-err
  1259. 61.09 s > thread 'dirac::test::feyncalc_reference::dirac_simplify_id46_d_dim_repeated_gamma_slash_sum' (504) panicked at crates/idenso/src/dirac/mod.rs:360:5:
  1260. 61.09 s > gamma third argument must be a Minkowski slot
  1261. 61.09 s > stack backtrace:
  1262. 61.09 s > 0: __rustc::rust_begin_unwind
  1263. 61.09 s > 1: core::panicking::panic_fmt
  1264. 61.09 s > 2: idenso::dirac::require_gamma_port
  1265. 61.09 s > 3: idenso::dirac::gamma_tensor
  1266. 61.09 s > 4: idenso::dirac::test::feyncalc_reference::dirac_simplify_id46_d_dim_repeated_gamma_slash_sum
  1267. 61.09 s > 5: <idenso::dirac::test::feyncalc_reference::dirac_simplify_id46_d_dim_repeated_gamma_slash_sum::{closure#0} as core::ops::function::FnOnce<()>>::call_once
  1268. 61.09 s > note: Some details are omitted, run with `RUST_BACKTRACE=full` for a verbose backtrace.
  1269. 61.09 s >
  1270. 61.09 s > 3. idenso::dirac::test::feyncalc_reference::dirac_simplify_id4_slash_sandwich
  1271. 61.09 s > failure: test failure with exit code 101
  1272. 61.09 s > thread 'dirac::test::feyncalc_reference::dirac_simplify_id4_slash_sandwich' (511) panicked at crates/idenso/src/dirac/mod.rs:360:5:
  1273. 61.09 s > gamma third argument must be a Minkowski slot
  1274. 61.09 s > stack backtrace:
  1275. 61.09 s > 0: __rustc::rust_begin_unwind
  1276. 61.09 s > 1: core::panicking::panic_fmt
  1277. 61.09 s > 2: idenso::dirac::require_gamma_port
  1278. 61.09 s > 3: idenso::dirac::gamma_tensor
  1279. 61.09 s > 4: idenso::dirac::test::feyncalc_reference::dirac_simplify_id4_slash_sandwich
  1280. 61.09 s > 5: <idenso::dirac::test::feyncalc_reference::dirac_simplify_id4_slash_sandwich::{closure#0} as core::ops::function::FnOnce<()>>::call_once
  1281. 61.09 s > note: Some details are omitted, run with `RUST_BACKTRACE=full` for a verbose backtrace.
  1282. 61.09 s > system-out
  1283. 61.09 s > running 1 test
  1284. 61.09 s > test dirac::test::feyncalc_reference::dirac_simplify_id4_slash_sandwich ... FAILED
  1285. 61.09 s >
  1286. 61.09 s > failures:
  1287. 61.09 s >
  1288. 61.09 s > failures:
  1289. 61.09 s > dirac::test::feyncalc_reference::dirac_simplify_id4_slash_sandwich
  1290. 61.09 s >
  1291. 61.09 s > test result: FAILED. 0 passed; 1 failed; 0 ignored; 0 measured; 248 filtered out; finished in 0.01s
  1292. 61.09 s > system-err
  1293. 61.09 s > thread 'dirac::test::feyncalc_reference::dirac_simplify_id4_slash_sandwich' (511) panicked at crates/idenso/src/dirac/mod.rs:360:5:
  1294. 61.09 s > gamma third argument must be a Minkowski slot
  1295. 61.09 s > stack backtrace:
  1296. 61.09 s > 0: __rustc::rust_begin_unwind
  1297. 61.09 s > 1: core::panicking::panic_fmt
  1298. 61.09 s > 2: idenso::dirac::require_gamma_port
  1299. 61.09 s > 3: idenso::dirac::gamma_tensor
  1300. 61.09 s > 4: idenso::dirac::test::feyncalc_reference::dirac_simplify_id4_slash_sandwich
  1301. 61.09 s > 5: <idenso::dirac::test::feyncalc_reference::dirac_simplify_id4_slash_sandwich::{closure#0} as core::ops::function::FnOnce<()>>::call_once
  1302. 61.09 s > note: Some details are omitted, run with `RUST_BACKTRACE=full` for a verbose backtrace.
  1303. 61.09 s >
  1304. 61.09 s > 4. idenso::reference_cases::tests::reference_case_simplification_snapshots
  1305. 61.09 s > failure: test failure with exit code 101
  1306. 61.09 s > thread 'reference_cases::tests::reference_case_simplification_snapshots' (684) panicked at crates/idenso/src/dirac/mod.rs:360:5:
  1307. 61.09 s > gamma third argument must be a Minkowski slot
  1308. 61.09 s > stack backtrace:
  1309. 61.09 s > 0: __rustc::rust_begin_unwind
  1310. 61.09 s > 1: core::panicking::panic_fmt
  1311. 61.09 s > 2: idenso::dirac::require_gamma_port
  1312. 61.09 s > 3: idenso::dirac::gamma_tensor
  1313. 61.09 s > 4: idenso::reference_cases::dirac_feyncalc_slash_sandwich_id4
  1314. 61.09 s > 5: <idenso::reference_cases::ReferenceCase>::simplified
  1315. 61.09 s > 6: <core::iter::adapters::map::Map<core::slice::iter::Iter<idenso::reference_cases::ReferenceCase>, idenso::reference_cases::tests::reference_case_simplification_snapshots::{closure#0}> as core::iter::traits::iterator::Iterator>::fold::<(), core::iter::traits::iterator::Iterator::for_each::call<alloc::string::String, <alloc::vec::Vec<alloc::string::String>>::extend_trusted<core::iter::adapters::map::Map<core::slice::iter::Iter<idenso::reference_cases::ReferenceCase>, idenso::reference_cases::tests::reference_case_simplification_snapshots::{closure#0}>>::{closure#0}>::{closure#0}>
  1316. 61.09 s > 7: <alloc::vec::Vec<alloc::string::String> as alloc::vec::spec_from_iter_nested::SpecFromIterNested<alloc::string::String, core::iter::adapters::map::Map<core::slice::iter::Iter<idenso::reference_cases::ReferenceCase>, idenso::reference_cases::tests::reference_case_simplification_snapshots::{closure#0}>>>::from_iter
  1317. 61.09 s > 8: idenso::reference_cases::tests::reference_case_simplification_snapshots
  1318. 61.09 s > 9: <idenso::reference_cases::tests::reference_case_simplification_snapshots::{closure#0} as core::ops::function::FnOnce<()>>::call_once
  1319. 61.09 s > note: Some details are omitted, run with `RUST_BACKTRACE=full` for a verbose backtrace.
  1320. 61.09 s > system-out
  1321. 61.09 s > running 1 test
  1322. 61.09 s > test reference_cases::tests::reference_case_simplification_snapshots ... FAILED
  1323. 61.09 s >
  1324. 61.09 s > failures:
  1325. 61.09 s >
  1326. 61.09 s > failures:
  1327. 61.09 s > reference_cases::tests::reference_case_simplification_snapshots
  1328. 61.09 s >
  1329. 61.09 s > test result: FAILED. 0 passed; 1 failed; 0 ignored; 0 measured; 248 filtered out; finished in 0.01s
  1330. 61.09 s > system-err
  1331. 61.09 s > thread 'reference_cases::tests::reference_case_simplification_snapshots' (684) panicked at crates/idenso/src/dirac/mod.rs:360:5:
  1332. 61.09 s > gamma third argument must be a Minkowski slot
  1333. 61.09 s > stack backtrace:
  1334. 61.09 s > 0: __rustc::rust_begin_unwind
  1335. 61.09 s > 1: core::panicking::panic_fmt
  1336. 61.09 s > 2: idenso::dirac::require_gamma_port
  1337. 61.09 s > 3: idenso::dirac::gamma_tensor
  1338. 61.09 s > 4: idenso::reference_cases::dirac_feyncalc_slash_sandwich_id4
  1339. 61.09 s > 5: <idenso::reference_cases::ReferenceCase>::simplified
  1340. 61.09 s > 6: <core::iter::adapters::map::Map<core::slice::iter::Iter<idenso::reference_cases::ReferenceCase>, idenso::reference_cases::tests::reference_case_simplification_snapshots::{closure#0}> as core::iter::traits::iterator::Iterator>::fold::<(), core::iter::traits::iterator::Iterator::for_each::call<alloc::string::String, <alloc::vec::Vec<alloc::string::String>>::extend_trusted<core::iter::adapters::map::Map<core::slice::iter::Iter<idenso::reference_cases::ReferenceCase>, idenso::reference_cases::tests::reference_case_simplification_snapshots::{closure#0}>>::{closure#0}>::{closure#0}>
  1341. 61.09 s > 7: <alloc::vec::Vec<alloc::string::String> as alloc::vec::spec_from_iter_nested::SpecFromIterNested<alloc::string::String, core::iter::adapters::map::Map<core::slice::iter::Iter<idenso::reference_cases::ReferenceCase>, idenso::reference_cases::tests::reference_case_simplification_snapshots::{closure#0}>>>::from_iter
  1342. 61.09 s > 8: idenso::reference_cases::tests::reference_case_simplification_snapshots
  1343. 61.09 s > 9: <idenso::reference_cases::tests::reference_case_simplification_snapshots::{closure#0} as core::ops::function::FnOnce<()>>::call_once
  1344. 61.09 s > note: Some details are omitted, run with `RUST_BACKTRACE=full` for a verbose backtrace.
  1345. 61.09 s >
  1346. 61.09 s > 5. idenso::tensor::tests::parsing::infinite_execution
  1347. 61.09 s > failure: test failure with exit code 101
  1348. 61.09 s > thread 'tensor::tests::parsing::infinite_execution' (849) panicked at /nix/store/g4vv637bgwmy4qf4lv8w7s6sghivpa09-vendor-cargo-deps/c19b7c6f923b580ac259164a89f2577984ad5ab09ee9d583b888f934adbbe8d0/insta-1.47.2/src/runtime.rs:719:13:
  1349. 61.09 s > snapshot assertion for 'infinite_execution' failed in line 905
  1350. 61.09 s > stack backtrace:
  1351. 61.09 s > 0: __rustc::rust_begin_unwind
  1352. 61.09 s > 1: core::panicking::panic_fmt
  1353. 61.09 s > 2: insta::runtime::assert_snapshot
  1354. 61.09 s > 3: idenso::tensor::tests::parsing::infinite_execution
  1355. 61.09 s > 4: <idenso::tensor::tests::parsing::infinite_execution::{closure#0} as core::ops::function::FnOnce<()>>::call_once
  1356. 61.09 s > note: Some details are omitted, run with `RUST_BACKTRACE=full` for a verbose backtrace.
  1357. 61.09 s > system-out
  1358. 61.09 s > running 1 test
  1359. 61.09 s > ━━━━━━━━━━━━━━━━━━━━━━━━━━━━━━━ Snapshot Summary ━━━━━━━━━━━━━━━━━━━━━━━━━━━━━━━
  1360. 61.09 s > Snapshot: infinite_execution
  1361. 61.09 s > Source: crates/idenso/src/tensor/tests/parsing.rs:905
  1362. 61.09 s > ────────────────────────────────────────────────────────────────────────────────
  1363. 61.09 s > Expression: net_iter.snapshot_dot()
  1364. 61.09 s > ────────────────────────────────────────────────────────────────────────────────
  1365. 61.09 s > -old snapshot
  1366. 61.09 s > +new results
  1367. 61.09 s > ────────────┬───────────────────────────────────────────────────────────────────
  1368. 61.09 s > 8 8 │ 0:0:s-> ext0 [id=0 color="red"];
  1369. 61.09 s > 9 9 │ ext1 [style=invis];
  1370. 61.09 s > 10 10 │ 0:5:s-> ext1 [id=1 dir=none color="red" label="mink4|l_0"];
  1371. 61.09 s > 11 11 │ ext2 [style=invis];
  1372. 61.09 s > 12 │- 0:4:s-> ext2 [id=2 dir=none color="red" label="bis4|l_2"];
  1373. 61.09 s > 12 │+ 0:3:s-> ext2 [id=2 dir=none color="red" label="mink4|l_1"];
  1374. 61.09 s > 13 13 │ ext3 [style=invis];
  1375. 61.09 s > 14 │- 0:3:s-> ext3 [id=3 dir=none color="red" label="bis4|l_3"];
  1376. 61.09 s > 14 │+ 0:1:s-> ext3 [id=3 dir=none color="red" label="bis4|l_2"];
  1377. 61.09 s > 15 15 │ ext4 [style=invis];
  1378. 61.09 s > 16 │- 0:1:s-> ext4 [id=4 dir=none color="red" label="mink4|l_1"];
  1379. 61.09 s > 16 │+ 0:2:s-> ext4 [id=4 dir=none color="red" label="mink4|l_4"];
  1380. 61.09 s > 17 17 │ ext5 [style=invis];
  1381. 61.09 s > 18 │- 0:2:s-> ext5 [id=5 dir=none color="red" label="mink4|l_4"];
  1382. 61.09 s > 18 │+ 0:4:s-> ext5 [id=5 dir=none color="red" label="bis4|l_3"];
  1383. 61.09 s > 19 19 │ }
  1384. 61.09 s > ────────────┴───────────────────────────────────────────────────────────────────
  1385. 61.09 s > To update snapshots run `cargo insta review`
  1386. 61.09 s > Stopped on the first failure. Run `cargo insta test` to run all snapshots.
  1387. 61.09 s > test tensor::tests::parsing::infinite_execution ... FAILED
  1388. 61.09 s >
  1389. 61.09 s > failures:
  1390. 61.09 s >
  1391. 61.09 s > failures:
  1392. 61.09 s > tensor::tests::parsing::infinite_execution
  1393. 61.09 s >
  1394. 61.09 s > test result: FAILED. 0 passed; 1 failed; 0 ignored; 0 measured; 248 filtered out; finished in 0.06s
  1395. 61.09 s > system-err
  1396. 61.09 s > thread 'tensor::tests::parsing::infinite_execution' (849) panicked at /nix/store/g4vv637bgwmy4qf4lv8w7s6sghivpa09-vendor-cargo-deps/c19b7c6f923b580ac259164a89f2577984ad5ab09ee9d583b888f934adbbe8d0/insta-1.47.2/src/runtime.rs:719:13:
  1397. 61.09 s > snapshot assertion for 'infinite_execution' failed in line 905
  1398. 61.09 s > stack backtrace:
  1399. 61.09 s > 0: __rustc::rust_begin_unwind
  1400. 61.09 s > 1: core::panicking::panic_fmt
  1401. 61.09 s > 2: insta::runtime::assert_snapshot
  1402. 61.09 s > 3: idenso::tensor::tests::parsing::infinite_execution
  1403. 61.09 s > 4: <idenso::tensor::tests::parsing::infinite_execution::{closure#0} as core::ops::function::FnOnce<()>>::call_once
  1404. 61.09 s > note: Some details are omitted, run with `RUST_BACKTRACE=full` for a verbose backtrace.
  1405. 61.09 s > =========================================
  1406. 61.09 s > Extracting 2 binaries and 1 linked path to /build/nextest-archive-z2TOkC
  1407. 61.09 s > Extracted 8 files to /build/nextest-archive-z2TOkC in 0.09s
  1408. 61.09 s > ------------
  1409. 61.09 s > Nextest run ID 89549e82-ad79-49f8-bb26-a301b45ede72 with nextest profile: ci_gammaloop
  1410. 61.09 s > Starting 195 tests across 2 binaries
  1411. 61.09 s > ------------
  1412. 61.09 s > Summary [ 0.111s] 195 tests run: 195 passed, 0 skipped
  1413. 61.09 s >
  1414. 61.09 s > ========== nextest test summary ==========
  1415. 61.09 s > report: target/nextest/ci_gammaloop/junit.xml
  1416. 61.09 s > tests: 195, failures: 0, errors: 0
  1417. 61.09 s > No failing testcases found.
  1418. 61.09 s > =========================================
  1419. 61.09 s > Extracting 5 binaries and 2 linked paths to /build/nextest-archive-Ru85v4
  1420. 61.09 s > Extracted 19 files to /build/nextest-archive-Ru85v4 in 0.24s
  1421. 61.09 s > ------------
  1422. 61.09 s > Nextest run ID a8cc015b-bdb6-4884-8d59-500b44da45f9 with nextest profile: ci_gammaloop
  1423. 61.09 s > Starting 27 tests across 5 binaries (1 test skipped via profile.ci_gammaloop.default-filter)
  1424. 61.09 s > FAIL [ 0.056s] (24/27) spenso-hep-lib::idenso_validation enabled_idenso_reference_cases_validate_against_explicit_tensors
  1425. 61.09 s > stdout ---
  1426. 61.09 s >
  1427. 61.09 s > running 1 test
  1428. 61.09 s > test enabled_idenso_reference_cases_validate_against_explicit_tensors ... FAILED
  1429. 61.09 s >
  1430. 61.09 s > failures:
  1431. 61.09 s >
  1432. 61.09 s > failures:
  1433. 61.09 s > enabled_idenso_reference_cases_validate_against_explicit_tensors
  1434. 61.09 s >
  1435. 61.09 s > test result: FAILED. 0 passed; 1 failed; 0 ignored; 0 measured; 14 filtered out; finished in 0.05s
  1436. 61.09 s >
  1437. 61.09 s > stderr ---
  1438. 61.09 s >
  1439. 61.09 s > thread 'enabled_idenso_reference_cases_validate_against_explicit_tensors' (1668) panicked at crates/idenso/src/dirac/mod.rs:360:5:
  1440. 61.09 s > gamma third argument must be a Minkowski slot
  1441. 61.09 s > stack backtrace:
  1442. 61.09 s > 0: __rustc::rust_begin_unwind
  1443. 61.09 s > 1: core::panicking::panic_fmt
  1444. 61.09 s > 2: idenso::dirac::require_gamma_port
  1445. 61.09 s > 3: idenso::dirac::gamma_tensor
  1446. 61.09 s > 4: idenso::reference_cases::dirac_feyncalc_slash_sandwich_id4
  1447. 61.09 s > 5: <idenso_validation::enabled_idenso_reference_cases_validate_against_explicit_tensors::{closure#0} as core::ops::function::FnOnce<()>>::call_once
  1448. 61.09 s > note: Some details are omitted, run with `RUST_BACKTRACE=full` for a verbose backtrace.
  1449. 61.09 s >
  1450. 61.09 s > ------------
  1451. 61.09 s > Summary [ 0.120s] 27 tests run: 26 passed, 1 failed, 1 skipped
  1452. 61.09 s > FAIL [ 0.056s] (24/27) spenso-hep-lib::idenso_validation enabled_idenso_reference_cases_validate_against_explicit_tensors
  1453. 61.09 s > stdout ---
  1454. 61.09 s >
  1455. 61.09 s > running 1 test
  1456. 61.09 s > test enabled_idenso_reference_cases_validate_against_explicit_tensors ... FAILED
  1457. 61.09 s >
  1458. 61.09 s > failures:
  1459. 61.09 s >
  1460. 61.09 s > failures:
  1461. 61.09 s > enabled_idenso_reference_cases_validate_against_explicit_tensors
  1462. 61.09 s >
  1463. 61.09 s > test result: FAILED. 0 passed; 1 failed; 0 ignored; 0 measured; 14 filtered out; finished in 0.05s
  1464. 61.09 s >
  1465. 61.09 s > stderr ---
  1466. 61.09 s >
  1467. 61.09 s > thread 'enabled_idenso_reference_cases_validate_against_explicit_tensors' (1668) panicked at crates/idenso/src/dirac/mod.rs:360:5:
  1468. 61.09 s > gamma third argument must be a Minkowski slot
  1469. 61.09 s > stack backtrace:
  1470. 61.09 s > 0: __rustc::rust_begin_unwind
  1471. 61.09 s > 1: core::panicking::panic_fmt
  1472. 61.09 s > 2: idenso::dirac::require_gamma_port
  1473. 61.09 s > 3: idenso::dirac::gamma_tensor
  1474. 61.09 s > 4: idenso::reference_cases::dirac_feyncalc_slash_sandwich_id4
  1475. 61.09 s > 5: <idenso_validation::enabled_idenso_reference_cases_validate_against_explicit_tensors::{closure#0} as core::ops::function::FnOnce<()>>::call_once
  1476. 61.09 s > note: Some details are omitted, run with `RUST_BACKTRACE=full` for a verbose backtrace.
  1477. 61.09 s >
  1478. 61.09 s > error: test run failed
  1479. 61.09 s >
  1480. 61.09 s > ========== nextest test summary ==========
  1481. 61.09 s > report: target/nextest/ci_gammaloop/junit.xml
  1482. 61.09 s > tests: 27, failures: 1, errors: 0
  1483. 61.09 s >
  1484. 61.09 s > 1. spenso-hep-lib::idenso_validation::enabled_idenso_reference_cases_validate_against_explicit_tensors
  1485. 61.09 s > failure: test failure with exit code 101
  1486. 61.09 s > thread 'enabled_idenso_reference_cases_validate_against_explicit_tensors' (1668) panicked at crates/idenso/src/dirac/mod.rs:360:5:
  1487. 61.09 s > gamma third argument must be a Minkowski slot
  1488. 61.09 s > stack backtrace:
  1489. 61.09 s > 0: __rustc::rust_begin_unwind
  1490. 61.09 s > 1: core::panicking::panic_fmt
  1491. 61.09 s > 2: idenso::dirac::require_gamma_port
  1492. 61.09 s > 3: idenso::dirac::gamma_tensor
  1493. 61.09 s > 4: idenso::reference_cases::dirac_feyncalc_slash_sandwich_id4
  1494. 61.09 s > 5: <idenso_validation::enabled_idenso_reference_cases_validate_against_explicit_tensors::{closure#0} as core::ops::function::FnOnce<()>>::call_once
  1495. 61.09 s > note: Some details are omitted, run with `RUST_BACKTRACE=full` for a verbose backtrace.
  1496. 61.09 s > system-out
  1497. 61.09 s > running 1 test
  1498. 61.09 s > test enabled_idenso_reference_cases_validate_against_explicit_tensors ... FAILED
  1499. 61.09 s >
  1500. 61.09 s > failures:
  1501. 61.09 s >
  1502. 61.09 s > failures:
  1503. 61.09 s > enabled_idenso_reference_cases_validate_against_explicit_tensors
  1504. 61.09 s >
  1505. 61.09 s > test result: FAILED. 0 passed; 1 failed; 0 ignored; 0 measured; 14 filtered out; finished in 0.05s
  1506. 61.09 s > system-err
  1507. 61.09 s > thread 'enabled_idenso_reference_cases_validate_against_explicit_tensors' (1668) panicked at crates/idenso/src/dirac/mod.rs:360:5:
  1508. 61.09 s > gamma third argument must be a Minkowski slot
  1509. 61.09 s > stack backtrace:
  1510. 61.09 s > 0: __rustc::rust_begin_unwind
  1511. 61.09 s > 1: core::panicking::panic_fmt
  1512. 61.09 s > 2: idenso::dirac::require_gamma_port
  1513. 61.09 s > 3: idenso::dirac::gamma_tensor
  1514. 61.09 s > 4: idenso::reference_cases::dirac_feyncalc_slash_sandwich_id4
  1515. 61.09 s > 5: <idenso_validation::enabled_idenso_reference_cases_validate_against_explicit_tensors::{closure#0} as core::ops::function::FnOnce<()>>::call_once
  1516. 61.09 s > note: Some details are omitted, run with `RUST_BACKTRACE=full` for a verbose backtrace.
  1517. 61.09 s > =========================================
  1518. 61.09 s > Extracting 2 binaries and 1 linked path to /build/nextest-archive-lGxak8
  1519. 61.09 s > Extracted 8 files to /build/nextest-archive-lGxak8 in 0.07s
  1520. 61.09 s > ------------
  1521. 61.09 s > Nextest run ID 53d1d928-8461-494d-a3ae-5d2df03da1bc with nextest profile: ci_gammaloop
  1522. 61.09 s > Starting 1 test across 2 binaries
  1523. 61.09 s > ------------
  1524. 61.09 s > Summary [ 0.005s] 1 test run: 1 passed, 0 skipped
  1525. 61.09 s >
  1526. 61.09 s > ========== nextest test summary ==========
  1527. 61.09 s > report: target/nextest/ci_gammaloop/junit.xml
  1528. 61.09 s > tests: 1, failures: 0, errors: 0
  1529. 61.09 s > No failing testcases found.
  1530. 61.09 s > =========================================
  1531. 61.09 s > Extracting 1 binary and 1 linked path to /build/nextest-archive-CPHOWb
  1532. 61.09 s > Extracted 7 files to /build/nextest-archive-CPHOWb in 0.07s
  1533. 61.09 s > ------------
  1534. 61.09 s > Nextest run ID 39a3ad9a-a5c3-46c4-a37b-c154c604571c with nextest profile: ci_gammaloop
  1535. 61.09 s > Starting 0 tests across 1 binary
  1536. 61.09 s > ------------
  1537. 61.09 s > Summary [ 0.000s] 0 tests run: 0 passed, 0 skipped
  1538. 61.09 s >
  1539. 61.09 s > ========== nextest test summary ==========
  1540. 61.09 s > report: target/nextest/ci_gammaloop/junit.xml
  1541. 61.09 s > tests: 0, failures: 0, errors: 0
  1542. 61.09 s > No failing testcases found.
  1543. 61.09 s > =========================================
  1544. 61.09 s For full logs, run:
  1545. 61.09 s nix log /nix/store/pcw901lvh10nhiz9sizq4ncxl7hk2sj8-gammaloop-nextest-spenso.drv
  1546. 61.30 s [0 built (1 failed), 9 cRun failed.