test packages.x86_64-linux.nix-ci-check-gammaloop-nextest-spenso

Reproduce this run
Original Run
  1. 0.00 s $ /nix/store/9ypz3flqsrl5xl495mm8h645gadjsxi1-coreutils-9.11/bin/timeout --kill-after=15s 7200s /nix/store/23zk8sgzamrbmj1fday15szf7f2279s8-nix-2.34.7/bin/nix --extra-experimental-features nix-command --extra-experimental-features flakes flake clone git+https://github.com/alphal00p/gammaloop --dest /tmp/nix-ci-worker/stable-pwd/repo/
  2. 0.15 s Cloning into '/tmp/nix-ci-worker/stable-pwd/repo'...
  3. 1.13 s remote: Enumerating objects: 83696, done.
  4. 1.26 s remote: Counting objects: 0% (1/9893) remote: Counting objects: 1% (99/9893) remote: Counting objects: 2% (198/9893) remote: Counting objects: 3% (297/9893) remote: Counting objects: 4% (396/9893) remote: Counting objects: 5% (495/9893) remote: Counting objects: 6% (594/9893) remote: Counting objects: 7% (693/9893) remote: Counting objects: 8% (792/9893) remote: Counting objects: 9% (891/9893) remote: Counting objects: 10% (990/9893) remote: Counting objects: 11% (1089/9893) remote: Counting objects: 12% (1188/9893) remote: Counting objects: 13% (1287/9893) remote: Counting objects: 14% (1386/9893) remote: Counting objects: 15% (1484/9893) remote: Counting objects: 16% (1583/9893) remote: Counting objects: 17% (1682/9893) remote: Counting objects: 18% (1781/9893) remote: Counting objects: 19% (1880/9893) remote: Counting objects: 20% (1979/9893) remote: Counting objects: 21% (2078/9893) remote: Counting objects: 22% (2177/9893) remote: Counting objects: 23% (2276/9893) remote: Counting objects: 24% (2375/9893) remote: Counting objects: 25% (2474/9893) remote: Counting objects: 26% (2573/9893) remote: Counting objects: 27% (2672/9893) remote: Counting objects: 28% (2771/9893) remote: Counting objects: 29% (2869/9893) remote: Counting objects: 30% (2968/9893) remote: Counting objects: 31% (3067/9893) remote: Counting objects: 32% (3166/9893) remote: Counting objects: 33% (3265/9893) remote: Counting objects: 34% (3364/9893) remote: Counting objects: 35% (3463/9893) remote: Counting objects: 36% (3562/9893) remote: Counting objects: 37% (3661/9893) remote: Counting objects: 38% (3760/9893) remote: Counting objects: 39% (3859/9893) remote: Counting objects: 40% (3958/9893) remote: Counting objects: 41% (4057/9893) remote: Counting objects: 42% (4156/9893) remote: Counting objects: 43% (4254/9893) remote: Counting objects: 44% (4353/9893) remote: Counting objects: 45% (4452/9893) remote: Counting objects: 46% (4551/9893) remote: Counting objects: 47% (4650/9893) remote: Counting objects: 48% (4749/9893) remote: Counting objects: 49% (4848/9893) remote: Counting objects: 50% (4947/9893) remote: Counting objects: 51% (5046/9893) remote: Counting objects: 52% (5145/9893) remote: Counting objects: 53% (5244/9893) remote: Counting objects: 54% (5343/9893) remote: Counting objects: 55% (5442/9893) remote: Counting objects: 56% (5541/9893) remote: Counting objects: 57% (5640/9893) remote: Counting objects: 58% (5738/9893) remote: Counting objects: 59% (5837/9893) remote: Counting objects: 60% (5936/9893) remote: Counting objects: 61% (6035/9893) remote: Counting objects: 62% (6134/9893) remote: Counting objects: 63% (6233/9893) remote: Counting objects: 64% (6332/9893) remote: Counting objects: 65% (6431/9893) remote: Counting objects: 66% (6530/9893) remote: Counting objects: 67% (6629/9893) remote: Counting objects: 68% (6728/9893) remote: Counting objects: 69% (6827/9893) remote: Counting objects: 70% (6926/9893) remote: Counting objects: 71% (7025/9893) remote: Counting objects: 72% (7123/9893) remote: Counting objects: 73% (7222/9893) remote: Counting objects: 74% (7321/9893) remote: Counting objects: 75% (7420/9893) remote: Counting objects: 76% (7519/9893) remote: Counting objects: 77% (7618/9893) remote: Counting objects: 78% (7717/9893) remote: Counting objects: 79% (7816/9893) remote: Counting objects: 80% (7915/9893) remote: Counting objects: 81% (8014/9893) remote: Counting objects: 82% (8113/9893) remote: Counting objects: 83% (8212/9893) remote: Counting objects: 84% (8311/9893) remote: Counting objects: 85% (8410/9893) remote: Counting objects: 86% (8508/9893) remote: Counting objects: 87% (8607/9893) remote: Counting objects: 88% (8706/9893) remote: Counting objects: 89% (8805/9893) remote: Counting objects: 90% (8904/9893) remote: Counting objects: 91% (9003/9893) remote: Counting objects: 92% (9102/9893) remote: Counting objects: 93% (9201/9893) remote: Counting objects: 94% (9300/9893) remote: Counting objects: 95% (9399/9893) remote: Counting objects: 96% (9498/9893) remote: Counting objects: 97% (9597/9893) remote: Counting objects: 98% (9696/9893) remote: Counting objects: 99% (9795/9893) remote: Counting objects: 100% (9893/9893) remote: Counting objects: 100% (9893/9893), done.
  5. 3.76 s remote: Compressing objects: 0% (1/2138) remote: Compressing objects: 1% (22/2138) remote: Compressing objects: 2% (43/2138) remote: Compressing objects: 3% (65/2138) remote: Compressing objects: 4% (86/2138) remote: Compressing objects: 5% (107/2138) remote: Compressing objects: 6% (129/2138) remote: Compressing objects: 7% (150/2138) remote: Compressing objects: 8% (172/2138) remote: Compressing objects: 9% (193/2138) remote: Compressing objects: 10% (214/2138) remote: Compressing objects: 11% (236/2138) remote: Compressing objects: 12% (257/2138) remote: Compressing objects: 13% (278/2138) remote: Compressing objects: 14% (300/2138) remote: Compressing objects: 15% (321/2138) remote: Compressing objects: 15% (336/2138) remote: Compressing objects: 16% (343/2138) remote: Compressing objects: 17% (364/2138) remote: Compressing objects: 18% (385/2138) remote: Compressing objects: 19% (407/2138) remote: Compressing objects: 20% (428/2138) remote: Compressing objects: 21% (449/2138) remote: Compressing objects: 22% (471/2138) remote: Compressing objects: 22% (484/2138) remote: Compressing objects: 23% (492/2138) remote: Compressing objects: 24% (514/2138) remote: Compressing objects: 25% (535/2138) remote: Compressing objects: 26% (556/2138) remote: Compressing objects: 27% (578/2138) remote: Compressing objects: 28% (599/2138) remote: Compressing objects: 29% (621/2138) remote: Compressing objects: 30% (642/2138) remote: Compressing objects: 31% (663/2138) remote: Compressing objects: 32% (685/2138) remote: Compressing objects: 33% (706/2138) remote: Compressing objects: 34% (727/2138) remote: Compressing objects: 35% (749/2138) remote: Compressing objects: 36% (770/2138) remote: Compressing objects: 37% (792/2138) remote: Compressing objects: 38% (813/2138) remote: Compressing objects: 39% (834/2138) remote: Compressing objects: 40% (856/2138) remote: Compressing objects: 41% (877/2138) remote: Compressing objects: 42% (898/2138) remote: Compressing objects: 43% (920/2138) remote: Compressing objects: 44% (941/2138) remote: Compressing objects: 45% (963/2138) remote: Compressing objects: 46% (984/2138) remote: Compressing objects: 47% (1005/2138) remote: Compressing objects: 48% (1027/2138) remote: Compressing objects: 49% (1048/2138) remote: Compressing objects: 50% (1069/2138) remote: Compressing objects: 51% (1091/2138) remote: Compressing objects: 52% (1112/2138) remote: Compressing objects: 53% (1134/2138) remote: Compressing objects: 54% (1155/2138) remote: Compressing objects: 55% (1176/2138) remote: Compressing objects: 56% (1198/2138) remote: Compressing objects: 57% (1219/2138) remote: Compressing objects: 58% (1241/2138) remote: Compressing objects: 59% (1262/2138) remote: Compressing objects: 60% (1283/2138) remote: Compressing objects: 61% (1305/2138) remote: Compressing objects: 62% (1326/2138) remote: Compressing objects: 63% (1347/2138) remote: Compressing objects: 64% (1369/2138) remote: Compressing objects: 65% (1390/2138) remote: Compressing objects: 66% (1412/2138) remote: Compressing objects: 67% (1433/2138) remote: Compressing objects: 68% (1454/2138) remote: Compressing objects: 69% (1476/2138) remote: Compressing objects: 70% (1497/2138) remote: Compressing objects: 71% (1518/2138) remote: Compressing objects: 72% (1540/2138) remote: Compressing objects: 73% (1561/2138) remote: Compressing objects: 74% (1583/2138) remote: Compressing objects: 75% (1604/2138) remote: Compressing objects: 76% (1625/2138) remote: Compressing objects: 77% (1647/2138) remote: Compressing objects: 78% (1668/2138) remote: Compressing objects: 79% (1690/2138) remote: Compressing objects: 80% (1711/2138) remote: Compressing objects: 81% (1732/2138) remote: Compressing objects: 82% (1754/2138) remote: Compressing objects: 83% (1775/2138) remote: Compressing objects: 84% (1796/2138) remote: Compressing objects: 85% (1818/2138) remote: Compressing objects: 86% (1839/2138) remote: Compressing objects: 87% (1861/2138) remote: Compressing objects: 88% (1882/2138) remote: Compressing objects: 89% (1903/2138) remote: Compressing objects: 90% (1925/2138) remote: Compressing objects: 91% (1946/2138) remote: Compressing objects: 92% (1967/2138) remote: Compressing objects: 93% (1989/2138) remote: Compressing objects: 94% (2010/2138) remote: Compressing objects: 95% (2032/2138) remote: Compressing objects: 96% (2053/2138) remote: Compressing objects: 97% (2074/2138) remote: Compressing objects: 98% (2096/2138) remote: Compressing objects: 99% (2117/2138) remote: Compressing objects: 100% (2138/2138) remote: Compressing objects: 100% (2138/2138), done.
  6. 8.46 s Receiving objects: 0% (1/83696) Receiving objects: 1% (837/83696) Receiving objects: 2% (1674/83696) Receiving objects: 3% (2511/83696) Receiving objects: 4% (3348/83696) Receiving objects: 5% (4185/83696) Receiving objects: 6% (5022/83696), 9.20 MiB | 18.38 MiB/s Receiving objects: 7% (5859/83696), 9.20 MiB | 18.38 MiB/s Receiving objects: 8% (6696/83696), 9.20 MiB | 18.38 MiB/s Receiving objects: 9% (7533/83696), 9.20 MiB | 18.38 MiB/s Receiving objects: 10% (8370/83696), 9.20 MiB | 18.38 MiB/s Receiving objects: 11% (9207/83696), 9.20 MiB | 18.38 MiB/s Receiving objects: 12% (10044/83696), 9.20 MiB | 18.38 MiB/s Receiving objects: 13% (10881/83696), 9.20 MiB | 18.38 MiB/s Receiving objects: 14% (11718/83696), 9.20 MiB | 18.38 MiB/s Receiving objects: 15% (12555/83696), 9.20 MiB | 18.38 MiB/s Receiving objects: 16% (13392/83696), 9.20 MiB | 18.38 MiB/s Receiving objects: 17% (14229/83696), 9.20 MiB | 18.38 MiB/s Receiving objects: 18% (15066/83696), 9.20 MiB | 18.38 MiB/s Receiving objects: 19% (15903/83696), 9.20 MiB | 18.38 MiB/s Receiving objects: 20% (16740/83696), 9.20 MiB | 18.38 MiB/s Receiving objects: 21% (17577/83696), 9.20 MiB | 18.38 MiB/s Receiving objects: 22% (18414/83696), 9.20 MiB | 18.38 MiB/s Receiving objects: 23% (19251/83696), 9.20 MiB | 18.38 MiB/s Receiving objects: 24% (20088/83696), 9.20 MiB | 18.38 MiB/s Receiving objects: 24% (20877/83696), 9.20 MiB | 18.38 MiB/s Receiving objects: 25% (20924/83696), 9.20 MiB | 18.38 MiB/s Receiving objects: 26% (21761/83696), 22.48 MiB | 22.47 MiB/s Receiving objects: 27% (22598/83696), 22.48 MiB | 22.47 MiB/s Receiving objects: 28% (23435/83696), 22.48 MiB | 22.47 MiB/s Receiving objects: 29% (24272/83696), 22.48 MiB | 22.47 MiB/s Receiving objects: 30% (25109/83696), 22.48 MiB | 22.47 MiB/s Receiving objects: 31% (25946/83696), 22.48 MiB | 22.47 MiB/s Receiving objects: 32% (26783/83696), 22.48 MiB | 22.47 MiB/s Receiving objects: 33% (27620/83696), 22.48 MiB | 22.47 MiB/s Receiving objects: 34% (28457/83696), 22.48 MiB | 22.47 MiB/s Receiving objects: 35% (29294/83696), 22.48 MiB | 22.47 MiB/s Receiving objects: 36% (30131/83696), 22.48 MiB | 22.47 MiB/s Receiving objects: 37% (30968/83696), 22.48 MiB | 22.47 MiB/s Receiving objects: 38% (31805/83696), 22.48 MiB | 22.47 MiB/s Receiving objects: 39% (32642/83696), 22.48 MiB | 22.47 MiB/s Receiving objects: 40% (33479/83696), 22.48 MiB | 22.47 MiB/s Receiving objects: 41% (34316/83696), 22.48 MiB | 22.47 MiB/s Receiving objects: 42% (35153/83696), 22.48 MiB | 22.47 MiB/s Receiving objects: 43% (35990/83696), 22.48 MiB | 22.47 MiB/s Receiving objects: 44% (36827/83696), 22.48 MiB | 22.47 MiB/s Receiving objects: 45% (37664/83696), 22.48 MiB | 22.47 MiB/s Receiving objects: 46% (38501/83696), 43.70 MiB | 28.72 MiB/s Receiving objects: 47% (39338/83696), 43.70 MiB | 28.72 MiB/s Receiving objects: 48% (40175/83696), 43.70 MiB | 28.72 MiB/s Receiving objects: 49% (41012/83696), 43.70 MiB | 28.72 MiB/s Receiving objects: 50% (41848/83696), 43.70 MiB | 28.72 MiB/s Receiving objects: 51% (42685/83696), 43.70 MiB | 28.72 MiB/s Receiving objects: 52% (43522/83696), 43.70 MiB | 28.72 MiB/s Receiving objects: 53% (44359/83696), 43.70 MiB | 28.72 MiB/s Receiving objects: 54% (45196/83696), 43.70 MiB | 28.72 MiB/s Receiving objects: 55% (46033/83696), 43.70 MiB | 28.72 MiB/s Receiving objects: 55% (46861/83696), 43.70 MiB | 28.72 MiB/s Receiving objects: 56% (46870/83696), 43.70 MiB | 28.72 MiB/s Receiving objects: 57% (47707/83696), 59.25 MiB | 29.21 MiB/s Receiving objects: 58% (48544/83696), 59.25 MiB | 29.21 MiB/s Receiving objects: 59% (49381/83696), 59.25 MiB | 29.21 MiB/s Receiving objects: 60% (50218/83696), 59.25 MiB | 29.21 MiB/s Receiving objects: 61% (51055/83696), 59.25 MiB | 29.21 MiB/s Receiving objects: 62% (51892/83696), 59.25 MiB | 29.21 MiB/s Receiving objects: 63% (52729/83696), 74.71 MiB | 29.54 MiB/s Receiving objects: 64% (53566/83696), 74.71 MiB | 29.54 MiB/s Receiving objects: 65% (54403/83696), 74.71 MiB | 29.54 MiB/s Receiving objects: 66% (55240/83696), 74.71 MiB | 29.54 MiB/s Receiving objects: 67% (56077/83696), 74.71 MiB | 29.54 MiB/s Receiving objects: 68% (56914/83696), 74.71 MiB | 29.54 MiB/s Receiving objects: 69% (57751/83696), 74.71 MiB | 29.54 MiB/s Receiving objects: 70% (58588/83696), 74.71 MiB | 29.54 MiB/s Receiving objects: 71% (59425/83696), 74.71 MiB | 29.54 MiB/s Receiving objects: 71% (59586/83696), 74.71 MiB | 29.54 MiB/s Receiving objects: 72% (60262/83696), 89.49 MiB | 29.55 MiB/s Receiving objects: 73% (61099/83696), 89.49 MiB | 29.55 MiB/s Receiving objects: 74% (61936/83696), 89.49 MiB | 29.55 MiB/s Receiving objects: 75% (62772/83696), 89.49 MiB | 29.55 MiB/s Receiving objects: 76% (63609/83696), 89.49 MiB | 29.55 MiB/s Receiving objects: 77% (64446/83696), 89.49 MiB | 29.55 MiB/s Receiving objects: 78% (65283/83696), 89.49 MiB | 29.55 MiB/s Receiving objects: 79% (66120/83696), 104.33 MiB | 29.57 MiB/s Receiving objects: 80% (66957/83696), 104.33 MiB | 29.57 MiB/s Receiving objects: 81% (67794/83696), 104.33 MiB | 29.57 MiB/s Receiving objects: 81% (68588/83696), 104.33 MiB | 29.57 MiB/s Receiving objects: 82% (68631/83696), 104.33 MiB | 29.57 MiB/s Receiving objects: 83% (69468/83696), 104.33 MiB | 29.57 MiB/s Receiving objects: 84% (70305/83696), 119.61 MiB | 29.69 MiB/s Receiving objects: 85% (71142/83696), 119.61 MiB | 29.69 MiB/s Receiving objects: 86% (71979/83696), 119.61 MiB | 29.69 MiB/s Receiving objects: 87% (72816/83696), 119.61 MiB | 29.69 MiB/s Receiving objects: 88% (73653/83696), 119.61 MiB | 29.69 MiB/s Receiving objects: 89% (74490/83696), 119.61 MiB | 29.69 MiB/s Receiving objects: 90% (75327/83696), 119.61 MiB | 29.69 MiB/s Receiving objects: 91% (76164/83696), 119.61 MiB | 29.69 MiB/s Receiving objects: 92% (77001/83696), 119.61 MiB | 29.69 MiB/s Receiving objects: 93% (77838/83696), 119.61 MiB | 29.69 MiB/s Receiving objects: 94% (78675/83696), 119.61 MiB | 29.69 MiB/s Receiving objects: 95% (79512/83696), 119.61 MiB | 29.69 MiB/s Receiving objects: 96% (80349/83696), 119.61 MiB | 29.69 MiB/s Receiving objects: 97% (81186/83696), 119.61 MiB | 29.69 MiB/s Receiving objects: 98% (82023/83696), 119.61 MiB | 29.69 MiB/s Receiving objects: 99% (82860/83696), 119.61 MiB | 29.69 MiB/s Receiving objects: 100% (83696/83696), 134.82 MiB | 29.77 MiB/s Receiving objects: 100% (83696/83696), 139.23 MiB | 29.63 MiB/s, done.
  7. 8.46 s remote: Total 83696 (delta 7944), reused 8038 (delta 7222), pack-reused 73803 (from 3)
  8. 11.12 s Resolving deltas: 0% (0/56218) Resolving deltas: 1% (563/56218) Resolving deltas: 2% (1125/56218) Resolving deltas: 3% (1687/56218) Resolving deltas: 4% (2249/56218) Resolving deltas: 5% (2811/56218) Resolving deltas: 6% (3374/56218) Resolving deltas: 7% (3936/56218) Resolving deltas: 8% (4498/56218) Resolving deltas: 9% (5060/56218) Resolving deltas: 10% (5622/56218) Resolving deltas: 11% (6184/56218) Resolving deltas: 12% (6747/56218) Resolving deltas: 13% (7309/56218) Resolving deltas: 14% (7874/56218) Resolving deltas: 15% (8433/56218) Resolving deltas: 16% (8995/56218) Resolving deltas: 17% (9558/56218) Resolving deltas: 18% (10120/56218) Resolving deltas: 19% (10682/56218) Resolving deltas: 20% (11244/56218) Resolving deltas: 21% (11806/56218) Resolving deltas: 22% (12368/56218) Resolving deltas: 23% (12931/56218) Resolving deltas: 24% (13493/56218) Resolving deltas: 25% (14055/56218) Resolving deltas: 26% (14617/56218) Resolving deltas: 27% (15179/56218) Resolving deltas: 28% (15742/56218) Resolving deltas: 29% (16304/56218) Resolving deltas: 30% (16866/56218) Resolving deltas: 31% (17428/56218) Resolving deltas: 32% (17990/56218) Resolving deltas: 33% (18552/56218) Resolving deltas: 34% (19115/56218) Resolving deltas: 35% (19677/56218) Resolving deltas: 36% (20239/56218) Resolving deltas: 37% (20801/56218) Resolving deltas: 38% (21363/56218) Resolving deltas: 39% (21926/56218) Resolving deltas: 40% (22488/56218) Resolving deltas: 41% (23050/56218) Resolving deltas: 42% (23612/56218) Resolving deltas: 43% (24174/56218) Resolving deltas: 44% (24736/56218) Resolving deltas: 45% (25299/56218) Resolving deltas: 46% (25861/56218) Resolving deltas: 47% (26423/56218) Resolving deltas: 48% (26985/56218) Resolving deltas: 49% (27547/56218) Resolving deltas: 50% (28110/56218) Resolving deltas: 51% (28672/56218) Resolving deltas: 52% (29234/56218) Resolving deltas: 53% (29796/56218) Resolving deltas: 53% (30025/56218) Resolving deltas: 54% (30358/56218) Resolving deltas: 55% (30920/56218) Resolving deltas: 56% (31483/56218) Resolving deltas: 57% (32045/56218) Resolving deltas: 58% (32607/56218) Resolving deltas: 59% (33169/56218) Resolving deltas: 60% (33731/56218) Resolving deltas: 61% (34293/56218) Resolving deltas: 62% (34856/56218) Resolving deltas: 63% (35418/56218) Resolving deltas: 64% (35980/56218) Resolving deltas: 65% (36543/56218) Resolving deltas: 66% (37104/56218) Resolving deltas: 67% (37667/56218) Resolving deltas: 68% (38229/56218) Resolving deltas: 69% (38791/56218) Resolving deltas: 70% (39353/56218) Resolving deltas: 71% (39915/56218) Resolving deltas: 72% (40477/56218) Resolving deltas: 73% (41040/56218) Resolving deltas: 74% (41602/56218) Resolving deltas: 74% (42081/56218) Resolving deltas: 75% (42164/56218) Resolving deltas: 76% (42726/56218) Resolving deltas: 77% (43288/56218) Resolving deltas: 78% (43851/56218) Resolving deltas: 79% (44413/56218) Resolving deltas: 80% (44975/56218) Resolving deltas: 81% (45537/56218) Resolving deltas: 82% (46099/56218) Resolving deltas: 83% (46661/56218) Resolving deltas: 84% (47224/56218) Resolving deltas: 85% (47786/56218) Resolving deltas: 86% (48348/56218) Resolving deltas: 87% (48910/56218) Resolving deltas: 88% (49472/56218) Resolving deltas: 89% (50035/56218) Resolving deltas: 90% (50597/56218) Resolving deltas: 91% (51159/56218) Resolving deltas: 92% (51721/56218) Resolving deltas: 93% (52283/56218) Resolving deltas: 94% (52845/56218) Resolving deltas: 95% (53408/56218) Resolving deltas: 96% (53971/56218) Resolving deltas: 97% (54532/56218) Resolving deltas: 98% (55094/56218) Resolving deltas: 99% (55656/56218) Resolving deltas: 100% (56218/56218) Resolving deltas: 100% (56218/56218), done.
  9. 11.68 s Fetching commit 5aadd389efabb7b039af74edad02a90d486a1c07 for simplify-spenso-api ...
  10. 11.68 s $ /nix/store/bcnisk3ydfgv26v2gw3zlky24g00yww2-git-2.54.0/bin/git fetch origin 5aadd389efabb7b039af74edad02a90d486a1c07
  11. 12.44 s From https://github.com/alphal00p/gammaloop
  12. 12.44 s * branch 5aadd389efabb7b039af74edad02a90d486a1c07 -> FETCH_HEAD
  13. 12.50 s $ /nix/store/9ypz3flqsrl5xl495mm8h645gadjsxi1-coreutils-9.11/bin/timeout --kill-after=15s 7200s /nix/store/bcnisk3ydfgv26v2gw3zlky24g00yww2-git-2.54.0/bin/git -c advice.detachedHead=false checkout 5aadd389efabb7b039af74edad02a90d486a1c07
  14. 12.90 s HEAD is now at 5aadd389e restore public gamma arguments to storage order
  15. 12.91 s $ /nix/store/9ypz3flqsrl5xl495mm8h645gadjsxi1-coreutils-9.11/bin/timeout --kill-after=15s 7200s /nix/store/23zk8sgzamrbmj1fday15szf7f2279s8-nix-2.34.7/bin/nix --extra-experimental-features nix-command --extra-experimental-features flakes --log-format internal-json run .#packages.x86_64-linux.nix-ci-check-gammaloop-nextest-spenso --print-build-logs
  16. 20.43 s
  17. 28.28 s evaluating derivation 'g copying '/nix/store/qism evaluating derivation 'g copying '/nix/store/qism evaluating derivation 'g copying '/nix/store/qism evaluating derivation 'g copying '/nix/store/qism evaluating derivation 'g copying '/nix/store/qism evaluating derivation 'g [0/1 built] [1/0/1 built] building ggammaloop-nextest-spenso> Extracting 5 binaries and 2 linked paths to /build/nextest-archive-k85fdx
  18. 28.56 s gammaloop-nextest-spenso> Extracted 19 files to /build/nextest-archive-k85fdx in 0.28s
  19. 28.62 s gammaloop-nextest-spenso> ------------
  20. 28.62 s gammaloop-nextest-spenso> Nextest run ID aecef523-6de8-44f5-b486-42e444028599 with nextest profile: ci_gammaloop
  21. 28.62 s gammaloop-nextest-spenso> Starting 232 tests across 5 binaries (26 tests skipped, including 2 tests via profile.ci_gammaloop.default-filter)
  22. 28.98 s gammaloop-nextest-spenso> FAIL [ 0.026s] ( 90/232) idenso dirac::test::feyncalc_reference::dirac_simplify_id46_d_dim_repeated_gamma_slash_sum
  23. 28.98 s gammaloop-nextest-spenso> stdout ---
  24. 28.98 s gammaloop-nextest-spenso>
  25. 28.98 s gammaloop-nextest-spenso> running 1 test
  26. 28.98 s gammaloop-nextest-spenso> test dirac::test::feyncalc_reference::dirac_simplify_id46_d_dim_repeated_gamma_slash_sum ... FAILED
  27. 28.98 s gammaloop-nextest-spenso>
  28. 28.98 s gammaloop-nextest-spenso> failures:
  29. 28.98 s gammaloop-nextest-spenso>
  30. 28.98 s gammaloop-nextest-spenso> failures:
  31. 28.98 s gammaloop-nextest-spenso> dirac::test::feyncalc_reference::dirac_simplify_id46_d_dim_repeated_gamma_slash_sum
  32. 28.98 s gammaloop-nextest-spenso>
  33. 28.98 s gammaloop-nextest-spenso> test result: FAILED. 0 passed; 1 failed; 0 ignored; 0 measured; 248 filtered out; finished in 0.01s
  34. 28.98 s gammaloop-nextest-spenso>
  35. 28.98 s gammaloop-nextest-spenso> stderr ---
  36. 28.98 s gammaloop-nextest-spenso>
  37. 28.98 s gammaloop-nextest-spenso> thread 'dirac::test::feyncalc_reference::dirac_simplify_id46_d_dim_repeated_gamma_slash_sum' (501) panicked at crates/idenso/src/dirac/mod.rs:360:5:
  38. 28.98 s gammaloop-nextest-spenso> gamma third argument must be a Minkowski slot
  39. 28.98 s gammaloop-nextest-spenso> stack backtrace:
  40. 28.98 s gammaloop-nextest-spenso> 0: __rustc::rust_begin_unwind
  41. 28.98 s gammaloop-nextest-spenso> 1: core::panicking::panic_fmt
  42. 28.98 s gammaloop-nextest-spenso> 2: idenso::dirac::require_gamma_port
  43. 28.98 s gammaloop-nextest-spenso> 3: idenso::dirac::gamma_tensor
  44. 28.98 s gammaloop-nextest-spenso> 4: idenso::dirac::test::feyncalc_reference::dirac_simplify_id46_d_dim_repeated_gamma_slash_sum
  45. 28.98 s gammaloop-nextest-spenso> 5: <idenso::dirac::test::feyncalc_reference::dirac_simplify_id46_d_dim_repeated_gamma_slash_sum::{closure#0} as core::ops::function::FnOnce<()>>::call_once
  46. 28.98 s gammaloop-nextest-spenso> note: Some details are omitted, run with `RUST_BACKTRACE=full` for a verbose backtrace.
  47. 28.98 s gammaloop-nextest-spenso>
  48. 28.98 s gammaloop-nextest-spenso> FAIL [ 0.034s] ( 91/232) idenso dirac::test::feyncalc_reference::dirac_simplify_id40_repeated_gamma_and_two_trace
  49. 28.98 s gammaloop-nextest-spenso> stdout ---
  50. 28.98 s gammaloop-nextest-spenso>
  51. 28.98 s gammaloop-nextest-spenso> running 1 test
  52. 28.98 s gammaloop-nextest-spenso> test dirac::test::feyncalc_reference::dirac_simplify_id40_repeated_gamma_and_two_trace ... FAILED
  53. 28.98 s gammaloop-nextest-spenso>
  54. 28.98 s gammaloop-nextest-spenso> failures:
  55. 28.98 s gammaloop-nextest-spenso>
  56. 28.98 s gammaloop-nextest-spenso> failures:
  57. 28.98 s gammaloop-nextest-spenso> dirac::test::feyncalc_reference::dirac_simplify_id40_repeated_gamma_and_two_trace
  58. 28.98 s gammaloop-nextest-spenso>
  59. 28.98 s gammaloop-nextest-spenso> test result: FAILED. 0 passed; 1 failed; 0 ignored; 0 measured; 248 filtered out; finished in 0.01s
  60. 28.98 s gammaloop-nextest-spenso>
  61. 28.98 s gammaloop-nextest-spenso> stderr ---
  62. 28.98 s gammaloop-nextest-spenso>
  63. 28.98 s gammaloop-nextest-spenso> thread 'dirac::test::feyncalc_reference::dirac_simplify_id40_repeated_gamma_and_two_trace' (505) panicked at crates/idenso/src/dirac/mod.rs:360:5:
  64. 28.98 s gammaloop-nextest-spenso> gamma third argument must be a Minkowski slot
  65. 28.98 s gammaloop-nextest-spenso> stack backtrace:
  66. 28.98 s gammaloop-nextest-spenso> 0: __rustc::rust_begin_unwind
  67. 28.98 s gammaloop-nextest-spenso> 1: core::panicking::panic_fmt
  68. 28.98 s gammaloop-nextest-spenso> 2: idenso::dirac::require_gamma_port
  69. 28.98 s gammaloop-nextest-spenso> 3: idenso::dirac::gamma_tensor
  70. 28.98 s gammaloop-nextest-spenso> 4: idenso::dirac::test::feyncalc_reference::dirac_simplify_id40_repeated_gamma_and_two_trace
  71. 28.98 s gammaloop-nextest-spenso> 5: <idenso::dirac::test::feyncalc_reference::dirac_simplify_id40_repeated_gamma_and_two_trace::{closure#0} as core::ops::function::FnOnce<()>>::call_once
  72. 28.98 s gammaloop-nextest-spenso> note: Some details are omitted, run with `RUST_BACKTRACE=full` for a verbose backtrace.
  73. 28.98 s gammaloop-nextest-spenso>
  74. 28.98 s gammaloop-nextest-spenso> FAIL [ 0.033s] ( 93/232) idenso dirac::test::feyncalc_reference::dirac_simplify_id4_slash_sandwich
  75. 28.98 s gammaloop-nextest-spenso> stdout ---
  76. 28.98 s gammaloop-nextest-spenso>
  77. 28.98 s gammaloop-nextest-spenso> running 1 test
  78. 28.98 s gammaloop-nextest-spenso> test dirac::test::feyncalc_reference::dirac_simplify_id4_slash_sandwich ... FAILED
  79. 28.98 s gammaloop-nextest-spenso>
  80. 28.98 s gammaloop-nextest-spenso> failures:
  81. 28.98 s gammaloop-nextest-spenso>
  82. 28.98 s gammaloop-nextest-spenso> failures:
  83. 28.98 s gammaloop-nextest-spenso> dirac::test::feyncalc_reference::dirac_simplify_id4_slash_sandwich
  84. 28.98 s gammaloop-nextest-spenso>
  85. 28.98 s gammaloop-nextest-spenso> test result: FAILED. 0 passed; 1 failed; 0 ignored; 0 measured; 248 filtered out; finished in 0.02s
  86. 28.98 s gammaloop-nextest-spenso>
  87. 28.98 s gammaloop-nextest-spenso> stderr ---
  88. 28.98 s gammaloop-nextest-spenso>
  89. 28.98 s gammaloop-nextest-spenso> thread 'dirac::test::feyncalc_reference::dirac_simplify_id4_slash_sandwich' (502) panicked at crates/idenso/src/dirac/mod.rs:360:5:
  90. 28.98 s gammaloop-nextest-spenso> gamma third argument must be a Minkowski slot
  91. 28.98 s gammaloop-nextest-spenso> stack backtrace:
  92. 28.98 s gammaloop-nextest-spenso> 0: __rustc::rust_begin_unwind
  93. 28.98 s gammaloop-nextest-spenso> 1: core::panicking::panic_fmt
  94. 28.98 s gammaloop-nextest-spenso> 2: idenso::dirac::require_gamma_port
  95. 28.98 s gammaloop-nextest-spenso> 3: idenso::dirac::gamma_tensor
  96. 28.98 s gammaloop-nextest-spenso> 4: idenso::dirac::test::feyncalc_reference::dirac_simplify_id4_slash_sandwich
  97. 28.98 s gammaloop-nextest-spenso> 5: <idenso::dirac::test::feyncalc_reference::dirac_simplify_id4_slash_sandwich::{closure#0} as core::ops::function::FnOnce<()>>::call_once
  98. 28.98 s gammaloop-nextest-spenso> note: Some details are omitted, run with `RUST_BACKTRACE=full` for a verbose backtrace.
  99. 28.98 s gammaloop-nextest-spenso>
  100. 29.19 s gammaloop-nextest-spenso> FAIL [ 0.038s] (145/232) idenso reference_cases::tests::reference_case_simplification_snapshots
  101. 29.19 s gammaloop-nextest-spenso> stdout ---
  102. 29.19 s gammaloop-nextest-spenso>
  103. 29.19 s gammaloop-nextest-spenso> running 1 test
  104. 29.19 s gammaloop-nextest-spenso> test reference_cases::tests::reference_case_simplification_snapshots ... FAILED
  105. 29.19 s gammaloop-nextest-spenso>
  106. 29.19 s gammaloop-nextest-spenso> failures:
  107. 29.19 s gammaloop-nextest-spenso>
  108. 29.19 s gammaloop-nextest-spenso> failures:
  109. 29.19 s gammaloop-nextest-spenso> reference_cases::tests::reference_case_simplification_snapshots
  110. 29.19 s gammaloop-nextest-spenso>
  111. 29.19 s gammaloop-nextest-spenso> test result: FAILED. 0 passed; 1 failed; 0 ignored; 0 measured; 248 filtered out; finished in 0.01s
  112. 29.19 s gammaloop-nextest-spenso>
  113. 29.19 s gammaloop-nextest-spenso> stderr ---
  114. 29.19 s gammaloop-nextest-spenso>
  115. 29.19 s gammaloop-nextest-spenso> thread 'reference_cases::tests::reference_case_simplification_snapshots' (694) panicked at crates/idenso/src/dirac/mod.rs:360:5:
  116. 29.19 s gammaloop-nextest-spenso> gamma third argument must be a Minkowski slot
  117. 29.19 s gammaloop-nextest-spenso> stack backtrace:
  118. 29.19 s gammaloop-nextest-spenso> 0: __rustc::rust_begin_unwind
  119. 29.19 s gammaloop-nextest-spenso> 1: core::panicking::panic_fmt
  120. 29.19 s gammaloop-nextest-spenso> 2: idenso::dirac::require_gamma_port
  121. 29.19 s gammaloop-nextest-spenso> 3: idenso::dirac::gamma_tensor
  122. 29.19 s gammaloop-nextest-spenso> 4: idenso::reference_cases::dirac_feyncalc_slash_sandwich_id4
  123. 29.19 s gammaloop-nextest-spenso> 5: <idenso::reference_cases::ReferenceCase>::simplified
  124. 29.19 s gammaloop-nextest-spenso> 6: <core::iter::adapters::map::Map<core::slice::iter::Iter<idenso::reference_cases::ReferenceCase>, idenso::reference_cases::tests::reference_case_simplification_snapshots::{closure#0}> as core::iter::traits::iterator::Iterator>::fold::<(), core::iter::traits::iterator::Iterator::for_each::call<alloc::string::String, <alloc::vec::Vec<alloc::string::String>>::extend_trusted<core::iter::adapters::map::Map<core::slice::iter::Iter<idenso::reference_cases::ReferenceCase>, idenso::reference_cases::tests::reference_case_simplification_snapshots::{closure#0}>>::{closure#0}>::{closure#0}>
  125. 29.19 s gammaloop-nextest-spenso> 7: <alloc::vec::Vec<alloc::string::String> as alloc::vec::spec_from_iter_nested::SpecFromIterNested<alloc::string::String, core::iter::adapters::map::Map<core::slice::iter::Iter<idenso::reference_cases::ReferenceCase>, idenso::reference_cases::tests::reference_case_simplification_snapshots::{closure#0}>>>::from_iter
  126. 29.19 s gammaloop-nextest-spenso> 8: idenso::reference_cases::tests::reference_case_simplification_snapshots
  127. 29.19 s gammaloop-nextest-spenso> 9: <idenso::reference_cases::tests::reference_case_simplification_snapshots::{closure#0} as core::ops::function::FnOnce<()>>::call_once
  128. 29.19 s gammaloop-nextest-spenso> note: Some details are omitted, run with `RUST_BACKTRACE=full` for a verbose backtrace.
  129. 29.19 s gammaloop-nextest-spenso>
  130. 29.44 s gammaloop-nextest-spenso> FAIL [ 0.113s] (224/232) idenso tensor::tests::parsing::infinite_execution
  131. 29.44 s gammaloop-nextest-spenso> stdout ---
  132. 29.44 s gammaloop-nextest-spenso>
  133. 29.44 s gammaloop-nextest-spenso> running 1 test
  134. 29.44 s gammaloop-nextest-spenso> ━━━━━━━━━━━━━━━━━━━━━━━━━━━━━━━ Snapshot Summary ━━━━━━━━━━━━━━━━━━━━━━━━━━━━━━━
  135. 29.44 s gammaloop-nextest-spenso> Snapshot: infinite_execution
  136. 29.44 s gammaloop-nextest-spenso> Source: crates/idenso/src/tensor/tests/parsing.rs:905
  137. 29.44 s gammaloop-nextest-spenso> ────────────────────────────────────────────────────────────────────────────────
  138. 29.44 s gammaloop-nextest-spenso> Expression: net_iter.snapshot_dot()
  139. 29.44 s gammaloop-nextest-spenso> ────────────────────────────────────────────────────────────────────────────────
  140. 29.44 s gammaloop-nextest-spenso> -old snapshot
  141. 29.44 s gammaloop-nextest-spenso> +new results
  142. 29.44 s gammaloop-nextest-spenso> ────────────┬───────────────────────────────────────────────────────────────────
  143. 29.44 s gammaloop-nextest-spenso> 8 8 │ 0:0:s -> ext0 [id=0 color="red"];
  144. 29.44 s gammaloop-nextest-spenso> 9 9 │ ext1 [style=invis];
  145. 29.44 s gammaloop-nextest-spenso> 10 10 │ 0:5:s -> ext1 [id=1 dir=none color="red" label="mink4|l_0"];
  146. 29.44 s gammaloop-nextest-spenso> 11 11 │ ext2 [style=invis];
  147. 29.44 s gammaloop-nextest-spenso> 12 │- 0:4:s -> ext2 [id=2 dir=none color="red" label="bis4|l_2"];
  148. 29.44 s gammaloop-nextest-spenso> 12 │+ 0:3:s -> ext2 [id=2 dir=none color="red" label="mink4|l_1"];
  149. 29.44 s gammaloop-nextest-spenso> 13 13 │ ext3 [style=invis];
  150. 29.44 s gammaloop-nextest-spenso> 14 │- 0:3:s -> ext3 [id=3 dir=none color="red" label="bis4|l_3"];
  151. 29.44 s gammaloop-nextest-spenso> 14 │+ 0:1:s -> ext3 [id=3 dir=none color="red" label="bis4|l_2"];
  152. 29.44 s gammaloop-nextest-spenso> 15 15 │ ext4 [style=invis];
  153. 29.44 s gammaloop-nextest-spenso> 16 │- 0:1:s -> ext4 [id=4 dir=none color="red" label="mink4|l_1"];
  154. 29.44 s gammaloop-nextest-spenso> 16 │+ 0:2:s -> ext4 [id=4 dir=none color="red" label="mink4|l_4"];
  155. 29.44 s gammaloop-nextest-spenso> 17 17 │ ext5 [style=invis];
  156. 29.44 s gammaloop-nextest-spenso> 18 │- 0:2:s -> ext5 [id=5 dir=none color="red" label="mink4|l_4"];
  157. 29.44 s gammaloop-nextest-spenso> 18 │+ 0:4:s -> ext5 [id=5 dir=none color="red" label="bis4|l_3"];
  158. 29.44 s gammaloop-nextest-spenso> 19 19 │ }
  159. 29.44 s gammaloop-nextest-spenso> ────────────┴───────────────────────────────────────────────────────────────────
  160. 29.44 s gammaloop-nextest-spenso> To update snapshots run `cargo insta review`
  161. 29.44 s gammaloop-nextest-spenso> Stopped on the first failure. Run `cargo insta test` to run all snapshots.
  162. 29.44 s gammaloop-nextest-spenso> test tensor::tests::parsing::infinite_execution ... FAILED
  163. 29.44 s gammaloop-nextest-spenso>
  164. 29.44 s gammaloop-nextest-spenso> failures:
  165. 29.44 s gammaloop-nextest-spenso>
  166. 29.44 s gammaloop-nextest-spenso> failures:
  167. 29.44 s gammaloop-nextest-spenso> tensor::tests::parsing::infinite_execution
  168. 29.44 s gammaloop-nextest-spenso>
  169. 29.44 s gammaloop-nextest-spenso> test result: FAILED. 0 passed; 1 failed; 0 ignored; 0 measured; 248 filtered out; finished in 0.09s
  170. 29.44 s gammaloop-nextest-spenso>
  171. 29.44 s gammaloop-nextest-spenso> stderr ---
  172. 29.44 s gammaloop-nextest-spenso>
  173. 29.44 s gammaloop-nextest-spenso> thread 'tensor::tests::parsing::infinite_execution' (856) panicked at /nix/store/g4vv637bgwmy4qf4lv8w7s6sghivpa09-vendor-cargo-deps/c19b7c6f923b580ac259164a89f2577984ad5ab09ee9d583b888f934adbbe8d0/insta-1.47.2/src/runtime.rs:719:13:
  174. 29.44 s gammaloop-nextest-spenso> snapshot assertion for 'infinite_execution' failed in line 905
  175. 29.44 s gammaloop-nextest-spenso> stack backtrace:
  176. 29.44 s gammaloop-nextest-spenso> 0: __rustc::rust_begin_unwind
  177. 29.44 s gammaloop-nextest-spenso> 1: core::panicking::panic_fmt
  178. 29.44 s gammaloop-nextest-spenso> 2: insta::runtime::assert_snapshot
  179. 29.44 s gammaloop-nextest-spenso> 3: idenso::tensor::tests::parsing::infinite_execution
  180. 29.44 s gammaloop-nextest-spenso> 4: <idenso::tensor::tests::parsing::infinite_execution::{closure#0} as core::ops::function::FnOnce<()>>::call_once
  181. 29.44 s gammaloop-nextest-spenso> note: Some details are omitted, run with `RUST_BACKTRACE=full` for a verbose backtrace.
  182. 29.44 s gammaloop-nextest-spenso>
  183. 31.18 s gammaloop-nextest-spenso> ------------
  184. 31.18 s gammaloop-nextest-spenso> Summary [ 2.564s] 232 tests run: 227 passed, 5 failed, 26 skipped
  185. 31.18 s gammaloop-nextest-spenso> FAIL [ 0.026s] ( 90/232) idenso dirac::test::feyncalc_reference::dirac_simplify_id46_d_dim_repeated_gamma_slash_sum
  186. 31.18 s gammaloop-nextest-spenso> stdout ---
  187. 31.18 s gammaloop-nextest-spenso>
  188. 31.18 s gammaloop-nextest-spenso> running 1 test
  189. 31.18 s gammaloop-nextest-spenso> test dirac::test::feyncalc_reference::dirac_simplify_id46_d_dim_repeated_gamma_slash_sum ... FAILED
  190. 31.18 s gammaloop-nextest-spenso>
  191. 31.18 s gammaloop-nextest-spenso> failures:
  192. 31.18 s gammaloop-nextest-spenso>
  193. 31.18 s gammaloop-nextest-spenso> failures:
  194. 31.18 s gammaloop-nextest-spenso> dirac::test::feyncalc_reference::dirac_simplify_id46_d_dim_repeated_gamma_slash_sum
  195. 31.18 s gammaloop-nextest-spenso>
  196. 31.18 s gammaloop-nextest-spenso> test result: FAILED. 0 passed; 1 failed; 0 ignored; 0 measured; 248 filtered out; finished in 0.01s
  197. 31.18 s gammaloop-nextest-spenso>
  198. 31.18 s gammaloop-nextest-spenso> stderr ---
  199. 31.18 s gammaloop-nextest-spenso>
  200. 31.18 s gammaloop-nextest-spenso> thread 'dirac::test::feyncalc_reference::dirac_simplify_id46_d_dim_repeated_gamma_slash_sum' (501) panicked at crates/idenso/src/dirac/mod.rs:360:5:
  201. 31.18 s gammaloop-nextest-spenso> gamma third argument must be a Minkowski slot
  202. 31.18 s gammaloop-nextest-spenso> stack backtrace:
  203. 31.18 s gammaloop-nextest-spenso> 0: __rustc::rust_begin_unwind
  204. 31.18 s gammaloop-nextest-spenso> 1: core::panicking::panic_fmt
  205. 31.18 s gammaloop-nextest-spenso> 2: idenso::dirac::require_gamma_port
  206. 31.18 s gammaloop-nextest-spenso> 3: idenso::dirac::gamma_tensor
  207. 31.18 s gammaloop-nextest-spenso> 4: idenso::dirac::test::feyncalc_reference::dirac_simplify_id46_d_dim_repeated_gamma_slash_sum
  208. 31.18 s gammaloop-nextest-spenso> 5: <idenso::dirac::test::feyncalc_reference::dirac_simplify_id46_d_dim_repeated_gamma_slash_sum::{closure#0} as core::ops::function::FnOnce<()>>::call_once
  209. 31.18 s gammaloop-nextest-spenso> note: Some details are omitted, run with `RUST_BACKTRACE=full` for a verbose backtrace.
  210. 31.18 s gammaloop-nextest-spenso>
  211. 31.18 s gammaloop-nextest-spenso> FAIL [ 0.034s] ( 91/232) idenso dirac::test::feyncalc_reference::dirac_simplify_id40_repeated_gamma_and_two_trace
  212. 31.18 s gammaloop-nextest-spenso> stdout ---
  213. 31.18 s gammaloop-nextest-spenso>
  214. 31.18 s gammaloop-nextest-spenso> running 1 test
  215. 31.18 s gammaloop-nextest-spenso> test dirac::test::feyncalc_reference::dirac_simplify_id40_repeated_gamma_and_two_trace ... FAILED
  216. 31.18 s gammaloop-nextest-spenso>
  217. 31.18 s gammaloop-nextest-spenso> failures:
  218. 31.18 s gammaloop-nextest-spenso>
  219. 31.18 s gammaloop-nextest-spenso> failures:
  220. 31.18 s gammaloop-nextest-spenso> dirac::test::feyncalc_reference::dirac_simplify_id40_repeated_gamma_and_two_trace
  221. 31.18 s gammaloop-nextest-spenso>
  222. 31.18 s gammaloop-nextest-spenso> test result: FAILED. 0 passed; 1 failed; 0 ignored; 0 measured; 248 filtered out; finished in 0.01s
  223. 31.18 s gammaloop-nextest-spenso>
  224. 31.18 s gammaloop-nextest-spenso> stderr ---
  225. 31.18 s gammaloop-nextest-spenso>
  226. 31.18 s gammaloop-nextest-spenso> thread 'dirac::test::feyncalc_reference::dirac_simplify_id40_repeated_gamma_and_two_trace' (505) panicked at crates/idenso/src/dirac/mod.rs:360:5:
  227. 31.18 s gammaloop-nextest-spenso> gamma third argument must be a Minkowski slot
  228. 31.18 s gammaloop-nextest-spenso> stack backtrace:
  229. 31.18 s gammaloop-nextest-spenso> 0: __rustc::rust_begin_unwind
  230. 31.18 s gammaloop-nextest-spenso> 1: core::panicking::panic_fmt
  231. 31.18 s gammaloop-nextest-spenso> 2: idenso::dirac::require_gamma_port
  232. 31.18 s gammaloop-nextest-spenso> 3: idenso::dirac::gamma_tensor
  233. 31.18 s gammaloop-nextest-spenso> 4: idenso::dirac::test::feyncalc_reference::dirac_simplify_id40_repeated_gamma_and_two_trace
  234. 31.18 s gammaloop-nextest-spenso> 5: <idenso::dirac::test::feyncalc_reference::dirac_simplify_id40_repeated_gamma_and_two_trace::{closure#0} as core::ops::function::FnOnce<()>>::call_once
  235. 31.18 s gammaloop-nextest-spenso> note: Some details are omitted, run with `RUST_BACKTRACE=full` for a verbose backtrace.
  236. 31.18 s gammaloop-nextest-spenso>
  237. 31.18 s gammaloop-nextest-spenso> FAIL [ 0.033s] ( 93/232) idenso dirac::test::feyncalc_reference::dirac_simplify_id4_slash_sandwich
  238. 31.18 s gammaloop-nextest-spenso> stdout ---
  239. 31.18 s gammaloop-nextest-spenso>
  240. 31.18 s gammaloop-nextest-spenso> running 1 test
  241. 31.18 s gammaloop-nextest-spenso> test dirac::test::feyncalc_reference::dirac_simplify_id4_slash_sandwich ... FAILED
  242. 31.18 s gammaloop-nextest-spenso>
  243. 31.18 s gammaloop-nextest-spenso> failures:
  244. 31.18 s gammaloop-nextest-spenso>
  245. 31.18 s gammaloop-nextest-spenso> failures:
  246. 31.18 s gammaloop-nextest-spenso> dirac::test::feyncalc_reference::dirac_simplify_id4_slash_sandwich
  247. 31.18 s gammaloop-nextest-spenso>
  248. 31.18 s gammaloop-nextest-spenso> test result: FAILED. 0 passed; 1 failed; 0 ignored; 0 measured; 248 filtered out; finished in 0.02s
  249. 31.18 s gammaloop-nextest-spenso>
  250. 31.18 s gammaloop-nextest-spenso> stderr ---
  251. 31.18 s gammaloop-nextest-spenso>
  252. 31.18 s gammaloop-nextest-spenso> thread 'dirac::test::feyncalc_reference::dirac_simplify_id4_slash_sandwich' (502) panicked at crates/idenso/src/dirac/mod.rs:360:5:
  253. 31.18 s gammaloop-nextest-spenso> gamma third argument must be a Minkowski slot
  254. 31.18 s gammaloop-nextest-spenso> stack backtrace:
  255. 31.18 s gammaloop-nextest-spenso> 0: __rustc::rust_begin_unwind
  256. 31.18 s gammaloop-nextest-spenso> 1: core::panicking::panic_fmt
  257. 31.18 s gammaloop-nextest-spenso> 2: idenso::dirac::require_gamma_port
  258. 31.18 s gammaloop-nextest-spenso> 3: idenso::dirac::gamma_tensor
  259. 31.18 s gammaloop-nextest-spenso> 4: idenso::dirac::test::feyncalc_reference::dirac_simplify_id4_slash_sandwich
  260. 31.18 s gammaloop-nextest-spenso> 5: <idenso::dirac::test::feyncalc_reference::dirac_simplify_id4_slash_sandwich::{closure#0} as core::ops::function::FnOnce<()>>::call_once
  261. 31.18 s gammaloop-nextest-spenso> note: Some details are omitted, run with `RUST_BACKTRACE=full` for a verbose backtrace.
  262. 31.18 s gammaloop-nextest-spenso>
  263. 31.18 s gammaloop-nextest-spenso> FAIL [ 0.038s] (145/232) idenso reference_cases::tests::reference_case_simplification_snapshots
  264. 31.18 s gammaloop-nextest-spenso> stdout ---
  265. 31.18 s gammaloop-nextest-spenso>
  266. 31.18 s gammaloop-nextest-spenso> running 1 test
  267. 31.18 s gammaloop-nextest-spenso> test reference_cases::tests::reference_case_simplification_snapshots ... FAILED
  268. 31.18 s gammaloop-nextest-spenso>
  269. 31.18 s gammaloop-nextest-spenso> failures:
  270. 31.18 s gammaloop-nextest-spenso>
  271. 31.18 s gammaloop-nextest-spenso> failures:
  272. 31.18 s gammaloop-nextest-spenso> reference_cases::tests::reference_case_simplification_snapshots
  273. 31.18 s gammaloop-nextest-spenso>
  274. 31.18 s gammaloop-nextest-spenso> test result: FAILED. 0 passed; 1 failed; 0 ignored; 0 measured; 248 filtered out; finished in 0.01s
  275. 31.18 s gammaloop-nextest-spenso>
  276. 31.18 s gammaloop-nextest-spenso> stderr ---
  277. 31.18 s gammaloop-nextest-spenso>
  278. 31.18 s gammaloop-nextest-spenso> thread 'reference_cases::tests::reference_case_simplification_snapshots' (694) panicked at crates/idenso/src/dirac/mod.rs:360:5:
  279. 31.18 s gammaloop-nextest-spenso> gamma third argument must be a Minkowski slot
  280. 31.18 s gammaloop-nextest-spenso> stack backtrace:
  281. 31.18 s gammaloop-nextest-spenso> 0: __rustc::rust_begin_unwind
  282. 31.18 s gammaloop-nextest-spenso> 1: core::panicking::panic_fmt
  283. 31.18 s gammaloop-nextest-spenso> 2: idenso::dirac::require_gamma_port
  284. 31.18 s gammaloop-nextest-spenso> 3: idenso::dirac::gamma_tensor
  285. 31.18 s gammaloop-nextest-spenso> 4: idenso::reference_cases::dirac_feyncalc_slash_sandwich_id4
  286. 31.18 s gammaloop-nextest-spenso> 5: <idenso::reference_cases::ReferenceCase>::simplified
  287. 31.19 s gammaloop-nextest-spenso> 6: <core::iter::adapters::map::Map<core::slice::iter::Iter<idenso::reference_cases::ReferenceCase>, idenso::reference_cases::tests::reference_case_simplification_snapshots::{closure#0}> as core::iter::traits::iterator::Iterator>::fold::<(), core::iter::traits::iterator::Iterator::for_each::call<alloc::string::String, <alloc::vec::Vec<alloc::string::String>>::extend_trusted<core::iter::adapters::map::Map<core::slice::iter::Iter<idenso::reference_cases::ReferenceCase>, idenso::reference_cases::tests::reference_case_simplification_snapshots::{closure#0}>>::{closure#0}>::{closure#0}>
  288. 31.19 s gammaloop-nextest-spenso> 7: <alloc::vec::Vec<alloc::string::String> as alloc::vec::spec_from_iter_nested::SpecFromIterNested<alloc::string::String, core::iter::adapters::map::Map<core::slice::iter::Iter<idenso::reference_cases::ReferenceCase>, idenso::reference_cases::tests::reference_case_simplification_snapshots::{closure#0}>>>::from_iter
  289. 31.19 s gammaloop-nextest-spenso> 8: idenso::reference_cases::tests::reference_case_simplification_snapshots
  290. 31.19 s gammaloop-nextest-spenso> 9: <idenso::reference_cases::tests::reference_case_simplification_snapshots::{closure#0} as core::ops::function::FnOnce<()>>::call_once
  291. 31.19 s gammaloop-nextest-spenso> note: Some details are omitted, run with `RUST_BACKTRACE=full` for a verbose backtrace.
  292. 31.19 s gammaloop-nextest-spenso>
  293. 31.19 s gammaloop-nextest-spenso> FAIL [ 0.113s] (224/232) idenso tensor::tests::parsing::infinite_execution
  294. 31.19 s gammaloop-nextest-spenso> stdout ---
  295. 31.19 s gammaloop-nextest-spenso>
  296. 31.19 s gammaloop-nextest-spenso> running 1 test
  297. 31.19 s gammaloop-nextest-spenso> ━━━━━━━━━━━━━━━━━━━━━━━━━━━━━━━ Snapshot Summary ━━━━━━━━━━━━━━━━━━━━━━━━━━━━━━━
  298. 31.19 s gammaloop-nextest-spenso> Snapshot: infinite_execution
  299. 31.19 s gammaloop-nextest-spenso> Source: crates/idenso/src/tensor/tests/parsing.rs:905
  300. 31.19 s gammaloop-nextest-spenso> ────────────────────────────────────────────────────────────────────────────────
  301. 31.19 s gammaloop-nextest-spenso> Expression: net_iter.snapshot_dot()
  302. 31.19 s gammaloop-nextest-spenso> ────────────────────────────────────────────────────────────────────────────────
  303. 31.19 s gammaloop-nextest-spenso> -old snapshot
  304. 31.19 s gammaloop-nextest-spenso> +new results
  305. 31.19 s gammaloop-nextest-spenso> ────────────┬───────────────────────────────────────────────────────────────────
  306. 31.19 s gammaloop-nextest-spenso> 8 8 │ 0:0:s -> ext0 [id=0 color="red"];
  307. 31.19 s gammaloop-nextest-spenso> 9 9 │ ext1 [style=invis];
  308. 31.19 s gammaloop-nextest-spenso> 10 10 │ 0:5:s -> ext1 [id=1 dir=none color="red" label="mink4|l_0"];
  309. 31.19 s gammaloop-nextest-spenso> 11 11 │ ext2 [style=invis];
  310. 31.19 s gammaloop-nextest-spenso> 12 │- 0:4:s -> ext2 [id=2 dir=none color="red" label="bis4|l_2"];
  311. 31.19 s gammaloop-nextest-spenso> 12 │+ 0:3:s -> ext2 [id=2 dir=none color="red" label="mink4|l_1"];
  312. 31.19 s gammaloop-nextest-spenso> 13 13 │ ext3 [style=invis];
  313. 31.19 s gammaloop-nextest-spenso> 14 │- 0:3:s -> ext3 [id=3 dir=none color="red" label="bis4|l_3"];
  314. 31.19 s gammaloop-nextest-spenso> 14 │+ 0:1:s -> ext3 [id=3 dir=none color="red" label="bis4|l_2"];
  315. 31.19 s gammaloop-nextest-spenso> 15 15 │ ext4 [style=invis];
  316. 31.19 s gammaloop-nextest-spenso> 16 │- 0:1:s -> ext4 [id=4 dir=none color="red" label="mink4|l_1"];
  317. 31.19 s gammaloop-nextest-spenso> 16 │+ 0:2:s -> ext4 [id=4 dir=none color="red" label="mink4|l_4"];
  318. 31.19 s gammaloop-nextest-spenso> 17 17 │ ext5 [style=invis];
  319. 31.19 s gammaloop-nextest-spenso> 18 │- 0:2:s -> ext5 [id=5 dir=none color="red" label="mink4|l_4"];
  320. 31.19 s gammaloop-nextest-spenso> 18 │+ 0:4:s -> ext5 [id=5 dir=none color="red" label="bis4|l_3"];
  321. 31.19 s gammaloop-nextest-spenso> 19 19 │ }
  322. 31.19 s gammaloop-nextest-spenso> ────────────┴───────────────────────────────────────────────────────────────────
  323. 31.19 s gammaloop-nextest-spenso> To update snapshots run `cargo insta review`
  324. 31.19 s gammaloop-nextest-spenso> Stopped on the first failure. Run `cargo insta test` to run all snapshots.
  325. 31.19 s gammaloop-nextest-spenso> test tensor::tests::parsing::infinite_execution ... FAILED
  326. 31.19 s gammaloop-nextest-spenso>
  327. 31.19 s gammaloop-nextest-spenso> failures:
  328. 31.19 s gammaloop-nextest-spenso>
  329. 31.19 s gammaloop-nextest-spenso> failures:
  330. 31.19 s gammaloop-nextest-spenso> tensor::tests::parsing::infinite_execution
  331. 31.19 s gammaloop-nextest-spenso>
  332. 31.19 s gammaloop-nextest-spenso> test result: FAILED. 0 passed; 1 failed; 0 ignored; 0 measured; 248 filtered out; finished in 0.09s
  333. 31.19 s gammaloop-nextest-spenso>
  334. 31.19 s gammaloop-nextest-spenso> stderr ---
  335. 31.19 s gammaloop-nextest-spenso>
  336. 31.19 s gammaloop-nextest-spenso> thread 'tensor::tests::parsing::infinite_execution' (856) panicked at /nix/store/g4vv637bgwmy4qf4lv8w7s6sghivpa09-vendor-cargo-deps/c19b7c6f923b580ac259164a89f2577984ad5ab09ee9d583b888f934adbbe8d0/insta-1.47.2/src/runtime.rs:719:13:
  337. 31.19 s gammaloop-nextest-spenso> snapshot assertion for 'infinite_execution' failed in line 905
  338. 31.19 s gammaloop-nextest-spenso> stack backtrace:
  339. 31.19 s gammaloop-nextest-spenso> 0: __rustc::rust_begin_unwind
  340. 31.19 s gammaloop-nextest-spenso> 1: core::panicking::panic_fmt
  341. 31.19 s gammaloop-nextest-spenso> 2: insta::runtime::assert_snapshot
  342. 31.19 s gammaloop-nextest-spenso> 3: idenso::tensor::tests::parsing::infinite_execution
  343. 31.19 s gammaloop-nextest-spenso> 4: <idenso::tensor::tests::parsing::infinite_execution::{closure#0} as core::ops::function::FnOnce<()>>::call_once
  344. 31.19 s gammaloop-nextest-spenso> note: Some details are omitted, run with `RUST_BACKTRACE=full` for a verbose backtrace.
  345. 31.19 s gammaloop-nextest-spenso>
  346. 31.22 s gammaloop-nextest-spenso> error: test run failed
  347. 31.27 s gammaloop-nextest-spenso>
  348. 31.27 s gammaloop-nextest-spenso> ========== nextest test summary ==========
  349. 31.27 s gammaloop-nextest-spenso> report: target/nextest/ci_gammaloop/junit.xml
  350. 31.27 s gammaloop-nextest-spenso> tests: 232, failures: 5, errors: 0
  351. 31.27 s gammaloop-nextest-spenso>
  352. 31.27 s gammaloop-nextest-spenso> 1. idenso::dirac::test::feyncalc_reference::dirac_simplify_id46_d_dim_repeated_gamma_slash_sum
  353. 31.27 s gammaloop-nextest-spenso> failure: test failure with exit code 101
  354. 31.27 s gammaloop-nextest-spenso> thread 'dirac::test::feyncalc_reference::dirac_simplify_id46_d_dim_repeated_gamma_slash_sum' (501) panicked at crates/idenso/src/dirac/mod.rs:360:5:
  355. 31.27 s gammaloop-nextest-spenso> gamma third argument must be a Minkowski slot
  356. 31.27 s gammaloop-nextest-spenso> stack backtrace:
  357. 31.27 s gammaloop-nextest-spenso> 0: __rustc::rust_begin_unwind
  358. 31.27 s gammaloop-nextest-spenso> 1: core::panicking::panic_fmt
  359. 31.27 s gammaloop-nextest-spenso> 2: idenso::dirac::require_gamma_port
  360. 31.27 s gammaloop-nextest-spenso> 3: idenso::dirac::gamma_tensor
  361. 31.27 s gammaloop-nextest-spenso> 4: idenso::dirac::test::feyncalc_reference::dirac_simplify_id46_d_dim_repeated_gamma_slash_sum
  362. 31.27 s gammaloop-nextest-spenso> 5: <idenso::dirac::test::feyncalc_reference::dirac_simplify_id46_d_dim_repeated_gamma_slash_sum::{closure#0} as core::ops::function::FnOnce<()>>::call_once
  363. 31.27 s gammaloop-nextest-spenso> note: Some details are omitted, run with `RUST_BACKTRACE=full` for a verbose backtrace.
  364. 31.27 s gammaloop-nextest-spenso> system-out
  365. 31.27 s gammaloop-nextest-spenso> running 1 test
  366. 31.27 s gammaloop-nextest-spenso> test dirac::test::feyncalc_reference::dirac_simplify_id46_d_dim_repeated_gamma_slash_sum ... FAILED
  367. 31.27 s gammaloop-nextest-spenso>
  368. 31.27 s gammaloop-nextest-spenso> failures:
  369. 31.27 s gammaloop-nextest-spenso>
  370. 31.27 s gammaloop-nextest-spenso> failures:
  371. 31.27 s gammaloop-nextest-spenso> dirac::test::feyncalc_reference::dirac_simplify_id46_d_dim_repeated_gamma_slash_sum
  372. 31.27 s gammaloop-nextest-spenso>
  373. 31.27 s gammaloop-nextest-spenso> test result: FAILED. 0 passed; 1 failed; 0 ignored; 0 measured; 248 filtered out; finished in 0.01s
  374. 31.27 s gammaloop-nextest-spenso> system-err
  375. 31.27 s gammaloop-nextest-spenso> thread 'dirac::test::feyncalc_reference::dirac_simplify_id46_d_dim_repeated_gamma_slash_sum' (501) panicked at crates/idenso/src/dirac/mod.rs:360:5:
  376. 31.27 s gammaloop-nextest-spenso> gamma third argument must be a Minkowski slot
  377. 31.27 s gammaloop-nextest-spenso> stack backtrace:
  378. 31.27 s gammaloop-nextest-spenso> 0: __rustc::rust_begin_unwind
  379. 31.27 s gammaloop-nextest-spenso> 1: core::panicking::panic_fmt
  380. 31.27 s gammaloop-nextest-spenso> 2: idenso::dirac::require_gamma_port
  381. 31.27 s gammaloop-nextest-spenso> 3: idenso::dirac::gamma_tensor
  382. 31.27 s gammaloop-nextest-spenso> 4: idenso::dirac::test::feyncalc_reference::dirac_simplify_id46_d_dim_repeated_gamma_slash_sum
  383. 31.27 s gammaloop-nextest-spenso> 5: <idenso::dirac::test::feyncalc_reference::dirac_simplify_id46_d_dim_repeated_gamma_slash_sum::{closure#0} as core::ops::function::FnOnce<()>>::call_once
  384. 31.27 s gammaloop-nextest-spenso> note: Some details are omitted, run with `RUST_BACKTRACE=full` for a verbose backtrace.
  385. 31.27 s gammaloop-nextest-spenso>
  386. 31.27 s gammaloop-nextest-spenso> 2. idenso::dirac::test::feyncalc_reference::dirac_simplify_id40_repeated_gamma_and_two_trace
  387. 31.27 s gammaloop-nextest-spenso> failure: test failure with exit code 101
  388. 31.27 s gammaloop-nextest-spenso> thread 'dirac::test::feyncalc_reference::dirac_simplify_id40_repeated_gamma_and_two_trace' (505) panicked at crates/idenso/src/dirac/mod.rs:360:5:
  389. 31.27 s gammaloop-nextest-spenso> gamma third argument must be a Minkowski slot
  390. 31.27 s gammaloop-nextest-spenso> stack backtrace:
  391. 31.27 s gammaloop-nextest-spenso> 0: __rustc::rust_begin_unwind
  392. 31.27 s gammaloop-nextest-spenso> 1: core::panicking::panic_fmt
  393. 31.27 s gammaloop-nextest-spenso> 2: idenso::dirac::require_gamma_port
  394. 31.27 s gammaloop-nextest-spenso> 3: idenso::dirac::gamma_tensor
  395. 31.27 s gammaloop-nextest-spenso> 4: idenso::dirac::test::feyncalc_reference::dirac_simplify_id40_repeated_gamma_and_two_trace
  396. 31.27 s gammaloop-nextest-spenso> 5: <idenso::dirac::test::feyncalc_reference::dirac_simplify_id40_repeated_gamma_and_two_trace::{closure#0} as core::ops::function::FnOnce<()>>::call_once
  397. 31.27 s gammaloop-nextest-spenso> note: Some details are omitted, run with `RUST_BACKTRACE=full` for a verbose backtrace.
  398. 31.27 s gammaloop-nextest-spenso> system-out
  399. 31.27 s gammaloop-nextest-spenso> running 1 test
  400. 31.27 s gammaloop-nextest-spenso> test dirac::test::feyncalc_reference::dirac_simplify_id40_repeated_gamma_and_two_trace ... FAILED
  401. 31.27 s gammaloop-nextest-spenso>
  402. 31.27 s gammaloop-nextest-spenso> failures:
  403. 31.27 s gammaloop-nextest-spenso>
  404. 31.27 s gammaloop-nextest-spenso> failures:
  405. 31.27 s gammaloop-nextest-spenso> dirac::test::feyncalc_reference::dirac_simplify_id40_repeated_gamma_and_two_trace
  406. 31.27 s gammaloop-nextest-spenso>
  407. 31.27 s gammaloop-nextest-spenso> test result: FAILED. 0 passed; 1 failed; 0 ignored; 0 measured; 248 filtered out; finished in 0.01s
  408. 31.27 s gammaloop-nextest-spenso> system-err
  409. 31.27 s gammaloop-nextest-spenso> thread 'dirac::test::feyncalc_reference::dirac_simplify_id40_repeated_gamma_and_two_trace' (505) panicked at crates/idenso/src/dirac/mod.rs:360:5:
  410. 31.27 s gammaloop-nextest-spenso> gamma third argument must be a Minkowski slot
  411. 31.27 s gammaloop-nextest-spenso> stack backtrace:
  412. 31.27 s gammaloop-nextest-spenso> 0: __rustc::rust_begin_unwind
  413. 31.27 s gammaloop-nextest-spenso> 1: core::panicking::panic_fmt
  414. 31.27 s gammaloop-nextest-spenso> 2: idenso::dirac::require_gamma_port
  415. 31.27 s gammaloop-nextest-spenso> 3: idenso::dirac::gamma_tensor
  416. 31.27 s gammaloop-nextest-spenso> 4: idenso::dirac::test::feyncalc_reference::dirac_simplify_id40_repeated_gamma_and_two_trace
  417. 31.27 s gammaloop-nextest-spenso> 5: <idenso::dirac::test::feyncalc_reference::dirac_simplify_id40_repeated_gamma_and_two_trace::{closure#0} as core::ops::function::FnOnce<()>>::call_once
  418. 31.27 s gammaloop-nextest-spenso> note: Some details are omitted, run with `RUST_BACKTRACE=full` for a verbose backtrace.
  419. 31.27 s gammaloop-nextest-spenso>
  420. 31.27 s gammaloop-nextest-spenso> 3. idenso::dirac::test::feyncalc_reference::dirac_simplify_id4_slash_sandwich
  421. 31.27 s gammaloop-nextest-spenso> failure: test failure with exit code 101
  422. 31.27 s gammaloop-nextest-spenso> thread 'dirac::test::feyncalc_reference::dirac_simplify_id4_slash_sandwich' (502) panicked at crates/idenso/src/dirac/mod.rs:360:5:
  423. 31.27 s gammaloop-nextest-spenso> gamma third argument must be a Minkowski slot
  424. 31.27 s gammaloop-nextest-spenso> stack backtrace:
  425. 31.27 s gammaloop-nextest-spenso> 0: __rustc::rust_begin_unwind
  426. 31.27 s gammaloop-nextest-spenso> 1: core::panicking::panic_fmt
  427. 31.27 s gammaloop-nextest-spenso> 2: idenso::dirac::require_gamma_port
  428. 31.27 s gammaloop-nextest-spenso> 3: idenso::dirac::gamma_tensor
  429. 31.27 s gammaloop-nextest-spenso> 4: idenso::dirac::test::feyncalc_reference::dirac_simplify_id4_slash_sandwich
  430. 31.27 s gammaloop-nextest-spenso> 5: <idenso::dirac::test::feyncalc_reference::dirac_simplify_id4_slash_sandwich::{closure#0} as core::ops::function::FnOnce<()>>::call_once
  431. 31.27 s gammaloop-nextest-spenso> note: Some details are omitted, run with `RUST_BACKTRACE=full` for a verbose backtrace.
  432. 31.27 s gammaloop-nextest-spenso> system-out
  433. 31.27 s gammaloop-nextest-spenso> running 1 test
  434. 31.27 s gammaloop-nextest-spenso> test dirac::test::feyncalc_reference::dirac_simplify_id4_slash_sandwich ... FAILED
  435. 31.27 s gammaloop-nextest-spenso>
  436. 31.27 s gammaloop-nextest-spenso> failures:
  437. 31.27 s gammaloop-nextest-spenso>
  438. 31.27 s gammaloop-nextest-spenso> failures:
  439. 31.27 s gammaloop-nextest-spenso> dirac::test::feyncalc_reference::dirac_simplify_id4_slash_sandwich
  440. 31.27 s gammaloop-nextest-spenso>
  441. 31.27 s gammaloop-nextest-spenso> test result: FAILED. 0 passed; 1 failed; 0 ignored; 0 measured; 248 filtered out; finished in 0.02s
  442. 31.27 s gammaloop-nextest-spenso> system-err
  443. 31.27 s gammaloop-nextest-spenso> thread 'dirac::test::feyncalc_reference::dirac_simplify_id4_slash_sandwich' (502) panicked at crates/idenso/src/dirac/mod.rs:360:5:
  444. 31.27 s gammaloop-nextest-spenso> gamma third argument must be a Minkowski slot
  445. 31.27 s gammaloop-nextest-spenso> stack backtrace:
  446. 31.27 s gammaloop-nextest-spenso> 0: __rustc::rust_begin_unwind
  447. 31.27 s gammaloop-nextest-spenso> 1: core::panicking::panic_fmt
  448. 31.27 s gammaloop-nextest-spenso> 2: idenso::dirac::require_gamma_port
  449. 31.27 s gammaloop-nextest-spenso> 3: idenso::dirac::gamma_tensor
  450. 31.27 s gammaloop-nextest-spenso> 4: idenso::dirac::test::feyncalc_reference::dirac_simplify_id4_slash_sandwich
  451. 31.27 s gammaloop-nextest-spenso> 5: <idenso::dirac::test::feyncalc_reference::dirac_simplify_id4_slash_sandwich::{closure#0} as core::ops::function::FnOnce<()>>::call_once
  452. 31.27 s gammaloop-nextest-spenso> note: Some details are omitted, run with `RUST_BACKTRACE=full` for a verbose backtrace.
  453. 31.27 s gammaloop-nextest-spenso>
  454. 31.27 s gammaloop-nextest-spenso> 4. idenso::reference_cases::tests::reference_case_simplification_snapshots
  455. 31.27 s gammaloop-nextest-spenso> failure: test failure with exit code 101
  456. 31.27 s gammaloop-nextest-spenso> thread 'reference_cases::tests::reference_case_simplification_snapshots' (694) panicked at crates/idenso/src/dirac/mod.rs:360:5:
  457. 31.27 s gammaloop-nextest-spenso> gamma third argument must be a Minkowski slot
  458. 31.27 s gammaloop-nextest-spenso> stack backtrace:
  459. 31.27 s gammaloop-nextest-spenso> 0: __rustc::rust_begin_unwind
  460. 31.27 s gammaloop-nextest-spenso> 1: core::panicking::panic_fmt
  461. 31.27 s gammaloop-nextest-spenso> 2: idenso::dirac::require_gamma_port
  462. 31.27 s gammaloop-nextest-spenso> 3: idenso::dirac::gamma_tensor
  463. 31.27 s gammaloop-nextest-spenso> 4: idenso::reference_cases::dirac_feyncalc_slash_sandwich_id4
  464. 31.27 s gammaloop-nextest-spenso> 5: <idenso::reference_cases::ReferenceCase>::simplified
  465. 31.27 s gammaloop-nextest-spenso> 6: <core::iter::adapters::map::Map<core::slice::iter::Iter<idenso::reference_cases::ReferenceCase>, idenso::reference_cases::tests::reference_case_simplification_snapshots::{closure#0}> as core::iter::traits::iterator::Iterator>::fold::<(), core::iter::traits::iterator::Iterator::for_each::call<alloc::string::String, <alloc::vec::Vec<alloc::string::String>>::extend_trusted<core::iter::adapters::map::Map<core::slice::iter::Iter<idenso::reference_cases::ReferenceCase>, idenso::reference_cases::tests::reference_case_simplification_snapshots::{closure#0}>>::{closure#0}>::{closure#0}>
  466. 31.27 s gammaloop-nextest-spenso> 7: <alloc::vec::Vec<alloc::string::String> as alloc::vec::spec_from_iter_nested::SpecFromIterNested<alloc::string::String, core::iter::adapters::map::Map<core::slice::iter::Iter<idenso::reference_cases::ReferenceCase>, idenso::reference_cases::tests::reference_case_simplification_snapshots::{closure#0}>>>::from_iter
  467. 31.27 s gammaloop-nextest-spenso> 8: idenso::reference_cases::tests::reference_case_simplification_snapshots
  468. 31.27 s gammaloop-nextest-spenso> 9: <idenso::reference_cases::tests::reference_case_simplification_snapshots::{closure#0} as core::ops::function::FnOnce<()>>::call_once
  469. 31.27 s gammaloop-nextest-spenso> note: Some details are omitted, run with `RUST_BACKTRACE=full` for a verbose backtrace.
  470. 31.27 s gammaloop-nextest-spenso> system-out
  471. 31.27 s gammaloop-nextest-spenso> running 1 test
  472. 31.27 s gammaloop-nextest-spenso> test reference_cases::tests::reference_case_simplification_snapshots ... FAILED
  473. 31.27 s gammaloop-nextest-spenso>
  474. 31.27 s gammaloop-nextest-spenso> failures:
  475. 31.27 s gammaloop-nextest-spenso>
  476. 31.27 s gammaloop-nextest-spenso> failures:
  477. 31.27 s gammaloop-nextest-spenso> reference_cases::tests::reference_case_simplification_snapshots
  478. 31.27 s gammaloop-nextest-spenso>
  479. 31.27 s gammaloop-nextest-spenso> test result: FAILED. 0 passed; 1 failed; 0 ignored; 0 measured; 248 filtered out; finished in 0.01s
  480. 31.27 s gammaloop-nextest-spenso> system-err
  481. 31.27 s gammaloop-nextest-spenso> thread 'reference_cases::tests::reference_case_simplification_snapshots' (694) panicked at crates/idenso/src/dirac/mod.rs:360:5:
  482. 31.27 s gammaloop-nextest-spenso> gamma third argument must be a Minkowski slot
  483. 31.27 s gammaloop-nextest-spenso> stack backtrace:
  484. 31.27 s gammaloop-nextest-spenso> 0: __rustc::rust_begin_unwind
  485. 31.27 s gammaloop-nextest-spenso> 1: core::panicking::panic_fmt
  486. 31.27 s gammaloop-nextest-spenso> 2: idenso::dirac::require_gamma_port
  487. 31.27 s gammaloop-nextest-spenso> 3: idenso::dirac::gamma_tensor
  488. 31.27 s gammaloop-nextest-spenso> 4: idenso::reference_cases::dirac_feyncalc_slash_sandwich_id4
  489. 31.27 s gammaloop-nextest-spenso> 5: <idenso::reference_cases::ReferenceCase>::simplified
  490. 31.28 s gammaloop-nextest-spenso> 6: <core::iter::adapters::map::Map<core::slice::iter::Iter<idenso::reference_cases::ReferenceCase>, idenso::reference_cases::tests::reference_case_simplification_snapshots::{closure#0}> as core::iter::traits::iterator::Iterator>::fold::<(), core::iter::traits::iterator::Iterator::for_each::call<alloc::string::String, <alloc::vec::Vec<alloc::string::String>>::extend_trusted<core::iter::adapters::map::Map<core::slice::iter::Iter<idenso::reference_cases::ReferenceCase>, idenso::reference_cases::tests::reference_case_simplification_snapshots::{closure#0}>>::{closure#0}>::{closure#0}>
  491. 31.28 s gammaloop-nextest-spenso> 7: <alloc::vec::Vec<alloc::string::String> as alloc::vec::spec_from_iter_nested::SpecFromIterNested<alloc::string::String, core::iter::adapters::map::Map<core::slice::iter::Iter<idenso::reference_cases::ReferenceCase>, idenso::reference_cases::tests::reference_case_simplification_snapshots::{closure#0}>>>::from_iter
  492. 31.28 s gammaloop-nextest-spenso> 8: idenso::reference_cases::tests::reference_case_simplification_snapshots
  493. 31.28 s gammaloop-nextest-spenso> 9: <idenso::reference_cases::tests::reference_case_simplification_snapshots::{closure#0} as core::ops::function::FnOnce<()>>::call_once
  494. 31.28 s gammaloop-nextest-spenso> note: Some details are omitted, run with `RUST_BACKTRACE=full` for a verbose backtrace.
  495. 31.28 s gammaloop-nextest-spenso>
  496. 31.28 s gammaloop-nextest-spenso> 5. idenso::tensor::tests::parsing::infinite_execution
  497. 31.28 s gammaloop-nextest-spenso> failure: test failure with exit code 101
  498. 31.28 s gammaloop-nextest-spenso> thread 'tensor::tests::parsing::infinite_execution' (856) panicked at /nix/store/g4vv637bgwmy4qf4lv8w7s6sghivpa09-vendor-cargo-deps/c19b7c6f923b580ac259164a89f2577984ad5ab09ee9d583b888f934adbbe8d0/insta-1.47.2/src/runtime.rs:719:13:
  499. 31.28 s gammaloop-nextest-spenso> snapshot assertion for 'infinite_execution' failed in line 905
  500. 31.28 s gammaloop-nextest-spenso> stack backtrace:
  501. 31.28 s gammaloop-nextest-spenso> 0: __rustc::rust_begin_unwind
  502. 31.28 s gammaloop-nextest-spenso> 1: core::panicking::panic_fmt
  503. 31.28 s gammaloop-nextest-spenso> 2: insta::runtime::assert_snapshot
  504. 31.28 s gammaloop-nextest-spenso> 3: idenso::tensor::tests::parsing::infinite_execution
  505. 31.28 s gammaloop-nextest-spenso> 4: <idenso::tensor::tests::parsing::infinite_execution::{closure#0} as core::ops::function::FnOnce<()>>::call_once
  506. 31.28 s gammaloop-nextest-spenso> note: Some details are omitted, run with `RUST_BACKTRACE=full` for a verbose backtrace.
  507. 31.28 s gammaloop-nextest-spenso> system-out
  508. 31.28 s gammaloop-nextest-spenso> running 1 test
  509. 31.28 s gammaloop-nextest-spenso> ━━━━━━━━━━━━━━━━━━━━━━━━━━━━━━━ Snapshot Summary ━━━━━━━━━━━━━━━━━━━━━━━━━━━━━━━
  510. 31.28 s gammaloop-nextest-spenso> Snapshot: infinite_execution
  511. 31.28 s gammaloop-nextest-spenso> Source: crates/idenso/src/tensor/tests/parsing.rs:905
  512. 31.28 s gammaloop-nextest-spenso> ────────────────────────────────────────────────────────────────────────────────
  513. 31.28 s gammaloop-nextest-spenso> Expression: net_iter.snapshot_dot()
  514. 31.28 s gammaloop-nextest-spenso> ────────────────────────────────────────────────────────────────────────────────
  515. 31.28 s gammaloop-nextest-spenso> -old snapshot
  516. 31.28 s gammaloop-nextest-spenso> +new results
  517. 31.28 s gammaloop-nextest-spenso> ────────────┬───────────────────────────────────────────────────────────────────
  518. 31.28 s gammaloop-nextest-spenso> 8 8 │ 0:0:s-> ext0 [id=0 color="red"];
  519. 31.28 s gammaloop-nextest-spenso> 9 9 │ ext1 [style=invis];
  520. 31.28 s gammaloop-nextest-spenso> 10 10 │ 0:5:s-> ext1 [id=1 dir=none color="red" label="mink4|l_0"];
  521. 31.28 s gammaloop-nextest-spenso> 11 11 │ ext2 [style=invis];
  522. 31.28 s gammaloop-nextest-spenso> 12 │- 0:4:s-> ext2 [id=2 dir=none color="red" label="bis4|l_2"];
  523. 31.28 s gammaloop-nextest-spenso> 12 │+ 0:3:s-> ext2 [id=2 dir=none color="red" label="mink4|l_1"];
  524. 31.28 s gammaloop-nextest-spenso> 13 13 │ ext3 [style=invis];
  525. 31.28 s gammaloop-nextest-spenso> 14 │- 0:3:s-> ext3 [id=3 dir=none color="red" label="bis4|l_3"];
  526. 31.28 s gammaloop-nextest-spenso> 14 │+ 0:1:s-> ext3 [id=3 dir=none color="red" label="bis4|l_2"];
  527. 31.28 s gammaloop-nextest-spenso> 15 15 │ ext4 [style=invis];
  528. 31.28 s gammaloop-nextest-spenso> 16 │- 0:1:s-> ext4 [id=4 dir=none color="red" label="mink4|l_1"];
  529. 31.28 s gammaloop-nextest-spenso> 16 │+ 0:2:s-> ext4 [id=4 dir=none color="red" label="mink4|l_4"];
  530. 31.28 s gammaloop-nextest-spenso> 17 17 │ ext5 [style=invis];
  531. 31.28 s gammaloop-nextest-spenso> 18 │- 0:2:s-> ext5 [id=5 dir=none color="red" label="mink4|l_4"];
  532. 31.28 s gammaloop-nextest-spenso> 18 │+ 0:4:s-> ext5 [id=5 dir=none color="red" label="bis4|l_3"];
  533. 31.28 s gammaloop-nextest-spenso> 19 19 │ }
  534. 31.28 s gammaloop-nextest-spenso> ────────────┴───────────────────────────────────────────────────────────────────
  535. 31.28 s gammaloop-nextest-spenso> To update snapshots run `cargo insta review`
  536. 31.28 s gammaloop-nextest-spenso> Stopped on the first failure. Run `cargo insta test` to run all snapshots.
  537. 31.28 s gammaloop-nextest-spenso> test tensor::tests::parsing::infinite_execution ... FAILED
  538. 31.28 s gammaloop-nextest-spenso>
  539. 31.28 s gammaloop-nextest-spenso> failures:
  540. 31.28 s gammaloop-nextest-spenso>
  541. 31.28 s gammaloop-nextest-spenso> failures:
  542. 31.28 s gammaloop-nextest-spenso> tensor::tests::parsing::infinite_execution
  543. 31.28 s gammaloop-nextest-spenso>
  544. 31.28 s gammaloop-nextest-spenso> test result: FAILED. 0 passed; 1 failed; 0 ignored; 0 measured; 248 filtered out; finished in 0.09s
  545. 31.28 s gammaloop-nextest-spenso> system-err
  546. 31.28 s gammaloop-nextest-spenso> thread 'tensor::tests::parsing::infinite_execution' (856) panicked at /nix/store/g4vv637bgwmy4qf4lv8w7s6sghivpa09-vendor-cargo-deps/c19b7c6f923b580ac259164a89f2577984ad5ab09ee9d583b888f934adbbe8d0/insta-1.47.2/src/runtime.rs:719:13:
  547. 31.28 s gammaloop-nextest-spenso> snapshot assertion for 'infinite_execution' failed in line 905
  548. 31.28 s gammaloop-nextest-spenso> stack backtrace:
  549. 31.28 s gammaloop-nextest-spenso> 0: __rustc::rust_begin_unwind
  550. 31.28 s gammaloop-nextest-spenso> 1: core::panicking::panic_fmt
  551. 31.28 s gammaloop-nextest-spenso> 2: insta::runtime::assert_snapshot
  552. 31.28 s gammaloop-nextest-spenso> 3: idenso::tensor::tests::parsing::infinite_execution
  553. 31.28 s gammaloop-nextest-spenso> 4: <idenso::tensor::tests::parsing::infinite_execution::{closure#0} as core::ops::function::FnOnce<()>>::call_once
  554. 31.28 s gammaloop-nextest-spenso> note: Some details are omitted, run with `RUST_BACKTRACE=full` for a verbose backtrace.
  555. 31.28 s gammaloop-nextest-spenso> =========================================
  556. 31.31 s gammaloop-nextest-spenso> Extracting 2 binaries and 1 linked path to /build/nextest-archive-9V1DY1
  557. 31.44 s gammaloop-nextest-spenso> Extracted 8 files to /build/nextest-archive-9V1DY1 in 0.13s
  558. 31.47 s gammaloop-nextest-spenso> ------------
  559. 31.47 s gammaloop-nextest-spenso> Nextest run ID 034b5a98-1ee1-42f5-b0d1-e046b7fc7472 with nextest profile: ci_gammaloop
  560. 31.47 s gammaloop-nextest-spenso> Starting 195 tests across 2 binaries
  561. 31.79 s gammaloop-nextest-spenso> ------------
  562. 31.79 s gammaloop-nextest-spenso> Summary [ 0.314s] 195 tests run: 195 passed, 0 skipped
  563. 31.86 s gammaloop-nextest-spenso>
  564. 31.86 s gammaloop-nextest-spenso> ========== nextest test summary ==========
  565. 31.86 s gammaloop-nextest-spenso> report: target/nextest/ci_gammaloop/junit.xml
  566. 31.86 s gammaloop-nextest-spenso> tests: 195, failures: 0, errors: 0
  567. 31.86 s gammaloop-nextest-spenso> No failing testcases found.
  568. 31.86 s gammaloop-nextest-spenso> =========================================
  569. 31.89 s gammaloop-nextest-spenso> Extracting 5 binaries and 2 linked paths to /build/nextest-archive-r9L7Uq
  570. 32.22 s gammaloop-nextest-spenso> Extracted 19 files to /build/nextest-archive-r9L7Uq in 0.33s
  571. 32.28 s gammaloop-nextest-spenso> ------------
  572. 32.28 s gammaloop-nextest-spenso> Nextest run ID 90c2b50f-5b15-4979-9c12-a4cf522e47ee with nextest profile: ci_gammaloop
  573. 32.28 s gammaloop-nextest-spenso> Starting 27 tests across 5 binaries (1 test skipped via profile.ci_gammaloop.default-filter)
  574. 32.50 s gammaloop-nextest-spenso> FAIL [ 0.162s] (25/27) spenso-hep-lib::idenso_validation enabled_idenso_reference_cases_validate_against_explicit_tensors
  575. 32.50 s gammaloop-nextest-spenso> stdout ---
  576. 32.50 s gammaloop-nextest-spenso>
  577. 32.50 s gammaloop-nextest-spenso> running 1 test
  578. 32.50 s gammaloop-nextest-spenso> test enabled_idenso_reference_cases_validate_against_explicit_tensors ... FAILED
  579. 32.50 s gammaloop-nextest-spenso>
  580. 32.50 s gammaloop-nextest-spenso> failures:
  581. 32.50 s gammaloop-nextest-spenso>
  582. 32.50 s gammaloop-nextest-spenso> failures:
  583. 32.50 s gammaloop-nextest-spenso> enabled_idenso_reference_cases_validate_against_explicit_tensors
  584. 32.50 s gammaloop-nextest-spenso>
  585. 32.50 s gammaloop-nextest-spenso> test result: FAILED. 0 passed; 1 failed; 0 ignored; 0 measured; 14 filtered out; finished in 0.14s
  586. 32.50 s gammaloop-nextest-spenso>
  587. 32.50 s gammaloop-nextest-spenso> stderr ---
  588. 32.50 s gammaloop-nextest-spenso>
  589. 32.50 s gammaloop-nextest-spenso> thread 'enabled_idenso_reference_cases_validate_against_explicit_tensors' (1666) panicked at crates/idenso/src/dirac/mod.rs:360:5:
  590. 32.50 s gammaloop-nextest-spenso> gamma third argument must be a Minkowski slot
  591. 32.50 s gammaloop-nextest-spenso> stack backtrace:
  592. 32.50 s gammaloop-nextest-spenso> 0: __rustc::rust_begin_unwind
  593. 32.50 s gammaloop-nextest-spenso> 1: core::panicking::panic_fmt
  594. 32.50 s gammaloop-nextest-spenso> 2: idenso::dirac::require_gamma_port
  595. 32.50 s gammaloop-nextest-spenso> 3: idenso::dirac::gamma_tensor
  596. 32.50 s gammaloop-nextest-spenso> 4: idenso::reference_cases::dirac_feyncalc_slash_sandwich_id4
  597. 32.50 s gammaloop-nextest-spenso> 5: <idenso_validation::enabled_idenso_reference_cases_validate_against_explicit_tensors::{closure#0} as core::ops::function::FnOnce<()>>::call_once
  598. 32.50 s gammaloop-nextest-spenso> note: Some details are omitted, run with `RUST_BACKTRACE=full` for a verbose backtrace.
  599. 32.50 s gammaloop-nextest-spenso>
  600. 32.66 s gammaloop-nextest-spenso> ------------
  601. 32.66 s gammaloop-nextest-spenso> Summary [ 0.378s] 27 tests run: 26 passed, 1 failed, 1 skipped
  602. 32.66 s gammaloop-nextest-spenso> FAIL [ 0.162s] (25/27) spenso-hep-lib::idenso_validation enabled_idenso_reference_cases_validate_against_explicit_tensors
  603. 32.66 s gammaloop-nextest-spenso> stdout ---
  604. 32.66 s gammaloop-nextest-spenso>
  605. 32.66 s gammaloop-nextest-spenso> running 1 test
  606. 32.66 s gammaloop-nextest-spenso> test enabled_idenso_reference_cases_validate_against_explicit_tensors ... FAILED
  607. 32.66 s gammaloop-nextest-spenso>
  608. 32.66 s gammaloop-nextest-spenso> failures:
  609. 32.66 s gammaloop-nextest-spenso>
  610. 32.66 s gammaloop-nextest-spenso> failures:
  611. 32.66 s gammaloop-nextest-spenso> enabled_idenso_reference_cases_validate_against_explicit_tensors
  612. 32.66 s gammaloop-nextest-spenso>
  613. 32.66 s gammaloop-nextest-spenso> test result: FAILED. 0 passed; 1 failed; 0 ignored; 0 measured; 14 filtered out; finished in 0.14s
  614. 32.66 s gammaloop-nextest-spenso>
  615. 32.66 s gammaloop-nextest-spenso> stderr ---
  616. 32.66 s gammaloop-nextest-spenso>
  617. 32.66 s gammaloop-nextest-spenso> thread 'enabled_idenso_reference_cases_validate_against_explicit_tensors' (1666) panicked at crates/idenso/src/dirac/mod.rs:360:5:
  618. 32.66 s gammaloop-nextest-spenso> gamma third argument must be a Minkowski slot
  619. 32.66 s gammaloop-nextest-spenso> stack backtrace:
  620. 32.66 s gammaloop-nextest-spenso> 0: __rustc::rust_begin_unwind
  621. 32.66 s gammaloop-nextest-spenso> 1: core::panicking::panic_fmt
  622. 32.66 s gammaloop-nextest-spenso> 2: idenso::dirac::require_gamma_port
  623. 32.66 s gammaloop-nextest-spenso> 3: idenso::dirac::gamma_tensor
  624. 32.66 s gammaloop-nextest-spenso> 4: idenso::reference_cases::dirac_feyncalc_slash_sandwich_id4
  625. 32.66 s gammaloop-nextest-spenso> 5: <idenso_validation::enabled_idenso_reference_cases_validate_against_explicit_tensors::{closure#0} as core::ops::function::FnOnce<()>>::call_once
  626. 32.66 s gammaloop-nextest-spenso> note: Some details are omitted, run with `RUST_BACKTRACE=full` for a verbose backtrace.
  627. 32.66 s gammaloop-nextest-spenso>
  628. 32.71 s gammaloop-nextest-spenso> error: test run failed
  629. 32.75 s gammaloop-nextest-spenso>
  630. 32.75 s gammaloop-nextest-spenso> ========== nextest test summary ==========
  631. 32.75 s gammaloop-nextest-spenso> report: target/nextest/ci_gammaloop/junit.xml
  632. 32.75 s gammaloop-nextest-spenso> tests: 27, failures: 1, errors: 0
  633. 32.75 s gammaloop-nextest-spenso>
  634. 32.75 s gammaloop-nextest-spenso> 1. spenso-hep-lib::idenso_validation::enabled_idenso_reference_cases_validate_against_explicit_tensors
  635. 32.75 s gammaloop-nextest-spenso> failure: test failure with exit code 101
  636. 32.75 s gammaloop-nextest-spenso> thread 'enabled_idenso_reference_cases_validate_against_explicit_tensors' (1666) panicked at crates/idenso/src/dirac/mod.rs:360:5:
  637. 32.75 s gammaloop-nextest-spenso> gamma third argument must be a Minkowski slot
  638. 32.75 s gammaloop-nextest-spenso> stack backtrace:
  639. 32.75 s gammaloop-nextest-spenso> 0: __rustc::rust_begin_unwind
  640. 32.75 s gammaloop-nextest-spenso> 1: core::panicking::panic_fmt
  641. 32.75 s gammaloop-nextest-spenso> 2: idenso::dirac::require_gamma_port
  642. 32.75 s gammaloop-nextest-spenso> 3: idenso::dirac::gamma_tensor
  643. 32.75 s gammaloop-nextest-spenso> 4: idenso::reference_cases::dirac_feyncalc_slash_sandwich_id4
  644. 32.75 s gammaloop-nextest-spenso> 5: <idenso_validation::enabled_idenso_reference_cases_validate_against_explicit_tensors::{closure#0} as core::ops::function::FnOnce<()>>::call_once
  645. 32.75 s gammaloop-nextest-spenso> note: Some details are omitted, run with `RUST_BACKTRACE=full` for a verbose backtrace.
  646. 32.75 s gammaloop-nextest-spenso> system-out
  647. 32.75 s gammaloop-nextest-spenso> running 1 test
  648. 32.75 s gammaloop-nextest-spenso> test enabled_idenso_reference_cases_validate_against_explicit_tensors ... FAILED
  649. 32.75 s gammaloop-nextest-spenso>
  650. 32.75 s gammaloop-nextest-spenso> failures:
  651. 32.75 s gammaloop-nextest-spenso>
  652. 32.75 s gammaloop-nextest-spenso> failures:
  653. 32.75 s gammaloop-nextest-spenso> enabled_idenso_reference_cases_validate_against_explicit_tensors
  654. 32.75 s gammaloop-nextest-spenso>
  655. 32.75 s gammaloop-nextest-spenso> test result: FAILED. 0 passed; 1 failed; 0 ignored; 0 measured; 14 filtered out; finished in 0.14s
  656. 32.75 s gammaloop-nextest-spenso> system-err
  657. 32.75 s gammaloop-nextest-spenso> thread 'enabled_idenso_reference_cases_validate_against_explicit_tensors' (1666) panicked at crates/idenso/src/dirac/mod.rs:360:5:
  658. 32.75 s gammaloop-nextest-spenso> gamma third argument must be a Minkowski slot
  659. 32.75 s gammaloop-nextest-spenso> stack backtrace:
  660. 32.75 s gammaloop-nextest-spenso> 0: __rustc::rust_begin_unwind
  661. 32.75 s gammaloop-nextest-spenso> 1: core::panicking::panic_fmt
  662. 32.75 s gammaloop-nextest-spenso> 2: idenso::dirac::require_gamma_port
  663. 32.75 s gammaloop-nextest-spenso> 3: idenso::dirac::gamma_tensor
  664. 32.75 s gammaloop-nextest-spenso> 4: idenso::reference_cases::dirac_feyncalc_slash_sandwich_id4
  665. 32.75 s gammaloop-nextest-spenso> 5: <idenso_validation::enabled_idenso_reference_cases_validate_against_explicit_tensors::{closure#0} as core::ops::function::FnOnce<()>>::call_once
  666. 32.75 s gammaloop-nextest-spenso> note: Some details are omitted, run with `RUST_BACKTRACE=full` for a verbose backtrace.
  667. 32.75 s gammaloop-nextest-spenso> =========================================
  668. 32.78 s gammaloop-nextest-spenso> Extracting 2 binaries and 1 linked path to /build/nextest-archive-Jh13qq
  669. 32.89 s gammaloop-nextest-spenso> Extracted 8 files to /build/nextest-archive-Jh13qq in 0.11s
  670. 32.94 s gammaloop-nextest-spenso> ------------
  671. 32.94 s gammaloop-nextest-spenso> Nextest run ID a622e619-e12d-4623-a4af-0b1f2952666e with nextest profile: ci_gammaloop
  672. 32.94 s gammaloop-nextest-spenso> Starting 1 test across 2 binaries
  673. 32.96 s gammaloop-nextest-spenso> ------------
  674. 32.96 s gammaloop-nextest-spenso> Summary [ 0.018s] 1 test run: 1 passed, 0 skipped
  675. 33.03 s gammaloop-nextest-spenso>
  676. 33.03 s gammaloop-nextest-spenso> ========== nextest test summary ==========
  677. 33.03 s gammaloop-nextest-spenso> report: target/nextest/ci_gammaloop/junit.xml
  678. 33.03 s gammaloop-nextest-spenso> tests: 1, failures: 0, errors: 0
  679. 33.03 s gammaloop-nextest-spenso> No failing testcases found.
  680. 33.03 s gammaloop-nextest-spenso> =========================================
  681. 33.07 s gammaloop-nextest-spenso> Extracting 1 binary and 1 linked path to /build/nextest-archive-gv1d93
  682. 33.18 s gammaloop-nextest-spenso> Extracted 7 files to /build/nextest-archive-gv1d93 in 0.11s
  683. 33.21 s gammaloop-nextest-spenso> ------------
  684. 33.21 s gammaloop-nextest-spenso> Nextest run ID 1e50c957-1200-4e44-96fa-d774f1c67565 with nextest profile: ci_gammaloop
  685. 33.21 s gammaloop-nextest-spenso> Starting 0 tests across 1 binary
  686. 33.21 s gammaloop-nextest-spenso> ------------
  687. 33.21 s gammaloop-nextest-spenso> Summary [ 0.001s] 0 tests run: 0 passed, 0 skipped
  688. 33.32 s gammaloop-nextest-spenso>
  689. 33.33 s gammaloop-nextest-spenso> ========== nextest test summary ==========
  690. 33.33 s gammaloop-nextest-spenso> report: target/nextest/ci_gammaloop/junit.xml
  691. 33.33 s gammaloop-nextest-spenso> tests: 0, failures: 0, errors: 0
  692. 33.33 s gammaloop-nextest-spenso> No failing testcases found.
  693. 33.33 s gammaloop-nextest-spenso> =========================================
  694. 33.38 s [0 built (1 failed)]error: Cannot build '/nix/store/pcw901lvh10nhiz9sizq4ncxl7hk2sj8-gammaloop-nextest-spenso.drv'.
  695. 33.38 s Reason: builder failed with exit code 100.
  696. 33.38 s Output paths:
  697. 33.38 s /nix/store/svfvfmdbxmky2ygprd3qgwr8zggj7a43-gammaloop-nextest-spenso
  698. 33.38 s Last 677 log lines:
  699. 33.38 s > Extracting 5 binaries and 2 linked paths to /build/nextest-archive-k85fdx
  700. 33.38 s > Extracted 19 files to /build/nextest-archive-k85fdx in 0.28s
  701. 33.38 s > ------------
  702. 33.38 s > Nextest run ID aecef523-6de8-44f5-b486-42e444028599 with nextest profile: ci_gammaloop
  703. 33.38 s > Starting 232 tests across 5 binaries (26 tests skipped, including 2 tests via profile.ci_gammaloop.default-filter)
  704. 33.38 s > FAIL [ 0.026s] ( 90/232) idenso dirac::test::feyncalc_reference::dirac_simplify_id46_d_dim_repeated_gamma_slash_sum
  705. 33.38 s > stdout ---
  706. 33.38 s >
  707. 33.38 s > running 1 test
  708. 33.38 s > test dirac::test::feyncalc_reference::dirac_simplify_id46_d_dim_repeated_gamma_slash_sum ... FAILED
  709. 33.38 s >
  710. 33.38 s > failures:
  711. 33.38 s >
  712. 33.38 s > failures:
  713. 33.38 s > dirac::test::feyncalc_reference::dirac_simplify_id46_d_dim_repeated_gamma_slash_sum
  714. 33.38 s >
  715. 33.38 s > test result: FAILED. 0 passed; 1 failed; 0 ignored; 0 measured; 248 filtered out; finished in 0.01s
  716. 33.38 s >
  717. 33.38 s > stderr ---
  718. 33.38 s >
  719. 33.38 s > thread 'dirac::test::feyncalc_reference::dirac_simplify_id46_d_dim_repeated_gamma_slash_sum' (501) panicked at crates/idenso/src/dirac/mod.rs:360:5:
  720. 33.38 s > gamma third argument must be a Minkowski slot
  721. 33.38 s > stack backtrace:
  722. 33.38 s > 0: __rustc::rust_begin_unwind
  723. 33.38 s > 1: core::panicking::panic_fmt
  724. 33.38 s > 2: idenso::dirac::require_gamma_port
  725. 33.38 s > 3: idenso::dirac::gamma_tensor
  726. 33.38 s > 4: idenso::dirac::test::feyncalc_reference::dirac_simplify_id46_d_dim_repeated_gamma_slash_sum
  727. 33.38 s > 5: <idenso::dirac::test::feyncalc_reference::dirac_simplify_id46_d_dim_repeated_gamma_slash_sum::{closure#0} as core::ops::function::FnOnce<()>>::call_once
  728. 33.38 s > note: Some details are omitted, run with `RUST_BACKTRACE=full` for a verbose backtrace.
  729. 33.38 s >
  730. 33.38 s > FAIL [ 0.034s] ( 91/232) idenso dirac::test::feyncalc_reference::dirac_simplify_id40_repeated_gamma_and_two_trace
  731. 33.38 s > stdout ---
  732. 33.38 s >
  733. 33.38 s > running 1 test
  734. 33.38 s > test dirac::test::feyncalc_reference::dirac_simplify_id40_repeated_gamma_and_two_trace ... FAILED
  735. 33.38 s >
  736. 33.38 s > failures:
  737. 33.38 s >
  738. 33.38 s > failures:
  739. 33.38 s > dirac::test::feyncalc_reference::dirac_simplify_id40_repeated_gamma_and_two_trace
  740. 33.38 s >
  741. 33.38 s > test result: FAILED. 0 passed; 1 failed; 0 ignored; 0 measured; 248 filtered out; finished in 0.01s
  742. 33.38 s >
  743. 33.38 s > stderr ---
  744. 33.38 s >
  745. 33.38 s > thread 'dirac::test::feyncalc_reference::dirac_simplify_id40_repeated_gamma_and_two_trace' (505) panicked at crates/idenso/src/dirac/mod.rs:360:5:
  746. 33.38 s > gamma third argument must be a Minkowski slot
  747. 33.38 s > stack backtrace:
  748. 33.38 s > 0: __rustc::rust_begin_unwind
  749. 33.38 s > 1: core::panicking::panic_fmt
  750. 33.38 s > 2: idenso::dirac::require_gamma_port
  751. 33.38 s > 3: idenso::dirac::gamma_tensor
  752. 33.38 s > 4: idenso::dirac::test::feyncalc_reference::dirac_simplify_id40_repeated_gamma_and_two_trace
  753. 33.38 s > 5: <idenso::dirac::test::feyncalc_reference::dirac_simplify_id40_repeated_gamma_and_two_trace::{closure#0} as core::ops::function::FnOnce<()>>::call_once
  754. 33.38 s > note: Some details are omitted, run with `RUST_BACKTRACE=full` for a verbose backtrace.
  755. 33.38 s >
  756. 33.38 s > FAIL [ 0.033s] ( 93/232) idenso dirac::test::feyncalc_reference::dirac_simplify_id4_slash_sandwich
  757. 33.38 s > stdout ---
  758. 33.38 s >
  759. 33.38 s > running 1 test
  760. 33.38 s > test dirac::test::feyncalc_reference::dirac_simplify_id4_slash_sandwich ... FAILED
  761. 33.38 s >
  762. 33.38 s > failures:
  763. 33.38 s >
  764. 33.38 s > failures:
  765. 33.38 s > dirac::test::feyncalc_reference::dirac_simplify_id4_slash_sandwich
  766. 33.38 s >
  767. 33.38 s > test result: FAILED. 0 passed; 1 failed; 0 ignored; 0 measured; 248 filtered out; finished in 0.02s
  768. 33.38 s >
  769. 33.38 s > stderr ---
  770. 33.38 s >
  771. 33.38 s > thread 'dirac::test::feyncalc_reference::dirac_simplify_id4_slash_sandwich' (502) panicked at crates/idenso/src/dirac/mod.rs:360:5:
  772. 33.38 s > gamma third argument must be a Minkowski slot
  773. 33.38 s > stack backtrace:
  774. 33.38 s > 0: __rustc::rust_begin_unwind
  775. 33.38 s > 1: core::panicking::panic_fmt
  776. 33.38 s > 2: idenso::dirac::require_gamma_port
  777. 33.38 s > 3: idenso::dirac::gamma_tensor
  778. 33.38 s > 4: idenso::dirac::test::feyncalc_reference::dirac_simplify_id4_slash_sandwich
  779. 33.38 s > 5: <idenso::dirac::test::feyncalc_reference::dirac_simplify_id4_slash_sandwich::{closure#0} as core::ops::function::FnOnce<()>>::call_once
  780. 33.38 s > note: Some details are omitted, run with `RUST_BACKTRACE=full` for a verbose backtrace.
  781. 33.38 s >
  782. 33.38 s > FAIL [ 0.038s] (145/232) idenso reference_cases::tests::reference_case_simplification_snapshots
  783. 33.38 s > stdout ---
  784. 33.38 s >
  785. 33.38 s > running 1 test
  786. 33.38 s > test reference_cases::tests::reference_case_simplification_snapshots ... FAILED
  787. 33.38 s >
  788. 33.38 s > failures:
  789. 33.38 s >
  790. 33.38 s > failures:
  791. 33.38 s > reference_cases::tests::reference_case_simplification_snapshots
  792. 33.38 s >
  793. 33.38 s > test result: FAILED. 0 passed; 1 failed; 0 ignored; 0 measured; 248 filtered out; finished in 0.01s
  794. 33.38 s >
  795. 33.38 s > stderr ---
  796. 33.38 s >
  797. 33.38 s > thread 'reference_cases::tests::reference_case_simplification_snapshots' (694) panicked at crates/idenso/src/dirac/mod.rs:360:5:
  798. 33.38 s > gamma third argument must be a Minkowski slot
  799. 33.38 s > stack backtrace:
  800. 33.38 s > 0: __rustc::rust_begin_unwind
  801. 33.38 s > 1: core::panicking::panic_fmt
  802. 33.38 s > 2: idenso::dirac::require_gamma_port
  803. 33.38 s > 3: idenso::dirac::gamma_tensor
  804. 33.38 s > 4: idenso::reference_cases::dirac_feyncalc_slash_sandwich_id4
  805. 33.38 s > 5: <idenso::reference_cases::ReferenceCase>::simplified
  806. 33.38 s > 6: <core::iter::adapters::map::Map<core::slice::iter::Iter<idenso::reference_cases::ReferenceCase>, idenso::reference_cases::tests::reference_case_simplification_snapshots::{closure#0}> as core::iter::traits::iterator::Iterator>::fold::<(), core::iter::traits::iterator::Iterator::for_each::call<alloc::string::String, <alloc::vec::Vec<alloc::string::String>>::extend_trusted<core::iter::adapters::map::Map<core::slice::iter::Iter<idenso::reference_cases::ReferenceCase>, idenso::reference_cases::tests::reference_case_simplification_snapshots::{closure#0}>>::{closure#0}>::{closure#0}>
  807. 33.38 s > 7: <alloc::vec::Vec<alloc::string::String> as alloc::vec::spec_from_iter_nested::SpecFromIterNested<alloc::string::String, core::iter::adapters::map::Map<core::slice::iter::Iter<idenso::reference_cases::ReferenceCase>, idenso::reference_cases::tests::reference_case_simplification_snapshots::{closure#0}>>>::from_iter
  808. 33.38 s > 8: idenso::reference_cases::tests::reference_case_simplification_snapshots
  809. 33.38 s > 9: <idenso::reference_cases::tests::reference_case_simplification_snapshots::{closure#0} as core::ops::function::FnOnce<()>>::call_once
  810. 33.38 s > note: Some details are omitted, run with `RUST_BACKTRACE=full` for a verbose backtrace.
  811. 33.38 s >
  812. 33.38 s > FAIL [ 0.113s] (224/232) idenso tensor::tests::parsing::infinite_execution
  813. 33.38 s > stdout ---
  814. 33.38 s >
  815. 33.38 s > running 1 test
  816. 33.38 s > ━━━━━━━━━━━━━━━━━━━━━━━━━━━━━━━ Snapshot Summary ━━━━━━━━━━━━━━━━━━━━━━━━━━━━━━━
  817. 33.38 s > Snapshot: infinite_execution
  818. 33.38 s > Source: crates/idenso/src/tensor/tests/parsing.rs:905
  819. 33.38 s > ────────────────────────────────────────────────────────────────────────────────
  820. 33.38 s > Expression: net_iter.snapshot_dot()
  821. 33.38 s > ────────────────────────────────────────────────────────────────────────────────
  822. 33.38 s > -old snapshot
  823. 33.38 s > +new results
  824. 33.38 s > ────────────┬───────────────────────────────────────────────────────────────────
  825. 33.38 s > 8 8 │ 0:0:s -> ext0 [id=0 color="red"];
  826. 33.38 s > 9 9 │ ext1 [style=invis];
  827. 33.38 s > 10 10 │ 0:5:s -> ext1 [id=1 dir=none color="red" label="mink4|l_0"];
  828. 33.38 s > 11 11 │ ext2 [style=invis];
  829. 33.38 s > 12 │- 0:4:s -> ext2 [id=2 dir=none color="red" label="bis4|l_2"];
  830. 33.38 s > 12 │+ 0:3:s -> ext2 [id=2 dir=none color="red" label="mink4|l_1"];
  831. 33.38 s > 13 13 │ ext3 [style=invis];
  832. 33.38 s > 14 │- 0:3:s -> ext3 [id=3 dir=none color="red" label="bis4|l_3"];
  833. 33.38 s > 14 │+ 0:1:s -> ext3 [id=3 dir=none color="red" label="bis4|l_2"];
  834. 33.38 s > 15 15 │ ext4 [style=invis];
  835. 33.38 s > 16 │- 0:1:s -> ext4 [id=4 dir=none color="red" label="mink4|l_1"];
  836. 33.38 s > 16 │+ 0:2:s -> ext4 [id=4 dir=none color="red" label="mink4|l_4"];
  837. 33.38 s > 17 17 │ ext5 [style=invis];
  838. 33.38 s > 18 │- 0:2:s -> ext5 [id=5 dir=none color="red" label="mink4|l_4"];
  839. 33.38 s > 18 │+ 0:4:s -> ext5 [id=5 dir=none color="red" label="bis4|l_3"];
  840. 33.38 s > 19 19 │ }
  841. 33.38 s > ────────────┴───────────────────────────────────────────────────────────────────
  842. 33.38 s > To update snapshots run `cargo insta review`
  843. 33.38 s > Stopped on the first failure. Run `cargo insta test` to run all snapshots.
  844. 33.38 s > test tensor::tests::parsing::infinite_execution ... FAILED
  845. 33.38 s >
  846. 33.38 s > failures:
  847. 33.38 s >
  848. 33.38 s > failures:
  849. 33.38 s > tensor::tests::parsing::infinite_execution
  850. 33.38 s >
  851. 33.38 s > test result: FAILED. 0 passed; 1 failed; 0 ignored; 0 measured; 248 filtered out; finished in 0.09s
  852. 33.38 s >
  853. 33.38 s > stderr ---
  854. 33.38 s >
  855. 33.38 s > thread 'tensor::tests::parsing::infinite_execution' (856) panicked at /nix/store/g4vv637bgwmy4qf4lv8w7s6sghivpa09-vendor-cargo-deps/c19b7c6f923b580ac259164a89f2577984ad5ab09ee9d583b888f934adbbe8d0/insta-1.47.2/src/runtime.rs:719:13:
  856. 33.38 s > snapshot assertion for 'infinite_execution' failed in line 905
  857. 33.38 s > stack backtrace:
  858. 33.38 s > 0: __rustc::rust_begin_unwind
  859. 33.38 s > 1: core::panicking::panic_fmt
  860. 33.38 s > 2: insta::runtime::assert_snapshot
  861. 33.38 s > 3: idenso::tensor::tests::parsing::infinite_execution
  862. 33.38 s > 4: <idenso::tensor::tests::parsing::infinite_execution::{closure#0} as core::ops::function::FnOnce<()>>::call_once
  863. 33.38 s > note: Some details are omitted, run with `RUST_BACKTRACE=full` for a verbose backtrace.
  864. 33.38 s >
  865. 33.38 s > ------------
  866. 33.38 s > Summary [ 2.564s] 232 tests run: 227 passed, 5 failed, 26 skipped
  867. 33.38 s > FAIL [ 0.026s] ( 90/232) idenso dirac::test::feyncalc_reference::dirac_simplify_id46_d_dim_repeated_gamma_slash_sum
  868. 33.38 s > stdout ---
  869. 33.38 s >
  870. 33.38 s > running 1 test
  871. 33.38 s > test dirac::test::feyncalc_reference::dirac_simplify_id46_d_dim_repeated_gamma_slash_sum ... FAILED
  872. 33.38 s >
  873. 33.38 s > failures:
  874. 33.38 s >
  875. 33.38 s > failures:
  876. 33.38 s > dirac::test::feyncalc_reference::dirac_simplify_id46_d_dim_repeated_gamma_slash_sum
  877. 33.38 s >
  878. 33.38 s > test result: FAILED. 0 passed; 1 failed; 0 ignored; 0 measured; 248 filtered out; finished in 0.01s
  879. 33.38 s >
  880. 33.38 s > stderr ---
  881. 33.38 s >
  882. 33.38 s > thread 'dirac::test::feyncalc_reference::dirac_simplify_id46_d_dim_repeated_gamma_slash_sum' (501) panicked at crates/idenso/src/dirac/mod.rs:360:5:
  883. 33.38 s > gamma third argument must be a Minkowski slot
  884. 33.38 s > stack backtrace:
  885. 33.38 s > 0: __rustc::rust_begin_unwind
  886. 33.38 s > 1: core::panicking::panic_fmt
  887. 33.38 s > 2: idenso::dirac::require_gamma_port
  888. 33.38 s > 3: idenso::dirac::gamma_tensor
  889. 33.38 s > 4: idenso::dirac::test::feyncalc_reference::dirac_simplify_id46_d_dim_repeated_gamma_slash_sum
  890. 33.38 s > 5: <idenso::dirac::test::feyncalc_reference::dirac_simplify_id46_d_dim_repeated_gamma_slash_sum::{closure#0} as core::ops::function::FnOnce<()>>::call_once
  891. 33.38 s > note: Some details are omitted, run with `RUST_BACKTRACE=full` for a verbose backtrace.
  892. 33.38 s >
  893. 33.38 s > FAIL [ 0.034s] ( 91/232) idenso dirac::test::feyncalc_reference::dirac_simplify_id40_repeated_gamma_and_two_trace
  894. 33.38 s > stdout ---
  895. 33.38 s >
  896. 33.38 s > running 1 test
  897. 33.38 s > test dirac::test::feyncalc_reference::dirac_simplify_id40_repeated_gamma_and_two_trace ... FAILED
  898. 33.38 s >
  899. 33.38 s > failures:
  900. 33.38 s >
  901. 33.38 s > failures:
  902. 33.38 s > dirac::test::feyncalc_reference::dirac_simplify_id40_repeated_gamma_and_two_trace
  903. 33.38 s >
  904. 33.38 s > test result: FAILED. 0 passed; 1 failed; 0 ignored; 0 measured; 248 filtered out; finished in 0.01s
  905. 33.38 s >
  906. 33.38 s > stderr ---
  907. 33.38 s >
  908. 33.38 s > thread 'dirac::test::feyncalc_reference::dirac_simplify_id40_repeated_gamma_and_two_trace' (505) panicked at crates/idenso/src/dirac/mod.rs:360:5:
  909. 33.38 s > gamma third argument must be a Minkowski slot
  910. 33.38 s > stack backtrace:
  911. 33.38 s > 0: __rustc::rust_begin_unwind
  912. 33.38 s > 1: core::panicking::panic_fmt
  913. 33.38 s > 2: idenso::dirac::require_gamma_port
  914. 33.38 s > 3: idenso::dirac::gamma_tensor
  915. 33.38 s > 4: idenso::dirac::test::feyncalc_reference::dirac_simplify_id40_repeated_gamma_and_two_trace
  916. 33.38 s > 5: <idenso::dirac::test::feyncalc_reference::dirac_simplify_id40_repeated_gamma_and_two_trace::{closure#0} as core::ops::function::FnOnce<()>>::call_once
  917. 33.38 s > note: Some details are omitted, run with `RUST_BACKTRACE=full` for a verbose backtrace.
  918. 33.38 s >
  919. 33.38 s > FAIL [ 0.033s] ( 93/232) idenso dirac::test::feyncalc_reference::dirac_simplify_id4_slash_sandwich
  920. 33.38 s > stdout ---
  921. 33.38 s >
  922. 33.38 s > running 1 test
  923. 33.38 s > test dirac::test::feyncalc_reference::dirac_simplify_id4_slash_sandwich ... FAILED
  924. 33.38 s >
  925. 33.38 s > failures:
  926. 33.38 s >
  927. 33.38 s > failures:
  928. 33.38 s > dirac::test::feyncalc_reference::dirac_simplify_id4_slash_sandwich
  929. 33.38 s >
  930. 33.38 s > test result: FAILED. 0 passed; 1 failed; 0 ignored; 0 measured; 248 filtered out; finished in 0.02s
  931. 33.38 s >
  932. 33.38 s > stderr ---
  933. 33.38 s >
  934. 33.38 s > thread 'dirac::test::feyncalc_reference::dirac_simplify_id4_slash_sandwich' (502) panicked at crates/idenso/src/dirac/mod.rs:360:5:
  935. 33.38 s > gamma third argument must be a Minkowski slot
  936. 33.38 s > stack backtrace:
  937. 33.38 s > 0: __rustc::rust_begin_unwind
  938. 33.38 s > 1: core::panicking::panic_fmt
  939. 33.38 s > 2: idenso::dirac::require_gamma_port
  940. 33.38 s > 3: idenso::dirac::gamma_tensor
  941. 33.38 s > 4: idenso::dirac::test::feyncalc_reference::dirac_simplify_id4_slash_sandwich
  942. 33.38 s > 5: <idenso::dirac::test::feyncalc_reference::dirac_simplify_id4_slash_sandwich::{closure#0} as core::ops::function::FnOnce<()>>::call_once
  943. 33.38 s > note: Some details are omitted, run with `RUST_BACKTRACE=full` for a verbose backtrace.
  944. 33.38 s >
  945. 33.38 s > FAIL [ 0.038s] (145/232) idenso reference_cases::tests::reference_case_simplification_snapshots
  946. 33.38 s > stdout ---
  947. 33.38 s >
  948. 33.38 s > running 1 test
  949. 33.38 s > test reference_cases::tests::reference_case_simplification_snapshots ... FAILED
  950. 33.38 s >
  951. 33.38 s > failures:
  952. 33.38 s >
  953. 33.38 s > failures:
  954. 33.38 s > reference_cases::tests::reference_case_simplification_snapshots
  955. 33.38 s >
  956. 33.38 s > test result: FAILED. 0 passed; 1 failed; 0 ignored; 0 measured; 248 filtered out; finished in 0.01s
  957. 33.38 s >
  958. 33.38 s > stderr ---
  959. 33.38 s >
  960. 33.38 s > thread 'reference_cases::tests::reference_case_simplification_snapshots' (694) panicked at crates/idenso/src/dirac/mod.rs:360:5:
  961. 33.38 s > gamma third argument must be a Minkowski slot
  962. 33.38 s > stack backtrace:
  963. 33.38 s > 0: __rustc::rust_begin_unwind
  964. 33.38 s > 1: core::panicking::panic_fmt
  965. 33.38 s > 2: idenso::dirac::require_gamma_port
  966. 33.38 s > 3: idenso::dirac::gamma_tensor
  967. 33.38 s > 4: idenso::reference_cases::dirac_feyncalc_slash_sandwich_id4
  968. 33.38 s > 5: <idenso::reference_cases::ReferenceCase>::simplified
  969. 33.38 s > 6: <core::iter::adapters::map::Map<core::slice::iter::Iter<idenso::reference_cases::ReferenceCase>, idenso::reference_cases::tests::reference_case_simplification_snapshots::{closure#0}> as core::iter::traits::iterator::Iterator>::fold::<(), core::iter::traits::iterator::Iterator::for_each::call<alloc::string::String, <alloc::vec::Vec<alloc::string::String>>::extend_trusted<core::iter::adapters::map::Map<core::slice::iter::Iter<idenso::reference_cases::ReferenceCase>, idenso::reference_cases::tests::reference_case_simplification_snapshots::{closure#0}>>::{closure#0}>::{closure#0}>
  970. 33.38 s > 7: <alloc::vec::Vec<alloc::string::String> as alloc::vec::spec_from_iter_nested::SpecFromIterNested<alloc::string::String, core::iter::adapters::map::Map<core::slice::iter::Iter<idenso::reference_cases::ReferenceCase>, idenso::reference_cases::tests::reference_case_simplification_snapshots::{closure#0}>>>::from_iter
  971. 33.38 s > 8: idenso::reference_cases::tests::reference_case_simplification_snapshots
  972. 33.38 s > 9: <idenso::reference_cases::tests::reference_case_simplification_snapshots::{closure#0} as core::ops::function::FnOnce<()>>::call_once
  973. 33.38 s > note: Some details are omitted, run with `RUST_BACKTRACE=full` for a verbose backtrace.
  974. 33.38 s >
  975. 33.38 s > FAIL [ 0.113s] (224/232) idenso tensor::tests::parsing::infinite_execution
  976. 33.38 s > stdout ---
  977. 33.38 s >
  978. 33.38 s > running 1 test
  979. 33.38 s > ━━━━━━━━━━━━━━━━━━━━━━━━━━━━━━━ Snapshot Summary ━━━━━━━━━━━━━━━━━━━━━━━━━━━━━━━
  980. 33.38 s > Snapshot: infinite_execution
  981. 33.38 s > Source: crates/idenso/src/tensor/tests/parsing.rs:905
  982. 33.38 s > ────────────────────────────────────────────────────────────────────────────────
  983. 33.38 s > Expression: net_iter.snapshot_dot()
  984. 33.38 s > ────────────────────────────────────────────────────────────────────────────────
  985. 33.38 s > -old snapshot
  986. 33.38 s > +new results
  987. 33.38 s > ────────────┬───────────────────────────────────────────────────────────────────
  988. 33.38 s > 8 8 │ 0:0:s -> ext0 [id=0 color="red"];
  989. 33.38 s > 9 9 │ ext1 [style=invis];
  990. 33.38 s > 10 10 │ 0:5:s -> ext1 [id=1 dir=none color="red" label="mink4|l_0"];
  991. 33.38 s > 11 11 │ ext2 [style=invis];
  992. 33.38 s > 12 │- 0:4:s -> ext2 [id=2 dir=none color="red" label="bis4|l_2"];
  993. 33.38 s > 12 │+ 0:3:s -> ext2 [id=2 dir=none color="red" label="mink4|l_1"];
  994. 33.38 s > 13 13 │ ext3 [style=invis];
  995. 33.38 s > 14 │- 0:3:s -> ext3 [id=3 dir=none color="red" label="bis4|l_3"];
  996. 33.38 s > 14 │+ 0:1:s -> ext3 [id=3 dir=none color="red" label="bis4|l_2"];
  997. 33.38 s > 15 15 │ ext4 [style=invis];
  998. 33.38 s > 16 │- 0:1:s -> ext4 [id=4 dir=none color="red" label="mink4|l_1"];
  999. 33.38 s > 16 │+ 0:2:s -> ext4 [id=4 dir=none color="red" label="mink4|l_4"];
  1000. 33.38 s > 17 17 │ ext5 [style=invis];
  1001. 33.38 s > 18 │- 0:2:s -> ext5 [id=5 dir=none color="red" label="mink4|l_4"];
  1002. 33.38 s > 18 │+ 0:4:s -> ext5 [id=5 dir=none color="red" label="bis4|l_3"];
  1003. 33.38 s > 19 19 │ }
  1004. 33.38 s > ────────────┴───────────────────────────────────────────────────────────────────
  1005. 33.38 s > To update snapshots run `cargo insta review`
  1006. 33.38 s > Stopped on the first failure. Run `cargo insta test` to run all snapshots.
  1007. 33.38 s > test tensor::tests::parsing::infinite_execution ... FAILED
  1008. 33.38 s >
  1009. 33.38 s > failures:
  1010. 33.38 s >
  1011. 33.38 s > failures:
  1012. 33.38 s > tensor::tests::parsing::infinite_execution
  1013. 33.38 s >
  1014. 33.38 s > test result: FAILED. 0 passed; 1 failed; 0 ignored; 0 measured; 248 filtered out; finished in 0.09s
  1015. 33.38 s >
  1016. 33.38 s > stderr ---
  1017. 33.38 s >
  1018. 33.38 s > thread 'tensor::tests::parsing::infinite_execution' (856) panicked at /nix/store/g4vv637bgwmy4qf4lv8w7s6sghivpa09-vendor-cargo-deps/c19b7c6f923b580ac259164a89f2577984ad5ab09ee9d583b888f934adbbe8d0/insta-1.47.2/src/runtime.rs:719:13:
  1019. 33.38 s > snapshot assertion for 'infinite_execution' failed in line 905
  1020. 33.38 s > stack backtrace:
  1021. 33.38 s > 0: __rustc::rust_begin_unwind
  1022. 33.38 s > 1: core::panicking::panic_fmt
  1023. 33.38 s > 2: insta::runtime::assert_snapshot
  1024. 33.38 s > 3: idenso::tensor::tests::parsing::infinite_execution
  1025. 33.38 s > 4: <idenso::tensor::tests::parsing::infinite_execution::{closure#0} as core::ops::function::FnOnce<()>>::call_once
  1026. 33.38 s > note: Some details are omitted, run with `RUST_BACKTRACE=full` for a verbose backtrace.
  1027. 33.38 s >
  1028. 33.38 s > error: test run failed
  1029. 33.38 s >
  1030. 33.38 s > ========== nextest test summary ==========
  1031. 33.38 s > report: target/nextest/ci_gammaloop/junit.xml
  1032. 33.38 s > tests: 232, failures: 5, errors: 0
  1033. 33.38 s >
  1034. 33.38 s > 1. idenso::dirac::test::feyncalc_reference::dirac_simplify_id46_d_dim_repeated_gamma_slash_sum
  1035. 33.38 s > failure: test failure with exit code 101
  1036. 33.38 s > thread 'dirac::test::feyncalc_reference::dirac_simplify_id46_d_dim_repeated_gamma_slash_sum' (501) panicked at crates/idenso/src/dirac/mod.rs:360:5:
  1037. 33.38 s > gamma third argument must be a Minkowski slot
  1038. 33.38 s > stack backtrace:
  1039. 33.38 s > 0: __rustc::rust_begin_unwind
  1040. 33.38 s > 1: core::panicking::panic_fmt
  1041. 33.38 s > 2: idenso::dirac::require_gamma_port
  1042. 33.38 s > 3: idenso::dirac::gamma_tensor
  1043. 33.38 s > 4: idenso::dirac::test::feyncalc_reference::dirac_simplify_id46_d_dim_repeated_gamma_slash_sum
  1044. 33.38 s > 5: <idenso::dirac::test::feyncalc_reference::dirac_simplify_id46_d_dim_repeated_gamma_slash_sum::{closure#0} as core::ops::function::FnOnce<()>>::call_once
  1045. 33.38 s > note: Some details are omitted, run with `RUST_BACKTRACE=full` for a verbose backtrace.
  1046. 33.38 s > system-out
  1047. 33.38 s > running 1 test
  1048. 33.38 s > test dirac::test::feyncalc_reference::dirac_simplify_id46_d_dim_repeated_gamma_slash_sum ... FAILED
  1049. 33.38 s >
  1050. 33.38 s > failures:
  1051. 33.38 s >
  1052. 33.38 s > failures:
  1053. 33.38 s > dirac::test::feyncalc_reference::dirac_simplify_id46_d_dim_repeated_gamma_slash_sum
  1054. 33.38 s >
  1055. 33.38 s > test result: FAILED. 0 passed; 1 failed; 0 ignored; 0 measured; 248 filtered out; finished in 0.01s
  1056. 33.38 s > system-err
  1057. 33.38 s > thread 'dirac::test::feyncalc_reference::dirac_simplify_id46_d_dim_repeated_gamma_slash_sum' (501) panicked at crates/idenso/src/dirac/mod.rs:360:5:
  1058. 33.38 s > gamma third argument must be a Minkowski slot
  1059. 33.38 s > stack backtrace:
  1060. 33.38 s > 0: __rustc::rust_begin_unwind
  1061. 33.38 s > 1: core::panicking::panic_fmt
  1062. 33.38 s > 2: idenso::dirac::require_gamma_port
  1063. 33.38 s > 3: idenso::dirac::gamma_tensor
  1064. 33.38 s > 4: idenso::dirac::test::feyncalc_reference::dirac_simplify_id46_d_dim_repeated_gamma_slash_sum
  1065. 33.38 s > 5: <idenso::dirac::test::feyncalc_reference::dirac_simplify_id46_d_dim_repeated_gamma_slash_sum::{closure#0} as core::ops::function::FnOnce<()>>::call_once
  1066. 33.38 s > note: Some details are omitted, run with `RUST_BACKTRACE=full` for a verbose backtrace.
  1067. 33.38 s >
  1068. 33.38 s > 2. idenso::dirac::test::feyncalc_reference::dirac_simplify_id40_repeated_gamma_and_two_trace
  1069. 33.38 s > failure: test failure with exit code 101
  1070. 33.38 s > thread 'dirac::test::feyncalc_reference::dirac_simplify_id40_repeated_gamma_and_two_trace' (505) panicked at crates/idenso/src/dirac/mod.rs:360:5:
  1071. 33.38 s > gamma third argument must be a Minkowski slot
  1072. 33.38 s > stack backtrace:
  1073. 33.38 s > 0: __rustc::rust_begin_unwind
  1074. 33.38 s > 1: core::panicking::panic_fmt
  1075. 33.38 s > 2: idenso::dirac::require_gamma_port
  1076. 33.38 s > 3: idenso::dirac::gamma_tensor
  1077. 33.38 s > 4: idenso::dirac::test::feyncalc_reference::dirac_simplify_id40_repeated_gamma_and_two_trace
  1078. 33.38 s > 5: <idenso::dirac::test::feyncalc_reference::dirac_simplify_id40_repeated_gamma_and_two_trace::{closure#0} as core::ops::function::FnOnce<()>>::call_once
  1079. 33.38 s > note: Some details are omitted, run with `RUST_BACKTRACE=full` for a verbose backtrace.
  1080. 33.38 s > system-out
  1081. 33.38 s > running 1 test
  1082. 33.38 s > test dirac::test::feyncalc_reference::dirac_simplify_id40_repeated_gamma_and_two_trace ... FAILED
  1083. 33.38 s >
  1084. 33.38 s > failures:
  1085. 33.38 s >
  1086. 33.38 s > failures:
  1087. 33.38 s > dirac::test::feyncalc_reference::dirac_simplify_id40_repeated_gamma_and_two_trace
  1088. 33.38 s >
  1089. 33.38 s > test result: FAILED. 0 passed; 1 failed; 0 ignored; 0 measured; 248 filtered out; finished in 0.01s
  1090. 33.38 s > system-err
  1091. 33.38 s > thread 'dirac::test::feyncalc_reference::dirac_simplify_id40_repeated_gamma_and_two_trace' (505) panicked at crates/idenso/src/dirac/mod.rs:360:5:
  1092. 33.38 s > gamma third argument must be a Minkowski slot
  1093. 33.38 s > stack backtrace:
  1094. 33.38 s > 0: __rustc::rust_begin_unwind
  1095. 33.38 s > 1: core::panicking::panic_fmt
  1096. 33.38 s > 2: idenso::dirac::require_gamma_port
  1097. 33.38 s > 3: idenso::dirac::gamma_tensor
  1098. 33.38 s > 4: idenso::dirac::test::feyncalc_reference::dirac_simplify_id40_repeated_gamma_and_two_trace
  1099. 33.38 s > 5: <idenso::dirac::test::feyncalc_reference::dirac_simplify_id40_repeated_gamma_and_two_trace::{closure#0} as core::ops::function::FnOnce<()>>::call_once
  1100. 33.38 s > note: Some details are omitted, run with `RUST_BACKTRACE=full` for a verbose backtrace.
  1101. 33.38 s >
  1102. 33.38 s > 3. idenso::dirac::test::feyncalc_reference::dirac_simplify_id4_slash_sandwich
  1103. 33.38 s > failure: test failure with exit code 101
  1104. 33.38 s > thread 'dirac::test::feyncalc_reference::dirac_simplify_id4_slash_sandwich' (502) panicked at crates/idenso/src/dirac/mod.rs:360:5:
  1105. 33.38 s > gamma third argument must be a Minkowski slot
  1106. 33.38 s > stack backtrace:
  1107. 33.38 s > 0: __rustc::rust_begin_unwind
  1108. 33.38 s > 1: core::panicking::panic_fmt
  1109. 33.38 s > 2: idenso::dirac::require_gamma_port
  1110. 33.38 s > 3: idenso::dirac::gamma_tensor
  1111. 33.38 s > 4: idenso::dirac::test::feyncalc_reference::dirac_simplify_id4_slash_sandwich
  1112. 33.38 s > 5: <idenso::dirac::test::feyncalc_reference::dirac_simplify_id4_slash_sandwich::{closure#0} as core::ops::function::FnOnce<()>>::call_once
  1113. 33.38 s > note: Some details are omitted, run with `RUST_BACKTRACE=full` for a verbose backtrace.
  1114. 33.38 s > system-out
  1115. 33.38 s > running 1 test
  1116. 33.38 s > test dirac::test::feyncalc_reference::dirac_simplify_id4_slash_sandwich ... FAILED
  1117. 33.38 s >
  1118. 33.38 s > failures:
  1119. 33.38 s >
  1120. 33.38 s > failures:
  1121. 33.38 s > dirac::test::feyncalc_reference::dirac_simplify_id4_slash_sandwich
  1122. 33.38 s >
  1123. 33.38 s > test result: FAILED. 0 passed; 1 failed; 0 ignored; 0 measured; 248 filtered out; finished in 0.02s
  1124. 33.38 s > system-err
  1125. 33.38 s > thread 'dirac::test::feyncalc_reference::dirac_simplify_id4_slash_sandwich' (502) panicked at crates/idenso/src/dirac/mod.rs:360:5:
  1126. 33.38 s > gamma third argument must be a Minkowski slot
  1127. 33.38 s > stack backtrace:
  1128. 33.38 s > 0: __rustc::rust_begin_unwind
  1129. 33.38 s > 1: core::panicking::panic_fmt
  1130. 33.38 s > 2: idenso::dirac::require_gamma_port
  1131. 33.38 s > 3: idenso::dirac::gamma_tensor
  1132. 33.38 s > 4: idenso::dirac::test::feyncalc_reference::dirac_simplify_id4_slash_sandwich
  1133. 33.38 s > 5: <idenso::dirac::test::feyncalc_reference::dirac_simplify_id4_slash_sandwich::{closure#0} as core::ops::function::FnOnce<()>>::call_once
  1134. 33.38 s > note: Some details are omitted, run with `RUST_BACKTRACE=full` for a verbose backtrace.
  1135. 33.38 s >
  1136. 33.38 s > 4. idenso::reference_cases::tests::reference_case_simplification_snapshots
  1137. 33.38 s > failure: test failure with exit code 101
  1138. 33.38 s > thread 'reference_cases::tests::reference_case_simplification_snapshots' (694) panicked at crates/idenso/src/dirac/mod.rs:360:5:
  1139. 33.38 s > gamma third argument must be a Minkowski slot
  1140. 33.38 s > stack backtrace:
  1141. 33.38 s > 0: __rustc::rust_begin_unwind
  1142. 33.38 s > 1: core::panicking::panic_fmt
  1143. 33.38 s > 2: idenso::dirac::require_gamma_port
  1144. 33.38 s > 3: idenso::dirac::gamma_tensor
  1145. 33.38 s > 4: idenso::reference_cases::dirac_feyncalc_slash_sandwich_id4
  1146. 33.38 s > 5: <idenso::reference_cases::ReferenceCase>::simplified
  1147. 33.38 s > 6: <core::iter::adapters::map::Map<core::slice::iter::Iter<idenso::reference_cases::ReferenceCase>, idenso::reference_cases::tests::reference_case_simplification_snapshots::{closure#0}> as core::iter::traits::iterator::Iterator>::fold::<(), core::iter::traits::iterator::Iterator::for_each::call<alloc::string::String, <alloc::vec::Vec<alloc::string::String>>::extend_trusted<core::iter::adapters::map::Map<core::slice::iter::Iter<idenso::reference_cases::ReferenceCase>, idenso::reference_cases::tests::reference_case_simplification_snapshots::{closure#0}>>::{closure#0}>::{closure#0}>
  1148. 33.38 s > 7: <alloc::vec::Vec<alloc::string::String> as alloc::vec::spec_from_iter_nested::SpecFromIterNested<alloc::string::String, core::iter::adapters::map::Map<core::slice::iter::Iter<idenso::reference_cases::ReferenceCase>, idenso::reference_cases::tests::reference_case_simplification_snapshots::{closure#0}>>>::from_iter
  1149. 33.38 s > 8: idenso::reference_cases::tests::reference_case_simplification_snapshots
  1150. 33.38 s > 9: <idenso::reference_cases::tests::reference_case_simplification_snapshots::{closure#0} as core::ops::function::FnOnce<()>>::call_once
  1151. 33.38 s > note: Some details are omitted, run with `RUST_BACKTRACE=full` for a verbose backtrace.
  1152. 33.38 s > system-out
  1153. 33.38 s > running 1 test
  1154. 33.38 s > test reference_cases::tests::reference_case_simplification_snapshots ... FAILED
  1155. 33.38 s >
  1156. 33.38 s > failures:
  1157. 33.38 s >
  1158. 33.38 s > failures:
  1159. 33.38 s > reference_cases::tests::reference_case_simplification_snapshots
  1160. 33.38 s >
  1161. 33.38 s > test result: FAILED. 0 passed; 1 failed; 0 ignored; 0 measured; 248 filtered out; finished in 0.01s
  1162. 33.38 s > system-err
  1163. 33.38 s > thread 'reference_cases::tests::reference_case_simplification_snapshots' (694) panicked at crates/idenso/src/dirac/mod.rs:360:5:
  1164. 33.38 s > gamma third argument must be a Minkowski slot
  1165. 33.38 s > stack backtrace:
  1166. 33.38 s > 0: __rustc::rust_begin_unwind
  1167. 33.38 s > 1: core::panicking::panic_fmt
  1168. 33.38 s > 2: idenso::dirac::require_gamma_port
  1169. 33.38 s > 3: idenso::dirac::gamma_tensor
  1170. 33.38 s > 4: idenso::reference_cases::dirac_feyncalc_slash_sandwich_id4
  1171. 33.38 s > 5: <idenso::reference_cases::ReferenceCase>::simplified
  1172. 33.38 s > 6: <core::iter::adapters::map::Map<core::slice::iter::Iter<idenso::reference_cases::ReferenceCase>, idenso::reference_cases::tests::reference_case_simplification_snapshots::{closure#0}> as core::iter::traits::iterator::Iterator>::fold::<(), core::iter::traits::iterator::Iterator::for_each::call<alloc::string::String, <alloc::vec::Vec<alloc::string::String>>::extend_trusted<core::iter::adapters::map::Map<core::slice::iter::Iter<idenso::reference_cases::ReferenceCase>, idenso::reference_cases::tests::reference_case_simplification_snapshots::{closure#0}>>::{closure#0}>::{closure#0}>
  1173. 33.38 s > 7: <alloc::vec::Vec<alloc::string::String> as alloc::vec::spec_from_iter_nested::SpecFromIterNested<alloc::string::String, core::iter::adapters::map::Map<core::slice::iter::Iter<idenso::reference_cases::ReferenceCase>, idenso::reference_cases::tests::reference_case_simplification_snapshots::{closure#0}>>>::from_iter
  1174. 33.38 s > 8: idenso::reference_cases::tests::reference_case_simplification_snapshots
  1175. 33.39 s > 9: <idenso::reference_cases::tests::reference_case_simplification_snapshots::{closure#0} as core::ops::function::FnOnce<()>>::call_once
  1176. 33.39 s > note: Some details are omitted, run with `RUST_BACKTRACE=full` for a verbose backtrace.
  1177. 33.39 s >
  1178. 33.39 s > 5. idenso::tensor::tests::parsing::infinite_execution
  1179. 33.39 s > failure: test failure with exit code 101
  1180. 33.39 s > thread 'tensor::tests::parsing::infinite_execution' (856) panicked at /nix/store/g4vv637bgwmy4qf4lv8w7s6sghivpa09-vendor-cargo-deps/c19b7c6f923b580ac259164a89f2577984ad5ab09ee9d583b888f934adbbe8d0/insta-1.47.2/src/runtime.rs:719:13:
  1181. 33.39 s > snapshot assertion for 'infinite_execution' failed in line 905
  1182. 33.39 s > stack backtrace:
  1183. 33.39 s > 0: __rustc::rust_begin_unwind
  1184. 33.39 s > 1: core::panicking::panic_fmt
  1185. 33.39 s > 2: insta::runtime::assert_snapshot
  1186. 33.39 s > 3: idenso::tensor::tests::parsing::infinite_execution
  1187. 33.39 s > 4: <idenso::tensor::tests::parsing::infinite_execution::{closure#0} as core::ops::function::FnOnce<()>>::call_once
  1188. 33.39 s > note: Some details are omitted, run with `RUST_BACKTRACE=full` for a verbose backtrace.
  1189. 33.39 s > system-out
  1190. 33.39 s > running 1 test
  1191. 33.39 s > ━━━━━━━━━━━━━━━━━━━━━━━━━━━━━━━ Snapshot Summary ━━━━━━━━━━━━━━━━━━━━━━━━━━━━━━━
  1192. 33.39 s > Snapshot: infinite_execution
  1193. 33.39 s > Source: crates/idenso/src/tensor/tests/parsing.rs:905
  1194. 33.39 s > ────────────────────────────────────────────────────────────────────────────────
  1195. 33.39 s > Expression: net_iter.snapshot_dot()
  1196. 33.39 s > ────────────────────────────────────────────────────────────────────────────────
  1197. 33.39 s > -old snapshot
  1198. 33.39 s > +new results
  1199. 33.39 s > ────────────┬───────────────────────────────────────────────────────────────────
  1200. 33.39 s > 8 8 │ 0:0:s-> ext0 [id=0 color="red"];
  1201. 33.39 s > 9 9 │ ext1 [style=invis];
  1202. 33.39 s > 10 10 │ 0:5:s-> ext1 [id=1 dir=none color="red" label="mink4|l_0"];
  1203. 33.39 s > 11 11 │ ext2 [style=invis];
  1204. 33.39 s > 12 │- 0:4:s-> ext2 [id=2 dir=none color="red" label="bis4|l_2"];
  1205. 33.39 s > 12 │+ 0:3:s-> ext2 [id=2 dir=none color="red" label="mink4|l_1"];
  1206. 33.39 s > 13 13 │ ext3 [style=invis];
  1207. 33.39 s > 14 │- 0:3:s-> ext3 [id=3 dir=none color="red" label="bis4|l_3"];
  1208. 33.39 s > 14 │+ 0:1:s-> ext3 [id=3 dir=none color="red" label="bis4|l_2"];
  1209. 33.39 s > 15 15 │ ext4 [style=invis];
  1210. 33.39 s > 16 │- 0:1:s-> ext4 [id=4 dir=none color="red" label="mink4|l_1"];
  1211. 33.39 s > 16 │+ 0:2:s-> ext4 [id=4 dir=none color="red" label="mink4|l_4"];
  1212. 33.39 s > 17 17 │ ext5 [style=invis];
  1213. 33.39 s > 18 │- 0:2:s-> ext5 [id=5 dir=none color="red" label="mink4|l_4"];
  1214. 33.39 s > 18 │+ 0:4:s-> ext5 [id=5 dir=none color="red" label="bis4|l_3"];
  1215. 33.39 s > 19 19 │ }
  1216. 33.39 s > ────────────┴───────────────────────────────────────────────────────────────────
  1217. 33.39 s > To update snapshots run `cargo insta review`
  1218. 33.39 s > Stopped on the first failure. Run `cargo insta test` to run all snapshots.
  1219. 33.39 s > test tensor::tests::parsing::infinite_execution ... FAILED
  1220. 33.39 s >
  1221. 33.39 s > failures:
  1222. 33.39 s >
  1223. 33.39 s > failures:
  1224. 33.39 s > tensor::tests::parsing::infinite_execution
  1225. 33.39 s >
  1226. 33.39 s > test result: FAILED. 0 passed; 1 failed; 0 ignored; 0 measured; 248 filtered out; finished in 0.09s
  1227. 33.39 s > system-err
  1228. 33.39 s > thread 'tensor::tests::parsing::infinite_execution' (856) panicked at /nix/store/g4vv637bgwmy4qf4lv8w7s6sghivpa09-vendor-cargo-deps/c19b7c6f923b580ac259164a89f2577984ad5ab09ee9d583b888f934adbbe8d0/insta-1.47.2/src/runtime.rs:719:13:
  1229. 33.39 s > snapshot assertion for 'infinite_execution' failed in line 905
  1230. 33.39 s > stack backtrace:
  1231. 33.39 s > 0: __rustc::rust_begin_unwind
  1232. 33.39 s > 1: core::panicking::panic_fmt
  1233. 33.39 s > 2: insta::runtime::assert_snapshot
  1234. 33.39 s > 3: idenso::tensor::tests::parsing::infinite_execution
  1235. 33.39 s > 4: <idenso::tensor::tests::parsing::infinite_execution::{closure#0} as core::ops::function::FnOnce<()>>::call_once
  1236. 33.39 s > note: Some details are omitted, run with `RUST_BACKTRACE=full` for a verbose backtrace.
  1237. 33.39 s > =========================================
  1238. 33.39 s > Extracting 2 binaries and 1 linked path to /build/nextest-archive-9V1DY1
  1239. 33.39 s > Extracted 8 files to /build/nextest-archive-9V1DY1 in 0.13s
  1240. 33.39 s > ------------
  1241. 33.39 s > Nextest run ID 034b5a98-1ee1-42f5-b0d1-e046b7fc7472 with nextest profile: ci_gammaloop
  1242. 33.39 s > Starting 195 tests across 2 binaries
  1243. 33.39 s > ------------
  1244. 33.39 s > Summary [ 0.314s] 195 tests run: 195 passed, 0 skipped
  1245. 33.39 s >
  1246. 33.39 s > ========== nextest test summary ==========
  1247. 33.39 s > report: target/nextest/ci_gammaloop/junit.xml
  1248. 33.39 s > tests: 195, failures: 0, errors: 0
  1249. 33.39 s > No failing testcases found.
  1250. 33.39 s > =========================================
  1251. 33.39 s > Extracting 5 binaries and 2 linked paths to /build/nextest-archive-r9L7Uq
  1252. 33.39 s > Extracted 19 files to /build/nextest-archive-r9L7Uq in 0.33s
  1253. 33.39 s > ------------
  1254. 33.39 s > Nextest run ID 90c2b50f-5b15-4979-9c12-a4cf522e47ee with nextest profile: ci_gammaloop
  1255. 33.39 s > Starting 27 tests across 5 binaries (1 test skipped via profile.ci_gammaloop.default-filter)
  1256. 33.39 s > FAIL [ 0.162s] (25/27) spenso-hep-lib::idenso_validation enabled_idenso_reference_cases_validate_against_explicit_tensors
  1257. 33.39 s > stdout ---
  1258. 33.39 s >
  1259. 33.39 s > running 1 test
  1260. 33.39 s > test enabled_idenso_reference_cases_validate_against_explicit_tensors ... FAILED
  1261. 33.39 s >
  1262. 33.39 s > failures:
  1263. 33.39 s >
  1264. 33.39 s > failures:
  1265. 33.39 s > enabled_idenso_reference_cases_validate_against_explicit_tensors
  1266. 33.39 s >
  1267. 33.39 s > test result: FAILED. 0 passed; 1 failed; 0 ignored; 0 measured; 14 filtered out; finished in 0.14s
  1268. 33.39 s >
  1269. 33.39 s > stderr ---
  1270. 33.39 s >
  1271. 33.39 s > thread 'enabled_idenso_reference_cases_validate_against_explicit_tensors' (1666) panicked at crates/idenso/src/dirac/mod.rs:360:5:
  1272. 33.39 s > gamma third argument must be a Minkowski slot
  1273. 33.39 s > stack backtrace:
  1274. 33.39 s > 0: __rustc::rust_begin_unwind
  1275. 33.39 s > 1: core::panicking::panic_fmt
  1276. 33.39 s > 2: idenso::dirac::require_gamma_port
  1277. 33.39 s > 3: idenso::dirac::gamma_tensor
  1278. 33.39 s > 4: idenso::reference_cases::dirac_feyncalc_slash_sandwich_id4
  1279. 33.39 s > 5: <idenso_validation::enabled_idenso_reference_cases_validate_against_explicit_tensors::{closure#0} as core::ops::function::FnOnce<()>>::call_once
  1280. 33.39 s > note: Some details are omitted, run with `RUST_BACKTRACE=full` for a verbose backtrace.
  1281. 33.39 s >
  1282. 33.39 s > ------------
  1283. 33.39 s > Summary [ 0.378s] 27 tests run: 26 passed, 1 failed, 1 skipped
  1284. 33.39 s > FAIL [ 0.162s] (25/27) spenso-hep-lib::idenso_validation enabled_idenso_reference_cases_validate_against_explicit_tensors
  1285. 33.39 s > stdout ---
  1286. 33.39 s >
  1287. 33.39 s > running 1 test
  1288. 33.39 s > test enabled_idenso_reference_cases_validate_against_explicit_tensors ... FAILED
  1289. 33.39 s >
  1290. 33.39 s > failures:
  1291. 33.39 s >
  1292. 33.39 s > failures:
  1293. 33.39 s > enabled_idenso_reference_cases_validate_against_explicit_tensors
  1294. 33.39 s >
  1295. 33.39 s > test result: FAILED. 0 passed; 1 failed; 0 ignored; 0 measured; 14 filtered out; finished in 0.14s
  1296. 33.39 s >
  1297. 33.39 s > stderr ---
  1298. 33.39 s >
  1299. 33.39 s > thread 'enabled_idenso_reference_cases_validate_against_explicit_tensors' (1666) panicked at crates/idenso/src/dirac/mod.rs:360:5:
  1300. 33.39 s > gamma third argument must be a Minkowski slot
  1301. 33.39 s > stack backtrace:
  1302. 33.39 s > 0: __rustc::rust_begin_unwind
  1303. 33.39 s > 1: core::panicking::panic_fmt
  1304. 33.39 s > 2: idenso::dirac::require_gamma_port
  1305. 33.39 s > 3: idenso::dirac::gamma_tensor
  1306. 33.39 s > 4: idenso::reference_cases::dirac_feyncalc_slash_sandwich_id4
  1307. 33.39 s > 5: <idenso_validation::enabled_idenso_reference_cases_validate_against_explicit_tensors::{closure#0} as core::ops::function::FnOnce<()>>::call_once
  1308. 33.39 s > note: Some details are omitted, run with `RUST_BACKTRACE=full` for a verbose backtrace.
  1309. 33.39 s >
  1310. 33.39 s > error: test run failed
  1311. 33.39 s >
  1312. 33.39 s > ========== nextest test summary ==========
  1313. 33.39 s > report: target/nextest/ci_gammaloop/junit.xml
  1314. 33.39 s > tests: 27, failures: 1, errors: 0
  1315. 33.39 s >
  1316. 33.39 s > 1. spenso-hep-lib::idenso_validation::enabled_idenso_reference_cases_validate_against_explicit_tensors
  1317. 33.39 s > failure: test failure with exit code 101
  1318. 33.39 s > thread 'enabled_idenso_reference_cases_validate_against_explicit_tensors' (1666) panicked at crates/idenso/src/dirac/mod.rs:360:5:
  1319. 33.39 s > gamma third argument must be a Minkowski slot
  1320. 33.39 s > stack backtrace:
  1321. 33.39 s > 0: __rustc::rust_begin_unwind
  1322. 33.39 s > 1: core::panicking::panic_fmt
  1323. 33.39 s > 2: idenso::dirac::require_gamma_port
  1324. 33.39 s > 3: idenso::dirac::gamma_tensor
  1325. 33.39 s > 4: idenso::reference_cases::dirac_feyncalc_slash_sandwich_id4
  1326. 33.39 s > 5: <idenso_validation::enabled_idenso_reference_cases_validate_against_explicit_tensors::{closure#0} as core::ops::function::FnOnce<()>>::call_once
  1327. 33.39 s > note: Some details are omitted, run with `RUST_BACKTRACE=full` for a verbose backtrace.
  1328. 33.39 s > system-out
  1329. 33.39 s > running 1 test
  1330. 33.39 s > test enabled_idenso_reference_cases_validate_against_explicit_tensors ... FAILED
  1331. 33.39 s >
  1332. 33.39 s > failures:
  1333. 33.39 s >
  1334. 33.39 s > failures:
  1335. 33.39 s > enabled_idenso_reference_cases_validate_against_explicit_tensors
  1336. 33.39 s >
  1337. 33.39 s > test result: FAILED. 0 passed; 1 failed; 0 ignored; 0 measured; 14 filtered out; finished in 0.14s
  1338. 33.39 s > system-err
  1339. 33.39 s > thread 'enabled_idenso_reference_cases_validate_against_explicit_tensors' (1666) panicked at crates/idenso/src/dirac/mod.rs:360:5:
  1340. 33.39 s > gamma third argument must be a Minkowski slot
  1341. 33.39 s > stack backtrace:
  1342. 33.39 s > 0: __rustc::rust_begin_unwind
  1343. 33.39 s > 1: core::panicking::panic_fmt
  1344. 33.39 s > 2: idenso::dirac::require_gamma_port
  1345. 33.39 s > 3: idenso::dirac::gamma_tensor
  1346. 33.39 s > 4: idenso::reference_cases::dirac_feyncalc_slash_sandwich_id4
  1347. 33.39 s > 5: <idenso_validation::enabled_idenso_reference_cases_validate_against_explicit_tensors::{closure#0} as core::ops::function::FnOnce<()>>::call_once
  1348. 33.39 s > note: Some details are omitted, run with `RUST_BACKTRACE=full` for a verbose backtrace.
  1349. 33.39 s > =========================================
  1350. 33.39 s > Extracting 2 binaries and 1 linked path to /build/nextest-archive-Jh13qq
  1351. 33.39 s > Extracted 8 files to /build/nextest-archive-Jh13qq in 0.11s
  1352. 33.39 s > ------------
  1353. 33.39 s > Nextest run ID a622e619-e12d-4623-a4af-0b1f2952666e with nextest profile: ci_gammaloop
  1354. 33.39 s > Starting 1 test across 2 binaries
  1355. 33.39 s > ------------
  1356. 33.39 s > Summary [ 0.018s] 1 test run: 1 passed, 0 skipped
  1357. 33.39 s >
  1358. 33.39 s > ========== nextest test summary ==========
  1359. 33.39 s > report: target/nextest/ci_gammaloop/junit.xml
  1360. 33.39 s > tests: 1, failures: 0, errors: 0
  1361. 33.39 s > No failing testcases found.
  1362. 33.39 s > =========================================
  1363. 33.39 s > Extracting 1 binary and 1 linked path to /build/nextest-archive-gv1d93
  1364. 33.39 s > Extracted 7 files to /build/nextest-archive-gv1d93 in 0.11s
  1365. 33.39 s > ------------
  1366. 33.39 s > Nextest run ID 1e50c957-1200-4e44-96fa-d774f1c67565 with nextest profile: ci_gammaloop
  1367. 33.39 s > Starting 0 tests across 1 binary
  1368. 33.39 s > ------------
  1369. 33.39 s > Summary [ 0.001s] 0 tests run: 0 passed, 0 skipped
  1370. 33.39 s >
  1371. 33.39 s > ========== nextest test summary ==========
  1372. 33.39 s > report: target/nextest/ci_gammaloop/junit.xml
  1373. 33.39 s > tests: 0, failures: 0, errors: 0
  1374. 33.39 s > No failing testcases found.
  1375. 33.39 s > =========================================
  1376. 33.39 s For full logs, run:
  1377. 33.39 s nix log /nix/store/pcw901lvh10nhiz9sizq4ncxl7hk2sj8-gammaloop-nextest-spenso.drv
  1378. 33.54 s Run failed.