test packages.x86_64-linux.nix-ci-check-gammaloop-nextest-core

Reproduce this run
Retry Run
  1. 0.01 s $ /nix/store/9ypz3flqsrl5xl495mm8h645gadjsxi1-coreutils-9.11/bin/timeout --kill-after=15s 7200s /nix/store/23zk8sgzamrbmj1fday15szf7f2279s8-nix-2.34.7/bin/nix --extra-experimental-features nix-command --extra-experimental-features flakes flake clone git+https://github.com/alphal00p/gammaloop --dest /tmp/nix-ci-worker/stable-pwd/repo/
  2. 0.09 s Cloning into '/tmp/nix-ci-worker/stable-pwd/repo'...
  3. 1.61 s remote: Enumerating objects: 83696, done.
  4. 1.84 s remote: Counting objects: 0% (1/9893) remote: Counting objects: 1% (99/9893) remote: Counting objects: 2% (198/9893) remote: Counting objects: 3% (297/9893) remote: Counting objects: 4% (396/9893) remote: Counting objects: 5% (495/9893) remote: Counting objects: 6% (594/9893) remote: Counting objects: 7% (693/9893) remote: Counting objects: 8% (792/9893) remote: Counting objects: 9% (891/9893) remote: Counting objects: 10% (990/9893) remote: Counting objects: 11% (1089/9893) remote: Counting objects: 12% (1188/9893) remote: Counting objects: 13% (1287/9893) remote: Counting objects: 14% (1386/9893) remote: Counting objects: 15% (1484/9893) remote: Counting objects: 16% (1583/9893) remote: Counting objects: 17% (1682/9893) remote: Counting objects: 18% (1781/9893) remote: Counting objects: 19% (1880/9893) remote: Counting objects: 20% (1979/9893) remote: Counting objects: 21% (2078/9893) remote: Counting objects: 22% (2177/9893) remote: Counting objects: 23% (2276/9893) remote: Counting objects: 24% (2375/9893) remote: Counting objects: 25% (2474/9893) remote: Counting objects: 26% (2573/9893) remote: Counting objects: 27% (2672/9893) remote: Counting objects: 28% (2771/9893) remote: Counting objects: 29% (2869/9893) remote: Counting objects: 30% (2968/9893) remote: Counting objects: 31% (3067/9893) remote: Counting objects: 32% (3166/9893) remote: Counting objects: 33% (3265/9893) remote: Counting objects: 34% (3364/9893) remote: Counting objects: 35% (3463/9893) remote: Counting objects: 36% (3562/9893) remote: Counting objects: 37% (3661/9893) remote: Counting objects: 38% (3760/9893) remote: Counting objects: 39% (3859/9893) remote: Counting objects: 40% (3958/9893) remote: Counting objects: 41% (4057/9893) remote: Counting objects: 42% (4156/9893) remote: Counting objects: 43% (4254/9893) remote: Counting objects: 44% (4353/9893) remote: Counting objects: 45% (4452/9893) remote: Counting objects: 46% (4551/9893) remote: Counting objects: 47% (4650/9893) remote: Counting objects: 48% (4749/9893) remote: Counting objects: 49% (4848/9893) remote: Counting objects: 50% (4947/9893) remote: Counting objects: 51% (5046/9893) remote: Counting objects: 52% (5145/9893) remote: Counting objects: 53% (5244/9893) remote: Counting objects: 54% (5343/9893) remote: Counting objects: 55% (5442/9893) remote: Counting objects: 56% (5541/9893) remote: Counting objects: 57% (5640/9893) remote: Counting objects: 58% (5738/9893) remote: Counting objects: 59% (5837/9893) remote: Counting objects: 60% (5936/9893) remote: Counting objects: 61% (6035/9893) remote: Counting objects: 62% (6134/9893) remote: Counting objects: 63% (6233/9893) remote: Counting objects: 64% (6332/9893) remote: Counting objects: 65% (6431/9893) remote: Counting objects: 66% (6530/9893) remote: Counting objects: 67% (6629/9893) remote: Counting objects: 68% (6728/9893) remote: Counting objects: 69% (6827/9893) remote: Counting objects: 70% (6926/9893) remote: Counting objects: 71% (7025/9893) remote: Counting objects: 72% (7123/9893) remote: Counting objects: 73% (7222/9893) remote: Counting objects: 74% (7321/9893) remote: Counting objects: 75% (7420/9893) remote: Counting objects: 76% (7519/9893) remote: Counting objects: 77% (7618/9893) remote: Counting objects: 78% (7717/9893) remote: Counting objects: 79% (7816/9893) remote: Counting objects: 80% (7915/9893) remote: Counting objects: 81% (8014/9893) remote: Counting objects: 82% (8113/9893) remote: Counting objects: 83% (8212/9893) remote: Counting objects: 84% (8311/9893) remote: Counting objects: 85% (8410/9893) remote: Counting objects: 86% (8508/9893) remote: Counting objects: 87% (8607/9893) remote: Counting objects: 88% (8706/9893) remote: Counting objects: 89% (8805/9893) remote: Counting objects: 90% (8904/9893) remote: Counting objects: 91% (9003/9893) remote: Counting objects: 92% (9102/9893) remote: Counting objects: 93% (9201/9893) remote: Counting objects: 94% (9300/9893) remote: Counting objects: 95% (9399/9893) remote: Counting objects: 96% (9498/9893) remote: Counting objects: 97% (9597/9893) remote: Counting objects: 98% (9696/9893) remote: Counting objects: 99% (9795/9893) remote: Counting objects: 100% (9893/9893) remote: Counting objects: 100% (9893/9893), done.
  5. 4.38 s remote: Compressing objects: 0% (1/2138) remote: Compressing objects: 1% (22/2138) remote: Compressing objects: 2% (43/2138) remote: Compressing objects: 3% (65/2138) remote: Compressing objects: 4% (86/2138) remote: Compressing objects: 5% (107/2138) remote: Compressing objects: 6% (129/2138) remote: Compressing objects: 7% (150/2138) remote: Compressing objects: 8% (172/2138) remote: Compressing objects: 9% (193/2138) remote: Compressing objects: 10% (214/2138) remote: Compressing objects: 11% (236/2138) remote: Compressing objects: 12% (257/2138) remote: Compressing objects: 13% (278/2138) remote: Compressing objects: 14% (300/2138) remote: Compressing objects: 15% (321/2138) remote: Compressing objects: 15% (334/2138) remote: Compressing objects: 16% (343/2138) remote: Compressing objects: 17% (364/2138) remote: Compressing objects: 18% (385/2138) remote: Compressing objects: 19% (407/2138) remote: Compressing objects: 20% (428/2138) remote: Compressing objects: 21% (449/2138) remote: Compressing objects: 21% (466/2138) remote: Compressing objects: 22% (471/2138) remote: Compressing objects: 23% (492/2138) remote: Compressing objects: 24% (514/2138) remote: Compressing objects: 25% (535/2138) remote: Compressing objects: 26% (556/2138) remote: Compressing objects: 27% (578/2138) remote: Compressing objects: 28% (599/2138) remote: Compressing objects: 29% (621/2138) remote: Compressing objects: 30% (642/2138) remote: Compressing objects: 31% (663/2138) remote: Compressing objects: 32% (685/2138) remote: Compressing objects: 33% (706/2138) remote: Compressing objects: 34% (727/2138) remote: Compressing objects: 35% (749/2138) remote: Compressing objects: 36% (770/2138) remote: Compressing objects: 37% (792/2138) remote: Compressing objects: 38% (813/2138) remote: Compressing objects: 39% (834/2138) remote: Compressing objects: 40% (856/2138) remote: Compressing objects: 41% (877/2138) remote: Compressing objects: 42% (898/2138) remote: Compressing objects: 43% (920/2138) remote: Compressing objects: 44% (941/2138) remote: Compressing objects: 45% (963/2138) remote: Compressing objects: 46% (984/2138) remote: Compressing objects: 47% (1005/2138) remote: Compressing objects: 48% (1027/2138) remote: Compressing objects: 49% (1048/2138) remote: Compressing objects: 50% (1069/2138) remote: Compressing objects: 51% (1091/2138) remote: Compressing objects: 52% (1112/2138) remote: Compressing objects: 53% (1134/2138) remote: Compressing objects: 54% (1155/2138) remote: Compressing objects: 55% (1176/2138) remote: Compressing objects: 56% (1198/2138) remote: Compressing objects: 57% (1219/2138) remote: Compressing objects: 58% (1241/2138) remote: Compressing objects: 59% (1262/2138) remote: Compressing objects: 60% (1283/2138) remote: Compressing objects: 61% (1305/2138) remote: Compressing objects: 62% (1326/2138) remote: Compressing objects: 63% (1347/2138) remote: Compressing objects: 64% (1369/2138) remote: Compressing objects: 65% (1390/2138) remote: Compressing objects: 66% (1412/2138) remote: Compressing objects: 67% (1433/2138) remote: Compressing objects: 68% (1454/2138) remote: Compressing objects: 69% (1476/2138) remote: Compressing objects: 70% (1497/2138) remote: Compressing objects: 71% (1518/2138) remote: Compressing objects: 72% (1540/2138) remote: Compressing objects: 73% (1561/2138) remote: Compressing objects: 74% (1583/2138) remote: Compressing objects: 75% (1604/2138) remote: Compressing objects: 76% (1625/2138) remote: Compressing objects: 77% (1647/2138) remote: Compressing objects: 78% (1668/2138) remote: Compressing objects: 79% (1690/2138) remote: Compressing objects: 80% (1711/2138) remote: Compressing objects: 81% (1732/2138) remote: Compressing objects: 82% (1754/2138) remote: Compressing objects: 83% (1775/2138) remote: Compressing objects: 84% (1796/2138) remote: Compressing objects: 85% (1818/2138) remote: Compressing objects: 86% (1839/2138) remote: Compressing objects: 87% (1861/2138) remote: Compressing objects: 88% (1882/2138) remote: Compressing objects: 89% (1903/2138) remote: Compressing objects: 90% (1925/2138) remote: Compressing objects: 91% (1946/2138) remote: Compressing objects: 92% (1967/2138) remote: Compressing objects: 93% (1989/2138) remote: Compressing objects: 94% (2010/2138) remote: Compressing objects: 95% (2032/2138) remote: Compressing objects: 96% (2053/2138) remote: Compressing objects: 97% (2074/2138) remote: Compressing objects: 98% (2096/2138) remote: Compressing objects: 99% (2117/2138) remote: Compressing objects: 100% (2138/2138) remote: Compressing objects: 100% (2138/2138), done.
  6. 8.67 s Receiving objects: 0% (1/83696) Receiving objects: 1% (837/83696) Receiving objects: 2% (1674/83696) Receiving objects: 3% (2511/83696) Receiving objects: 4% (3348/83696) Receiving objects: 5% (4185/83696) Receiving objects: 6% (5022/83696) Receiving objects: 7% (5859/83696) Receiving objects: 8% (6696/83696) Receiving objects: 9% (7533/83696), 11.05 MiB | 22.08 MiB/s Receiving objects: 10% (8370/83696), 11.05 MiB | 22.08 MiB/s Receiving objects: 11% (9207/83696), 11.05 MiB | 22.08 MiB/s Receiving objects: 12% (10044/83696), 11.05 MiB | 22.08 MiB/s Receiving objects: 13% (10881/83696), 11.05 MiB | 22.08 MiB/s Receiving objects: 14% (11718/83696), 11.05 MiB | 22.08 MiB/s Receiving objects: 15% (12555/83696), 11.05 MiB | 22.08 MiB/s Receiving objects: 16% (13392/83696), 11.05 MiB | 22.08 MiB/s Receiving objects: 17% (14229/83696), 11.05 MiB | 22.08 MiB/s Receiving objects: 18% (15066/83696), 11.05 MiB | 22.08 MiB/s Receiving objects: 19% (15903/83696), 11.05 MiB | 22.08 MiB/s Receiving objects: 20% (16740/83696), 11.05 MiB | 22.08 MiB/s Receiving objects: 21% (17577/83696), 11.05 MiB | 22.08 MiB/s Receiving objects: 22% (18414/83696), 11.05 MiB | 22.08 MiB/s Receiving objects: 23% (19251/83696), 11.05 MiB | 22.08 MiB/s Receiving objects: 24% (20088/83696), 11.05 MiB | 22.08 MiB/s Receiving objects: 25% (20924/83696), 11.05 MiB | 22.08 MiB/s Receiving objects: 26% (21761/83696), 11.05 MiB | 22.08 MiB/s Receiving objects: 27% (22598/83696), 11.05 MiB | 22.08 MiB/s Receiving objects: 28% (23435/83696), 11.05 MiB | 22.08 MiB/s Receiving objects: 29% (24272/83696), 11.05 MiB | 22.08 MiB/s Receiving objects: 30% (25109/83696), 11.05 MiB | 22.08 MiB/s Receiving objects: 31% (25946/83696), 11.05 MiB | 22.08 MiB/s Receiving objects: 32% (26783/83696), 11.05 MiB | 22.08 MiB/s Receiving objects: 33% (27620/83696), 11.05 MiB | 22.08 MiB/s Receiving objects: 34% (28457/83696), 11.05 MiB | 22.08 MiB/s Receiving objects: 35% (29294/83696), 11.05 MiB | 22.08 MiB/s Receiving objects: 36% (30131/83696), 11.05 MiB | 22.08 MiB/s Receiving objects: 37% (30968/83696), 11.05 MiB | 22.08 MiB/s Receiving objects: 37% (31798/83696), 11.05 MiB | 22.08 MiB/s Receiving objects: 38% (31805/83696), 11.05 MiB | 22.08 MiB/s Receiving objects: 39% (32642/83696), 29.61 MiB | 29.60 MiB/s Receiving objects: 40% (33479/83696), 29.61 MiB | 29.60 MiB/s Receiving objects: 41% (34316/83696), 29.61 MiB | 29.60 MiB/s Receiving objects: 42% (35153/83696), 29.61 MiB | 29.60 MiB/s Receiving objects: 43% (35990/83696), 29.61 MiB | 29.60 MiB/s Receiving objects: 44% (36827/83696), 29.61 MiB | 29.60 MiB/s Receiving objects: 45% (37664/83696), 29.61 MiB | 29.60 MiB/s Receiving objects: 46% (38501/83696), 29.61 MiB | 29.60 MiB/s Receiving objects: 47% (39338/83696), 29.61 MiB | 29.60 MiB/s Receiving objects: 48% (40175/83696), 46.31 MiB | 30.77 MiB/s Receiving objects: 49% (41012/83696), 46.31 MiB | 30.77 MiB/s Receiving objects: 50% (41848/83696), 46.31 MiB | 30.77 MiB/s Receiving objects: 51% (42685/83696), 46.31 MiB | 30.77 MiB/s Receiving objects: 52% (43522/83696), 46.31 MiB | 30.77 MiB/s Receiving objects: 53% (44359/83696), 46.31 MiB | 30.77 MiB/s Receiving objects: 54% (45196/83696), 46.31 MiB | 30.77 MiB/s Receiving objects: 55% (46033/83696), 46.31 MiB | 30.77 MiB/s Receiving objects: 56% (46870/83696), 46.31 MiB | 30.77 MiB/s Receiving objects: 57% (47707/83696), 46.31 MiB | 30.77 MiB/s Receiving objects: 58% (48544/83696), 46.31 MiB | 30.77 MiB/s Receiving objects: 58% (48725/83696), 63.18 MiB | 31.51 MiB/s Receiving objects: 59% (49381/83696), 63.18 MiB | 31.51 MiB/s Receiving objects: 60% (50218/83696), 63.18 MiB | 31.51 MiB/s Receiving objects: 61% (51055/83696), 63.18 MiB | 31.51 MiB/s Receiving objects: 62% (51892/83696), 63.18 MiB | 31.51 MiB/s Receiving objects: 63% (52729/83696), 63.18 MiB | 31.51 MiB/s Receiving objects: 64% (53566/83696), 63.18 MiB | 31.51 MiB/s Receiving objects: 65% (54403/83696), 79.60 MiB | 31.74 MiB/s Receiving objects: 66% (55240/83696), 79.60 MiB | 31.74 MiB/s Receiving objects: 67% (56077/83696), 79.60 MiB | 31.74 MiB/s Receiving objects: 68% (56914/83696), 79.60 MiB | 31.74 MiB/s Receiving objects: 69% (57751/83696), 79.60 MiB | 31.74 MiB/s Receiving objects: 70% (58588/83696), 79.60 MiB | 31.74 MiB/s Receiving objects: 71% (59425/83696), 79.60 MiB | 31.74 MiB/s Receiving objects: 72% (60262/83696), 79.60 MiB | 31.74 MiB/s Receiving objects: 73% (61099/83696), 79.60 MiB | 31.74 MiB/s Receiving objects: 74% (61936/83696), 79.60 MiB | 31.74 MiB/s Receiving objects: 74% (62533/83696), 79.60 MiB | 31.74 MiB/s Receiving objects: 75% (62772/83696), 79.60 MiB | 31.74 MiB/s Receiving objects: 76% (63609/83696), 96.62 MiB | 32.12 MiB/s Receiving objects: 77% (64446/83696), 96.62 MiB | 32.12 MiB/s Receiving objects: 78% (65283/83696), 96.62 MiB | 32.12 MiB/s Receiving objects: 79% (66120/83696), 96.62 MiB | 32.12 MiB/s Receiving objects: 80% (66957/83696), 96.62 MiB | 32.12 MiB/s Receiving objects: 81% (67794/83696), 113.37 MiB | 32.32 MiB/s Receiving objects: 82% (68631/83696), 113.37 MiB | 32.32 MiB/s Receiving objects: 83% (69468/83696), 113.37 MiB | 32.32 MiB/s Receiving objects: 84% (70305/83696), 113.37 MiB | 32.32 MiB/s Receiving objects: 85% (71142/83696), 113.37 MiB | 32.32 MiB/s Receiving objects: 86% (71979/83696), 113.37 MiB | 32.32 MiB/s Receiving objects: 87% (72816/83696), 113.37 MiB | 32.32 MiB/s Receiving objects: 88% (73653/83696), 113.37 MiB | 32.32 MiB/s Receiving objects: 89% (74490/83696), 113.37 MiB | 32.32 MiB/s Receiving objects: 90% (75327/83696), 113.37 MiB | 32.32 MiB/s Receiving objects: 91% (76164/83696), 113.37 MiB | 32.32 MiB/s Receiving objects: 92% (77001/83696), 113.37 MiB | 32.32 MiB/s Receiving objects: 93% (77838/83696), 113.37 MiB | 32.32 MiB/s Receiving objects: 94% (78675/83696), 113.37 MiB | 32.32 MiB/s Receiving objects: 95% (79512/83696), 113.37 MiB | 32.32 MiB/s Receiving objects: 96% (80349/83696), 113.37 MiB | 32.32 MiB/s Receiving objects: 97% (81186/83696), 113.37 MiB | 32.32 MiB/s Receiving objects: 98% (82023/83696), 113.37 MiB | 32.32 MiB/s Receiving objects: 98% (82592/83696), 113.37 MiB | 32.32 MiB/s Receiving objects: 99% (82860/83696), 130.29 MiB | 32.44 MiB/s remote: Total 83696 (delta 7944), reused 8038 (delta 7222), pack-reused 73803 (from 3)
  7. 8.67 s Receiving objects: 100% (83696/83696), 130.29 MiB | 32.44 MiB/s Receiving objects: 100% (83696/83696), 139.23 MiB | 32.52 MiB/s, done.
  8. 9.65 s Resolving deltas: 0% (0/56218) Resolving deltas: 1% (563/56218) Resolving deltas: 2% (1125/56218) Resolving deltas: 3% (1687/56218) Resolving deltas: 4% (2251/56218) Resolving deltas: 5% (2811/56218) Resolving deltas: 6% (3374/56218) Resolving deltas: 7% (3936/56218) Resolving deltas: 8% (4498/56218) Resolving deltas: 9% (5061/56218) Resolving deltas: 10% (5622/56218) Resolving deltas: 11% (6184/56218) Resolving deltas: 12% (6747/56218) Resolving deltas: 13% (7309/56218) Resolving deltas: 14% (7871/56218) Resolving deltas: 15% (8433/56218) Resolving deltas: 16% (8995/56218) Resolving deltas: 17% (9558/56218) Resolving deltas: 18% (10120/56218) Resolving deltas: 19% (10682/56218) Resolving deltas: 20% (11244/56218) Resolving deltas: 21% (11808/56218) Resolving deltas: 22% (12369/56218) Resolving deltas: 23% (12932/56218) Resolving deltas: 24% (13493/56218) Resolving deltas: 25% (14055/56218) Resolving deltas: 26% (14618/56218) Resolving deltas: 27% (15179/56218) Resolving deltas: 28% (15742/56218) Resolving deltas: 29% (16304/56218) Resolving deltas: 30% (16866/56218) Resolving deltas: 31% (17429/56218) Resolving deltas: 32% (17990/56218) Resolving deltas: 33% (18555/56218) Resolving deltas: 34% (19116/56218) Resolving deltas: 35% (19677/56218) Resolving deltas: 36% (20239/56218) Resolving deltas: 37% (20801/56218) Resolving deltas: 38% (21363/56218) Resolving deltas: 39% (21926/56218) Resolving deltas: 40% (22489/56218) Resolving deltas: 41% (23050/56218) Resolving deltas: 42% (23612/56218) Resolving deltas: 43% (24174/56218) Resolving deltas: 44% (24736/56218) Resolving deltas: 45% (25299/56218) Resolving deltas: 46% (25861/56218) Resolving deltas: 47% (26423/56218) Resolving deltas: 48% (26985/56218) Resolving deltas: 49% (27547/56218) Resolving deltas: 50% (28110/56218) Resolving deltas: 51% (28673/56218) Resolving deltas: 52% (29237/56218) Resolving deltas: 53% (29796/56218) Resolving deltas: 54% (30358/56218) Resolving deltas: 55% (30920/56218) Resolving deltas: 56% (31483/56218) Resolving deltas: 57% (32045/56218) Resolving deltas: 58% (32608/56218) Resolving deltas: 59% (33170/56218) Resolving deltas: 60% (33732/56218) Resolving deltas: 61% (34295/56218) Resolving deltas: 62% (34856/56218) Resolving deltas: 63% (35418/56218) Resolving deltas: 64% (35980/56218) Resolving deltas: 65% (36542/56218) Resolving deltas: 66% (37104/56218) Resolving deltas: 67% (37668/56218) Resolving deltas: 68% (38229/56218) Resolving deltas: 69% (38791/56218) Resolving deltas: 70% (39353/56218) Resolving deltas: 71% (39915/56218) Resolving deltas: 72% (40477/56218) Resolving deltas: 73% (41040/56218) Resolving deltas: 74% (41602/56218) Resolving deltas: 75% (42164/56218) Resolving deltas: 76% (42726/56218) Resolving deltas: 77% (43289/56218) Resolving deltas: 78% (43851/56218) Resolving deltas: 79% (44413/56218) Resolving deltas: 80% (44975/56218) Resolving deltas: 81% (45537/56218) Resolving deltas: 82% (46099/56218) Resolving deltas: 83% (46662/56218) Resolving deltas: 84% (47226/56218) Resolving deltas: 85% (47786/56218) Resolving deltas: 86% (48348/56218) Resolving deltas: 87% (48910/56218) Resolving deltas: 88% (49472/56218) Resolving deltas: 89% (50035/56218) Resolving deltas: 90% (50597/56218) Resolving deltas: 91% (51159/56218) Resolving deltas: 92% (51721/56218) Resolving deltas: 93% (52283/56218) Resolving deltas: 94% (52845/56218) Resolving deltas: 95% (53408/56218) Resolving deltas: 96% (53970/56218) Resolving deltas: 97% (54532/56218) Resolving deltas: 98% (55094/56218) Resolving deltas: 99% (55656/56218) Resolving deltas: 100% (56218/56218) Resolving deltas: 100% (56218/56218), done.
  9. 9.97 s Fetching commit 5aadd389efabb7b039af74edad02a90d486a1c07 for simplify-spenso-api ...
  10. 9.97 s $ /nix/store/bcnisk3ydfgv26v2gw3zlky24g00yww2-git-2.54.0/bin/git fetch origin 5aadd389efabb7b039af74edad02a90d486a1c07
  11. 10.51 s From https://github.com/alphal00p/gammaloop
  12. 10.51 s * branch 5aadd389efabb7b039af74edad02a90d486a1c07 -> FETCH_HEAD
  13. 10.52 s $ /nix/store/9ypz3flqsrl5xl495mm8h645gadjsxi1-coreutils-9.11/bin/timeout --kill-after=15s 7200s /nix/store/bcnisk3ydfgv26v2gw3zlky24g00yww2-git-2.54.0/bin/git -c advice.detachedHead=false checkout 5aadd389efabb7b039af74edad02a90d486a1c07
  14. 10.72 s HEAD is now at 5aadd389e restore public gamma arguments to storage order
  15. 10.72 s $ /nix/store/9ypz3flqsrl5xl495mm8h645gadjsxi1-coreutils-9.11/bin/timeout --kill-after=15s 7200s /nix/store/23zk8sgzamrbmj1fday15szf7f2279s8-nix-2.34.7/bin/nix --extra-experimental-features nix-command --extra-experimental-features flakes --log-format internal-json run .#packages.x86_64-linux.nix-ci-check-gammaloop-nextest-core --print-build-logs
  16. 11.16 s
  17. 12.17 s Downloading cached source from https://cache.nix-ci.com
  18. 19.49 s Downloaded cached source (199.4 MiB) in 7.3s
  19. 19.49 s Progress: 1 of 1 downloaded from cache
  20. 26.71 s fetching Git repository 'https://github.com/symbolica-dev/symbolica'
  21. 27.42 s remote: Enumerating objects: 17195, done.
  22. 27.47 s remote: Counting objects: 0% (1/646) remote: Counting objects: 1% (7/646) remote: Counting objects: 2% (13/646) remote: Counting objects: 3% (20/646) remote: Counting objects: 4% (26/646) remote: Counting objects: 5% (33/646) remote: Counting objects: 6% (39/646) remote: Counting objects: 7% (46/646) remote: Counting objects: 8% (52/646) remote: Counting objects: 9% (59/646) remote: Counting objects: 10% (65/646) remote: Counting objects: 11% (72/646) remote: Counting objects: 12% (78/646) remote: Counting objects: 13% (84/646) remote: Counting objects: 14% (91/646) remote: Counting objects: 15% (97/646) remote: Counting objects: 16% (104/646) remote: Counting objects: 17% (110/646) remote: Counting objects: 18% (117/646) remote: Counting objects: 19% (123/646) remote: Counting objects: 20% (130/646) remote: Counting objects: 21% (136/646) remote: Counting objects: 22% (143/646) remote: Counting objects: 23% (149/646) remote: Counting objects: 24% (156/646) remote: Counting objects: 25% (162/646) remote: Counting objects: 26% (168/646) remote: Counting objects: 27% (175/646) remote: Counting objects: 28% (181/646) remote: Counting objects: 29% (188/646) remote: Counting objects: 30% (194/646) remote: Counting objects: 31% (201/646) remote: Counting objects: 32% (207/646) remote: Counting objects: 33% (214/646) remote: Counting objects: 34% (220/646) remote: Counting objects: 35% (227/646) remote: Counting objects: 36% (233/646) remote: Counting objects: 37% (240/646) remote: Counting objects: 38% (246/646) remote: Counting objects: 39% (252/646) remote: Counting objects: 40% (259/646) remote: Counting objects: 41% (265/646) remote: Counting objects: 42% (272/646) remote: Counting objects: 43% (278/646) remote: Counting objects: 44% (285/646) remote: Counting objects: 45% (291/646) remote: Counting objects: 46% (298/646) remote: Counting objects: 47% (304/646) remote: Counting objects: 48% (311/646) remote: Counting objects: 49% (317/646) remote: Counting objects: 50% (323/646) remote: Counting objects: 51% (330/646) remote: Counting objects: 52% (336/646) remote: Counting objects: 53% (343/646) remote: Counting objects: 54% (349/646) remote: Counting objects: 55% (356/646) remote: Counting objects: 56% (362/646) remote: Counting objects: 57% (369/646) remote: Counting objects: 58% (375/646) remote: Counting objects: 59% (382/646) remote: Counting objects: 60% (388/646) remote: Counting objects: 61% (395/646) remote: Counting objects: 62% (401/646) remote: Counting objects: 63% (407/646) remote: Counting objects: 64% (414/646) remote: Counting objects: 65% (420/646) remote: Counting objects: 66% (427/646) remote: Counting objects: 67% (433/646) remote: Counting objects: 68% (440/646) remote: Counting objects: 69% (446/646) remote: Counting objects: 70% (453/646) remote: Counting objects: 71% (459/646) remote: Counting objects: 72% (466/646) remote: Counting objects: 73% (472/646) remote: Counting objects: 74% (479/646) remote: Counting objects: 75% (485/646) remote: Counting objects: 76% (491/646) remote: Counting objects: 77% (498/646) remote: Counting objects: 78% (504/646) remote: Counting objects: 79% (511/646) remote: Counting objects: 80% (517/646) remote: Counting objects: 81% (524/646) remote: Counting objects: 82% (530/646) remote: Counting objects: 83% (537/646) remote: Counting objects: 84% (543/646) remote: Counting objects: 85% (550/646) remote: Counting objects: 86% (556/646) remote: Counting objects: 87% (563/646) remote: Counting objects: 88% (569/646) remote: Counting objects: 89% (575/646) remote: Counting objects: 90% (582/646) remote: Counting objects: 91% (588/646) remote: Counting objects: 92% (595/646) remote: Counting objects: 93% (601/646) remote: Counting objects: 94% (608/646) remote: Counting objects: 95% (614/646) remote: Counting objects: 96% (621/646) remote: Counting objects: 97% (627/646) remote: Counting objects: 98% (634/646) remote: Counting objects: 99% (640/646) remote: Counting objects: 100% (646/646) remote: Counting objects: 100% (646/646), done.
  23. 27.47 s remote: Compressing objects: 1% (1/71) remote: Compressing objects: 2% (2/71) remote: Compressing objects: 4% (3/71) remote: Compressing objects: 5% (4/71) remote: Compressing objects: 7% (5/71) remote: Compressing objects: 8% (6/71) remote: Compressing objects: 9% (7/71) remote: Compressing objects: 11% (8/71) remote: Compressing objects: 12% (9/71) remote: Compressing objects: 14% (10/71) remote: Compressing objects: 15% (11/71) remote: Compressing objects: 16% (12/71) remote: Compressing objects: 18% (13/71) remote: Compressing objects: 19% (14/71) remote: Compressing objects: 21% (15/71) remote: Compressing objects: 22% (16/71) remote: Compressing objects: 23% (17/71) remote: Compressing objects: 25% (18/71) remote: Compressing objects: 26% (19/71) remote: Compressing objects: 28% (20/71) remote: Compressing objects: 29% (21/71) remote: Compressing objects: 30% (22/71) remote: Compressing objects: 32% (23/71) remote: Compressing objects: 33% (24/71) remote: Compressing objects: 35% (25/71) remote: Compressing objects: 36% (26/71) remote: Compressing objects: 38% (27/71) remote: Compressing objects: 39% (28/71) remote: Compressing objects: 40% (29/71) remote: Compressing objects: 42% (30/71) remote: Compressing objects: 43% (31/71) remote: Compressing objects: 45% (32/71) remote: Compressing objects: 46% (33/71) remote: Compressing objects: 47% (34/71) remote: Compressing objects: 49% (35/71) remote: Compressing objects: 50% (36/71) remote: Compressing objects: 52% (37/71) remote: Compressing objects: 53% (38/71) remote: Compressing objects: 54% (39/71) remote: Compressing objects: 56% (40/71) remote: Compressing objects: 57% (41/71) remote: Compressing objects: 59% (42/71) remote: Compressing objects: 60% (43/71) remote: Compressing objects: 61% (44/71) remote: Compressing objects: 63% (45/71) remote: Compressing objects: 64% (46/71) remote: Compressing objects: 66% (47/71) remote: Compressing objects: 67% (48/71) remote: Compressing objects: 69% (49/71) remote: Compressing objects: 70% (50/71) remote: Compressing objects: 71% (51/71) remote: Compressing objects: 73% (52/71) remote: Compressing objects: 74% (53/71) remote: Compressing objects: 76% (54/71) remote: Compressing objects: 77% (55/71) remote: Compressing objects: 78% (56/71) remote: Compressing objects: 80% (57/71) remote: Compressing objects: 81% (58/71) remote: Compressing objects: 83% (59/71) remote: Compressing objects: 84% (60/71) remote: Compressing objects: 85% (61/71) remote: Compressing objects: 87% (62/71) remote: Compressing objects: 88% (63/71) remote: Compressing objects: 90% (64/71) remote: Compressing objects: 91% (65/71) remote: Compressing objects: 92% (66/71) remote: Compressing objects: 94% (67/71) remote: Compressing objects: 95% (68/71) remote: Compressing objects: 97% (69/71) remote: Compressing objects: 98% (70/71) remote: Compressing objects: 100% (71/71) remote: Compressing objects: 100% (71/71), done.
  24. 28.82 s Receiving objects: 0% (1/17195) Receiving objects: 0% (31/17195), 30.94 MiB | 30.70 MiB/s Receiving objects: 1% (172/17195), 30.94 MiB | 30.70 MiB/s Receiving objects: 2% (344/17195), 30.94 MiB | 30.70 MiB/s Receiving objects: 3% (516/17195), 30.94 MiB | 30.70 MiB/s Receiving objects: 4% (688/17195), 30.94 MiB | 30.70 MiB/s Receiving objects: 5% (860/17195), 30.94 MiB | 30.70 MiB/s Receiving objects: 6% (1032/17195), 30.94 MiB | 30.70 MiB/s Receiving objects: 7% (1204/17195), 30.94 MiB | 30.70 MiB/s Receiving objects: 8% (1376/17195), 30.94 MiB | 30.70 MiB/s Receiving objects: 9% (1548/17195), 30.94 MiB | 30.70 MiB/s Receiving objects: 10% (1720/17195), 30.94 MiB | 30.70 MiB/s Receiving objects: 11% (1892/17195), 30.94 MiB | 30.70 MiB/s Receiving objects: 12% (2064/17195), 30.94 MiB | 30.70 MiB/s Receiving objects: 13% (2236/17195), 30.94 MiB | 30.70 MiB/s Receiving objects: 14% (2408/17195), 30.94 MiB | 30.70 MiB/s Receiving objects: 15% (2580/17195), 30.94 MiB | 30.70 MiB/s Receiving objects: 16% (2752/17195), 30.94 MiB | 30.70 MiB/s Receiving objects: 17% (2924/17195), 30.94 MiB | 30.70 MiB/s Receiving objects: 18% (3096/17195), 30.94 MiB | 30.70 MiB/s Receiving objects: 19% (3268/17195), 30.94 MiB | 30.70 MiB/s Receiving objects: 20% (3439/17195), 30.94 MiB | 30.70 MiB/s Receiving objects: 21% (3611/17195), 30.94 MiB | 30.70 MiB/s Receiving objects: 22% (3783/17195), 30.94 MiB | 30.70 MiB/s Receiving objects: 23% (3955/17195), 30.94 MiB | 30.70 MiB/s Receiving objects: 24% (4127/17195), 30.94 MiB | 30.70 MiB/s Receiving objects: 25% (4299/17195), 30.94 MiB | 30.70 MiB/s Receiving objects: 26% (4471/17195), 30.94 MiB | 30.70 MiB/s Receiving objects: 27% (4643/17195), 30.94 MiB | 30.70 MiB/s Receiving objects: 28% (4815/17195), 30.94 MiB | 30.70 MiB/s Receiving objects: 29% (4987/17195), 30.94 MiB | 30.70 MiB/s Receiving objects: 30% (5159/17195), 30.94 MiB | 30.70 MiB/s Receiving objects: 31% (5331/17195), 30.94 MiB | 30.70 MiB/s Receiving objects: 32% (5503/17195), 30.94 MiB | 30.70 MiB/s Receiving objects: 33% (5675/17195), 30.94 MiB | 30.70 MiB/s Receiving objects: 34% (5847/17195), 30.94 MiB | 30.70 MiB/s Receiving objects: 35% (6019/17195), 30.94 MiB | 30.70 MiB/s Receiving objects: 36% (6191/17195), 30.94 MiB | 30.70 MiB/s Receiving objects: 37% (6363/17195), 30.94 MiB | 30.70 MiB/s Receiving objects: 38% (6535/17195), 30.94 MiB | 30.70 MiB/s Receiving objects: 39% (6707/17195), 30.94 MiB | 30.70 MiB/s Receiving objects: 40% (6878/17195), 30.94 MiB | 30.70 MiB/s Receiving objects: 41% (7050/17195), 30.94 MiB | 30.70 MiB/s Receiving objects: 42% (7222/17195), 30.94 MiB | 30.70 MiB/s Receiving objects: 43% (7394/17195), 30.94 MiB | 30.70 MiB/s Receiving objects: 44% (7566/17195), 30.94 MiB | 30.70 MiB/s Receiving objects: 45% (7738/17195), 30.94 MiB | 30.70 MiB/s Receiving objects: 46% (7910/17195), 30.94 MiB | 30.70 MiB/s Receiving objects: 47% (8082/17195), 30.94 MiB | 30.70 MiB/s Receiving objects: 48% (8254/17195), 30.94 MiB | 30.70 MiB/s Receiving objects: 49% (8426/17195), 30.94 MiB | 30.70 MiB/s Receiving objects: 50% (8598/17195), 30.94 MiB | 30.70 MiB/s Receiving objects: 51% (8770/17195), 30.94 MiB | 30.70 MiB/s Receiving objects: 52% (8942/17195), 30.94 MiB | 30.70 MiB/s Receiving objects: 53% (9114/17195), 30.94 MiB | 30.70 MiB/s Receiving objects: 54% (9286/17195), 30.94 MiB | 30.70 MiB/s Receiving objects: 55% (9458/17195), 30.94 MiB | 30.70 MiB/s Receiving objects: 56% (9630/17195), 30.94 MiB | 30.70 MiB/s Receiving objects: 57% (9802/17195), 30.94 MiB | 30.70 MiB/s Receiving objects: 58% (9974/17195), 30.94 MiB | 30.70 MiB/s Receiving objects: 59% (10146/17195), 30.94 MiB | 30.70 MiB/s Receiving objects: 60% (10317/17195), 30.94 MiB | 30.70 MiB/s Receiving objects: 61% (10489/17195), 30.94 MiB | 30.70 MiB/s Receiving objects: 62% (10661/17195), 30.94 MiB | 30.70 MiB/s Receiving objects: 63% (10833/17195), 30.94 MiB | 30.70 MiB/s Receiving objects: 64% (11005/17195), 30.94 MiB | 30.70 MiB/s Receiving objects: 65% (11177/17195), 30.94 MiB | 30.70 MiB/s Receiving objects: 66% (11349/17195), 30.94 MiB | 30.70 MiB/s Receiving objects: 67% (11521/17195), 30.94 MiB | 30.70 MiB/s Receiving objects: 68% (11693/17195), 30.94 MiB | 30.70 MiB/s Receiving objects: 69% (11865/17195), 30.94 MiB | 30.70 MiB/s Receiving objects: 70% (12037/17195), 30.94 MiB | 30.70 MiB/s Receiving objects: 71% (12209/17195), 30.94 MiB | 30.70 MiB/s Receiving objects: 72% (12381/17195), 30.94 MiB | 30.70 MiB/s Receiving objects: 73% (12553/17195), 30.94 MiB | 30.70 MiB/s Receiving objects: 74% (12725/17195), 30.94 MiB | 30.70 MiB/s Receiving objects: 75% (12897/17195), 30.94 MiB | 30.70 MiB/s Receiving objects: 76% (13069/17195), 30.94 MiB | 30.70 MiB/s Receiving objects: 77% (13241/17195), 30.94 MiB | 30.70 MiB/s Receiving objects: 78% (13413/17195), 30.94 MiB | 30.70 MiB/s Receiving objects: 79% (13585/17195), 30.94 MiB | 30.70 MiB/s Receiving objects: 80% (13756/17195), 30.94 MiB | 30.70 MiB/s Receiving objects: 81% (13928/17195), 30.94 MiB | 30.70 MiB/s Receiving objects: 82% (14100/17195), 30.94 MiB | 30.70 MiB/s Receiving objects: 83% (14272/17195), 30.94 MiB | 30.70 MiB/s Receiving objects: 84% (14444/17195), 30.94 MiB | 30.70 MiB/s Receiving objects: 85% (14616/17195), 30.94 MiB | 30.70 MiB/s Receiving objects: 86% (14788/17195), 30.94 MiB | 30.70 MiB/s Receiving objects: 87% (14960/17195), 30.94 MiB | 30.70 MiB/s Receiving objects: 88% (15132/17195), 30.94 MiB | 30.70 MiB/s Receiving objects: 89% (15304/17195), 30.94 MiB | 30.70 MiB/s Receiving objects: 90% (15476/17195), 30.94 MiB | 30.70 MiB/s Receiving objects: 91% (15648/17195), 30.94 MiB | 30.70 MiB/s Receiving objects: 92% (15820/17195), 30.94 MiB | 30.70 MiB/s Receiving objects: 93% (15992/17195), 30.94 MiB | 30.70 MiB/s Receiving objects: 94% (16164/17195), 30.94 MiB | 30.70 MiB/s Receiving objects: 95% (16336/17195), 30.94 MiB | 30.70 MiB/s Receiving objects: 96% (16508/17195), 30.94 MiB | 30.70 MiB/s Receiving objects: 97% (16680/17195), 30.94 MiB | 30.70 MiB/s Receiving objects: 98% (16852/17195), 30.94 MiB | 30.70 MiB/s Receiving objects: 99% (17024/17195), 30.94 MiB | 30.70 MiB/s remote: Total 17195 (delta 614), reused 575 (delta 575), pack-reused 16549 (from 1)
  25. 28.82 s Receiving objects: 100% (17195/17195), 30.94 MiB | 30.70 MiB/s Receiving objects: 100% (17195/17195), 43.06 MiB | 31.93 MiB/s, done.
  26. 29.04 s Resolving deltas: 0% (0/13290) Resolving deltas: 1% (134/13290) Resolving deltas: 2% (266/13290) Resolving deltas: 3% (399/13290) Resolving deltas: 4% (532/13290) Resolving deltas: 5% (669/13290) Resolving deltas: 6% (798/13290) Resolving deltas: 7% (931/13290) Resolving deltas: 8% (1064/13290) Resolving deltas: 9% (1197/13290) Resolving deltas: 10% (1329/13290) Resolving deltas: 11% (1462/13290) Resolving deltas: 12% (1595/13290) Resolving deltas: 13% (1728/13290) Resolving deltas: 14% (1861/13290) Resolving deltas: 15% (1994/13290) Resolving deltas: 16% (2127/13290) Resolving deltas: 17% (2260/13290) Resolving deltas: 18% (2393/13290) Resolving deltas: 19% (2526/13290) Resolving deltas: 20% (2658/13290) Resolving deltas: 21% (2791/13290) Resolving deltas: 22% (2924/13290) Resolving deltas: 23% (3057/13290) Resolving deltas: 24% (3190/13290) Resolving deltas: 25% (3323/13290) Resolving deltas: 26% (3457/13290) Resolving deltas: 27% (3589/13290) Resolving deltas: 28% (3722/13290) Resolving deltas: 29% (3855/13290) Resolving deltas: 30% (3987/13290) Resolving deltas: 31% (4120/13290) Resolving deltas: 32% (4253/13290) Resolving deltas: 33% (4386/13290) Resolving deltas: 34% (4519/13290) Resolving deltas: 35% (4652/13290) Resolving deltas: 36% (4785/13290) Resolving deltas: 37% (4918/13290) Resolving deltas: 38% (5051/13290) Resolving deltas: 39% (5184/13290) Resolving deltas: 40% (5316/13290) Resolving deltas: 41% (5449/13290) Resolving deltas: 42% (5582/13290) Resolving deltas: 43% (5715/13290) Resolving deltas: 44% (5849/13290) Resolving deltas: 45% (5981/13290) Resolving deltas: 46% (6114/13290) Resolving deltas: 47% (6247/13290) Resolving deltas: 48% (6382/13290) Resolving deltas: 49% (6514/13290) Resolving deltas: 50% (6646/13290) Resolving deltas: 51% (6779/13290) Resolving deltas: 52% (6911/13290) Resolving deltas: 53% (7044/13290) Resolving deltas: 54% (7178/13290) Resolving deltas: 55% (7310/13290) Resolving deltas: 56% (7444/13290) Resolving deltas: 57% (7576/13290) Resolving deltas: 58% (7709/13290) Resolving deltas: 59% (7842/13290) Resolving deltas: 60% (7974/13290) Resolving deltas: 61% (8107/13290) Resolving deltas: 62% (8241/13290) Resolving deltas: 63% (8373/13290) Resolving deltas: 64% (8506/13290) Resolving deltas: 65% (8639/13290) Resolving deltas: 66% (8772/13290) Resolving deltas: 67% (8905/13290) Resolving deltas: 68% (9038/13290) Resolving deltas: 69% (9171/13290) Resolving deltas: 70% (9303/13290) Resolving deltas: 71% (9437/13290) Resolving deltas: 72% (9571/13290) Resolving deltas: 73% (9702/13290) Resolving deltas: 74% (9835/13290) Resolving deltas: 75% (9968/13290) Resolving deltas: 76% (10101/13290) Resolving deltas: 77% (10235/13290) Resolving deltas: 78% (10369/13290) Resolving deltas: 79% (10500/13290) Resolving deltas: 80% (10632/13290) Resolving deltas: 81% (10766/13290) Resolving deltas: 82% (10899/13290) Resolving deltas: 83% (11031/13290) Resolving deltas: 84% (11165/13290) Resolving deltas: 85% (11297/13290) Resolving deltas: 86% (11431/13290) Resolving deltas: 87% (11563/13290) Resolving deltas: 88% (11696/13290) Resolving deltas: 89% (11829/13290) Resolving deltas: 90% (11961/13290) Resolving deltas: 91% (12095/13290) Resolving deltas: 92% (12227/13290) Resolving deltas: 93% (12360/13290) Resolving deltas: 94% (12493/13290) Resolving deltas: 95% (12626/13290) Resolving deltas: 96% (12759/13290) Resolving deltas: 97% (12892/13290) Resolving deltas: 98% (13025/13290) Resolving deltas: 99% (13158/13290) Resolving deltas: 100% (13290/13290) Resolving deltas: 100% (13290/13290), done.
  27. 29.14 s From https://github.com/symbolica-dev/symbolica
  28. 29.14 s * [new branch] algebraic_rational -> algebraic_rational
  29. 29.14 s * [new branch] alias -> alias
  30. 29.14 s * [new branch] arm_asm -> arm_asm
  31. 29.14 s * [new branch] bincode -> bincode
  32. 29.14 s * [new branch] borrowed_atom -> borrowed_atom
  33. 29.14 s * [new branch] branching_evaluate -> branching_evaluate
  34. 29.14 s * [new branch] chi_sq_fix -> chi_sq_fix
  35. 29.14 s * [new branch] coeff -> coeff
  36. 29.14 s * [new branch] coeff_first -> coeff_first
  37. 29.14 s * [new branch] complex_coeff -> complex_coeff
  38. 29.14 s * [new branch] complex_ring -> complex_ring
  39. 29.14 s * [new branch] computational_graph -> computational_graph
  40. 29.14 s * [new branch] conditions -> conditions
  41. 29.14 s * [new branch] delay -> delay
  42. 29.14 s * [new branch] dense_mul -> dense_mul
  43. 29.14 s * [new branch] dev -> dev
  44. 29.14 s * [new branch] dev-cleanup-release-2.0 -> dev-cleanup-release-2.0
  45. 29.14 s * [new branch] dev-cleanup-release-2.0-numerica2-bisectable -> dev-cleanup-release-2.0-numerica2-bisectable
  46. 29.14 s * [new branch] dev_poly -> dev_poly
  47. 29.14 s * [new branch] dual -> dual
  48. 29.14 s * [new branch] error_tracking_coeff -> error_tracking_coeff
  49. 29.14 s * [new branch] evaluate -> evaluate
  50. 29.14 s * [new branch] evaluate_merge -> evaluate_merge
  51. 29.14 s * [new branch] export -> export
  52. 29.14 s * [new branch] export_serde -> export_serde
  53. 29.14 s * [new branch] fac_div -> fac_div
  54. 29.14 s * [new branch] factorint -> factorint
  55. 29.14 s * [new branch] float -> float
  56. 29.14 s * [new branch] floatmerge -> floatmerge
  57. 29.14 s * [new branch] format -> format
  58. 29.14 s * [new branch] function_simplify -> function_simplify
  59. 29.14 s * [new branch] graph_filter -> graph_filter
  60. 29.14 s * [new branch] infinity -> infinity
  61. 29.14 s * [new branch] int_i128 -> int_i128
  62. 29.14 s * [new branch] lib_merge -> lib_merge
  63. 29.14 s * [new branch] logging -> logging
  64. 29.14 s * [new branch] main -> main
  65. 29.14 s * [new branch] merge_evaluator -> merge_evaluator
  66. 29.14 s * [new branch] modules -> modules
  67. 29.14 s * [new branch] name_check -> name_check
  68. 29.14 s * [new branch] nested_evaluate -> nested_evaluate
  69. 29.14 s * [new branch] nested_symmetrize -> nested_symmetrize
  70. 29.14 s * [new branch] newton -> newton
  71. 29.14 s * [new branch] no_namespace -> no_namespace
  72. 29.14 s * [new branch] numer_coeff -> numer_coeff
  73. 29.14 s * [new branch] numpy -> numpy
  74. 29.14 s * [new branch] oem -> oem
  75. 29.14 s * [new branch] optim -> optim
  76. 29.14 s * [new branch] optional_patterns -> optional_patterns
  77. 29.14 s * [new branch] oss_repo_split -> oss_repo_split
  78. 29.14 s * [new branch] oss_split -> oss_split
  79. 29.14 s * [new branch] packed_exp -> packed_exp
  80. 29.14 s * [new branch] prep -> prep
  81. 29.14 s * [new branch] rat_parser -> rat_parser
  82. 29.14 s * [new branch] ratpolyfac -> ratpolyfac
  83. 29.14 s * [new branch] register_symbols -> register_symbols
  84. 29.14 s * [new branch] replace_builder -> replace_builder
  85. 29.14 s * [new branch] rewrite -> rewrite
  86. 29.14 s * [new branch] rug_patch -> rug_patch
  87. 29.14 s * [new branch] series -> series
  88. 29.14 s * [new branch] simd -> simd
  89. 29.14 s * [new branch] simple_stub -> simple_stub
  90. 29.14 s * [new branch] skip-license-scopes -> skip-license-scopes
  91. 29.14 s * [new branch] smaller_poly -> smaller_poly
  92. 29.14 s * [new branch] specialize_pattern -> specialize_pattern
  93. 29.14 s * [new branch] split_asm -> split_asm
  94. 29.14 s * [new branch] sub-evaluators -> sub-evaluators
  95. 29.14 s * [new branch] symbol_data -> symbol_data
  96. 29.14 s * [new branch] symbol_der -> symbol_der
  97. 29.14 s * [new branch] symbol_group -> symbol_group
  98. 29.14 s * [new branch] symjit -> symjit
  99. 29.14 s * [new branch] tmp_merge -> tmp_merge
  100. 29.14 s * [new branch] transformer -> transformer
  101. 29.14 s * [new branch] vector_evaluate -> vector_evaluate
  102. 29.14 s * [new branch] wasm -> wasm
  103. 29.14 s * [new branch] wasm2 -> wasm2
  104. 29.14 s * [new branch] windows -> windows
  105. 29.14 s * [new branch] windows_ci -> windows_ci
  106. 29.14 s * [new branch] zeroflow -> zeroflow
  107. 29.14 s * [new ref] refs/pull/12/head -> refs/pull/12/head
  108. 29.14 s * [new ref] refs/pull/13/head -> refs/pull/13/head
  109. 29.14 s * [new ref] refs/pull/14/head -> refs/pull/14/head
  110. 29.14 s * [new ref] refs/pull/19/head -> refs/pull/19/head
  111. 29.14 s * [new ref] refs/pull/2/head -> refs/pull/2/head
  112. 29.14 s * [new ref] refs/pull/20/head -> refs/pull/20/head
  113. 29.14 s * [new ref] refs/pull/22/head -> refs/pull/22/head
  114. 29.14 s * [new ref] refs/pull/26/head -> refs/pull/26/head
  115. 29.14 s * [new ref] refs/pull/29/head -> refs/pull/29/head
  116. 29.14 s * [new ref] refs/pull/30/head -> refs/pull/30/head
  117. 29.14 s * [new ref] refs/pull/31/head -> refs/pull/31/head
  118. 29.14 s * [new ref] refs/pull/32/head -> refs/pull/32/head
  119. 29.14 s * [new ref] refs/pull/39/head -> refs/pull/39/head
  120. 29.14 s * [new ref] refs/pull/40/head -> refs/pull/40/head
  121. 29.14 s * [new ref] refs/pull/41/head -> refs/pull/41/head
  122. 29.14 s * [new ref] refs/pull/43/head -> refs/pull/43/head
  123. 29.14 s * [new ref] refs/pull/44/head -> refs/pull/44/head
  124. 29.14 s * [new ref] refs/pull/45/head -> refs/pull/45/head
  125. 29.14 s * [new ref] refs/pull/46/head -> refs/pull/46/head
  126. 29.14 s * [new ref] refs/pull/47/head -> refs/pull/47/head
  127. 29.14 s * [new ref] refs/pull/47/merge -> refs/pull/47/merge
  128. 29.14 s * [new ref] refs/pull/48/head -> refs/pull/48/head
  129. 29.14 s * [new ref] refs/pull/48/merge -> refs/pull/48/merge
  130. 29.14 s * [new ref] refs/pull/5/head -> refs/pull/5/head
  131. 29.14 s * [new ref] refs/pull/6/head -> refs/pull/6/head
  132. 29.14 s * [new ref] refs/pull/7/head -> refs/pull/7/head
  133. 29.14 s * [new ref] refs/pull/8/head -> refs/pull/8/head
  134. 29.14 s * [new tag] v0.1.0 -> v0.1.0
  135. 29.14 s * [new tag] v0.1.1 -> v0.1.1
  136. 29.14 s * [new tag] v0.1.2 -> v0.1.2
  137. 29.14 s * [new tag] v0.1.3 -> v0.1.3
  138. 29.14 s * [new tag] v0.1.4 -> v0.1.4
  139. 29.14 s * [new tag] v0.10.0 -> v0.10.0
  140. 29.14 s * [new tag] v0.11.0 -> v0.11.0
  141. 29.14 s * [new tag] v0.12.0 -> v0.12.0
  142. 29.14 s * [new tag] v0.12.1 -> v0.12.1
  143. 29.14 s * [new tag] v0.13.0 -> v0.13.0
  144. 29.14 s * [new tag] v0.14.0 -> v0.14.0
  145. 29.14 s * [new tag] v0.15.0 -> v0.15.0
  146. 29.14 s * [new tag] v0.15.1 -> v0.15.1
  147. 29.14 s * [new tag] v0.16.0 -> v0.16.0
  148. 29.14 s * [new tag] v0.17.0 -> v0.17.0
  149. 29.14 s * [new tag] v0.18.0 -> v0.18.0
  150. 29.14 s * [new tag] v0.19.0 -> v0.19.0
  151. 29.14 s * [new tag] v0.2.0 -> v0.2.0
  152. 29.14 s * [new tag] v0.20.0 -> v0.20.0
  153. 29.14 s * [new tag] v0.3.0 -> v0.3.0
  154. 29.14 s * [new tag] v0.4.0 -> v0.4.0
  155. 29.14 s * [new tag] v0.5.0 -> v0.5.0
  156. 29.14 s * [new tag] v0.6.0 -> v0.6.0
  157. 29.14 s * [new tag] v0.7.0 -> v0.7.0
  158. 29.14 s * [new tag] v0.8.0 -> v0.8.0
  159. 29.14 s * [new tag] v0.8.1 -> v0.8.1
  160. 29.14 s * [new tag] v0.8.2 -> v0.8.2
  161. 29.14 s * [new tag] v0.9.0 -> v0.9.0
  162. 29.14 s * [new tag] v1.0.0 -> v1.0.0
  163. 29.14 s * [new tag] v1.0.1 -> v1.0.1
  164. 29.14 s * [new tag] v1.1.0 -> v1.1.0
  165. 29.14 s * [new tag] v1.2.0 -> v1.2.0
  166. 29.14 s * [new tag] v1.3.0 -> v1.3.0
  167. 29.14 s * [new tag] v1.4.0 -> v1.4.0
  168. 29.14 s * [new tag] v1.5.0 -> v1.5.0
  169. 29.14 s * [new tag] v1.5.1 -> v1.5.1
  170. 29.14 s * [new tag] v2.0.0 -> v2.0.0
  171. 29.14 s * [new tag] v2.1.0 -> v2.1.0
  172. 29.14 s * [new tag] v2.2.0 -> v2.2.0
  173. 29.72 s fetching Git repository 'https://github.com/lcnbr/tymbolica'
  174. 30.39 s remote: Enumerating objects: 1056, done.
  175. 36.19 s Receiving objects: 0% (1/1056) Receiving objects: 1% (11/1056) Receiving objects: 2% (22/1056) Receiving objects: 3% (32/1056) Receiving objects: 4% (43/1056) Receiving objects: 5% (53/1056) Receiving objects: 6% (64/1056) Receiving objects: 7% (74/1056) Receiving objects: 8% (85/1056) Receiving objects: 9% (96/1056) Receiving objects: 10% (106/1056) Receiving objects: 11% (117/1056) Receiving objects: 12% (127/1056) Receiving objects: 13% (138/1056) Receiving objects: 14% (148/1056) Receiving objects: 15% (159/1056) Receiving objects: 16% (169/1056), 14.66 MiB | 27.59 MiB/s Receiving objects: 17% (180/1056), 14.66 MiB | 27.59 MiB/s Receiving objects: 18% (191/1056), 14.66 MiB | 27.59 MiB/s Receiving objects: 19% (201/1056), 14.66 MiB | 27.59 MiB/s Receiving objects: 20% (212/1056), 14.66 MiB | 27.59 MiB/s Receiving objects: 20% (221/1056), 30.73 MiB | 29.79 MiB/s Receiving objects: 21% (222/1056), 30.73 MiB | 29.79 MiB/s Receiving objects: 22% (233/1056), 30.73 MiB | 29.79 MiB/s Receiving objects: 23% (243/1056), 30.73 MiB | 29.79 MiB/s Receiving objects: 24% (254/1056), 30.73 MiB | 29.79 MiB/s Receiving objects: 25% (264/1056), 30.73 MiB | 29.79 MiB/s Receiving objects: 26% (275/1056), 30.73 MiB | 29.79 MiB/s Receiving objects: 27% (286/1056), 30.73 MiB | 29.79 MiB/s Receiving objects: 28% (296/1056), 45.89 MiB | 29.80 MiB/s Receiving objects: 29% (307/1056), 45.89 MiB | 29.80 MiB/s Receiving objects: 30% (317/1056), 45.89 MiB | 29.80 MiB/s Receiving objects: 30% (321/1056), 60.92 MiB | 29.83 MiB/s Receiving objects: 31% (328/1056), 60.92 MiB | 29.83 MiB/s Receiving objects: 32% (338/1056), 60.92 MiB | 29.83 MiB/s Receiving objects: 33% (349/1056), 60.92 MiB | 29.83 MiB/s Receiving objects: 34% (360/1056), 77.46 MiB | 30.46 MiB/s Receiving objects: 35% (370/1056), 77.46 MiB | 30.46 MiB/s Receiving objects: 36% (381/1056), 77.46 MiB | 30.46 MiB/s Receiving objects: 37% (391/1056), 77.46 MiB | 30.46 MiB/s Receiving objects: 38% (402/1056), 77.46 MiB | 30.46 MiB/s Receiving objects: 39% (412/1056), 77.46 MiB | 30.46 MiB/s Receiving objects: 40% (423/1056), 77.46 MiB | 30.46 MiB/s Receiving objects: 41% (433/1056), 77.46 MiB | 30.46 MiB/s Receiving objects: 42% (444/1056), 77.46 MiB | 30.46 MiB/s Receiving objects: 43% (455/1056), 77.46 MiB | 30.46 MiB/s Receiving objects: 44% (465/1056), 77.46 MiB | 30.46 MiB/s Receiving objects: 45% (476/1056), 77.46 MiB | 30.46 MiB/s Receiving objects: 46% (486/1056), 77.46 MiB | 30.46 MiB/s Receiving objects: 47% (497/1056), 77.46 MiB | 30.46 MiB/s Receiving objects: 48% (507/1056), 77.46 MiB | 30.46 MiB/s Receiving objects: 49% (518/1056), 77.46 MiB | 30.46 MiB/s Receiving objects: 50% (528/1056), 77.46 MiB | 30.46 MiB/s Receiving objects: 51% (539/1056), 77.46 MiB | 30.46 MiB/s Receiving objects: 52% (550/1056), 77.46 MiB | 30.46 MiB/s Receiving objects: 53% (560/1056), 77.46 MiB | 30.46 MiB/s Receiving objects: 54% (571/1056), 77.46 MiB | 30.46 MiB/s Receiving objects: 55% (581/1056), 77.46 MiB | 30.46 MiB/s Receiving objects: 56% (592/1056), 77.46 MiB | 30.46 MiB/s Receiving objects: 57% (602/1056), 77.46 MiB | 30.46 MiB/s Receiving objects: 58% (613/1056), 77.46 MiB | 30.46 MiB/s Receiving objects: 58% (621/1056), 94.57 MiB | 31.08 MiB/s Receiving objects: 59% (624/1056), 94.57 MiB | 31.08 MiB/s Receiving objects: 60% (634/1056), 94.57 MiB | 31.08 MiB/s Receiving objects: 61% (645/1056), 94.57 MiB | 31.08 MiB/s Receiving objects: 62% (655/1056), 110.74 MiB | 31.17 MiB/s Receiving objects: 63% (666/1056), 110.74 MiB | 31.17 MiB/s Receiving objects: 64% (676/1056), 110.74 MiB | 31.17 MiB/s Receiving objects: 65% (687/1056), 110.74 MiB | 31.17 MiB/s Receiving objects: 66% (697/1056), 110.74 MiB | 31.17 MiB/s Receiving objects: 67% (708/1056), 110.74 MiB | 31.17 MiB/s Receiving objects: 67% (717/1056), 127.27 MiB | 31.40 MiB/s Receiving objects: 68% (719/1056), 127.27 MiB | 31.40 MiB/s Receiving objects: 69% (729/1056), 127.27 MiB | 31.40 MiB/s Receiving objects: 70% (740/1056), 127.27 MiB | 31.40 MiB/s Receiving objects: 71% (750/1056), 144.45 MiB | 31.73 MiB/s Receiving objects: 72% (761/1056), 144.45 MiB | 31.73 MiB/s Receiving objects: 73% (771/1056), 144.45 MiB | 31.73 MiB/s Receiving objects: 74% (782/1056), 144.45 MiB | 31.73 MiB/s Receiving objects: 75% (792/1056), 144.45 MiB | 31.73 MiB/s Receiving objects: 76% (803/1056), 144.45 MiB | 31.73 MiB/s Receiving objects: 77% (814/1056), 144.45 MiB | 31.73 MiB/s Receiving objects: 78% (824/1056), 144.45 MiB | 31.73 MiB/s Receiving objects: 79% (835/1056), 144.45 MiB | 31.73 MiB/s Receiving objects: 80% (845/1056), 144.45 MiB | 31.73 MiB/s Receiving objects: 81% (856/1056), 144.45 MiB | 31.73 MiB/s Receiving objects: 82% (866/1056), 144.45 MiB | 31.73 MiB/s Receiving objects: 83% (877/1056), 144.45 MiB | 31.73 MiB/s Receiving objects: 84% (888/1056), 144.45 MiB | 31.73 MiB/s Receiving objects: 85% (898/1056), 144.45 MiB | 31.73 MiB/s Receiving objects: 86% (909/1056), 144.45 MiB | 31.73 MiB/s Receiving objects: 87% (919/1056), 144.45 MiB | 31.73 MiB/s Receiving objects: 88% (930/1056), 144.45 MiB | 31.73 MiB/s Receiving objects: 89% (940/1056), 144.45 MiB | 31.73 MiB/s Receiving objects: 89% (950/1056), 160.11 MiB | 32.03 MiB/s Receiving objects: 90% (951/1056), 160.11 MiB | 32.03 MiB/s Receiving objects: 91% (961/1056), 160.11 MiB | 32.03 MiB/s Receiving objects: 92% (972/1056), 176.53 MiB | 32.06 MiB/s Receiving objects: 93% (983/1056), 176.53 MiB | 32.06 MiB/s Receiving objects: 94% (993/1056), 176.53 MiB | 32.06 MiB/s Receiving objects: 95% (1004/1056), 176.53 MiB | 32.06 MiB/s Receiving objects: 96% (1014/1056), 176.53 MiB | 32.06 MiB/s Receiving objects: 97% (1025/1056), 176.53 MiB | 32.06 MiB/s Receiving objects: 98% (1035/1056), 176.53 MiB | 32.06 MiB/s Receiving objects: 99% (1046/1056), 176.53 MiB | 32.06 MiB/s remote: Total 1056 (delta 0), reused 0 (delta 0), pack-reused 1056 (from 1)
  176. 36.19 s Receiving objects: 100% (1056/1056), 176.53 MiB | 32.06 MiB/s Receiving objects: 100% (1056/1056), 182.85 MiB | 31.79 MiB/s, done.
  177. 36.41 s Resolving deltas: 0% (0/560) Resolving deltas: 1% (6/560) Resolving deltas: 2% (13/560) Resolving deltas: 3% (18/560) Resolving deltas: 4% (23/560) Resolving deltas: 5% (28/560) Resolving deltas: 6% (34/560) Resolving deltas: 7% (40/560) Resolving deltas: 8% (45/560) Resolving deltas: 9% (51/560) Resolving deltas: 10% (56/560) Resolving deltas: 11% (62/560) Resolving deltas: 12% (68/560) Resolving deltas: 13% (73/560) Resolving deltas: 14% (79/560) Resolving deltas: 15% (85/560) Resolving deltas: 16% (93/560) Resolving deltas: 17% (96/560) Resolving deltas: 18% (101/560) Resolving deltas: 19% (107/560) Resolving deltas: 20% (112/560) Resolving deltas: 21% (119/560) Resolving deltas: 22% (124/560) Resolving deltas: 23% (129/560) Resolving deltas: 24% (136/560) Resolving deltas: 25% (140/560) Resolving deltas: 26% (146/560) Resolving deltas: 27% (152/560) Resolving deltas: 28% (157/560) Resolving deltas: 29% (167/560) Resolving deltas: 30% (169/560) Resolving deltas: 31% (174/560) Resolving deltas: 32% (180/560) Resolving deltas: 33% (185/560) Resolving deltas: 34% (191/560) Resolving deltas: 35% (196/560) Resolving deltas: 36% (202/560) Resolving deltas: 37% (208/560) Resolving deltas: 38% (213/560) Resolving deltas: 39% (219/560) Resolving deltas: 40% (224/560) Resolving deltas: 41% (230/560) Resolving deltas: 42% (236/560) Resolving deltas: 43% (241/560) Resolving deltas: 44% (247/560) Resolving deltas: 45% (252/560) Resolving deltas: 46% (258/560) Resolving deltas: 47% (264/560) Resolving deltas: 48% (269/560) Resolving deltas: 49% (275/560) Resolving deltas: 50% (280/560) Resolving deltas: 51% (288/560) Resolving deltas: 52% (292/560) Resolving deltas: 53% (297/560) Resolving deltas: 54% (303/560) Resolving deltas: 55% (309/560) Resolving deltas: 56% (314/560) Resolving deltas: 57% (320/560) Resolving deltas: 58% (325/560) Resolving deltas: 59% (331/560) Resolving deltas: 60% (336/560) Resolving deltas: 61% (342/560) Resolving deltas: 62% (348/560) Resolving deltas: 63% (353/560) Resolving deltas: 64% (360/560) Resolving deltas: 65% (364/560) Resolving deltas: 66% (370/560) Resolving deltas: 67% (377/560) Resolving deltas: 68% (381/560) Resolving deltas: 69% (387/560) Resolving deltas: 70% (392/560) Resolving deltas: 71% (398/560) Resolving deltas: 72% (404/560) Resolving deltas: 73% (414/560) Resolving deltas: 74% (415/560) Resolving deltas: 75% (420/560) Resolving deltas: 76% (426/560) Resolving deltas: 77% (434/560) Resolving deltas: 78% (438/560) Resolving deltas: 79% (444/560) Resolving deltas: 80% (448/560) Resolving deltas: 81% (454/560) Resolving deltas: 82% (460/560) Resolving deltas: 83% (468/560) Resolving deltas: 84% (471/560) Resolving deltas: 85% (476/560) Resolving deltas: 86% (482/560) Resolving deltas: 87% (488/560) Resolving deltas: 88% (493/560) Resolving deltas: 89% (500/560) Resolving deltas: 90% (504/560) Resolving deltas: 91% (510/560) Resolving deltas: 92% (517/560) Resolving deltas: 93% (521/560) Resolving deltas: 94% (527/560) Resolving deltas: 95% (534/560) Resolving deltas: 96% (539/560) Resolving deltas: 97% (544/560) Resolving deltas: 98% (549/560) Resolving deltas: 99% (555/560) Resolving deltas: 100% (560/560) Resolving deltas: 100% (560/560), done.
  178. 36.53 s From https://github.com/lcnbr/tymbolica
  179. 36.53 s * [new branch] main -> main
  180. 36.53 s * [new branch] shared-symbolica-interface -> shared-symbolica-interface
  181. 38.91 s
  182. 38.91 s Downloading cached gammaloop-nextest-binaries-core-gammaloop-api from https://cache.nix-ci.com
  183. 38.91 s Downloading cached gammaloop-nextest-binaries-core-gammaloop-tracing-filter from https://cache.nix-ci.com
  184. 38.91 s Downloading cached gammaloop-nextest-binaries-core-gammaloop-tracing-filter-macros from https://cache.nix-ci.com
  185. 38.91 s Downloading cached gammaloop-nextest-binaries-core-gammalooprs from https://cache.nix-ci.com
  186. 38.92 s Downloading cached xgcc-15.2.0-libgcc from https://cache.nix-ci.com
  187. 38.92 s Downloading cached busybox from https://cache.nix-ci.com
  188. 38.92 s Downloading cached gcc-15.2.0-libgcc from https://cache.nix-ci.com
  189. 38.92 s Downloading cached libunistring from https://cache.nix-ci.com
  190. 38.92 s Downloading cached publicsuffix-list-0-unstable-2026-05 from https://cache.nix-ci.com
  191. 39.08 s Downloaded cached publicsuffix-list-0-unstable-2026-05 (329 KiB) in 162ms
  192. 39.08 s Progress: 0 of 1 built, 1 of 71 downloaded from cache (8 downloading)
  193. 39.08 s Downloaded cached gcc-15.2.0-libgcc (193 KiB) in 165ms
  194. 39.08 s Progress: 0 of 1 built, 2 of 71 downloaded from cache (7 downloading)
  195. 39.09 s Downloaded cached busybox (230 KiB) in 166ms
  196. 39.09 s Progress: 0 of 1 built, 3 of 71 downloaded from cache (6 downloading)
  197. 39.09 s Downloaded cached xgcc-15.2.0-libgcc (193 KiB) in 172ms
  198. 39.09 s Progress: 0 of 1 built, 4 of 71 downloaded from cache (5 downloading)
  199. 39.10 s Downloaded cached libunistring (2 MiB) in 180ms
  200. 39.10 s Progress: 0 of 1 built, 5 of 71 downloaded from cache (4 downloading)
  201. 39.10 s Downloading cached libidn2 from https://cache.nix-ci.com
  202. 39.15 s Downloaded cached gammaloop-nextest-binaries-core-gammaloop-tracing-filter-macros (1.7 MiB) in 230ms
  203. 39.15 s Progress: 0 of 1 built, 6 of 71 downloaded from cache (4 downloading)
  204. 39.21 s Downloaded cached libidn2 (359 KiB) in 106ms
  205. 39.21 s Progress: 0 of 1 built, 7 of 71 downloaded from cache (3 downloading)
  206. 39.21 s Downloading cached glibc-2.42 from https://cache.nix-ci.com
  207. 39.59 s Downloaded cached glibc-2.42 (33.5 MiB) in 380ms
  208. 39.59 s Progress: 0 of 1 built, 8 of 71 downloaded from cache (3 downloading)
  209. 39.59 s Downloading cached attr from https://cache.nix-ci.com
  210. 39.59 s Downloading cached aws-c-common from https://cache.nix-ci.com
  211. 39.59 s Downloading cached bash from https://cache.nix-ci.com
  212. 39.59 s Downloading cached brotli-1.2.0-lib from https://cache.nix-ci.com
  213. 39.59 s Downloading cached bzip2 from https://cache.nix-ci.com
  214. 39.59 s Downloading cached editline-1.17.1-unstable-2025-05 from https://cache.nix-ci.com
  215. 39.59 s Downloading cached gcc-15.2.0-lib from https://cache.nix-ci.com
  216. 39.59 s Downloading cached hwloc-2.14.0-lib from https://cache.nix-ci.com
  217. 39.59 s Downloading cached libcpuid from https://cache.nix-ci.com
  218. 39.59 s Downloading cached keyutils-1.6.3-lib from https://cache.nix-ci.com
  219. 39.59 s Downloading cached libpsl from https://cache.nix-ci.com
  220. 39.60 s Downloading cached libseccomp-2.6.0-lib from https://cache.nix-ci.com
  221. 39.60 s Downloading cached libsodium-1.0.22-unstable-2026-04 from https://cache.nix-ci.com
  222. 39.68 s Downloaded cached attr (90 KiB) in 88ms
  223. 39.68 s Progress: 0 of 1 built, 9 of 71 downloaded from cache (15 downloading)
  224. 39.68 s Downloading cached libxml2 from https://cache.nix-ci.com
  225. 39.70 s Downloaded cached editline-1.17.1-unstable-2025-05 (58 KiB) in 113ms
  226. 39.70 s Progress: 0 of 1 built, 10 of 71 downloaded from cache (15 downloading)
  227. 39.70 s Downloading cached acl from https://cache.nix-ci.com
  228. 39.70 s Downloaded cached bzip2 (86 KiB) in 115ms
  229. 39.70 s Progress: 0 of 1 built, 11 of 71 downloaded from cache (15 downloading)
  230. 39.70 s Downloading cached llhttp from https://cache.nix-ci.com
  231. 39.71 s Downloaded cached libpsl (114 KiB) in 115ms
  232. 39.71 s Progress: 0 of 1 built, 12 of 71 downloaded from cache (15 downloading)
  233. 39.71 s Downloading cached lowdown-3.0.1-lib from https://cache.nix-ci.com
  234. 39.73 s Downloaded cached brotli-1.2.0-lib (961 KiB) in 137ms
  235. 39.73 s Progress: 0 of 1 built, 13 of 71 downloaded from cache (15 downloading)
  236. 39.73 s Downloading cached nghttp2-1.69.0-lib from https://cache.nix-ci.com
  237. 39.74 s Downloaded cached bash (1.8 MiB) in 155ms
  238. 39.74 s Progress: 0 of 1 built, 14 of 71 downloaded from cache (15 downloading)
  239. 39.74 s Downloading cached nghttp3 from https://cache.nix-ci.com
  240. 39.75 s Downloaded cached aws-c-common (1.1 MiB) in 159ms
  241. 39.75 s Progress: 0 of 1 built, 15 of 71 downloaded from cache (15 downloading)
  242. 39.75 s Downloading cached openssl from https://cache.nix-ci.com
  243. 39.75 s Downloaded cached libcpuid (326 KiB) in 160ms
  244. 39.75 s Progress: 0 of 1 built, 16 of 71 downloaded from cache (15 downloading)
  245. 39.75 s Downloading cached aws-c-compression from https://cache.nix-ci.com
  246. 39.75 s Downloaded cached keyutils-1.6.3-lib (41 KiB) in 165ms
  247. 39.75 s Progress: 0 of 1 built, 17 of 71 downloaded from cache (15 downloading)
  248. 39.76 s Downloading cached aws-c-sdkutils from https://cache.nix-ci.com
  249. 39.76 s Downloaded cached libsodium-1.0.22-unstable-2026-04 (666 KiB) in 159ms
  250. 39.76 s Progress: 0 of 1 built, 18 of 71 downloaded from cache (15 downloading)
  251. 39.76 s Downloading cached aws-checksums from https://cache.nix-ci.com
  252. 39.77 s Downloaded cached hwloc-2.14.0-lib (459 KiB) in 177ms
  253. 39.77 s Progress: 0 of 1 built, 19 of 71 downloaded from cache (15 downloading)
  254. 39.77 s Downloading cached pcre2 from https://cache.nix-ci.com
  255. 39.77 s Downloaded cached libseccomp-2.6.0-lib (193 KiB) in 170ms
  256. 39.77 s Progress: 0 of 1 built, 20 of 71 downloaded from cache (15 downloading)
  257. 39.77 s Downloading cached xz from https://cache.nix-ci.com
  258. 39.85 s Downloaded cached libxml2 (1.4 MiB) in 168ms
  259. 39.85 s Progress: 0 of 1 built, 21 of 71 downloaded from cache (15 downloading)
  260. 39.85 s Downloading cached zlib from https://cache.nix-ci.com
  261. 39.85 s Downloaded cached acl (125 KiB) in 147ms
  262. 39.85 s Progress: 0 of 1 built, 22 of 71 downloaded from cache (15 downloading)
  263. 39.85 s Downloaded cached lowdown-3.0.1-lib (341 KiB) in 148ms
  264. 39.85 s Progress: 0 of 1 built, 23 of 71 downloaded from cache (14 downloading)
  265. 39.85 s Downloaded cached llhttp (89 KiB) in 149ms
  266. 39.85 s Progress: 0 of 1 built, 24 of 71 downloaded from cache (13 downloading)
  267. 39.86 s Downloaded cached nghttp2-1.69.0-lib (225 KiB) in 130ms
  268. 39.86 s Progress: 0 of 1 built, 25 of 71 downloaded from cache (12 downloading)
  269. 39.86 s Downloaded cached nghttp3 (228 KiB) in 114ms
  270. 39.86 s Progress: 0 of 1 built, 26 of 71 downloaded from cache (11 downloading)
  271. 39.86 s Downloaded cached aws-c-sdkutils (155 KiB) in 105ms
  272. 39.86 s Progress: 0 of 1 built, 27 of 71 downloaded from cache (10 downloading)
  273. 39.86 s Downloaded cached aws-checksums (86 KiB) in 103ms
  274. 39.86 s Progress: 0 of 1 built, 28 of 71 downloaded from cache (9 downloading)
  275. 39.86 s Downloaded cached aws-c-compression (31 KiB) in 111ms
  276. 39.86 s Progress: 0 of 1 built, 29 of 71 downloaded from cache (8 downloading)
  277. 39.88 s Downloaded cached gcc-15.2.0-lib (9.8 MiB) in 287ms
  278. 39.88 s Progress: 0 of 1 built, 30 of 71 downloaded from cache (7 downloading)
  279. 39.88 s Downloading cached boehm-gc from https://cache.nix-ci.com
  280. 39.88 s Downloading cached icu4c from https://cache.nix-ci.com
  281. 39.88 s Downloading cached onetbb from https://cache.nix-ci.com
  282. 39.88 s Downloading cached zstd from https://cache.nix-ci.com
  283. 39.95 s Downloaded cached openssl (8.9 MiB) in 206ms
  284. 39.95 s Progress: 0 of 1 built, 31 of 71 downloaded from cache (10 downloading)
  285. 39.96 s Downloading cached aws-c-cal from https://cache.nix-ci.com
  286. 39.96 s Downloading cached krb5-1.22.2-lib from https://cache.nix-ci.com
  287. 39.96 s Downloading cached ngtcp2 from https://cache.nix-ci.com
  288. 39.96 s Downloading cached s2n-tls from https://cache.nix-ci.com
  289. 39.98 s Downloaded cached pcre2 (2 MiB) in 210ms
  290. 39.98 s Progress: 0 of 1 built, 32 of 71 downloaded from cache (13 downloading)
  291. 39.98 s Downloaded cached xz (837 KiB) in 208ms
  292. 39.98 s Progress: 0 of 1 built, 33 of 71 downloaded from cache (12 downloading)
  293. 40.04 s Downloaded cached zlib (129 KiB) in 196ms
  294. 40.04 s Progress: 0 of 1 built, 34 of 71 downloaded from cache (11 downloading)
  295. 40.04 s Downloading cached libssh2 from https://cache.nix-ci.com
  296. 40.04 s Downloading cached sqlite from https://cache.nix-ci.com
  297. 40.05 s Downloaded cached aws-c-cal (158 KiB) in 92ms
  298. 40.05 s Progress: 0 of 1 built, 35 of 71 downloaded from cache (12 downloading)
  299. 40.05 s Downloaded cached boehm-gc (312 KiB) in 175ms
  300. 40.05 s Progress: 0 of 1 built, 36 of 71 downloaded from cache (11 downloading)
  301. 40.06 s Downloaded cached onetbb (626 KiB) in 183ms
  302. 40.06 s Progress: 0 of 1 built, 37 of 71 downloaded from cache (10 downloading)
  303. 40.06 s Downloading cached libblake3 from https://cache.nix-ci.com
  304. 40.07 s Downloaded cached zstd (1.1 MiB) in 195ms
  305. 40.07 s Progress: 0 of 1 built, 38 of 71 downloaded from cache (10 downloading)
  306. 40.07 s Downloading cached libarchive-3.8.8-lib from https://cache.nix-ci.com
  307. 40.18 s Downloaded cached ngtcp2 (515 KiB) in 226ms
  308. 40.18 s Progress: 0 of 1 built, 39 of 71 downloaded from cache (10 downloading)
  309. 40.19 s Downloaded cached s2n-tls (1.3 MiB) in 235ms
  310. 40.19 s Progress: 0 of 1 built, 40 of 71 downloaded from cache (9 downloading)
  311. 40.19 s Downloading cached aws-c-io from https://cache.nix-ci.com
  312. 40.23 s Downloaded cached libblake3 (117 KiB) in 173ms
  313. 40.23 s Progress: 0 of 1 built, 41 of 71 downloaded from cache (9 downloading)
  314. 40.24 s Downloaded cached krb5-1.22.2-lib (2.7 MiB) in 279ms
  315. 40.24 s Progress: 0 of 1 built, 42 of 71 downloaded from cache (8 downloading)
  316. 40.24 s Downloaded cached libssh2 (330 KiB) in 200ms
  317. 40.24 s Progress: 0 of 1 built, 43 of 71 downloaded from cache (7 downloading)
  318. 40.24 s Downloading cached curl from https://cache.nix-ci.com
  319. 40.24 s Downloading cached libgit2-1.9.4-lib from https://cache.nix-ci.com
  320. 40.29 s Downloaded cached libarchive-3.8.8-lib (953 KiB) in 220ms
  321. 40.29 s Progress: 0 of 1 built, 44 of 71 downloaded from cache (8 downloading)
  322. 40.34 s Downloaded cached sqlite (5.7 MiB) in 299ms
  323. 40.34 s Progress: 0 of 1 built, 45 of 71 downloaded from cache (7 downloading)
  324. 40.37 s Downloaded cached aws-c-io (648 KiB) in 172ms
  325. 40.37 s Progress: 0 of 1 built, 46 of 71 downloaded from cache (6 downloading)
  326. 40.37 s Downloading cached aws-c-event-stream from https://cache.nix-ci.com
  327. 40.37 s Downloading cached aws-c-http from https://cache.nix-ci.com
  328. 40.45 s Downloaded cached curl (1.2 MiB) in 204ms
  329. 40.45 s Progress: 0 of 1 built, 47 of 71 downloaded from cache (7 downloading)
  330. 40.45 s Downloaded cached libgit2-1.9.4-lib (1.6 MiB) in 207ms
  331. 40.45 s Progress: 0 of 1 built, 48 of 71 downloaded from cache (6 downloading)
  332. 40.50 s Downloaded cached gammaloop-nextest-binaries-core-gammaloop-api (70 MiB) in 1.5s
  333. 40.50 s Progress: 0 of 1 built, 49 of 71 downloaded from cache (5 downloading)
  334. 40.53 s Downloaded cached aws-c-event-stream (176 KiB) in 161ms
  335. 40.53 s Progress: 0 of 1 built, 50 of 71 downloaded from cache (4 downloading)
  336. 40.53 s Downloaded cached aws-c-http (641 KiB) in 167ms
  337. 40.53 s Progress: 0 of 1 built, 51 of 71 downloaded from cache (3 downloading)
  338. 40.53 s Downloading cached aws-c-auth from https://cache.nix-ci.com
  339. 40.53 s Downloading cached aws-c-mqtt from https://cache.nix-ci.com
  340. 40.58 s Downloaded cached icu4c (38.2 MiB) in 701ms
  341. 40.58 s Progress: 0 of 1 built, 52 of 71 downloaded from cache (4 downloading)
  342. 40.58 s Downloading cached boost from https://cache.nix-ci.com
  343. 40.61 s Downloaded cached aws-c-mqtt (557 KiB) in 80ms
  344. 40.61 s Progress: 0 of 1 built, 53 of 71 downloaded from cache (4 downloading)
  345. 40.62 s Downloaded cached aws-c-auth (387 KiB) in 81ms
  346. 40.62 s Progress: 0 of 1 built, 54 of 71 downloaded from cache (3 downloading)
  347. 40.62 s Downloading cached aws-c-s3 from https://cache.nix-ci.com
  348. 40.75 s Downloaded cached boost (14.5 MiB) in 170ms
  349. 40.75 s Progress: 0 of 1 built, 55 of 71 downloaded from cache (3 downloading)
  350. 40.75 s Downloading cached nix-util from https://cache.nix-ci.com
  351. 40.75 s Downloaded cached aws-c-s3 (384 KiB) in 136ms
  352. 40.75 s Progress: 0 of 1 built, 56 of 71 downloaded from cache (3 downloading)
  353. 40.75 s Downloading cached aws-crt-cpp from https://cache.nix-ci.com
  354. 40.79 s Downloaded cached gammaloop-nextest-binaries-core-gammaloop-tracing-filter (8 MiB) in 1.8s
  355. 40.79 s Progress: 0 of 1 built, 57 of 71 downloaded from cache (3 downloading)
  356. 40.83 s Downloaded cached aws-crt-cpp (979 KiB) in 80ms
  357. 40.83 s Progress: 0 of 1 built, 58 of 71 downloaded from cache (2 downloading)
  358. 40.85 s Downloaded cached nix-util (2.4 MiB) in 101ms
  359. 40.85 s Progress: 0 of 1 built, 59 of 71 downloaded from cache (1 downloading)
  360. 40.85 s Downloading cached nix-nswrapper from https://cache.nix-ci.com
  361. 40.85 s Downloading cached nix-store from https://cache.nix-ci.com
  362. 40.94 s Downloaded cached nix-nswrapper (131 KiB) in 82ms
  363. 40.94 s Progress: 0 of 1 built, 60 of 71 downloaded from cache (2 downloading)
  364. 40.97 s Downloaded cached nix-store (5.8 MiB) in 122ms
  365. 40.97 s Progress: 0 of 1 built, 61 of 71 downloaded from cache (1 downloading)
  366. 40.97 s Downloading cached nix-fetchers from https://cache.nix-ci.com
  367. 40.98 s Downloading cached nix-main from https://cache.nix-ci.com
  368. 41.05 s Downloaded cached nix-main (393 KiB) in 75ms
  369. 41.05 s Progress: 0 of 1 built, 62 of 71 downloaded from cache (2 downloading)
  370. 41.06 s Downloaded cached nix-fetchers (1.5 MiB) in 85ms
  371. 41.06 s Progress: 0 of 1 built, 63 of 71 downloaded from cache (1 downloading)
  372. 41.06 s Downloading cached nix-expr from https://cache.nix-ci.com
  373. 41.14 s Downloaded cached nix-expr (3.3 MiB) in 82ms
  374. 41.14 s Progress: 0 of 1 built, 64 of 71 downloaded from cache (1 downloading)
  375. 41.14 s Downloading cached nix-flake from https://cache.nix-ci.com
  376. 41.22 s Downloaded cached nix-flake (956 KiB) in 75ms
  377. 41.22 s Progress: 0 of 1 built, 65 of 71 downloaded from cache (1 downloading)
  378. 41.22 s Downloading cached nix-cmd from https://cache.nix-ci.com
  379. 41.29 s Downloaded cached nix-cmd (1 MiB) in 69ms
  380. 41.29 s Progress: 0 of 1 built, 66 of 71 downloaded from cache (1 downloading)
  381. 41.29 s Downloading cached nix from https://cache.nix-ci.com
  382. 41.39 s Downloaded cached nix (3.9 MiB) in 98ms
  383. 41.39 s Progress: 0 of 1 built, 67 of 71 downloaded from cache (1 downloading)
  384. 41.39 s Downloading cached nix from https://cache.nix-ci.com
  385. 41.45 s Downloaded cached nix (8848 B) in 61ms
  386. 41.45 s Progress: 0 of 1 built, 68 of 71 downloaded from cache (1 downloading)
  387. 41.90 s Downloaded cached gammaloop-nextest-binaries-core-gammalooprs (84.2 MiB) in 2.9s
  388. 41.90 s Progress: 0 of 1 built, 69 of 71 downloaded from cache
  389. 41.90 s Downloading cached gammaloop-nextest-binaries-core from https://cache.nix-ci.com
  390. 41.94 s Downloaded cached gammaloop-nextest-binaries-core (1640 B) in 40ms
  391. 41.94 s Progress: 0 of 1 built, 70 of 71 downloaded from cache
  392. 41.94 s Downloading cached nix-ci-check-gammaloop-nextest-core from https://cache.nix-ci.com
  393. 41.98 s Downloaded cached nix-ci-check-gammaloop-nextest-core (1016 B) in 39ms
  394. 41.98 s Progress: 0 of 1 built, 71 of 71 downloaded from cache
  395. 47.73 s evaluating derivation 'g copying '/nix/store/qism evaluating derivation 'g copying '/nix/store/qism evaluating derivation 'g copying '/nix/store/qism evaluating derivation 'g copying '/nix/store/qism evaluating derivation 'g copying '/nix/store/qism evaluating derivation 'g copying '/nix/store/qism evaluating derivation 'g copying '/nix/store/qism evaluating derivation 'g querying gammaloop-nexte [0.0 KiB DL] querying mp [4.2 KiB DL] querying mp [16.2 KiB DL] querying f [28.4 KiB DL] querying m [44.2 KiB DL] querying b [49.0 KiB DL] querying g [0/20 built, 16/0/63 cop [0/22 built, 16/1/63 cop [0/22 built, 16/8/63 cop [0/21 built, 16/14/63 co [0/21 built, 16/16/63 co [0/20 built, 16/17/63 co [0/20 built, 16/22/63 co [0/19 built, 16/28/63 co [0/18 built, 16/29/63 co [0/18 built, 16/32/63 co [0/18 built, 16/36/63 co [0/18 built, 16/38/63 co [0/18 built, 16/39/63 co [0/17 built, 12/43/63 co [0/17 built, 10/45/63 co [0/17 built, 10/48/63 co [0/17 built, 9/50/63 cop [0/16 built, 8/51/63 cop [2/0/15 built, 7/52/63 ccrane-dummy-cargo-target.rs (post)> Uploading to the NixCI cache: /nix/store/hd50hqi25fymr09a2w4xdiy5jmb2cfl5-crane-dummy-cargo-target.rs
  396. 47.78 s crane-dummy-cargo-target.rs (post)> warning: 'warn-short-path-literals' is deprecated, use 'lint-short-path-literals = ignore' instead
  397. 47.90 s crane-dummy-cargo-target.rs (post)> copying 0 paths...
  398. 47.95 s crane-dummy-cargo-target.rs (post)> warning: 'warn-short-path-literals' is deprecated, use 'lint-short-path-literals = ignore' instead
  399. 49.22 s crane-dummy-cargo-target.rs (post)> copying 0 paths...
  400. 49.25 s [1/1/15 built, 6/53/63 ccrane-dummy-proc-macro-cargo-target.rs (post)> Uploading to the NixCI cache: /nix/store/z0b4s6pznqwlbyw5v4bbq7k1kp721g19-crane-dummy-proc-macro-cargo-target.rs
  401. 49.30 s crane-dummy-proc-macro-cargo-target.rs (post)> warning: 'warn-short-path-literals' is deprecated, use 'lint-short-path-literals = ignore' instead
  402. 49.42 s crane-dummy-proc-macro-cargo-target.rs (post)> copying 0 paths...
  403. 49.47 s crane-dummy-proc-macro-cargo-target.rs (post)> warning: 'warn-short-path-literals' is deprecated, use 'lint-short-path-literals = ignore' instead
  404. 49.60 s crane-dummy-proc-macro-cargo-target.rs (post)> copying 0 paths...
  405. 59.08 s [2/14 built, 7/54/63 cop [2/12 built, 5/57/63 cop [2/11 built, 4/58/63 cop [2/10 built, 4/59/63 cop [2/9 built, 3/60/63 copi [2/8 built, 2/61/63 copi [2/7 built, 1/62/63 copi [1/2/6 built, 63 copied [2/2/6 built, 63 copied rust-stable-with-std (post)> Uploading to the NixCI cache: /nix/store/imnwv6nazijihjlgf2h3l1qm63m7l9wk-rust-stable-with-std-2026-07-09
  406. 59.12 s rust-stable-with-std (post)> warning: 'warn-short-path-literals' is deprecated, use 'lint-short-path-literals = ignore' instead
  407. 59.24 s rust-stable-with-std (post)> copying 0 paths...
  408. 59.28 s rust-stable-with-std (post)> warning: 'warn-short-path-literals' is deprecated, use 'lint-short-path-literals = ignore' instead
  409. 59.56 s rust-stable-with-std (post)> copying 0 paths...
  410. 59.73 s [1/3/7 built, 63 copied clippy-stable-with-std (post)> Uploading to the NixCI cache: /nix/store/r4bjy93lvnfma1awpi480n2mz3af0adx-clippy-stable-with-std-2026-07-09
  411. 59.76 s clippy-stable-with-std (post)> warning: 'warn-short-path-literals' is deprecated, use 'lint-short-path-literals = ignore' instead
  412. 59.88 s clippy-stable-with-std (post)> copying 0 paths...
  413. 59.93 s clippy-stable-with-std (post)> warning: 'warn-short-path-literals' is deprecated, use 'lint-short-path-literals = ignore' instead
  414. 60.06 s clippy-stable-with-std (post)> copying 0 paths...
  415. 60.15 s [4/7 built, 63 copied (1 [1/4/6 built, 63 copied rust-stable-with-components> /nix/store/imnwv6nazijihjlgf2h3l1qm63m7l9wk-rust-stable-with-std-2026-07-09/lib:
  416. 60.15 s rust-stable-with-components> librustc_driver-a39fc8bf9e61dbb9.so: Keeping existing link to /nix/store/r4bjy93lvnfma1awpi480n2mz3af0adx-clippy-stable-with-std-2026-07-09/lib/librustc_driver-a39fc8bf9e61dbb9.so
  417. 60.15 s rust-stable-with-components> /nix/store/imnwv6nazijihjlgf2h3l1qm63m7l9wk-rust-stable-with-std-2026-07-09/bin:
  418. 60.15 s rust-stable-with-components> rust-gdb: Keeping existing link to /nix/store/r4bjy93lvnfma1awpi480n2mz3af0adx-clippy-stable-with-std-2026-07-09/bin/rust-gdb
  419. 60.15 s rust-stable-with-components> rust-lldb: Keeping existing link to /nix/store/r4bjy93lvnfma1awpi480n2mz3af0adx-clippy-stable-with-std-2026-07-09/bin/rust-lldb
  420. 60.15 s rust-stable-with-components> rustdoc: Keeping existing link to /nix/store/r4bjy93lvnfma1awpi480n2mz3af0adx-clippy-stable-with-std-2026-07-09/bin/rustdoc
  421. 60.15 s rust-stable-with-components> rustc: Keeping existing link to /nix/store/r4bjy93lvnfma1awpi480n2mz3af0adx-clippy-stable-with-std-2026-07-09/bin/rustc
  422. 60.15 s rust-stable-with-components> rust-gdbgui: Keeping existing link to /nix/store/r4bjy93lvnfma1awpi480n2mz3af0adx-clippy-stable-with-std-2026-07-09/bin/rust-gdbgui
  423. 60.61 s rust-stable-with-components (post)> Uploading to the NixCI cache: /nix/store/9pb4ikjdw4gp766ayxl6gg3b7hqm6ds4-rust-stable-with-components-2026-07-09
  424. 60.64 s rust-stable-with-components (post)> warning: 'warn-short-path-literals' is deprecated, use 'lint-short-path-literals = ignore' instead
  425. 60.76 s rust-stable-with-components (post)> copying 0 paths...
  426. 60.81 s rust-stable-with-components (post)> warning: 'warn-short-path-literals' is deprecated, use 'lint-short-path-literals = ignore' instead
  427. 60.96 s rust-stable-with-components (post)> copying 0 paths...
  428. 61.27 s [5/7 built, 63 copied (1 [1/5/6 built, 63 copied gammaloop-nextest-core> Extracting 3 binaries (including 1 non-test binary), 1 build script output directory, and 2 linked paths to /build/nextest-archive-esWNw0
  429. 61.68 s gammaloop-nextest-core> Extracted 18 files to /build/nextest-archive-esWNw0 in 0.41s
  430. 61.69 s gammaloop-nextest-core> ------------
  431. 61.69 s gammaloop-nextest-core> Nextest run ID b7aa5d21-d207-403b-8270-11bcda2dd794 with nextest profile: ci_gammaloop
  432. 61.69 s gammaloop-nextest-core> Starting 339 tests across 2 binaries
  433. 62.11 s gammaloop-nextest-core> ------------
  434. 62.11 s gammaloop-nextest-core> Summary [ 0.421s] 339 tests run: 339 passed, 0 skipped
  435. 62.19 s gammaloop-nextest-core>
  436. 62.19 s gammaloop-nextest-core> ========== nextest test summary ==========
  437. 62.19 s gammaloop-nextest-core> report: target/nextest/ci_gammaloop/junit.xml
  438. 62.19 s gammaloop-nextest-core> tests: 339, failures: 0, errors: 0
  439. 62.19 s gammaloop-nextest-core> No failing testcases found.
  440. 62.19 s gammaloop-nextest-core> =========================================
  441. 62.20 s gammaloop-nextest-core> Extracting 1 binary and 1 linked path to /build/nextest-archive-fjVL9V
  442. 62.26 s gammaloop-nextest-core> Extracted 7 files to /build/nextest-archive-fjVL9V in 0.06s
  443. 62.27 s gammaloop-nextest-core> ------------
  444. 62.27 s gammaloop-nextest-core> Nextest run ID 998553e9-d599-483b-b8b3-858e4ecd3563 with nextest profile: ci_gammaloop
  445. 62.27 s gammaloop-nextest-core> Starting 19 tests across 1 binary
  446. 62.28 s gammaloop-nextest-core> ------------
  447. 62.28 s gammaloop-nextest-core> Summary [ 0.010s] 19 tests run: 19 passed, 0 skipped
  448. 62.31 s gammaloop-nextest-core>
  449. 62.31 s gammaloop-nextest-core> ========== nextest test summary ==========
  450. 62.31 s gammaloop-nextest-core> report: target/nextest/ci_gammaloop/junit.xml
  451. 62.31 s gammaloop-nextest-core> tests: 19, failures: 0, errors: 0
  452. 62.31 s gammaloop-nextest-core> No failing testcases found.
  453. 62.31 s gammaloop-nextest-core> =========================================
  454. 62.32 s gammaloop-nextest-core> Extracting 1 binary to /build/nextest-archive-uZJmKN
  455. 62.35 s gammaloop-nextest-core> Extracted 4 files to /build/nextest-archive-uZJmKN in 0.03s
  456. 62.36 s gammaloop-nextest-core> ------------
  457. 62.36 s gammaloop-nextest-core> Nextest run ID 60cbc14f-f1bc-4186-b9b4-e8c188cc9192 with nextest profile: ci_gammaloop
  458. 62.36 s gammaloop-nextest-core> Starting 0 tests across 1 binary
  459. 62.36 s gammaloop-nextest-core> ------------
  460. 62.36 s gammaloop-nextest-core> Summary [ 0.000s] 0 tests run: 0 passed, 0 skipped
  461. 62.38 s gammaloop-nextest-core>
  462. 62.38 s gammaloop-nextest-core> ========== nextest test summary ==========
  463. 62.38 s gammaloop-nextest-core> report: target/nextest/ci_gammaloop/junit.xml
  464. 62.38 s gammaloop-nextest-core> tests: 0, failures: 0, errors: 0
  465. 62.38 s gammaloop-nextest-core> No failing testcases found.
  466. 62.38 s gammaloop-nextest-core> =========================================
  467. 62.40 s gammaloop-nextest-core> Extracting 4 binaries, 1 build script output directory, and 2 linked paths to /build/nextest-archive-NPuctH
  468. 62.82 s gammaloop-nextest-core> Extracted 18 files to /build/nextest-archive-NPuctH in 0.42s
  469. 62.83 s gammaloop-nextest-core> ------------
  470. 62.83 s gammaloop-nextest-core> Nextest run ID 7b1e8638-3636-403f-84a3-574305cf339c with nextest profile: ci_gammaloop
  471. 62.83 s gammaloop-nextest-core> Starting 456 tests across 4 binaries (61 tests skipped, including 60 tests via profile.ci_gammaloop.default-filter)
  472. 63.72 s gammaloop-nextest-core> FAIL [ 0.148s] (442/456) gammalooprs::test_renormalization finite_part_ghost_2loop
  473. 63.72 s gammaloop-nextest-core> stdout ---
  474. 63.72 s gammaloop-nextest-core>
  475. 63.72 s gammaloop-nextest-core> running 1 test
  476. 63.72 s gammaloop-nextest-core> test finite_part_ghost_2loop ... FAILED
  477. 63.72 s gammaloop-nextest-core>
  478. 63.72 s gammaloop-nextest-core> failures:
  479. 63.72 s gammaloop-nextest-core>
  480. 63.72 s gammaloop-nextest-core> failures:
  481. 63.72 s gammaloop-nextest-core> finite_part_ghost_2loop
  482. 63.72 s gammaloop-nextest-core>
  483. 63.72 s gammaloop-nextest-core> test result: FAILED. 0 passed; 1 failed; 0 ignored; 0 measured; 5 filtered out; finished in 0.14s
  484. 63.72 s gammaloop-nextest-core>
  485. 63.72 s gammaloop-nextest-core> stderr ---
  486. 63.72 s gammaloop-nextest-core> The application panicked (crashed).
  487. 63.72 s gammaloop-nextest-core> Message: called `Result::unwrap()` on an `Err` value: "Symbol spenso::mink redefined with new attributes:\n\t- new user data specified: List([String(\"spenso::representation-v2\"), String(\"inline-metric\"), List([String(\"symbol\"), String(\"mink\")]), List([String(\"cyclic\"), Integer(1), List([List([String(\"symbol\"), String(\"mu\")]), List([String(\"symbol\"), String(\"nu\")]), List([String(\"symbol\"), String(\"rho\")]), List([String(\"symbol\"), String(\"sigma\")])])]), String(\"top\")]) vs None\n"
  488. 63.72 s gammaloop-nextest-core> Location: crates/vakint/src/lib.rs:4766
  489. 63.72 s gammaloop-nextest-core>
  490. 63.72 s gammaloop-nextest-core> ━━━━━━━━━━━━━━━━━━━━━━━━━━━━━━━━━━ BACKTRACE ━━━━━━━━━━━━━━━━━━━━━━━━━━━━━━━━━━━
  491. 63.72 s gammaloop-nextest-core> 1: <color_eyre[5722b77bc20a64cf]::config::PanicHook>::panic_report<unknown>
  492. 63.72 s gammaloop-nextest-core> at <unknown source file>:<unknown line>
  493. 63.72 s gammaloop-nextest-core> 2: <color_eyre[5722b77bc20a64cf]::config::PanicHook>::into_panic_hook::{closure#0}<unknown>
  494. 63.72 s gammaloop-nextest-core> at <unknown source file>:<unknown line>
  495. 63.72 s gammaloop-nextest-core> 3: std[bcb96dfbba0ab899]::panicking::panic_with_hook<unknown>
  496. 63.72 s gammaloop-nextest-core> at <unknown source file>:<unknown line>
  497. 63.72 s gammaloop-nextest-core> 4: std[bcb96dfbba0ab899]::panicking::panic_handler::{closure#0}<unknown>
  498. 63.72 s gammaloop-nextest-core> at <unknown source file>:<unknown line>
  499. 63.72 s gammaloop-nextest-core> 5: std[bcb96dfbba0ab899]::sys::backtrace::__rust_end_short_backtrace::<std[bcb96dfbba0ab899]::panicking::panic_handler::{closure#0}, !><unknown>
  500. 63.72 s gammaloop-nextest-core> at <unknown source file>:<unknown line>
  501. 63.72 s gammaloop-nextest-core> 6: __rustc[6c289b9f9c454d21]::rust_begin_unwind<unknown>
  502. 63.72 s gammaloop-nextest-core> at <unknown source file>:<unknown line>
  503. 63.72 s gammaloop-nextest-core> 7: core[940e698046960fd5]::panicking::panic_fmt<unknown>
  504. 63.72 s gammaloop-nextest-core> at <unknown source file>:<unknown line>
  505. 63.72 s gammaloop-nextest-core> 8: core[940e698046960fd5]::result::unwrap_failed<unknown>
  506. 63.72 s gammaloop-nextest-core> at <unknown source file>:<unknown line>
  507. 63.72 s gammaloop-nextest-core> 9: <vakint[eb7a1daa8ec05e1f]::Vakint>::sanitize_user_expressions<unknown>
  508. 63.72 s gammaloop-nextest-core> at <unknown source file>:<unknown line>
  509. 63.72 s gammaloop-nextest-core> 10: <vakint[eb7a1daa8ec05e1f]::Vakint>::prepare_expression_for_form<unknown>
  510. 63.72 s gammaloop-nextest-core> at <unknown source file>:<unknown line>
  511. 63.72 s gammaloop-nextest-core> 11: <vakint[eb7a1daa8ec05e1f]::VakintTerm>::tensor_reduce<unknown>
  512. 63.72 s gammaloop-nextest-core> at <unknown source file>:<unknown line>
  513. 63.72 s gammaloop-nextest-core> 12: <vakint[eb7a1daa8ec05e1f]::VakintExpression>::tensor_reduce<unknown>
  514. 63.72 s gammaloop-nextest-core> at <unknown source file>:<unknown line>
  515. 63.72 s gammaloop-nextest-core> 13: <gammalooprs[822fc56666e1de73]::uv::approx::integrated::Integrated>::integrate::<gammalooprs[822fc56666e1de73]::uv::approx::Approximation><unknown>
  516. 63.72 s gammaloop-nextest-core> at <unknown source file>:<unknown line>
  517. 63.72 s gammaloop-nextest-core> 14: <gammalooprs[822fc56666e1de73]::uv::approx::integrated::Integrated>::run::<gammalooprs[822fc56666e1de73]::uv::approx::Approximation, gammalooprs[822fc56666e1de73]::uv::approx::Approximation><unknown>
  518. 63.72 s gammaloop-nextest-core> at <unknown source file>:<unknown line>
  519. 63.72 s gammaloop-nextest-core> 15: <gammalooprs[822fc56666e1de73]::uv::forest::Forest>::compute<unknown>
  520. 63.72 s gammaloop-nextest-core> at <unknown source file>:<unknown line>
  521. 63.72 s gammaloop-nextest-core> 16: gammalooprs[822fc56666e1de73]::uv::orchestrator::legacy_renormalization_part<unknown>
  522. 63.72 s gammaloop-nextest-core> at <unknown source file>:<unknown line>
  523. 63.72 s gammaloop-nextest-core> 17: <gammalooprs[822fc56666e1de73]::uv::settings::UVOrchestrator>::renormalization_part<unknown>
  524. 63.72 s gammaloop-nextest-core> at <unknown source file>:<unknown line>
  525. 63.72 s gammaloop-nextest-core> 18: <gammalooprs[822fc56666e1de73]::processes::amplitude::AmplitudeGraph>::renormalization_part<unknown>
  526. 63.72 s gammaloop-nextest-core> at <unknown source file>:<unknown line>
  527. 63.72 s gammaloop-nextest-core> 19: test_renormalization[9f554b029f822e2d]::finite_part_ghost_2loop<unknown>
  528. 63.72 s gammaloop-nextest-core> at <unknown source file>:<unknown line>
  529. 63.72 s gammaloop-nextest-core> 20: <test_renormalization[9f554b029f822e2d]::finite_part_ghost_2loop::{closure#0} as core[940e698046960fd5]::ops::function::FnOnce<()>>::call_once<unknown>
  530. 63.72 s gammaloop-nextest-core> at <unknown source file>:<unknown line>
  531. 63.72 s gammaloop-nextest-core> 21: test[75d6903177b1d7e9]::__rust_begin_short_backtrace::<core[940e698046960fd5]::result::Result<(), alloc[2ea6bcb46fca0c42]::string::String>, fn() -> core[940e698046960fd5]::result::Result<(), alloc[2ea6bcb46fca0c42]::string::String>><unknown>
  532. 63.72 s gammaloop-nextest-core> at <unknown source file>:<unknown line>
  533. 63.72 s gammaloop-nextest-core> 22: test[75d6903177b1d7e9]::run_test::{closure#0}<unknown>
  534. 63.72 s gammaloop-nextest-core> at <unknown source file>:<unknown line>
  535. 63.72 s gammaloop-nextest-core> 23: std[bcb96dfbba0ab899]::sys::backtrace::__rust_begin_short_backtrace::<test[75d6903177b1d7e9]::run_test::{closure#1}, ()><unknown>
  536. 63.72 s gammaloop-nextest-core> at <unknown source file>:<unknown line>
  537. 63.72 s gammaloop-nextest-core> 24: <std[bcb96dfbba0ab899]::thread::lifecycle::spawn_unchecked<test[75d6903177b1d7e9]::run_test::{closure#1}, ()>::{closure#1} as core[940e698046960fd5]::ops::function::FnOnce<()>>::call_once::{shim:vtable#0}<unknown>
  538. 63.72 s gammaloop-nextest-core> at <unknown source file>:<unknown line>
  539. 63.72 s gammaloop-nextest-core> 25: <std[bcb96dfbba0ab899]::sys::thread::unix::Thread>::new::thread_start<unknown>
  540. 63.72 s gammaloop-nextest-core> at <unknown source file>:<unknown line>
  541. 63.72 s gammaloop-nextest-core> 26: start_thread<unknown>
  542. 63.72 s gammaloop-nextest-core> at <unknown source file>:<unknown line>
  543. 63.72 s gammaloop-nextest-core> 27: __clone3<unknown>
  544. 63.72 s gammaloop-nextest-core> at <unknown source file>:<unknown line>
  545. 63.72 s gammaloop-nextest-core>
  546. 63.72 s gammaloop-nextest-core> Run with COLORBT_SHOW_HIDDEN=1 environment variable to disable frame filtering.
  547. 63.72 s gammaloop-nextest-core> Run with RUST_BACKTRACE=full to include source snippets.
  548. 63.72 s gammaloop-nextest-core>
  549. 63.77 s gammaloop-nextest-core> FAIL [ 0.198s] (444/456) gammalooprs::test_renormalization finit_part_ghlo
  550. 63.77 s gammaloop-nextest-core> stdout ---
  551. 63.77 s gammaloop-nextest-core>
  552. 63.77 s gammaloop-nextest-core> running 1 test
  553. 63.77 s gammaloop-nextest-core> test finit_part_ghlo ... FAILED
  554. 63.77 s gammaloop-nextest-core>
  555. 63.77 s gammaloop-nextest-core> failures:
  556. 63.77 s gammaloop-nextest-core>
  557. 63.77 s gammaloop-nextest-core> failures:
  558. 63.77 s gammaloop-nextest-core> finit_part_ghlo
  559. 63.77 s gammaloop-nextest-core>
  560. 63.77 s gammaloop-nextest-core> test result: FAILED. 0 passed; 1 failed; 0 ignored; 0 measured; 5 filtered out; finished in 0.18s
  561. 63.77 s gammaloop-nextest-core>
  562. 63.77 s gammaloop-nextest-core> stderr ---
  563. 63.77 s gammaloop-nextest-core> The application panicked (crashed).
  564. 63.77 s gammaloop-nextest-core> Message: called `Result::unwrap()` on an `Err` value:
  565. 63.77 s gammaloop-nextest-core> 0: Symbolica could not parse FORM output:
  566. 63.77 s gammaloop-nextest-core> [spenso::{antisymmetric,real,spenso::tensor}::f]([spenso::{spenso::representat\
  567. 63.77 s gammaloop-nextest-core> ion,spenso::self_dual}::coad](8,[gammalooprs::{spenso::index}::hedge](0)
  568. 63.77 s gammaloop-nextest-core> ),[spenso::{spenso::representation,spenso::self_dual}::coad](8,[gammaloo\
  569. 63.77 s gammaloop-nextest-core> prs::{spenso::index}::hedge](3)),[spenso::{spenso::representation,spenso\
  570. 63.77 s gammaloop-nextest-core> ::self_dual}::coad](8,[gammalooprs::{spenso::index}::hedge](5)))*
  571. 63.77 s gammaloop-nextest-core> [spenso::{antisymmetric,real,spenso::tensor}::f]([spenso::{spenso::repre\
  572. 63.77 s gammaloop-nextest-core> sentation,spenso::self_dual}::coad](8,[gammalooprs::{spenso::index}::hed\
  573. 63.77 s gammaloop-nextest-core> ge](1)),[spenso::{spenso::representation,spenso::self_dual}::coad](8,
  574. 63.77 s gammaloop-nextest-core> [gammalooprs::{spenso::index}::hedge](3)),[spenso::{spenso::representati\
  575. 63.77 s gammaloop-nextest-core> on,spenso::self_dual}::coad](8,[gammalooprs::{spenso::index}::hedge](5))
  576. 63.77 s gammaloop-nextest-core> )*dot(p1,p0)*[UFO::{}::GC_10]^2*rat(-1,1)
  577. 63.77 s gammaloop-nextest-core>
  578. 63.77 s gammaloop-nextest-core> Error:Symbol spenso::coad redefined with new attributes:
  579. 63.77 s gammaloop-nextest-core> - new user data specified: List([String("spenso::representation-v2"), String("self-dual"), List([String("symbol"), String("coad")]), List([String("cyclic"), Integer(1), List([List([String("symbol"), String("a")]), List([String("symbol"), String("b")]), List([String("symbol"), String("c")]), List([String("symbol"), String("d")])])]), String("top")]) vs None
  580. 63.77 s gammaloop-nextest-core>
  581. 63.77 s gammaloop-nextest-core>
  582. 63.77 s gammaloop-nextest-core> Location:
  583. 63.77 s gammaloop-nextest-core> crates/gammalooprs/src/uv/approx/integrated.rs:332
  584. 63.77 s gammaloop-nextest-core>
  585. 63.77 s gammaloop-nextest-core> ━━━━━━━━━━━━━━━━━━━━━━━━━━━━━━━━━━ BACKTRACE ━━━━━━━━━━━━━━━━━━━━━━━━━━━━━━━━━━━
  586. 63.77 s gammaloop-nextest-core> 1: <color_eyre[5722b77bc20a64cf]::config::EyreHook>::into_eyre_hook::{closure#0}<unknown>
  587. 63.77 s gammaloop-nextest-core> at <unknown source file>:<unknown line>
  588. 63.77 s gammaloop-nextest-core> 2: eyre[cb2fd339c0c40fca]::capture_handler<unknown>
  589. 63.77 s gammaloop-nextest-core> at <unknown source file>:<unknown line>
  590. 63.77 s gammaloop-nextest-core> 3: <eyre[cb2fd339c0c40fca]::Report>::from_std::<vakint[eb7a1daa8ec05e1f]::VakintError><unknown>
  591. 63.77 s gammaloop-nextest-core> at <unknown source file>:<unknown line>
  592. 63.77 s gammaloop-nextest-core> 4: <gammalooprs[822fc56666e1de73]::uv::approx::integrated::Integrated>::integrate::<gammalooprs[822fc56666e1de73]::uv::hedge_poset::ForestNode><unknown>
  593. 63.77 s gammaloop-nextest-core> at <unknown source file>:<unknown line>
  594. 63.77 s gammaloop-nextest-core> 5: <gammalooprs[822fc56666e1de73]::uv::approx::integrated::Integrated>::run::<gammalooprs[822fc56666e1de73]::uv::hedge_poset::ForestNode, gammalooprs[822fc56666e1de73]::uv::hedge_poset::ForestNode><unknown>
  595. 63.77 s gammaloop-nextest-core> at <unknown source file>:<unknown line>
  596. 63.77 s gammaloop-nextest-core> 6: <gammalooprs[822fc56666e1de73]::uv::hedge_poset::Forests>::integrate<unknown>
  597. 63.77 s gammaloop-nextest-core> at <unknown source file>:<unknown line>
  598. 63.77 s gammaloop-nextest-core> 7: gammalooprs[822fc56666e1de73]::uv::orchestrator::hedge_poset_renormalization_part<unknown>
  599. 63.77 s gammaloop-nextest-core> at <unknown source file>:<unknown line>
  600. 63.77 s gammaloop-nextest-core> 8: <gammalooprs[822fc56666e1de73]::uv::settings::UVOrchestrator>::renormalization_part<unknown>
  601. 63.77 s gammaloop-nextest-core> at <unknown source file>:<unknown line>
  602. 63.77 s gammaloop-nextest-core> 9: <gammalooprs[822fc56666e1de73]::processes::amplitude::AmplitudeGraph>::renormalization_part<unknown>
  603. 63.77 s gammaloop-nextest-core> at <unknown source file>:<unknown line>
  604. 63.77 s gammaloop-nextest-core> 10: <test_renormalization[9f554b029f822e2d]::finit_part_ghlo::{closure#0} as core[940e698046960fd5]::ops::function::FnOnce<()>>::call_once<unknown>
  605. 63.77 s gammaloop-nextest-core> at <unknown source file>:<unknown line>
  606. 63.77 s gammaloop-nextest-core> 11: test[75d6903177b1d7e9]::__rust_begin_short_backtrace::<core[940e698046960fd5]::result::Result<(), alloc[2ea6bcb46fca0c42]::string::String>, fn() -> core[940e698046960fd5]::result::Result<(), alloc[2ea6bcb46fca0c42]::string::String>><unknown>
  607. 63.77 s gammaloop-nextest-core> at <unknown source file>:<unknown line>
  608. 63.77 s gammaloop-nextest-core> 12: test[75d6903177b1d7e9]::run_test::{closure#0}<unknown>
  609. 63.77 s gammaloop-nextest-core> at <unknown source file>:<unknown line>
  610. 63.77 s gammaloop-nextest-core> 13: std[bcb96dfbba0ab899]::sys::backtrace::__rust_begin_short_backtrace::<test[75d6903177b1d7e9]::run_test::{closure#1}, ()><unknown>
  611. 63.77 s gammaloop-nextest-core> at <unknown source file>:<unknown line>
  612. 63.77 s gammaloop-nextest-core> 14: <std[bcb96dfbba0ab899]::thread::lifecycle::spawn_unchecked<test[75d6903177b1d7e9]::run_test::{closure#1}, ()>::{closure#1} as core[940e698046960fd5]::ops::function::FnOnce<()>>::call_once::{shim:vtable#0}<unknown>
  613. 63.77 s gammaloop-nextest-core> at <unknown source file>:<unknown line>
  614. 63.77 s gammaloop-nextest-core> 15: <std[bcb96dfbba0ab899]::sys::thread::unix::Thread>::new::thread_start<unknown>
  615. 63.77 s gammaloop-nextest-core> at <unknown source file>:<unknown line>
  616. 63.77 s gammaloop-nextest-core> 16: start_thread<unknown>
  617. 63.77 s gammaloop-nextest-core> at <unknown source file>:<unknown line>
  618. 63.77 s gammaloop-nextest-core> 17: __clone3<unknown>
  619. 63.77 s gammaloop-nextest-core> at <unknown source file>:<unknown line>
  620. 63.77 s gammaloop-nextest-core>
  621. 63.77 s gammaloop-nextest-core> Run with COLORBT_SHOW_HIDDEN=1 environment variable to disable frame filtering.
  622. 63.77 s gammaloop-nextest-core> Run with RUST_BACKTRACE=full to include source snippets.
  623. 63.77 s gammaloop-nextest-core> Location: crates/gammalooprs/tests/test_renormalization.rs:550
  624. 63.77 s gammaloop-nextest-core>
  625. 63.77 s gammaloop-nextest-core> ━━━━━━━━━━━━━━━━━━━━━━━━━━━━━━━━━━ BACKTRACE ━━━━━━━━━━━━━━━━━━━━━━━━━━━━━━━━━━━
  626. 63.77 s gammaloop-nextest-core> 1: <color_eyre[5722b77bc20a64cf]::config::PanicHook>::panic_report<unknown>
  627. 63.77 s gammaloop-nextest-core> at <unknown source file>:<unknown line>
  628. 63.77 s gammaloop-nextest-core> 2: <color_eyre[5722b77bc20a64cf]::config::PanicHook>::into_panic_hook::{closure#0}<unknown>
  629. 63.77 s gammaloop-nextest-core> at <unknown source file>:<unknown line>
  630. 63.77 s gammaloop-nextest-core> 3: std[bcb96dfbba0ab899]::panicking::panic_with_hook<unknown>
  631. 63.77 s gammaloop-nextest-core> at <unknown source file>:<unknown line>
  632. 63.77 s gammaloop-nextest-core> 4: std[bcb96dfbba0ab899]::panicking::panic_handler::{closure#0}<unknown>
  633. 63.77 s gammaloop-nextest-core> at <unknown source file>:<unknown line>
  634. 63.77 s gammaloop-nextest-core> 5: std[bcb96dfbba0ab899]::sys::backtrace::__rust_end_short_backtrace::<std[bcb96dfbba0ab899]::panicking::panic_handler::{closure#0}, !><unknown>
  635. 63.77 s gammaloop-nextest-core> at <unknown source file>:<unknown line>
  636. 63.77 s gammaloop-nextest-core> 6: __rustc[6c289b9f9c454d21]::rust_begin_unwind<unknown>
  637. 63.77 s gammaloop-nextest-core> at <unknown source file>:<unknown line>
  638. 63.77 s gammaloop-nextest-core> 7: core[940e698046960fd5]::panicking::panic_fmt<unknown>
  639. 63.77 s gammaloop-nextest-core> at <unknown source file>:<unknown line>
  640. 63.77 s gammaloop-nextest-core> 8: core[940e698046960fd5]::result::unwrap_failed<unknown>
  641. 63.77 s gammaloop-nextest-core> at <unknown source file>:<unknown line>
  642. 63.77 s gammaloop-nextest-core> 9: <test_renormalization[9f554b029f822e2d]::finit_part_ghlo::{closure#0} as core[940e698046960fd5]::ops::function::FnOnce<()>>::call_once<unknown>
  643. 63.77 s gammaloop-nextest-core> at <unknown source file>:<unknown line>
  644. 63.77 s gammaloop-nextest-core> 10: test[75d6903177b1d7e9]::__rust_begin_short_backtrace::<core[940e698046960fd5]::result::Result<(), alloc[2ea6bcb46fca0c42]::string::String>, fn() -> core[940e698046960fd5]::result::Result<(), alloc[2ea6bcb46fca0c42]::string::String>><unknown>
  645. 63.77 s gammaloop-nextest-core> at <unknown source file>:<unknown line>
  646. 63.77 s gammaloop-nextest-core> 11: test[75d6903177b1d7e9]::run_test::{closure#0}<unknown>
  647. 63.77 s gammaloop-nextest-core> at <unknown source file>:<unknown line>
  648. 63.77 s gammaloop-nextest-core> 12: std[bcb96dfbba0ab899]::sys::backtrace::__rust_begin_short_backtrace::<test[75d6903177b1d7e9]::run_test::{closure#1}, ()><unknown>
  649. 63.77 s gammaloop-nextest-core> at <unknown source file>:<unknown line>
  650. 63.77 s gammaloop-nextest-core> 13: <std[bcb96dfbba0ab899]::thread::lifecycle::spawn_unchecked<test[75d6903177b1d7e9]::run_test::{closure#1}, ()>::{closure#1} as core[940e698046960fd5]::ops::function::FnOnce<()>>::call_once::{shim:vtable#0}<unknown>
  651. 63.77 s gammaloop-nextest-core> at <unknown source file>:<unknown line>
  652. 63.77 s gammaloop-nextest-core> 14: <std[bcb96dfbba0ab899]::sys::thread::unix::Thread>::new::thread_start<unknown>
  653. 63.77 s gammaloop-nextest-core> at <unknown source file>:<unknown line>
  654. 63.77 s gammaloop-nextest-core> 15: start_thread<unknown>
  655. 63.77 s gammaloop-nextest-core> at <unknown source file>:<unknown line>
  656. 63.77 s gammaloop-nextest-core> 16: __clone3<unknown>
  657. 63.77 s gammaloop-nextest-core> at <unknown source file>:<unknown line>
  658. 63.77 s gammaloop-nextest-core>
  659. 63.77 s gammaloop-nextest-core> Run with COLORBT_SHOW_HIDDEN=1 environment variable to disable frame filtering.
  660. 63.77 s gammaloop-nextest-core> Run with RUST_BACKTRACE=full to include source snippets.
  661. 63.77 s gammaloop-nextest-core>
  662. 63.77 s gammaloop-nextest-core> FAIL [ 0.184s] (445/456) gammalooprs::test_renormalization finite_part_quark_lo
  663. 63.77 s gammaloop-nextest-core> stdout ---
  664. 63.77 s gammaloop-nextest-core>
  665. 63.77 s gammaloop-nextest-core> running 1 test
  666. 63.77 s gammaloop-nextest-core> test finite_part_quark_lo ... FAILED
  667. 63.77 s gammaloop-nextest-core>
  668. 63.77 s gammaloop-nextest-core> failures:
  669. 63.77 s gammaloop-nextest-core>
  670. 63.77 s gammaloop-nextest-core> failures:
  671. 63.77 s gammaloop-nextest-core> finite_part_quark_lo
  672. 63.77 s gammaloop-nextest-core>
  673. 63.77 s gammaloop-nextest-core> test result: FAILED. 0 passed; 1 failed; 0 ignored; 0 measured; 5 filtered out; finished in 0.17s
  674. 63.77 s gammaloop-nextest-core>
  675. 63.77 s gammaloop-nextest-core> stderr ---
  676. 63.77 s gammaloop-nextest-core> The application panicked (crashed).
  677. 63.77 s gammaloop-nextest-core> Message: called `Result::unwrap()` on an `Err` value: "Symbol spenso::mink redefined with new attributes:\n\t- new user data specified: List([String(\"spenso::representation-v2\"), String(\"inline-metric\"), List([String(\"symbol\"), String(\"mink\")]), List([String(\"cyclic\"), Integer(1), List([List([String(\"symbol\"), String(\"mu\")]), List([String(\"symbol\"), String(\"nu\")]), List([String(\"symbol\"), String(\"rho\")]), List([String(\"symbol\"), String(\"sigma\")])])]), String(\"top\")]) vs None\n"
  678. 63.77 s gammaloop-nextest-core> Location: crates/vakint/src/lib.rs:4766
  679. 63.77 s gammaloop-nextest-core>
  680. 63.77 s gammaloop-nextest-core> ━━━━━━━━━━━━━━━━━━━━━━━━━━━━━━━━━━ BACKTRACE ━━━━━━━━━━━━━━━━━━━━━━━━━━━━━━━━━━━
  681. 63.77 s gammaloop-nextest-core> 1: <color_eyre[5722b77bc20a64cf]::config::PanicHook>::panic_report<unknown>
  682. 63.77 s gammaloop-nextest-core> at <unknown source file>:<unknown line>
  683. 63.77 s gammaloop-nextest-core> 2: <color_eyre[5722b77bc20a64cf]::config::PanicHook>::into_panic_hook::{closure#0}<unknown>
  684. 63.77 s gammaloop-nextest-core> at <unknown source file>:<unknown line>
  685. 63.77 s gammaloop-nextest-core> 3: std[bcb96dfbba0ab899]::panicking::panic_with_hook<unknown>
  686. 63.77 s gammaloop-nextest-core> at <unknown source file>:<unknown line>
  687. 63.77 s gammaloop-nextest-core> 4: std[bcb96dfbba0ab899]::panicking::panic_handler::{closure#0}<unknown>
  688. 63.77 s gammaloop-nextest-core> at <unknown source file>:<unknown line>
  689. 63.77 s gammaloop-nextest-core> 5: std[bcb96dfbba0ab899]::sys::backtrace::__rust_end_short_backtrace::<std[bcb96dfbba0ab899]::panicking::panic_handler::{closure#0}, !><unknown>
  690. 63.77 s gammaloop-nextest-core> at <unknown source file>:<unknown line>
  691. 63.77 s gammaloop-nextest-core> 6: __rustc[6c289b9f9c454d21]::rust_begin_unwind<unknown>
  692. 63.77 s gammaloop-nextest-core> at <unknown source file>:<unknown line>
  693. 63.77 s gammaloop-nextest-core> 7: core[940e698046960fd5]::panicking::panic_fmt<unknown>
  694. 63.77 s gammaloop-nextest-core> at <unknown source file>:<unknown line>
  695. 63.77 s gammaloop-nextest-core> 8: core[940e698046960fd5]::result::unwrap_failed<unknown>
  696. 63.77 s gammaloop-nextest-core> at <unknown source file>:<unknown line>
  697. 63.77 s gammaloop-nextest-core> 9: <vakint[eb7a1daa8ec05e1f]::Vakint>::sanitize_user_expressions<unknown>
  698. 63.77 s gammaloop-nextest-core> at <unknown source file>:<unknown line>
  699. 63.77 s gammaloop-nextest-core> 10: <vakint[eb7a1daa8ec05e1f]::Vakint>::prepare_expression_for_form<unknown>
  700. 63.77 s gammaloop-nextest-core> at <unknown source file>:<unknown line>
  701. 63.77 s gammaloop-nextest-core> 11: <vakint[eb7a1daa8ec05e1f]::VakintTerm>::tensor_reduce<unknown>
  702. 63.77 s gammaloop-nextest-core> at <unknown source file>:<unknown line>
  703. 63.77 s gammaloop-nextest-core> 12: <vakint[eb7a1daa8ec05e1f]::VakintExpression>::tensor_reduce<unknown>
  704. 63.77 s gammaloop-nextest-core> at <unknown source file>:<unknown line>
  705. 63.77 s gammaloop-nextest-core> 13: <gammalooprs[822fc56666e1de73]::uv::approx::integrated::Integrated>::integrate::<gammalooprs[822fc56666e1de73]::uv::hedge_poset::ForestNode><unknown>
  706. 63.77 s gammaloop-nextest-core> at <unknown source file>:<unknown line>
  707. 63.77 s gammaloop-nextest-core> 14: <gammalooprs[822fc56666e1de73]::uv::approx::integrated::Integrated>::run::<gammalooprs[822fc56666e1de73]::uv::hedge_poset::ForestNode, gammalooprs[822fc56666e1de73]::uv::hedge_poset::ForestNode><unknown>
  708. 63.77 s gammaloop-nextest-core> at <unknown source file>:<unknown line>
  709. 63.77 s gammaloop-nextest-core> 15: <gammalooprs[822fc56666e1de73]::uv::hedge_poset::Forests>::integrate<unknown>
  710. 63.77 s gammaloop-nextest-core> at <unknown source file>:<unknown line>
  711. 63.77 s gammaloop-nextest-core> 16: gammalooprs[822fc56666e1de73]::uv::orchestrator::hedge_poset_renormalization_part<unknown>
  712. 63.77 s gammaloop-nextest-core> at <unknown source file>:<unknown line>
  713. 63.77 s gammaloop-nextest-core> 17: <gammalooprs[822fc56666e1de73]::uv::settings::UVOrchestrator>::renormalization_part<unknown>
  714. 63.77 s gammaloop-nextest-core> at <unknown source file>:<unknown line>
  715. 63.77 s gammaloop-nextest-core> 18: <gammalooprs[822fc56666e1de73]::processes::amplitude::AmplitudeGraph>::renormalization_part<unknown>
  716. 63.77 s gammaloop-nextest-core> at <unknown source file>:<unknown line>
  717. 63.77 s gammaloop-nextest-core> 19: <test_renormalization[9f554b029f822e2d]::finite_part_quark_lo::{closure#0} as core[940e698046960fd5]::ops::function::FnOnce<()>>::call_once<unknown>
  718. 63.77 s gammaloop-nextest-core> at <unknown source file>:<unknown line>
  719. 63.77 s gammaloop-nextest-core> 20: test[75d6903177b1d7e9]::__rust_begin_short_backtrace::<core[940e698046960fd5]::result::Result<(), alloc[2ea6bcb46fca0c42]::string::String>, fn() -> core[940e698046960fd5]::result::Result<(), alloc[2ea6bcb46fca0c42]::string::String>><unknown>
  720. 63.77 s gammaloop-nextest-core> at <unknown source file>:<unknown line>
  721. 63.77 s gammaloop-nextest-core> 21: test[75d6903177b1d7e9]::run_test::{closure#0}<unknown>
  722. 63.77 s gammaloop-nextest-core> at <unknown source file>:<unknown line>
  723. 63.77 s gammaloop-nextest-core> 22: std[bcb96dfbba0ab899]::sys::backtrace::__rust_begin_short_backtrace::<test[75d6903177b1d7e9]::run_test::{closure#1}, ()><unknown>
  724. 63.77 s gammaloop-nextest-core> at <unknown source file>:<unknown line>
  725. 63.77 s gammaloop-nextest-core> 23: <std[bcb96dfbba0ab899]::thread::lifecycle::spawn_unchecked<test[75d6903177b1d7e9]::run_test::{closure#1}, ()>::{closure#1} as core[940e698046960fd5]::ops::function::FnOnce<()>>::call_once::{shim:vtable#0}<unknown>
  726. 63.77 s gammaloop-nextest-core> at <unknown source file>:<unknown line>
  727. 63.77 s gammaloop-nextest-core> 24: <std[bcb96dfbba0ab899]::sys::thread::unix::Thread>::new::thread_start<unknown>
  728. 63.77 s gammaloop-nextest-core> at <unknown source file>:<unknown line>
  729. 63.77 s gammaloop-nextest-core> 25: start_thread<unknown>
  730. 63.77 s gammaloop-nextest-core> at <unknown source file>:<unknown line>
  731. 63.77 s gammaloop-nextest-core> 26: __clone3<unknown>
  732. 63.77 s gammaloop-nextest-core> at <unknown source file>:<unknown line>
  733. 63.77 s gammaloop-nextest-core>
  734. 63.77 s gammaloop-nextest-core> Run with COLORBT_SHOW_HIDDEN=1 environment variable to disable frame filtering.
  735. 63.77 s gammaloop-nextest-core> Run with RUST_BACKTRACE=full to include source snippets.
  736. 63.77 s gammaloop-nextest-core>
  737. 70.49 s gammaloop-nextest-core> ------------
  738. 70.49 s gammaloop-nextest-core> Summary [ 7.665s] 456 tests run: 453 passed, 3 failed, 61 skipped
  739. 70.49 s gammaloop-nextest-core> FAIL [ 0.148s] (442/456) gammalooprs::test_renormalization finite_part_ghost_2loop
  740. 70.50 s gammaloop-nextest-core> stdout ---
  741. 70.50 s gammaloop-nextest-core>
  742. 70.50 s gammaloop-nextest-core> running 1 test
  743. 70.50 s gammaloop-nextest-core> test finite_part_ghost_2loop ... FAILED
  744. 70.50 s gammaloop-nextest-core>
  745. 70.50 s gammaloop-nextest-core> failures:
  746. 70.50 s gammaloop-nextest-core>
  747. 70.50 s gammaloop-nextest-core> failures:
  748. 70.50 s gammaloop-nextest-core> finite_part_ghost_2loop
  749. 70.50 s gammaloop-nextest-core>
  750. 70.50 s gammaloop-nextest-core> test result: FAILED. 0 passed; 1 failed; 0 ignored; 0 measured; 5 filtered out; finished in 0.14s
  751. 70.50 s gammaloop-nextest-core>
  752. 70.50 s gammaloop-nextest-core> stderr ---
  753. 70.50 s gammaloop-nextest-core> The application panicked (crashed).
  754. 70.50 s gammaloop-nextest-core> Message: called `Result::unwrap()` on an `Err` value: "Symbol spenso::mink redefined with new attributes:\n\t- new user data specified: List([String(\"spenso::representation-v2\"), String(\"inline-metric\"), List([String(\"symbol\"), String(\"mink\")]), List([String(\"cyclic\"), Integer(1), List([List([String(\"symbol\"), String(\"mu\")]), List([String(\"symbol\"), String(\"nu\")]), List([String(\"symbol\"), String(\"rho\")]), List([String(\"symbol\"), String(\"sigma\")])])]), String(\"top\")]) vs None\n"
  755. 70.50 s gammaloop-nextest-core> Location: crates/vakint/src/lib.rs:4766
  756. 70.50 s gammaloop-nextest-core>
  757. 70.50 s gammaloop-nextest-core> ━━━━━━━━━━━━━━━━━━━━━━━━━━━━━━━━━━ BACKTRACE ━━━━━━━━━━━━━━━━━━━━━━━━━━━━━━━━━━━
  758. 70.50 s gammaloop-nextest-core> 1: <color_eyre[5722b77bc20a64cf]::config::PanicHook>::panic_report<unknown>
  759. 70.50 s gammaloop-nextest-core> at <unknown source file>:<unknown line>
  760. 70.50 s gammaloop-nextest-core> 2: <color_eyre[5722b77bc20a64cf]::config::PanicHook>::into_panic_hook::{closure#0}<unknown>
  761. 70.50 s gammaloop-nextest-core> at <unknown source file>:<unknown line>
  762. 70.50 s gammaloop-nextest-core> 3: std[bcb96dfbba0ab899]::panicking::panic_with_hook<unknown>
  763. 70.50 s gammaloop-nextest-core> at <unknown source file>:<unknown line>
  764. 70.50 s gammaloop-nextest-core> 4: std[bcb96dfbba0ab899]::panicking::panic_handler::{closure#0}<unknown>
  765. 70.50 s gammaloop-nextest-core> at <unknown source file>:<unknown line>
  766. 70.50 s gammaloop-nextest-core> 5: std[bcb96dfbba0ab899]::sys::backtrace::__rust_end_short_backtrace::<std[bcb96dfbba0ab899]::panicking::panic_handler::{closure#0}, !><unknown>
  767. 70.50 s gammaloop-nextest-core> at <unknown source file>:<unknown line>
  768. 70.50 s gammaloop-nextest-core> 6: __rustc[6c289b9f9c454d21]::rust_begin_unwind<unknown>
  769. 70.50 s gammaloop-nextest-core> at <unknown source file>:<unknown line>
  770. 70.50 s gammaloop-nextest-core> 7: core[940e698046960fd5]::panicking::panic_fmt<unknown>
  771. 70.50 s gammaloop-nextest-core> at <unknown source file>:<unknown line>
  772. 70.50 s gammaloop-nextest-core> 8: core[940e698046960fd5]::result::unwrap_failed<unknown>
  773. 70.50 s gammaloop-nextest-core> at <unknown source file>:<unknown line>
  774. 70.50 s gammaloop-nextest-core> 9: <vakint[eb7a1daa8ec05e1f]::Vakint>::sanitize_user_expressions<unknown>
  775. 70.50 s gammaloop-nextest-core> at <unknown source file>:<unknown line>
  776. 70.50 s gammaloop-nextest-core> 10: <vakint[eb7a1daa8ec05e1f]::Vakint>::prepare_expression_for_form<unknown>
  777. 70.50 s gammaloop-nextest-core> at <unknown source file>:<unknown line>
  778. 70.50 s gammaloop-nextest-core> 11: <vakint[eb7a1daa8ec05e1f]::VakintTerm>::tensor_reduce<unknown>
  779. 70.50 s gammaloop-nextest-core> at <unknown source file>:<unknown line>
  780. 70.50 s gammaloop-nextest-core> 12: <vakint[eb7a1daa8ec05e1f]::VakintExpression>::tensor_reduce<unknown>
  781. 70.50 s gammaloop-nextest-core> at <unknown source file>:<unknown line>
  782. 70.50 s gammaloop-nextest-core> 13: <gammalooprs[822fc56666e1de73]::uv::approx::integrated::Integrated>::integrate::<gammalooprs[822fc56666e1de73]::uv::approx::Approximation><unknown>
  783. 70.50 s gammaloop-nextest-core> at <unknown source file>:<unknown line>
  784. 70.50 s gammaloop-nextest-core> 14: <gammalooprs[822fc56666e1de73]::uv::approx::integrated::Integrated>::run::<gammalooprs[822fc56666e1de73]::uv::approx::Approximation, gammalooprs[822fc56666e1de73]::uv::approx::Approximation><unknown>
  785. 70.50 s gammaloop-nextest-core> at <unknown source file>:<unknown line>
  786. 70.50 s gammaloop-nextest-core> 15: <gammalooprs[822fc56666e1de73]::uv::forest::Forest>::compute<unknown>
  787. 70.50 s gammaloop-nextest-core> at <unknown source file>:<unknown line>
  788. 70.50 s gammaloop-nextest-core> 16: gammalooprs[822fc56666e1de73]::uv::orchestrator::legacy_renormalization_part<unknown>
  789. 70.50 s gammaloop-nextest-core> at <unknown source file>:<unknown line>
  790. 70.50 s gammaloop-nextest-core> 17: <gammalooprs[822fc56666e1de73]::uv::settings::UVOrchestrator>::renormalization_part<unknown>
  791. 70.50 s gammaloop-nextest-core> at <unknown source file>:<unknown line>
  792. 70.50 s gammaloop-nextest-core> 18: <gammalooprs[822fc56666e1de73]::processes::amplitude::AmplitudeGraph>::renormalization_part<unknown>
  793. 70.50 s gammaloop-nextest-core> at <unknown source file>:<unknown line>
  794. 70.50 s gammaloop-nextest-core> 19: test_renormalization[9f554b029f822e2d]::finite_part_ghost_2loop<unknown>
  795. 70.50 s gammaloop-nextest-core> at <unknown source file>:<unknown line>
  796. 70.50 s gammaloop-nextest-core> 20: <test_renormalization[9f554b029f822e2d]::finite_part_ghost_2loop::{closure#0} as core[940e698046960fd5]::ops::function::FnOnce<()>>::call_once<unknown>
  797. 70.50 s gammaloop-nextest-core> at <unknown source file>:<unknown line>
  798. 70.50 s gammaloop-nextest-core> 21: test[75d6903177b1d7e9]::__rust_begin_short_backtrace::<core[940e698046960fd5]::result::Result<(), alloc[2ea6bcb46fca0c42]::string::String>, fn() -> core[940e698046960fd5]::result::Result<(), alloc[2ea6bcb46fca0c42]::string::String>><unknown>
  799. 70.50 s gammaloop-nextest-core> at <unknown source file>:<unknown line>
  800. 70.50 s gammaloop-nextest-core> 22: test[75d6903177b1d7e9]::run_test::{closure#0}<unknown>
  801. 70.50 s gammaloop-nextest-core> at <unknown source file>:<unknown line>
  802. 70.50 s gammaloop-nextest-core> 23: std[bcb96dfbba0ab899]::sys::backtrace::__rust_begin_short_backtrace::<test[75d6903177b1d7e9]::run_test::{closure#1}, ()><unknown>
  803. 70.50 s gammaloop-nextest-core> at <unknown source file>:<unknown line>
  804. 70.50 s gammaloop-nextest-core> 24: <std[bcb96dfbba0ab899]::thread::lifecycle::spawn_unchecked<test[75d6903177b1d7e9]::run_test::{closure#1}, ()>::{closure#1} as core[940e698046960fd5]::ops::function::FnOnce<()>>::call_once::{shim:vtable#0}<unknown>
  805. 70.50 s gammaloop-nextest-core> at <unknown source file>:<unknown line>
  806. 70.50 s gammaloop-nextest-core> 25: <std[bcb96dfbba0ab899]::sys::thread::unix::Thread>::new::thread_start<unknown>
  807. 70.50 s gammaloop-nextest-core> at <unknown source file>:<unknown line>
  808. 70.50 s gammaloop-nextest-core> 26: start_thread<unknown>
  809. 70.50 s gammaloop-nextest-core> at <unknown source file>:<unknown line>
  810. 70.50 s gammaloop-nextest-core> 27: __clone3<unknown>
  811. 70.50 s gammaloop-nextest-core> at <unknown source file>:<unknown line>
  812. 70.50 s gammaloop-nextest-core>
  813. 70.50 s gammaloop-nextest-core> Run with COLORBT_SHOW_HIDDEN=1 environment variable to disable frame filtering.
  814. 70.50 s gammaloop-nextest-core> Run with RUST_BACKTRACE=full to include source snippets.
  815. 70.50 s gammaloop-nextest-core>
  816. 70.50 s gammaloop-nextest-core> FAIL [ 0.198s] (444/456) gammalooprs::test_renormalization finit_part_ghlo
  817. 70.50 s gammaloop-nextest-core> stdout ---
  818. 70.50 s gammaloop-nextest-core>
  819. 70.50 s gammaloop-nextest-core> running 1 test
  820. 70.50 s gammaloop-nextest-core> test finit_part_ghlo ... FAILED
  821. 70.50 s gammaloop-nextest-core>
  822. 70.50 s gammaloop-nextest-core> failures:
  823. 70.50 s gammaloop-nextest-core>
  824. 70.50 s gammaloop-nextest-core> failures:
  825. 70.50 s gammaloop-nextest-core> finit_part_ghlo
  826. 70.50 s gammaloop-nextest-core>
  827. 70.50 s gammaloop-nextest-core> test result: FAILED. 0 passed; 1 failed; 0 ignored; 0 measured; 5 filtered out; finished in 0.18s
  828. 70.50 s gammaloop-nextest-core>
  829. 70.50 s gammaloop-nextest-core> stderr ---
  830. 70.50 s gammaloop-nextest-core> The application panicked (crashed).
  831. 70.50 s gammaloop-nextest-core> Message: called `Result::unwrap()` on an `Err` value:
  832. 70.50 s gammaloop-nextest-core> 0: Symbolica could not parse FORM output:
  833. 70.50 s gammaloop-nextest-core> [spenso::{antisymmetric,real,spenso::tensor}::f]([spenso::{spenso::representat\
  834. 70.50 s gammaloop-nextest-core> ion,spenso::self_dual}::coad](8,[gammalooprs::{spenso::index}::hedge](0)
  835. 70.50 s gammaloop-nextest-core> ),[spenso::{spenso::representation,spenso::self_dual}::coad](8,[gammaloo\
  836. 70.50 s gammaloop-nextest-core> prs::{spenso::index}::hedge](3)),[spenso::{spenso::representation,spenso\
  837. 70.50 s gammaloop-nextest-core> ::self_dual}::coad](8,[gammalooprs::{spenso::index}::hedge](5)))*
  838. 70.50 s gammaloop-nextest-core> [spenso::{antisymmetric,real,spenso::tensor}::f]([spenso::{spenso::repre\
  839. 70.50 s gammaloop-nextest-core> sentation,spenso::self_dual}::coad](8,[gammalooprs::{spenso::index}::hed\
  840. 70.50 s gammaloop-nextest-core> ge](1)),[spenso::{spenso::representation,spenso::self_dual}::coad](8,
  841. 70.50 s gammaloop-nextest-core> [gammalooprs::{spenso::index}::hedge](3)),[spenso::{spenso::representati\
  842. 70.50 s gammaloop-nextest-core> on,spenso::self_dual}::coad](8,[gammalooprs::{spenso::index}::hedge](5))
  843. 70.50 s gammaloop-nextest-core> )*dot(p1,p0)*[UFO::{}::GC_10]^2*rat(-1,1)
  844. 70.50 s gammaloop-nextest-core>
  845. 70.50 s gammaloop-nextest-core> Error:Symbol spenso::coad redefined with new attributes:
  846. 70.50 s gammaloop-nextest-core> - new user data specified: List([String("spenso::representation-v2"), String("self-dual"), List([String("symbol"), String("coad")]), List([String("cyclic"), Integer(1), List([List([String("symbol"), String("a")]), List([String("symbol"), String("b")]), List([String("symbol"), String("c")]), List([String("symbol"), String("d")])])]), String("top")]) vs None
  847. 70.50 s gammaloop-nextest-core>
  848. 70.50 s gammaloop-nextest-core>
  849. 70.50 s gammaloop-nextest-core> Location:
  850. 70.50 s gammaloop-nextest-core> crates/gammalooprs/src/uv/approx/integrated.rs:332
  851. 70.50 s gammaloop-nextest-core>
  852. 70.50 s gammaloop-nextest-core> ━━━━━━━━━━━━━━━━━━━━━━━━━━━━━━━━━━ BACKTRACE ━━━━━━━━━━━━━━━━━━━━━━━━━━━━━━━━━━━
  853. 70.50 s gammaloop-nextest-core> 1: <color_eyre[5722b77bc20a64cf]::config::EyreHook>::into_eyre_hook::{closure#0}<unknown>
  854. 70.50 s gammaloop-nextest-core> at <unknown source file>:<unknown line>
  855. 70.50 s gammaloop-nextest-core> 2: eyre[cb2fd339c0c40fca]::capture_handler<unknown>
  856. 70.50 s gammaloop-nextest-core> at <unknown source file>:<unknown line>
  857. 70.50 s gammaloop-nextest-core> 3: <eyre[cb2fd339c0c40fca]::Report>::from_std::<vakint[eb7a1daa8ec05e1f]::VakintError><unknown>
  858. 70.50 s gammaloop-nextest-core> at <unknown source file>:<unknown line>
  859. 70.50 s gammaloop-nextest-core> 4: <gammalooprs[822fc56666e1de73]::uv::approx::integrated::Integrated>::integrate::<gammalooprs[822fc56666e1de73]::uv::hedge_poset::ForestNode><unknown>
  860. 70.50 s gammaloop-nextest-core> at <unknown source file>:<unknown line>
  861. 70.50 s gammaloop-nextest-core> 5: <gammalooprs[822fc56666e1de73]::uv::approx::integrated::Integrated>::run::<gammalooprs[822fc56666e1de73]::uv::hedge_poset::ForestNode, gammalooprs[822fc56666e1de73]::uv::hedge_poset::ForestNode><unknown>
  862. 70.50 s gammaloop-nextest-core> at <unknown source file>:<unknown line>
  863. 70.50 s gammaloop-nextest-core> 6: <gammalooprs[822fc56666e1de73]::uv::hedge_poset::Forests>::integrate<unknown>
  864. 70.50 s gammaloop-nextest-core> at <unknown source file>:<unknown line>
  865. 70.50 s gammaloop-nextest-core> 7: gammalooprs[822fc56666e1de73]::uv::orchestrator::hedge_poset_renormalization_part<unknown>
  866. 70.50 s gammaloop-nextest-core> at <unknown source file>:<unknown line>
  867. 70.50 s gammaloop-nextest-core> 8: <gammalooprs[822fc56666e1de73]::uv::settings::UVOrchestrator>::renormalization_part<unknown>
  868. 70.50 s gammaloop-nextest-core> at <unknown source file>:<unknown line>
  869. 70.50 s gammaloop-nextest-core> 9: <gammalooprs[822fc56666e1de73]::processes::amplitude::AmplitudeGraph>::renormalization_part<unknown>
  870. 70.50 s gammaloop-nextest-core> at <unknown source file>:<unknown line>
  871. 70.50 s gammaloop-nextest-core> 10: <test_renormalization[9f554b029f822e2d]::finit_part_ghlo::{closure#0} as core[940e698046960fd5]::ops::function::FnOnce<()>>::call_once<unknown>
  872. 70.50 s gammaloop-nextest-core> at <unknown source file>:<unknown line>
  873. 70.50 s gammaloop-nextest-core> 11: test[75d6903177b1d7e9]::__rust_begin_short_backtrace::<core[940e698046960fd5]::result::Result<(), alloc[2ea6bcb46fca0c42]::string::String>, fn() -> core[940e698046960fd5]::result::Result<(), alloc[2ea6bcb46fca0c42]::string::String>><unknown>
  874. 70.50 s gammaloop-nextest-core> at <unknown source file>:<unknown line>
  875. 70.50 s gammaloop-nextest-core> 12: test[75d6903177b1d7e9]::run_test::{closure#0}<unknown>
  876. 70.50 s gammaloop-nextest-core> at <unknown source file>:<unknown line>
  877. 70.50 s gammaloop-nextest-core> 13: std[bcb96dfbba0ab899]::sys::backtrace::__rust_begin_short_backtrace::<test[75d6903177b1d7e9]::run_test::{closure#1}, ()><unknown>
  878. 70.50 s gammaloop-nextest-core> at <unknown source file>:<unknown line>
  879. 70.50 s gammaloop-nextest-core> 14: <std[bcb96dfbba0ab899]::thread::lifecycle::spawn_unchecked<test[75d6903177b1d7e9]::run_test::{closure#1}, ()>::{closure#1} as core[940e698046960fd5]::ops::function::FnOnce<()>>::call_once::{shim:vtable#0}<unknown>
  880. 70.50 s gammaloop-nextest-core> at <unknown source file>:<unknown line>
  881. 70.50 s gammaloop-nextest-core> 15: <std[bcb96dfbba0ab899]::sys::thread::unix::Thread>::new::thread_start<unknown>
  882. 70.50 s gammaloop-nextest-core> at <unknown source file>:<unknown line>
  883. 70.50 s gammaloop-nextest-core> 16: start_thread<unknown>
  884. 70.50 s gammaloop-nextest-core> at <unknown source file>:<unknown line>
  885. 70.50 s gammaloop-nextest-core> 17: __clone3<unknown>
  886. 70.50 s gammaloop-nextest-core> at <unknown source file>:<unknown line>
  887. 70.50 s gammaloop-nextest-core>
  888. 70.50 s gammaloop-nextest-core> Run with COLORBT_SHOW_HIDDEN=1 environment variable to disable frame filtering.
  889. 70.50 s gammaloop-nextest-core> Run with RUST_BACKTRACE=full to include source snippets.
  890. 70.50 s gammaloop-nextest-core> Location: crates/gammalooprs/tests/test_renormalization.rs:550
  891. 70.50 s gammaloop-nextest-core>
  892. 70.50 s gammaloop-nextest-core> ━━━━━━━━━━━━━━━━━━━━━━━━━━━━━━━━━━ BACKTRACE ━━━━━━━━━━━━━━━━━━━━━━━━━━━━━━━━━━━
  893. 70.50 s gammaloop-nextest-core> 1: <color_eyre[5722b77bc20a64cf]::config::PanicHook>::panic_report<unknown>
  894. 70.50 s gammaloop-nextest-core> at <unknown source file>:<unknown line>
  895. 70.50 s gammaloop-nextest-core> 2: <color_eyre[5722b77bc20a64cf]::config::PanicHook>::into_panic_hook::{closure#0}<unknown>
  896. 70.50 s gammaloop-nextest-core> at <unknown source file>:<unknown line>
  897. 70.50 s gammaloop-nextest-core> 3: std[bcb96dfbba0ab899]::panicking::panic_with_hook<unknown>
  898. 70.50 s gammaloop-nextest-core> at <unknown source file>:<unknown line>
  899. 70.50 s gammaloop-nextest-core> 4: std[bcb96dfbba0ab899]::panicking::panic_handler::{closure#0}<unknown>
  900. 70.50 s gammaloop-nextest-core> at <unknown source file>:<unknown line>
  901. 70.50 s gammaloop-nextest-core> 5: std[bcb96dfbba0ab899]::sys::backtrace::__rust_end_short_backtrace::<std[bcb96dfbba0ab899]::panicking::panic_handler::{closure#0}, !><unknown>
  902. 70.50 s gammaloop-nextest-core> at <unknown source file>:<unknown line>
  903. 70.50 s gammaloop-nextest-core> 6: __rustc[6c289b9f9c454d21]::rust_begin_unwind<unknown>
  904. 70.50 s gammaloop-nextest-core> at <unknown source file>:<unknown line>
  905. 70.50 s gammaloop-nextest-core> 7: core[940e698046960fd5]::panicking::panic_fmt<unknown>
  906. 70.50 s gammaloop-nextest-core> at <unknown source file>:<unknown line>
  907. 70.50 s gammaloop-nextest-core> 8: core[940e698046960fd5]::result::unwrap_failed<unknown>
  908. 70.50 s gammaloop-nextest-core> at <unknown source file>:<unknown line>
  909. 70.50 s gammaloop-nextest-core> 9: <test_renormalization[9f554b029f822e2d]::finit_part_ghlo::{closure#0} as core[940e698046960fd5]::ops::function::FnOnce<()>>::call_once<unknown>
  910. 70.50 s gammaloop-nextest-core> at <unknown source file>:<unknown line>
  911. 70.50 s gammaloop-nextest-core> 10: test[75d6903177b1d7e9]::__rust_begin_short_backtrace::<core[940e698046960fd5]::result::Result<(), alloc[2ea6bcb46fca0c42]::string::String>, fn() -> core[940e698046960fd5]::result::Result<(), alloc[2ea6bcb46fca0c42]::string::String>><unknown>
  912. 70.50 s gammaloop-nextest-core> at <unknown source file>:<unknown line>
  913. 70.50 s gammaloop-nextest-core> 11: test[75d6903177b1d7e9]::run_test::{closure#0}<unknown>
  914. 70.50 s gammaloop-nextest-core> at <unknown source file>:<unknown line>
  915. 70.50 s gammaloop-nextest-core> 12: std[bcb96dfbba0ab899]::sys::backtrace::__rust_begin_short_backtrace::<test[75d6903177b1d7e9]::run_test::{closure#1}, ()><unknown>
  916. 70.50 s gammaloop-nextest-core> at <unknown source file>:<unknown line>
  917. 70.50 s gammaloop-nextest-core> 13: <std[bcb96dfbba0ab899]::thread::lifecycle::spawn_unchecked<test[75d6903177b1d7e9]::run_test::{closure#1}, ()>::{closure#1} as core[940e698046960fd5]::ops::function::FnOnce<()>>::call_once::{shim:vtable#0}<unknown>
  918. 70.50 s gammaloop-nextest-core> at <unknown source file>:<unknown line>
  919. 70.50 s gammaloop-nextest-core> 14: <std[bcb96dfbba0ab899]::sys::thread::unix::Thread>::new::thread_start<unknown>
  920. 70.50 s gammaloop-nextest-core> at <unknown source file>:<unknown line>
  921. 70.50 s gammaloop-nextest-core> 15: start_thread<unknown>
  922. 70.50 s gammaloop-nextest-core> at <unknown source file>:<unknown line>
  923. 70.50 s gammaloop-nextest-core> 16: __clone3<unknown>
  924. 70.50 s gammaloop-nextest-core> at <unknown source file>:<unknown line>
  925. 70.50 s gammaloop-nextest-core>
  926. 70.50 s gammaloop-nextest-core> Run with COLORBT_SHOW_HIDDEN=1 environment variable to disable frame filtering.
  927. 70.50 s gammaloop-nextest-core> Run with RUST_BACKTRACE=full to include source snippets.
  928. 70.50 s gammaloop-nextest-core>
  929. 70.50 s gammaloop-nextest-core> FAIL [ 0.184s] (445/456) gammalooprs::test_renormalization finite_part_quark_lo
  930. 70.50 s gammaloop-nextest-core> stdout ---
  931. 70.50 s gammaloop-nextest-core>
  932. 70.50 s gammaloop-nextest-core> running 1 test
  933. 70.50 s gammaloop-nextest-core> test finite_part_quark_lo ... FAILED
  934. 70.50 s gammaloop-nextest-core>
  935. 70.50 s gammaloop-nextest-core> failures:
  936. 70.50 s gammaloop-nextest-core>
  937. 70.50 s gammaloop-nextest-core> failures:
  938. 70.50 s gammaloop-nextest-core> finite_part_quark_lo
  939. 70.50 s gammaloop-nextest-core>
  940. 70.50 s gammaloop-nextest-core> test result: FAILED. 0 passed; 1 failed; 0 ignored; 0 measured; 5 filtered out; finished in 0.17s
  941. 70.50 s gammaloop-nextest-core>
  942. 70.50 s gammaloop-nextest-core> stderr ---
  943. 70.50 s gammaloop-nextest-core> The application panicked (crashed).
  944. 70.50 s gammaloop-nextest-core> Message: called `Result::unwrap()` on an `Err` value: "Symbol spenso::mink redefined with new attributes:\n\t- new user data specified: List([String(\"spenso::representation-v2\"), String(\"inline-metric\"), List([String(\"symbol\"), String(\"mink\")]), List([String(\"cyclic\"), Integer(1), List([List([String(\"symbol\"), String(\"mu\")]), List([String(\"symbol\"), String(\"nu\")]), List([String(\"symbol\"), String(\"rho\")]), List([String(\"symbol\"), String(\"sigma\")])])]), String(\"top\")]) vs None\n"
  945. 70.50 s gammaloop-nextest-core> Location: crates/vakint/src/lib.rs:4766
  946. 70.50 s gammaloop-nextest-core>
  947. 70.50 s gammaloop-nextest-core> ━━━━━━━━━━━━━━━━━━━━━━━━━━━━━━━━━━ BACKTRACE ━━━━━━━━━━━━━━━━━━━━━━━━━━━━━━━━━━━
  948. 70.50 s gammaloop-nextest-core> 1: <color_eyre[5722b77bc20a64cf]::config::PanicHook>::panic_report<unknown>
  949. 70.50 s gammaloop-nextest-core> at <unknown source file>:<unknown line>
  950. 70.50 s gammaloop-nextest-core> 2: <color_eyre[5722b77bc20a64cf]::config::PanicHook>::into_panic_hook::{closure#0}<unknown>
  951. 70.50 s gammaloop-nextest-core> at <unknown source file>:<unknown line>
  952. 70.50 s gammaloop-nextest-core> 3: std[bcb96dfbba0ab899]::panicking::panic_with_hook<unknown>
  953. 70.50 s gammaloop-nextest-core> at <unknown source file>:<unknown line>
  954. 70.50 s gammaloop-nextest-core> 4: std[bcb96dfbba0ab899]::panicking::panic_handler::{closure#0}<unknown>
  955. 70.50 s gammaloop-nextest-core> at <unknown source file>:<unknown line>
  956. 70.50 s gammaloop-nextest-core> 5: std[bcb96dfbba0ab899]::sys::backtrace::__rust_end_short_backtrace::<std[bcb96dfbba0ab899]::panicking::panic_handler::{closure#0}, !><unknown>
  957. 70.50 s gammaloop-nextest-core> at <unknown source file>:<unknown line>
  958. 70.50 s gammaloop-nextest-core> 6: __rustc[6c289b9f9c454d21]::rust_begin_unwind<unknown>
  959. 70.50 s gammaloop-nextest-core> at <unknown source file>:<unknown line>
  960. 70.50 s gammaloop-nextest-core> 7: core[940e698046960fd5]::panicking::panic_fmt<unknown>
  961. 70.50 s gammaloop-nextest-core> at <unknown source file>:<unknown line>
  962. 70.50 s gammaloop-nextest-core> 8: core[940e698046960fd5]::result::unwrap_failed<unknown>
  963. 70.50 s gammaloop-nextest-core> at <unknown source file>:<unknown line>
  964. 70.50 s gammaloop-nextest-core> 9: <vakint[eb7a1daa8ec05e1f]::Vakint>::sanitize_user_expressions<unknown>
  965. 70.50 s gammaloop-nextest-core> at <unknown source file>:<unknown line>
  966. 70.50 s gammaloop-nextest-core> 10: <vakint[eb7a1daa8ec05e1f]::Vakint>::prepare_expression_for_form<unknown>
  967. 70.50 s gammaloop-nextest-core> at <unknown source file>:<unknown line>
  968. 70.50 s gammaloop-nextest-core> 11: <vakint[eb7a1daa8ec05e1f]::VakintTerm>::tensor_reduce<unknown>
  969. 70.50 s gammaloop-nextest-core> at <unknown source file>:<unknown line>
  970. 70.50 s gammaloop-nextest-core> 12: <vakint[eb7a1daa8ec05e1f]::VakintExpression>::tensor_reduce<unknown>
  971. 70.50 s gammaloop-nextest-core> at <unknown source file>:<unknown line>
  972. 70.50 s gammaloop-nextest-core> 13: <gammalooprs[822fc56666e1de73]::uv::approx::integrated::Integrated>::integrate::<gammalooprs[822fc56666e1de73]::uv::hedge_poset::ForestNode><unknown>
  973. 70.50 s gammaloop-nextest-core> at <unknown source file>:<unknown line>
  974. 70.50 s gammaloop-nextest-core> 14: <gammalooprs[822fc56666e1de73]::uv::approx::integrated::Integrated>::run::<gammalooprs[822fc56666e1de73]::uv::hedge_poset::ForestNode, gammalooprs[822fc56666e1de73]::uv::hedge_poset::ForestNode><unknown>
  975. 70.50 s gammaloop-nextest-core> at <unknown source file>:<unknown line>
  976. 70.50 s gammaloop-nextest-core> 15: <gammalooprs[822fc56666e1de73]::uv::hedge_poset::Forests>::integrate<unknown>
  977. 70.50 s gammaloop-nextest-core> at <unknown source file>:<unknown line>
  978. 70.50 s gammaloop-nextest-core> 16: gammalooprs[822fc56666e1de73]::uv::orchestrator::hedge_poset_renormalization_part<unknown>
  979. 70.50 s gammaloop-nextest-core> at <unknown source file>:<unknown line>
  980. 70.50 s gammaloop-nextest-core> 17: <gammalooprs[822fc56666e1de73]::uv::settings::UVOrchestrator>::renormalization_part<unknown>
  981. 70.50 s gammaloop-nextest-core> at <unknown source file>:<unknown line>
  982. 70.50 s gammaloop-nextest-core> 18: <gammalooprs[822fc56666e1de73]::processes::amplitude::AmplitudeGraph>::renormalization_part<unknown>
  983. 70.50 s gammaloop-nextest-core> at <unknown source file>:<unknown line>
  984. 70.50 s gammaloop-nextest-core> 19: <test_renormalization[9f554b029f822e2d]::finite_part_quark_lo::{closure#0} as core[940e698046960fd5]::ops::function::FnOnce<()>>::call_once<unknown>
  985. 70.50 s gammaloop-nextest-core> at <unknown source file>:<unknown line>
  986. 70.50 s gammaloop-nextest-core> 20: test[75d6903177b1d7e9]::__rust_begin_short_backtrace::<core[940e698046960fd5]::result::Result<(), alloc[2ea6bcb46fca0c42]::string::String>, fn() -> core[940e698046960fd5]::result::Result<(), alloc[2ea6bcb46fca0c42]::string::String>><unknown>
  987. 70.50 s gammaloop-nextest-core> at <unknown source file>:<unknown line>
  988. 70.50 s gammaloop-nextest-core> 21: test[75d6903177b1d7e9]::run_test::{closure#0}<unknown>
  989. 70.50 s gammaloop-nextest-core> at <unknown source file>:<unknown line>
  990. 70.50 s gammaloop-nextest-core> 22: std[bcb96dfbba0ab899]::sys::backtrace::__rust_begin_short_backtrace::<test[75d6903177b1d7e9]::run_test::{closure#1}, ()><unknown>
  991. 70.50 s gammaloop-nextest-core> at <unknown source file>:<unknown line>
  992. 70.50 s gammaloop-nextest-core> 23: <std[bcb96dfbba0ab899]::thread::lifecycle::spawn_unchecked<test[75d6903177b1d7e9]::run_test::{closure#1}, ()>::{closure#1} as core[940e698046960fd5]::ops::function::FnOnce<()>>::call_once::{shim:vtable#0}<unknown>
  993. 70.50 s gammaloop-nextest-core> at <unknown source file>:<unknown line>
  994. 70.50 s gammaloop-nextest-core> 24: <std[bcb96dfbba0ab899]::sys::thread::unix::Thread>::new::thread_start<unknown>
  995. 70.50 s gammaloop-nextest-core> at <unknown source file>:<unknown line>
  996. 70.50 s gammaloop-nextest-core> 25: start_thread<unknown>
  997. 70.50 s gammaloop-nextest-core> at <unknown source file>:<unknown line>
  998. 70.50 s gammaloop-nextest-core> 26: __clone3<unknown>
  999. 70.50 s gammaloop-nextest-core> at <unknown source file>:<unknown line>
  1000. 70.50 s gammaloop-nextest-core>
  1001. 70.50 s gammaloop-nextest-core> Run with COLORBT_SHOW_HIDDEN=1 environment variable to disable frame filtering.
  1002. 70.50 s gammaloop-nextest-core> Run with RUST_BACKTRACE=full to include source snippets.
  1003. 70.50 s gammaloop-nextest-core>
  1004. 70.55 s gammaloop-nextest-core> error: test run failed
  1005. 70.57 s gammaloop-nextest-core>
  1006. 70.57 s gammaloop-nextest-core> ========== nextest test summary ==========
  1007. 70.57 s gammaloop-nextest-core> report: target/nextest/ci_gammaloop/junit.xml
  1008. 70.57 s gammaloop-nextest-core> tests: 456, failures: 3, errors: 0
  1009. 70.57 s gammaloop-nextest-core>
  1010. 70.57 s gammaloop-nextest-core> 1. gammalooprs::test_renormalization::finite_part_ghost_2loop
  1011. 70.57 s gammaloop-nextest-core> failure: test failure with exit code 101
  1012. 70.57 s gammaloop-nextest-core> system-out
  1013. 70.57 s gammaloop-nextest-core> running 1 test
  1014. 70.57 s gammaloop-nextest-core> test finite_part_ghost_2loop ... FAILED
  1015. 70.57 s gammaloop-nextest-core>
  1016. 70.57 s gammaloop-nextest-core> failures:
  1017. 70.57 s gammaloop-nextest-core>
  1018. 70.57 s gammaloop-nextest-core> failures:
  1019. 70.57 s gammaloop-nextest-core> finite_part_ghost_2loop
  1020. 70.57 s gammaloop-nextest-core>
  1021. 70.57 s gammaloop-nextest-core> test result: FAILED. 0 passed; 1 failed; 0 ignored; 0 measured; 5 filtered out; finished in 0.14s
  1022. 70.57 s gammaloop-nextest-core> system-err
  1023. 70.57 s gammaloop-nextest-core> The application panicked (crashed).
  1024. 70.57 s gammaloop-nextest-core> Message: called `Result::unwrap()` on an `Err` value: "Symbol spenso::mink redefined with new attributes:\n\t- new user data specified: List([String(\"spenso::representation-v2\"), String(\"inline-metric\"), List([String(\"symbol\"), String(\"mink\")]), List([String(\"cyclic\"), Integer(1), List([List([String(\"symbol\"), String(\"mu\")]), List([String(\"symbol\"), String(\"nu\")]), List([String(\"symbol\"), String(\"rho\")]), List([String(\"symbol\"), String(\"sigma\")])])]), String(\"top\")]) vs None\n"
  1025. 70.57 s gammaloop-nextest-core> Location: crates/vakint/src/lib.rs:4766
  1026. 70.57 s gammaloop-nextest-core>
  1027. 70.57 s gammaloop-nextest-core> ━━━━━━━━━━━━━━━━━━━━━━━━━━━━━━━━━━ BACKTRACE ━━━━━━━━━━━━━━━━━━━━━━━━━━━━━━━━━━━
  1028. 70.57 s gammaloop-nextest-core> 1: <color_eyre[5722b77bc20a64cf]::config::PanicHook>::panic_report<unknown>
  1029. 70.57 s gammaloop-nextest-core> at <unknown source file>:<unknown line>
  1030. 70.57 s gammaloop-nextest-core> 2: <color_eyre[5722b77bc20a64cf]::config::PanicHook>::into_panic_hook::{closure#0}<unknown>
  1031. 70.57 s gammaloop-nextest-core> at <unknown source file>:<unknown line>
  1032. 70.57 s gammaloop-nextest-core> 3: std[bcb96dfbba0ab899]::panicking::panic_with_hook<unknown>
  1033. 70.57 s gammaloop-nextest-core> at <unknown source file>:<unknown line>
  1034. 70.57 s gammaloop-nextest-core> 4: std[bcb96dfbba0ab899]::panicking::panic_handler::{closure#0}<unknown>
  1035. 70.57 s gammaloop-nextest-core> at <unknown source file>:<unknown line>
  1036. 70.57 s gammaloop-nextest-core> 5: std[bcb96dfbba0ab899]::sys::backtrace::__rust_end_short_backtrace::<std[bcb96dfbba0ab899]::panicking::panic_handler::{closure#0}, !><unknown>
  1037. 70.57 s gammaloop-nextest-core> at <unknown source file>:<unknown line>
  1038. 70.57 s gammaloop-nextest-core> 6: __rustc[6c289b9f9c454d21]::rust_begin_unwind<unknown>
  1039. 70.57 s gammaloop-nextest-core> at <unknown source file>:<unknown line>
  1040. 70.57 s gammaloop-nextest-core> 7: core[940e698046960fd5]::panicking::panic_fmt<unknown>
  1041. 70.57 s gammaloop-nextest-core> at <unknown source file>:<unknown line>
  1042. 70.57 s gammaloop-nextest-core> 8: core[940e698046960fd5]::result::unwrap_failed<unknown>
  1043. 70.57 s gammaloop-nextest-core> at <unknown source file>:<unknown line>
  1044. 70.57 s gammaloop-nextest-core> 9: <vakint[eb7a1daa8ec05e1f]::Vakint>::sanitize_user_expressions<unknown>
  1045. 70.57 s gammaloop-nextest-core> at <unknown source file>:<unknown line>
  1046. 70.57 s gammaloop-nextest-core> 10: <vakint[eb7a1daa8ec05e1f]::Vakint>::prepare_expression_for_form<unknown>
  1047. 70.57 s gammaloop-nextest-core> at <unknown source file>:<unknown line>
  1048. 70.57 s gammaloop-nextest-core> 11: <vakint[eb7a1daa8ec05e1f]::VakintTerm>::tensor_reduce<unknown>
  1049. 70.57 s gammaloop-nextest-core> at <unknown source file>:<unknown line>
  1050. 70.57 s gammaloop-nextest-core> 12: <vakint[eb7a1daa8ec05e1f]::VakintExpression>::tensor_reduce<unknown>
  1051. 70.57 s gammaloop-nextest-core> at <unknown source file>:<unknown line>
  1052. 70.57 s gammaloop-nextest-core> 13: <gammalooprs[822fc56666e1de73]::uv::approx::integrated::Integrated>::integrate::<gammalooprs[822fc56666e1de73]::uv::approx::Approximation><unknown>
  1053. 70.57 s gammaloop-nextest-core> at <unknown source file>:<unknown line>
  1054. 70.57 s gammaloop-nextest-core> 14: <gammalooprs[822fc56666e1de73]::uv::approx::integrated::Integrated>::run::<gammalooprs[822fc56666e1de73]::uv::approx::Approximation, gammalooprs[822fc56666e1de73]::uv::approx::Approximation><unknown>
  1055. 70.57 s gammaloop-nextest-core> at <unknown source file>:<unknown line>
  1056. 70.57 s gammaloop-nextest-core> 15: <gammalooprs[822fc56666e1de73]::uv::forest::Forest>::compute<unknown>
  1057. 70.57 s gammaloop-nextest-core> at <unknown source file>:<unknown line>
  1058. 70.57 s gammaloop-nextest-core> 16: gammalooprs[822fc56666e1de73]::uv::orchestrator::legacy_renormalization_part<unknown>
  1059. 70.57 s gammaloop-nextest-core> at <unknown source file>:<unknown line>
  1060. 70.57 s gammaloop-nextest-core> 17: <gammalooprs[822fc56666e1de73]::uv::settings::UVOrchestrator>::renormalization_part<unknown>
  1061. 70.57 s gammaloop-nextest-core> at <unknown source file>:<unknown line>
  1062. 70.57 s gammaloop-nextest-core> 18: <gammalooprs[822fc56666e1de73]::processes::amplitude::AmplitudeGraph>::renormalization_part<unknown>
  1063. 70.57 s gammaloop-nextest-core> at <unknown source file>:<unknown line>
  1064. 70.57 s gammaloop-nextest-core> 19: test_renormalization[9f554b029f822e2d]::finite_part_ghost_2loop<unknown>
  1065. 70.57 s gammaloop-nextest-core> at <unknown source file>:<unknown line>
  1066. 70.57 s gammaloop-nextest-core> 20: <test_renormalization[9f554b029f822e2d]::finite_part_ghost_2loop::{closure#0} as core[940e698046960fd5]::ops::function::FnOnce<()>>::call_once<unknown>
  1067. 70.57 s gammaloop-nextest-core> at <unknown source file>:<unknown line>
  1068. 70.57 s gammaloop-nextest-core> 21: test[75d6903177b1d7e9]::__rust_begin_short_backtrace::<core[940e698046960fd5]::result::Result<(), alloc[2ea6bcb46fca0c42]::string::String>, fn() -> core[940e698046960fd5]::result::Result<(), alloc[2ea6bcb46fca0c42]::string::String>><unknown>
  1069. 70.57 s gammaloop-nextest-core> at <unknown source file>:<unknown line>
  1070. 70.57 s gammaloop-nextest-core> 22: test[75d6903177b1d7e9]::run_test::{closure#0}<unknown>
  1071. 70.57 s gammaloop-nextest-core> at <unknown source file>:<unknown line>
  1072. 70.57 s gammaloop-nextest-core> 23: std[bcb96dfbba0ab899]::sys::backtrace::__rust_begin_short_backtrace::<test[75d6903177b1d7e9]::run_test::{closure#1}, ()><unknown>
  1073. 70.57 s gammaloop-nextest-core> at <unknown source file>:<unknown line>
  1074. 70.57 s gammaloop-nextest-core> 24: <std[bcb96dfbba0ab899]::thread::lifecycle::spawn_unchecked<test[75d6903177b1d7e9]::run_test::{closure#1}, ()>::{closure#1} as core[940e698046960fd5]::ops::function::FnOnce<()>>::call_once::{shim:vtable#0}<unknown>
  1075. 70.57 s gammaloop-nextest-core> at <unknown source file>:<unknown line>
  1076. 70.57 s gammaloop-nextest-core> 25: <std[bcb96dfbba0ab899]::sys::thread::unix::Thread>::new::thread_start<unknown>
  1077. 70.57 s gammaloop-nextest-core> at <unknown source file>:<unknown line>
  1078. 70.57 s gammaloop-nextest-core> 26: start_thread<unknown>
  1079. 70.57 s gammaloop-nextest-core> at <unknown source file>:<unknown line>
  1080. 70.57 s gammaloop-nextest-core> 27: __clone3<unknown>
  1081. 70.57 s gammaloop-nextest-core> at <unknown source file>:<unknown line>
  1082. 70.57 s gammaloop-nextest-core>
  1083. 70.57 s gammaloop-nextest-core> Run with COLORBT_SHOW_HIDDEN=1 environment variable to disable frame filtering.
  1084. 70.57 s gammaloop-nextest-core> Run with RUST_BACKTRACE=full to include source snippets.
  1085. 70.57 s gammaloop-nextest-core>
  1086. 70.57 s gammaloop-nextest-core> 2. gammalooprs::test_renormalization::finit_part_ghlo
  1087. 70.57 s gammaloop-nextest-core> failure: test failure with exit code 101
  1088. 70.57 s gammaloop-nextest-core> system-out
  1089. 70.57 s gammaloop-nextest-core> running 1 test
  1090. 70.57 s gammaloop-nextest-core> test finit_part_ghlo ... FAILED
  1091. 70.57 s gammaloop-nextest-core>
  1092. 70.57 s gammaloop-nextest-core> failures:
  1093. 70.57 s gammaloop-nextest-core>
  1094. 70.57 s gammaloop-nextest-core> failures:
  1095. 70.57 s gammaloop-nextest-core> finit_part_ghlo
  1096. 70.57 s gammaloop-nextest-core>
  1097. 70.57 s gammaloop-nextest-core> test result: FAILED. 0 passed; 1 failed; 0 ignored; 0 measured; 5 filtered out; finished in 0.18s
  1098. 70.57 s gammaloop-nextest-core> system-err
  1099. 70.57 s gammaloop-nextest-core> The application panicked (crashed).
  1100. 70.57 s gammaloop-nextest-core> Message: called `Result::unwrap()` on an `Err` value:
  1101. 70.57 s gammaloop-nextest-core> 0: Symbolica could not parse FORM output:
  1102. 70.57 s gammaloop-nextest-core> [spenso::{antisymmetric,real,spenso::tensor}::f]([spenso::{spenso::representat\
  1103. 70.57 s gammaloop-nextest-core> ion,spenso::self_dual}::coad](8,[gammalooprs::{spenso::index}::hedge](0)
  1104. 70.57 s gammaloop-nextest-core> ),[spenso::{spenso::representation,spenso::self_dual}::coad](8,[gammaloo\
  1105. 70.57 s gammaloop-nextest-core> prs::{spenso::index}::hedge](3)),[spenso::{spenso::representation,spenso\
  1106. 70.57 s gammaloop-nextest-core> ::self_dual}::coad](8,[gammalooprs::{spenso::index}::hedge](5)))*
  1107. 70.57 s gammaloop-nextest-core> [spenso::{antisymmetric,real,spenso::tensor}::f]([spenso::{spenso::repre\
  1108. 70.57 s gammaloop-nextest-core> sentation,spenso::self_dual}::coad](8,[gammalooprs::{spenso::index}::hed\
  1109. 70.57 s gammaloop-nextest-core> ge](1)),[spenso::{spenso::representation,spenso::self_dual}::coad](8,
  1110. 70.57 s gammaloop-nextest-core> [gammalooprs::{spenso::index}::hedge](3)),[spenso::{spenso::representati\
  1111. 70.57 s gammaloop-nextest-core> on,spenso::self_dual}::coad](8,[gammalooprs::{spenso::index}::hedge](5))
  1112. 70.57 s gammaloop-nextest-core> )*dot(p1,p0)*[UFO::{}::GC_10]^2*rat(-1,1)
  1113. 70.57 s gammaloop-nextest-core>
  1114. 70.57 s gammaloop-nextest-core> Error:Symbol spenso::coad redefined with new attributes:
  1115. 70.57 s gammaloop-nextest-core> - new user data specified: List([String("spenso::representation-v2"), String("self-dual"), List([String("symbol"), String("coad")]), List([String("cyclic"), Integer(1), List([List([String("symbol"), String("a")]), List([String("symbol"), String("b")]), List([String("symbol"), String("c")]), List([String("symbol"), String("d")])])]), String("top")]) vs None
  1116. 70.57 s gammaloop-nextest-core>
  1117. 70.57 s gammaloop-nextest-core>
  1118. 70.57 s gammaloop-nextest-core> Location:
  1119. 70.57 s gammaloop-nextest-core> crates/gammalooprs/src/uv/approx/integrated.rs:332
  1120. 70.57 s gammaloop-nextest-core>
  1121. 70.57 s gammaloop-nextest-core> ━━━━━━━━━━━━━━━━━━━━━━━━━━━━━━━━━━ BACKTRACE ━━━━━━━━━━━━━━━━━━━━━━━━━━━━━━━━━━━
  1122. 70.57 s gammaloop-nextest-core> 1: <color_eyre[5722b77bc20a64cf]::config::EyreHook>::into_eyre_hook::{closure#0}<unknown>
  1123. 70.57 s gammaloop-nextest-core> at <unknown source file>:<unknown line>
  1124. 70.57 s gammaloop-nextest-core> 2: eyre[cb2fd339c0c40fca]::capture_handler<unknown>
  1125. 70.57 s gammaloop-nextest-core> at <unknown source file>:<unknown line>
  1126. 70.57 s gammaloop-nextest-core> 3: <eyre[cb2fd339c0c40fca]::Report>::from_std::<vakint[eb7a1daa8ec05e1f]::VakintError><unknown>
  1127. 70.57 s gammaloop-nextest-core> at <unknown source file>:<unknown line>
  1128. 70.57 s gammaloop-nextest-core> 4: <gammalooprs[822fc56666e1de73]::uv::approx::integrated::Integrated>::integrate::<gammalooprs[822fc56666e1de73]::uv::hedge_poset::ForestNode><unknown>
  1129. 70.57 s gammaloop-nextest-core> at <unknown source file>:<unknown line>
  1130. 70.57 s gammaloop-nextest-core> 5: <gammalooprs[822fc56666e1de73]::uv::approx::integrated::Integrated>::run::<gammalooprs[822fc56666e1de73]::uv::hedge_poset::ForestNode, gammalooprs[822fc56666e1de73]::uv::hedge_poset::ForestNode><unknown>
  1131. 70.57 s gammaloop-nextest-core> at <unknown source file>:<unknown line>
  1132. 70.57 s gammaloop-nextest-core> 6: <gammalooprs[822fc56666e1de73]::uv::hedge_poset::Forests>::integrate<unknown>
  1133. 70.57 s gammaloop-nextest-core> at <unknown source file>:<unknown line>
  1134. 70.57 s gammaloop-nextest-core> 7: gammalooprs[822fc56666e1de73]::uv::orchestrator::hedge_poset_renormalization_part<unknown>
  1135. 70.57 s gammaloop-nextest-core> at <unknown source file>:<unknown line>
  1136. 70.57 s gammaloop-nextest-core> 8: <gammalooprs[822fc56666e1de73]::uv::settings::UVOrchestrator>::renormalization_part<unknown>
  1137. 70.57 s gammaloop-nextest-core> at <unknown source file>:<unknown line>
  1138. 70.58 s gammaloop-nextest-core> 9: <gammalooprs[822fc56666e1de73]::processes::amplitude::AmplitudeGraph>::renormalization_part<unknown>
  1139. 70.58 s gammaloop-nextest-core> at <unknown source file>:<unknown line>
  1140. 70.58 s gammaloop-nextest-core> 10: <test_renormalization[9f554b029f822e2d]::finit_part_ghlo::{closure#0} as core[940e698046960fd5]::ops::function::FnOnce<()>>::call_once<unknown>
  1141. 70.58 s gammaloop-nextest-core> at <unknown source file>:<unknown line>
  1142. 70.58 s gammaloop-nextest-core> 11: test[75d6903177b1d7e9]::__rust_begin_short_backtrace::<core[940e698046960fd5]::result::Result<(), alloc[2ea6bcb46fca0c42]::string::String>, fn() -> core[940e698046960fd5]::result::Result<(), alloc[2ea6bcb46fca0c42]::string::String>><unknown>
  1143. 70.58 s gammaloop-nextest-core> at <unknown source file>:<unknown line>
  1144. 70.58 s gammaloop-nextest-core> 12: test[75d6903177b1d7e9]::run_test::{closure#0}<unknown>
  1145. 70.58 s gammaloop-nextest-core> at <unknown source file>:<unknown line>
  1146. 70.58 s gammaloop-nextest-core> 13: std[bcb96dfbba0ab899]::sys::backtrace::__rust_begin_short_backtrace::<test[75d6903177b1d7e9]::run_test::{closure#1}, ()><unknown>
  1147. 70.58 s gammaloop-nextest-core> at <unknown source file>:<unknown line>
  1148. 70.58 s gammaloop-nextest-core> 14: <std[bcb96dfbba0ab899]::thread::lifecycle::spawn_unchecked<test[75d6903177b1d7e9]::run_test::{closure#1}, ()>::{closure#1} as core[940e698046960fd5]::ops::function::FnOnce<()>>::call_once::{shim:vtable#0}<unknown>
  1149. 70.58 s gammaloop-nextest-core> at <unknown source file>:<unknown line>
  1150. 70.58 s gammaloop-nextest-core> 15: <std[bcb96dfbba0ab899]::sys::thread::unix::Thread>::new::thread_start<unknown>
  1151. 70.58 s gammaloop-nextest-core> at <unknown source file>:<unknown line>
  1152. 70.58 s gammaloop-nextest-core> 16: start_thread<unknown>
  1153. 70.58 s gammaloop-nextest-core> at <unknown source file>:<unknown line>
  1154. 70.58 s gammaloop-nextest-core> 17: __clone3<unknown>
  1155. 70.58 s gammaloop-nextest-core> at <unknown source file>:<unknown line>
  1156. 70.58 s gammaloop-nextest-core>
  1157. 70.58 s gammaloop-nextest-core> Run with COLORBT_SHOW_HIDDEN=1 environment variable to disable frame filtering.
  1158. 70.58 s gammaloop-nextest-core> Run with RUST_BACKTRACE=full to include source snippets.
  1159. 70.58 s gammaloop-nextest-core> Location: crates/gammalooprs/tests/test_renormalization.rs:550
  1160. 70.58 s gammaloop-nextest-core>
  1161. 70.58 s gammaloop-nextest-core> ━━━━━━━━━━━━━━━━━━━━━━━━━━━━━━━━━━ BACKTRACE ━━━━━━━━━━━━━━━━━━━━━━━━━━━━━━━━━━━
  1162. 70.58 s gammaloop-nextest-core> 1: <color_eyre[5722b77bc20a64cf]::config::PanicHook>::panic_report<unknown>
  1163. 70.58 s gammaloop-nextest-core> at <unknown source file>:<unknown line>
  1164. 70.58 s gammaloop-nextest-core> 2: <color_eyre[5722b77bc20a64cf]::config::PanicHook>::into_panic_hook::{closure#0}<unknown>
  1165. 70.58 s gammaloop-nextest-core> at <unknown source file>:<unknown line>
  1166. 70.58 s gammaloop-nextest-core> 3: std[bcb96dfbba0ab899]::panicking::panic_with_hook<unknown>
  1167. 70.58 s gammaloop-nextest-core> at <unknown source file>:<unknown line>
  1168. 70.58 s gammaloop-nextest-core> 4: std[bcb96dfbba0ab899]::panicking::panic_handler::{closure#0}<unknown>
  1169. 70.58 s gammaloop-nextest-core> at <unknown source file>:<unknown line>
  1170. 70.58 s gammaloop-nextest-core> 5: std[bcb96dfbba0ab899]::sys::backtrace::__rust_end_short_backtrace::<std[bcb96dfbba0ab899]::panicking::panic_handler::{closure#0}, !><unknown>
  1171. 70.58 s gammaloop-nextest-core> at <unknown source file>:<unknown line>
  1172. 70.58 s gammaloop-nextest-core> 6: __rustc[6c289b9f9c454d21]::rust_begin_unwind<unknown>
  1173. 70.58 s gammaloop-nextest-core> at <unknown source file>:<unknown line>
  1174. 70.58 s gammaloop-nextest-core> 7: core[940e698046960fd5]::panicking::panic_fmt<unknown>
  1175. 70.58 s gammaloop-nextest-core> at <unknown source file>:<unknown line>
  1176. 70.58 s gammaloop-nextest-core> 8: core[940e698046960fd5]::result::unwrap_failed<unknown>
  1177. 70.58 s gammaloop-nextest-core> at <unknown source file>:<unknown line>
  1178. 70.58 s gammaloop-nextest-core> 9: <test_renormalization[9f554b029f822e2d]::finit_part_ghlo::{closure#0} as core[940e698046960fd5]::ops::function::FnOnce<()>>::call_once<unknown>
  1179. 70.58 s gammaloop-nextest-core> at <unknown source file>:<unknown line>
  1180. 70.58 s gammaloop-nextest-core> 10: test[75d6903177b1d7e9]::__rust_begin_short_backtrace::<core[940e698046960fd5]::result::Result<(), alloc[2ea6bcb46fca0c42]::string::String>, fn() -> core[940e698046960fd5]::result::Result<(), alloc[2ea6bcb46fca0c42]::string::String>><unknown>
  1181. 70.58 s gammaloop-nextest-core> at <unknown source file>:<unknown line>
  1182. 70.58 s gammaloop-nextest-core> 11: test[75d6903177b1d7e9]::run_test::{closure#0}<unknown>
  1183. 70.58 s gammaloop-nextest-core> at <unknown source file>:<unknown line>
  1184. 70.58 s gammaloop-nextest-core> 12: std[bcb96dfbba0ab899]::sys::backtrace::__rust_begin_short_backtrace::<test[75d6903177b1d7e9]::run_test::{closure#1}, ()><unknown>
  1185. 70.58 s gammaloop-nextest-core> at <unknown source file>:<unknown line>
  1186. 70.58 s gammaloop-nextest-core> 13: <std[bcb96dfbba0ab899]::thread::lifecycle::spawn_unchecked<test[75d6903177b1d7e9]::run_test::{closure#1}, ()>::{closure#1} as core[940e698046960fd5]::ops::function::FnOnce<()>>::call_once::{shim:vtable#0}<unknown>
  1187. 70.58 s gammaloop-nextest-core> at <unknown source file>:<unknown line>
  1188. 70.58 s gammaloop-nextest-core> 14: <std[bcb96dfbba0ab899]::sys::thread::unix::Thread>::new::thread_start<unknown>
  1189. 70.58 s gammaloop-nextest-core> at <unknown source file>:<unknown line>
  1190. 70.58 s gammaloop-nextest-core> 15: start_thread<unknown>
  1191. 70.58 s gammaloop-nextest-core> at <unknown source file>:<unknown line>
  1192. 70.58 s gammaloop-nextest-core> 16: __clone3<unknown>
  1193. 70.58 s gammaloop-nextest-core> at <unknown source file>:<unknown line>
  1194. 70.58 s gammaloop-nextest-core>
  1195. 70.58 s gammaloop-nextest-core> Run with COLORBT_SHOW_HIDDEN=1 environment variable to disable frame filtering.
  1196. 70.58 s gammaloop-nextest-core> Run with RUST_BACKTRACE=full to include source snippets.
  1197. 70.58 s gammaloop-nextest-core>
  1198. 70.58 s gammaloop-nextest-core> 3. gammalooprs::test_renormalization::finite_part_quark_lo
  1199. 70.58 s gammaloop-nextest-core> failure: test failure with exit code 101
  1200. 70.58 s gammaloop-nextest-core> system-out
  1201. 70.58 s gammaloop-nextest-core> running 1 test
  1202. 70.58 s gammaloop-nextest-core> test finite_part_quark_lo ... FAILED
  1203. 70.58 s gammaloop-nextest-core>
  1204. 70.58 s gammaloop-nextest-core> failures:
  1205. 70.58 s gammaloop-nextest-core>
  1206. 70.58 s gammaloop-nextest-core> failures:
  1207. 70.58 s gammaloop-nextest-core> finite_part_quark_lo
  1208. 70.58 s gammaloop-nextest-core>
  1209. 70.58 s gammaloop-nextest-core> test result: FAILED. 0 passed; 1 failed; 0 ignored; 0 measured; 5 filtered out; finished in 0.17s
  1210. 70.58 s gammaloop-nextest-core> system-err
  1211. 70.58 s gammaloop-nextest-core> The application panicked (crashed).
  1212. 70.58 s gammaloop-nextest-core> Message: called `Result::unwrap()` on an `Err` value: "Symbol spenso::mink redefined with new attributes:\n\t- new user data specified: List([String(\"spenso::representation-v2\"), String(\"inline-metric\"), List([String(\"symbol\"), String(\"mink\")]), List([String(\"cyclic\"), Integer(1), List([List([String(\"symbol\"), String(\"mu\")]), List([String(\"symbol\"), String(\"nu\")]), List([String(\"symbol\"), String(\"rho\")]), List([String(\"symbol\"), String(\"sigma\")])])]), String(\"top\")]) vs None\n"
  1213. 70.58 s gammaloop-nextest-core> Location: crates/vakint/src/lib.rs:4766
  1214. 70.58 s gammaloop-nextest-core>
  1215. 70.58 s gammaloop-nextest-core> ━━━━━━━━━━━━━━━━━━━━━━━━━━━━━━━━━━ BACKTRACE ━━━━━━━━━━━━━━━━━━━━━━━━━━━━━━━━━━━
  1216. 70.58 s gammaloop-nextest-core> 1: <color_eyre[5722b77bc20a64cf]::config::PanicHook>::panic_report<unknown>
  1217. 70.58 s gammaloop-nextest-core> at <unknown source file>:<unknown line>
  1218. 70.58 s gammaloop-nextest-core> 2: <color_eyre[5722b77bc20a64cf]::config::PanicHook>::into_panic_hook::{closure#0}<unknown>
  1219. 70.58 s gammaloop-nextest-core> at <unknown source file>:<unknown line>
  1220. 70.58 s gammaloop-nextest-core> 3: std[bcb96dfbba0ab899]::panicking::panic_with_hook<unknown>
  1221. 70.58 s gammaloop-nextest-core> at <unknown source file>:<unknown line>
  1222. 70.58 s gammaloop-nextest-core> 4: std[bcb96dfbba0ab899]::panicking::panic_handler::{closure#0}<unknown>
  1223. 70.58 s gammaloop-nextest-core> at <unknown source file>:<unknown line>
  1224. 70.58 s gammaloop-nextest-core> 5: std[bcb96dfbba0ab899]::sys::backtrace::__rust_end_short_backtrace::<std[bcb96dfbba0ab899]::panicking::panic_handler::{closure#0}, !><unknown>
  1225. 70.58 s gammaloop-nextest-core> at <unknown source file>:<unknown line>
  1226. 70.58 s gammaloop-nextest-core> 6: __rustc[6c289b9f9c454d21]::rust_begin_unwind<unknown>
  1227. 70.58 s gammaloop-nextest-core> at <unknown source file>:<unknown line>
  1228. 70.58 s gammaloop-nextest-core> 7: core[940e698046960fd5]::panicking::panic_fmt<unknown>
  1229. 70.58 s gammaloop-nextest-core> at <unknown source file>:<unknown line>
  1230. 70.58 s gammaloop-nextest-core> 8: core[940e698046960fd5]::result::unwrap_failed<unknown>
  1231. 70.58 s gammaloop-nextest-core> at <unknown source file>:<unknown line>
  1232. 70.58 s gammaloop-nextest-core> 9: <vakint[eb7a1daa8ec05e1f]::Vakint>::sanitize_user_expressions<unknown>
  1233. 70.58 s gammaloop-nextest-core> at <unknown source file>:<unknown line>
  1234. 70.58 s gammaloop-nextest-core> 10: <vakint[eb7a1daa8ec05e1f]::Vakint>::prepare_expression_for_form<unknown>
  1235. 70.58 s gammaloop-nextest-core> at <unknown source file>:<unknown line>
  1236. 70.58 s gammaloop-nextest-core> 11: <vakint[eb7a1daa8ec05e1f]::VakintTerm>::tensor_reduce<unknown>
  1237. 70.58 s gammaloop-nextest-core> at <unknown source file>:<unknown line>
  1238. 70.58 s gammaloop-nextest-core> 12: <vakint[eb7a1daa8ec05e1f]::VakintExpression>::tensor_reduce<unknown>
  1239. 70.58 s gammaloop-nextest-core> at <unknown source file>:<unknown line>
  1240. 70.58 s gammaloop-nextest-core> 13: <gammalooprs[822fc56666e1de73]::uv::approx::integrated::Integrated>::integrate::<gammalooprs[822fc56666e1de73]::uv::hedge_poset::ForestNode><unknown>
  1241. 70.58 s gammaloop-nextest-core> at <unknown source file>:<unknown line>
  1242. 70.58 s gammaloop-nextest-core> 14: <gammalooprs[822fc56666e1de73]::uv::approx::integrated::Integrated>::run::<gammalooprs[822fc56666e1de73]::uv::hedge_poset::ForestNode, gammalooprs[822fc56666e1de73]::uv::hedge_poset::ForestNode><unknown>
  1243. 70.58 s gammaloop-nextest-core> at <unknown source file>:<unknown line>
  1244. 70.58 s gammaloop-nextest-core> 15: <gammalooprs[822fc56666e1de73]::uv::hedge_poset::Forests>::integrate<unknown>
  1245. 70.58 s gammaloop-nextest-core> at <unknown source file>:<unknown line>
  1246. 70.58 s gammaloop-nextest-core> 16: gammalooprs[822fc56666e1de73]::uv::orchestrator::hedge_poset_renormalization_part<unknown>
  1247. 70.58 s gammaloop-nextest-core> at <unknown source file>:<unknown line>
  1248. 70.58 s gammaloop-nextest-core> 17: <gammalooprs[822fc56666e1de73]::uv::settings::UVOrchestrator>::renormalization_part<unknown>
  1249. 70.58 s gammaloop-nextest-core> at <unknown source file>:<unknown line>
  1250. 70.58 s gammaloop-nextest-core> 18: <gammalooprs[822fc56666e1de73]::processes::amplitude::AmplitudeGraph>::renormalization_part<unknown>
  1251. 70.58 s gammaloop-nextest-core> at <unknown source file>:<unknown line>
  1252. 70.58 s gammaloop-nextest-core> 19: <test_renormalization[9f554b029f822e2d]::finite_part_quark_lo::{closure#0} as core[940e698046960fd5]::ops::function::FnOnce<()>>::call_once<unknown>
  1253. 70.58 s gammaloop-nextest-core> at <unknown source file>:<unknown line>
  1254. 70.58 s gammaloop-nextest-core> 20: test[75d6903177b1d7e9]::__rust_begin_short_backtrace::<core[940e698046960fd5]::result::Result<(), alloc[2ea6bcb46fca0c42]::string::String>, fn() -> core[940e698046960fd5]::result::Result<(), alloc[2ea6bcb46fca0c42]::string::String>><unknown>
  1255. 70.58 s gammaloop-nextest-core> at <unknown source file>:<unknown line>
  1256. 70.58 s gammaloop-nextest-core> 21: test[75d6903177b1d7e9]::run_test::{closure#0}<unknown>
  1257. 70.58 s gammaloop-nextest-core> at <unknown source file>:<unknown line>
  1258. 70.58 s gammaloop-nextest-core> 22: std[bcb96dfbba0ab899]::sys::backtrace::__rust_begin_short_backtrace::<test[75d6903177b1d7e9]::run_test::{closure#1}, ()><unknown>
  1259. 70.58 s gammaloop-nextest-core> at <unknown source file>:<unknown line>
  1260. 70.58 s gammaloop-nextest-core> 23: <std[bcb96dfbba0ab899]::thread::lifecycle::spawn_unchecked<test[75d6903177b1d7e9]::run_test::{closure#1}, ()>::{closure#1} as core[940e698046960fd5]::ops::function::FnOnce<()>>::call_once::{shim:vtable#0}<unknown>
  1261. 70.58 s gammaloop-nextest-core> at <unknown source file>:<unknown line>
  1262. 70.58 s gammaloop-nextest-core> 24: <std[bcb96dfbba0ab899]::sys::thread::unix::Thread>::new::thread_start<unknown>
  1263. 70.58 s gammaloop-nextest-core> at <unknown source file>:<unknown line>
  1264. 70.58 s gammaloop-nextest-core> 25: start_thread<unknown>
  1265. 70.58 s gammaloop-nextest-core> at <unknown source file>:<unknown line>
  1266. 70.58 s gammaloop-nextest-core> 26: __clone3<unknown>
  1267. 70.58 s gammaloop-nextest-core> at <unknown source file>:<unknown line>
  1268. 70.58 s gammaloop-nextest-core>
  1269. 70.58 s gammaloop-nextest-core> Run with COLORBT_SHOW_HIDDEN=1 environment variable to disable frame filtering.
  1270. 70.58 s gammaloop-nextest-core> Run with RUST_BACKTRACE=full to include source snippets.
  1271. 70.58 s gammaloop-nextest-core> =========================================
  1272. 70.61 s [5 built (1 failed), 63 error: Cannot build '/nix/store/zinbrvppkmzalr7ws9scxa6mjscpn55x-gammaloop-nextest-core.drv'.
  1273. 70.61 s Reason: builder failed with exit code 100.
  1274. 70.61 s Output paths:
  1275. 70.61 s /nix/store/k5v8ghl7chk97jbw3f7b7213dk976a9s-gammaloop-nextest-core
  1276. 70.61 s Last 844 log lines:
  1277. 70.61 s > Extracting 3 binaries (including 1 non-test binary), 1 build script output directory, and 2 linked paths to /build/nextest-archive-esWNw0
  1278. 70.61 s > Extracted 18 files to /build/nextest-archive-esWNw0 in 0.41s
  1279. 70.61 s > ------------
  1280. 70.61 s > Nextest run ID b7aa5d21-d207-403b-8270-11bcda2dd794 with nextest profile: ci_gammaloop
  1281. 70.61 s > Starting 339 tests across 2 binaries
  1282. 70.61 s > ------------
  1283. 70.61 s > Summary [ 0.421s] 339 tests run: 339 passed, 0 skipped
  1284. 70.61 s >
  1285. 70.61 s > ========== nextest test summary ==========
  1286. 70.61 s > report: target/nextest/ci_gammaloop/junit.xml
  1287. 70.61 s > tests: 339, failures: 0, errors: 0
  1288. 70.61 s > No failing testcases found.
  1289. 70.61 s > =========================================
  1290. 70.61 s > Extracting 1 binary and 1 linked path to /build/nextest-archive-fjVL9V
  1291. 70.61 s > Extracted 7 files to /build/nextest-archive-fjVL9V in 0.06s
  1292. 70.61 s > ------------
  1293. 70.61 s > Nextest run ID 998553e9-d599-483b-b8b3-858e4ecd3563 with nextest profile: ci_gammaloop
  1294. 70.61 s > Starting 19 tests across 1 binary
  1295. 70.61 s > ------------
  1296. 70.61 s > Summary [ 0.010s] 19 tests run: 19 passed, 0 skipped
  1297. 70.61 s >
  1298. 70.61 s > ========== nextest test summary ==========
  1299. 70.61 s > report: target/nextest/ci_gammaloop/junit.xml
  1300. 70.61 s > tests: 19, failures: 0, errors: 0
  1301. 70.61 s > No failing testcases found.
  1302. 70.61 s > =========================================
  1303. 70.61 s > Extracting 1 binary to /build/nextest-archive-uZJmKN
  1304. 70.61 s > Extracted 4 files to /build/nextest-archive-uZJmKN in 0.03s
  1305. 70.61 s > ------------
  1306. 70.61 s > Nextest run ID 60cbc14f-f1bc-4186-b9b4-e8c188cc9192 with nextest profile: ci_gammaloop
  1307. 70.61 s > Starting 0 tests across 1 binary
  1308. 70.61 s > ------------
  1309. 70.61 s > Summary [ 0.000s] 0 tests run: 0 passed, 0 skipped
  1310. 70.61 s >
  1311. 70.61 s > ========== nextest test summary ==========
  1312. 70.61 s > report: target/nextest/ci_gammaloop/junit.xml
  1313. 70.61 s > tests: 0, failures: 0, errors: 0
  1314. 70.61 s > No failing testcases found.
  1315. 70.61 s > =========================================
  1316. 70.61 s > Extracting 4 binaries, 1 build script output directory, and 2 linked paths to /build/nextest-archive-NPuctH
  1317. 70.61 s > Extracted 18 files to /build/nextest-archive-NPuctH in 0.42s
  1318. 70.61 s > ------------
  1319. 70.61 s > Nextest run ID 7b1e8638-3636-403f-84a3-574305cf339c with nextest profile: ci_gammaloop
  1320. 70.61 s > Starting 456 tests across 4 binaries (61 tests skipped, including 60 tests via profile.ci_gammaloop.default-filter)
  1321. 70.61 s > FAIL [ 0.148s] (442/456) gammalooprs::test_renormalization finite_part_ghost_2loop
  1322. 70.61 s > stdout ---
  1323. 70.61 s >
  1324. 70.61 s > running 1 test
  1325. 70.61 s > test finite_part_ghost_2loop ... FAILED
  1326. 70.61 s >
  1327. 70.61 s > failures:
  1328. 70.61 s >
  1329. 70.61 s > failures:
  1330. 70.61 s > finite_part_ghost_2loop
  1331. 70.61 s >
  1332. 70.61 s > test result: FAILED. 0 passed; 1 failed; 0 ignored; 0 measured; 5 filtered out; finished in 0.14s
  1333. 70.61 s >
  1334. 70.61 s > stderr ---
  1335. 70.61 s > The application panicked (crashed).
  1336. 70.61 s > Message: called `Result::unwrap()` on an `Err` value: "Symbol spenso::mink redefined with new attributes:\n\t- new user data specified: List([String(\"spenso::representation-v2\"), String(\"inline-metric\"), List([String(\"symbol\"), String(\"mink\")]), List([String(\"cyclic\"), Integer(1), List([List([String(\"symbol\"), String(\"mu\")]), List([String(\"symbol\"), String(\"nu\")]), List([String(\"symbol\"), String(\"rho\")]), List([String(\"symbol\"), String(\"sigma\")])])]), String(\"top\")]) vs None\n"
  1337. 70.61 s > Location: crates/vakint/src/lib.rs:4766
  1338. 70.61 s >
  1339. 70.61 s > ━━━━━━━━━━━━━━━━━━━━━━━━━━━━━━━━━━ BACKTRACE ━━━━━━━━━━━━━━━━━━━━━━━━━━━━━━━━━━━
  1340. 70.61 s > 1: <color_eyre[5722b77bc20a64cf]::config::PanicHook>::panic_report<unknown>
  1341. 70.61 s > at <unknown source file>:<unknown line>
  1342. 70.61 s > 2: <color_eyre[5722b77bc20a64cf]::config::PanicHook>::into_panic_hook::{closure#0}<unknown>
  1343. 70.61 s > at <unknown source file>:<unknown line>
  1344. 70.61 s > 3: std[bcb96dfbba0ab899]::panicking::panic_with_hook<unknown>
  1345. 70.61 s > at <unknown source file>:<unknown line>
  1346. 70.61 s > 4: std[bcb96dfbba0ab899]::panicking::panic_handler::{closure#0}<unknown>
  1347. 70.61 s > at <unknown source file>:<unknown line>
  1348. 70.61 s > 5: std[bcb96dfbba0ab899]::sys::backtrace::__rust_end_short_backtrace::<std[bcb96dfbba0ab899]::panicking::panic_handler::{closure#0}, !><unknown>
  1349. 70.61 s > at <unknown source file>:<unknown line>
  1350. 70.61 s > 6: __rustc[6c289b9f9c454d21]::rust_begin_unwind<unknown>
  1351. 70.61 s > at <unknown source file>:<unknown line>
  1352. 70.61 s > 7: core[940e698046960fd5]::panicking::panic_fmt<unknown>
  1353. 70.61 s > at <unknown source file>:<unknown line>
  1354. 70.61 s > 8: core[940e698046960fd5]::result::unwrap_failed<unknown>
  1355. 70.61 s > at <unknown source file>:<unknown line>
  1356. 70.61 s > 9: <vakint[eb7a1daa8ec05e1f]::Vakint>::sanitize_user_expressions<unknown>
  1357. 70.61 s > at <unknown source file>:<unknown line>
  1358. 70.61 s > 10: <vakint[eb7a1daa8ec05e1f]::Vakint>::prepare_expression_for_form<unknown>
  1359. 70.61 s > at <unknown source file>:<unknown line>
  1360. 70.61 s > 11: <vakint[eb7a1daa8ec05e1f]::VakintTerm>::tensor_reduce<unknown>
  1361. 70.61 s > at <unknown source file>:<unknown line>
  1362. 70.61 s > 12: <vakint[eb7a1daa8ec05e1f]::VakintExpression>::tensor_reduce<unknown>
  1363. 70.61 s > at <unknown source file>:<unknown line>
  1364. 70.61 s > 13: <gammalooprs[822fc56666e1de73]::uv::approx::integrated::Integrated>::integrate::<gammalooprs[822fc56666e1de73]::uv::approx::Approximation><unknown>
  1365. 70.61 s > at <unknown source file>:<unknown line>
  1366. 70.61 s > 14: <gammalooprs[822fc56666e1de73]::uv::approx::integrated::Integrated>::run::<gammalooprs[822fc56666e1de73]::uv::approx::Approximation, gammalooprs[822fc56666e1de73]::uv::approx::Approximation><unknown>
  1367. 70.61 s > at <unknown source file>:<unknown line>
  1368. 70.61 s > 15: <gammalooprs[822fc56666e1de73]::uv::forest::Forest>::compute<unknown>
  1369. 70.61 s > at <unknown source file>:<unknown line>
  1370. 70.61 s > 16: gammalooprs[822fc56666e1de73]::uv::orchestrator::legacy_renormalization_part<unknown>
  1371. 70.61 s > at <unknown source file>:<unknown line>
  1372. 70.61 s > 17: <gammalooprs[822fc56666e1de73]::uv::settings::UVOrchestrator>::renormalization_part<unknown>
  1373. 70.61 s > at <unknown source file>:<unknown line>
  1374. 70.61 s > 18: <gammalooprs[822fc56666e1de73]::processes::amplitude::AmplitudeGraph>::renormalization_part<unknown>
  1375. 70.61 s > at <unknown source file>:<unknown line>
  1376. 70.61 s > 19: test_renormalization[9f554b029f822e2d]::finite_part_ghost_2loop<unknown>
  1377. 70.61 s > at <unknown source file>:<unknown line>
  1378. 70.61 s > 20: <test_renormalization[9f554b029f822e2d]::finite_part_ghost_2loop::{closure#0} as core[940e698046960fd5]::ops::function::FnOnce<()>>::call_once<unknown>
  1379. 70.61 s > at <unknown source file>:<unknown line>
  1380. 70.61 s > 21: test[75d6903177b1d7e9]::__rust_begin_short_backtrace::<core[940e698046960fd5]::result::Result<(), alloc[2ea6bcb46fca0c42]::string::String>, fn() -> core[940e698046960fd5]::result::Result<(), alloc[2ea6bcb46fca0c42]::string::String>><unknown>
  1381. 70.61 s > at <unknown source file>:<unknown line>
  1382. 70.61 s > 22: test[75d6903177b1d7e9]::run_test::{closure#0}<unknown>
  1383. 70.61 s > at <unknown source file>:<unknown line>
  1384. 70.61 s > 23: std[bcb96dfbba0ab899]::sys::backtrace::__rust_begin_short_backtrace::<test[75d6903177b1d7e9]::run_test::{closure#1}, ()><unknown>
  1385. 70.61 s > at <unknown source file>:<unknown line>
  1386. 70.61 s > 24: <std[bcb96dfbba0ab899]::thread::lifecycle::spawn_unchecked<test[75d6903177b1d7e9]::run_test::{closure#1}, ()>::{closure#1} as core[940e698046960fd5]::ops::function::FnOnce<()>>::call_once::{shim:vtable#0}<unknown>
  1387. 70.61 s > at <unknown source file>:<unknown line>
  1388. 70.61 s > 25: <std[bcb96dfbba0ab899]::sys::thread::unix::Thread>::new::thread_start<unknown>
  1389. 70.61 s > at <unknown source file>:<unknown line>
  1390. 70.61 s > 26: start_thread<unknown>
  1391. 70.61 s > at <unknown source file>:<unknown line>
  1392. 70.61 s > 27: __clone3<unknown>
  1393. 70.61 s > at <unknown source file>:<unknown line>
  1394. 70.61 s >
  1395. 70.61 s > Run with COLORBT_SHOW_HIDDEN=1 environment variable to disable frame filtering.
  1396. 70.61 s > Run with RUST_BACKTRACE=full to include source snippets.
  1397. 70.61 s >
  1398. 70.61 s > FAIL [ 0.198s] (444/456) gammalooprs::test_renormalization finit_part_ghlo
  1399. 70.61 s > stdout ---
  1400. 70.61 s >
  1401. 70.61 s > running 1 test
  1402. 70.61 s > test finit_part_ghlo ... FAILED
  1403. 70.61 s >
  1404. 70.61 s > failures:
  1405. 70.61 s >
  1406. 70.61 s > failures:
  1407. 70.61 s > finit_part_ghlo
  1408. 70.61 s >
  1409. 70.61 s > test result: FAILED. 0 passed; 1 failed; 0 ignored; 0 measured; 5 filtered out; finished in 0.18s
  1410. 70.61 s >
  1411. 70.61 s > stderr ---
  1412. 70.61 s > The application panicked (crashed).
  1413. 70.61 s > Message: called `Result::unwrap()` on an `Err` value:
  1414. 70.61 s > 0: Symbolica could not parse FORM output:
  1415. 70.61 s > [spenso::{antisymmetric,real,spenso::tensor}::f]([spenso::{spenso::representat\
  1416. 70.61 s > ion,spenso::self_dual}::coad](8,[gammalooprs::{spenso::index}::hedge](0)
  1417. 70.61 s > ),[spenso::{spenso::representation,spenso::self_dual}::coad](8,[gammaloo\
  1418. 70.61 s > prs::{spenso::index}::hedge](3)),[spenso::{spenso::representation,spenso\
  1419. 70.61 s > ::self_dual}::coad](8,[gammalooprs::{spenso::index}::hedge](5)))*
  1420. 70.61 s > [spenso::{antisymmetric,real,spenso::tensor}::f]([spenso::{spenso::repre\
  1421. 70.61 s > sentation,spenso::self_dual}::coad](8,[gammalooprs::{spenso::index}::hed\
  1422. 70.61 s > ge](1)),[spenso::{spenso::representation,spenso::self_dual}::coad](8,
  1423. 70.61 s > [gammalooprs::{spenso::index}::hedge](3)),[spenso::{spenso::representati\
  1424. 70.61 s > on,spenso::self_dual}::coad](8,[gammalooprs::{spenso::index}::hedge](5))
  1425. 70.61 s > )*dot(p1,p0)*[UFO::{}::GC_10]^2*rat(-1,1)
  1426. 70.61 s >
  1427. 70.61 s > Error:Symbol spenso::coad redefined with new attributes:
  1428. 70.61 s > - new user data specified: List([String("spenso::representation-v2"), String("self-dual"), List([String("symbol"), String("coad")]), List([String("cyclic"), Integer(1), List([List([String("symbol"), String("a")]), List([String("symbol"), String("b")]), List([String("symbol"), String("c")]), List([String("symbol"), String("d")])])]), String("top")]) vs None
  1429. 70.61 s >
  1430. 70.61 s >
  1431. 70.61 s > Location:
  1432. 70.61 s > crates/gammalooprs/src/uv/approx/integrated.rs:332
  1433. 70.61 s >
  1434. 70.61 s > ━━━━━━━━━━━━━━━━━━━━━━━━━━━━━━━━━━ BACKTRACE ━━━━━━━━━━━━━━━━━━━━━━━━━━━━━━━━━━━
  1435. 70.61 s > 1: <color_eyre[5722b77bc20a64cf]::config::EyreHook>::into_eyre_hook::{closure#0}<unknown>
  1436. 70.61 s > at <unknown source file>:<unknown line>
  1437. 70.61 s > 2: eyre[cb2fd339c0c40fca]::capture_handler<unknown>
  1438. 70.61 s > at <unknown source file>:<unknown line>
  1439. 70.61 s > 3: <eyre[cb2fd339c0c40fca]::Report>::from_std::<vakint[eb7a1daa8ec05e1f]::VakintError><unknown>
  1440. 70.61 s > at <unknown source file>:<unknown line>
  1441. 70.61 s > 4: <gammalooprs[822fc56666e1de73]::uv::approx::integrated::Integrated>::integrate::<gammalooprs[822fc56666e1de73]::uv::hedge_poset::ForestNode><unknown>
  1442. 70.61 s > at <unknown source file>:<unknown line>
  1443. 70.61 s > 5: <gammalooprs[822fc56666e1de73]::uv::approx::integrated::Integrated>::run::<gammalooprs[822fc56666e1de73]::uv::hedge_poset::ForestNode, gammalooprs[822fc56666e1de73]::uv::hedge_poset::ForestNode><unknown>
  1444. 70.61 s > at <unknown source file>:<unknown line>
  1445. 70.61 s > 6: <gammalooprs[822fc56666e1de73]::uv::hedge_poset::Forests>::integrate<unknown>
  1446. 70.61 s > at <unknown source file>:<unknown line>
  1447. 70.61 s > 7: gammalooprs[822fc56666e1de73]::uv::orchestrator::hedge_poset_renormalization_part<unknown>
  1448. 70.61 s > at <unknown source file>:<unknown line>
  1449. 70.61 s > 8: <gammalooprs[822fc56666e1de73]::uv::settings::UVOrchestrator>::renormalization_part<unknown>
  1450. 70.61 s > at <unknown source file>:<unknown line>
  1451. 70.61 s > 9: <gammalooprs[822fc56666e1de73]::processes::amplitude::AmplitudeGraph>::renormalization_part<unknown>
  1452. 70.61 s > at <unknown source file>:<unknown line>
  1453. 70.61 s > 10: <test_renormalization[9f554b029f822e2d]::finit_part_ghlo::{closure#0} as core[940e698046960fd5]::ops::function::FnOnce<()>>::call_once<unknown>
  1454. 70.61 s > at <unknown source file>:<unknown line>
  1455. 70.61 s > 11: test[75d6903177b1d7e9]::__rust_begin_short_backtrace::<core[940e698046960fd5]::result::Result<(), alloc[2ea6bcb46fca0c42]::string::String>, fn() -> core[940e698046960fd5]::result::Result<(), alloc[2ea6bcb46fca0c42]::string::String>><unknown>
  1456. 70.61 s > at <unknown source file>:<unknown line>
  1457. 70.61 s > 12: test[75d6903177b1d7e9]::run_test::{closure#0}<unknown>
  1458. 70.61 s > at <unknown source file>:<unknown line>
  1459. 70.61 s > 13: std[bcb96dfbba0ab899]::sys::backtrace::__rust_begin_short_backtrace::<test[75d6903177b1d7e9]::run_test::{closure#1}, ()><unknown>
  1460. 70.61 s > at <unknown source file>:<unknown line>
  1461. 70.61 s > 14: <std[bcb96dfbba0ab899]::thread::lifecycle::spawn_unchecked<test[75d6903177b1d7e9]::run_test::{closure#1}, ()>::{closure#1} as core[940e698046960fd5]::ops::function::FnOnce<()>>::call_once::{shim:vtable#0}<unknown>
  1462. 70.61 s > at <unknown source file>:<unknown line>
  1463. 70.61 s > 15: <std[bcb96dfbba0ab899]::sys::thread::unix::Thread>::new::thread_start<unknown>
  1464. 70.61 s > at <unknown source file>:<unknown line>
  1465. 70.61 s > 16: start_thread<unknown>
  1466. 70.61 s > at <unknown source file>:<unknown line>
  1467. 70.61 s > 17: __clone3<unknown>
  1468. 70.61 s > at <unknown source file>:<unknown line>
  1469. 70.61 s >
  1470. 70.61 s > Run with COLORBT_SHOW_HIDDEN=1 environment variable to disable frame filtering.
  1471. 70.61 s > Run with RUST_BACKTRACE=full to include source snippets.
  1472. 70.61 s > Location: crates/gammalooprs/tests/test_renormalization.rs:550
  1473. 70.61 s >
  1474. 70.61 s > ━━━━━━━━━━━━━━━━━━━━━━━━━━━━━━━━━━ BACKTRACE ━━━━━━━━━━━━━━━━━━━━━━━━━━━━━━━━━━━
  1475. 70.61 s > 1: <color_eyre[5722b77bc20a64cf]::config::PanicHook>::panic_report<unknown>
  1476. 70.61 s > at <unknown source file>:<unknown line>
  1477. 70.61 s > 2: <color_eyre[5722b77bc20a64cf]::config::PanicHook>::into_panic_hook::{closure#0}<unknown>
  1478. 70.61 s > at <unknown source file>:<unknown line>
  1479. 70.61 s > 3: std[bcb96dfbba0ab899]::panicking::panic_with_hook<unknown>
  1480. 70.61 s > at <unknown source file>:<unknown line>
  1481. 70.61 s > 4: std[bcb96dfbba0ab899]::panicking::panic_handler::{closure#0}<unknown>
  1482. 70.61 s > at <unknown source file>:<unknown line>
  1483. 70.61 s > 5: std[bcb96dfbba0ab899]::sys::backtrace::__rust_end_short_backtrace::<std[bcb96dfbba0ab899]::panicking::panic_handler::{closure#0}, !><unknown>
  1484. 70.61 s > at <unknown source file>:<unknown line>
  1485. 70.61 s > 6: __rustc[6c289b9f9c454d21]::rust_begin_unwind<unknown>
  1486. 70.61 s > at <unknown source file>:<unknown line>
  1487. 70.61 s > 7: core[940e698046960fd5]::panicking::panic_fmt<unknown>
  1488. 70.61 s > at <unknown source file>:<unknown line>
  1489. 70.61 s > 8: core[940e698046960fd5]::result::unwrap_failed<unknown>
  1490. 70.61 s > at <unknown source file>:<unknown line>
  1491. 70.61 s > 9: <test_renormalization[9f554b029f822e2d]::finit_part_ghlo::{closure#0} as core[940e698046960fd5]::ops::function::FnOnce<()>>::call_once<unknown>
  1492. 70.61 s > at <unknown source file>:<unknown line>
  1493. 70.61 s > 10: test[75d6903177b1d7e9]::__rust_begin_short_backtrace::<core[940e698046960fd5]::result::Result<(), alloc[2ea6bcb46fca0c42]::string::String>, fn() -> core[940e698046960fd5]::result::Result<(), alloc[2ea6bcb46fca0c42]::string::String>><unknown>
  1494. 70.61 s > at <unknown source file>:<unknown line>
  1495. 70.61 s > 11: test[75d6903177b1d7e9]::run_test::{closure#0}<unknown>
  1496. 70.61 s > at <unknown source file>:<unknown line>
  1497. 70.61 s > 12: std[bcb96dfbba0ab899]::sys::backtrace::__rust_begin_short_backtrace::<test[75d6903177b1d7e9]::run_test::{closure#1}, ()><unknown>
  1498. 70.61 s > at <unknown source file>:<unknown line>
  1499. 70.61 s > 13: <std[bcb96dfbba0ab899]::thread::lifecycle::spawn_unchecked<test[75d6903177b1d7e9]::run_test::{closure#1}, ()>::{closure#1} as core[940e698046960fd5]::ops::function::FnOnce<()>>::call_once::{shim:vtable#0}<unknown>
  1500. 70.61 s > at <unknown source file>:<unknown line>
  1501. 70.61 s > 14: <std[bcb96dfbba0ab899]::sys::thread::unix::Thread>::new::thread_start<unknown>
  1502. 70.61 s > at <unknown source file>:<unknown line>
  1503. 70.61 s > 15: start_thread<unknown>
  1504. 70.61 s > at <unknown source file>:<unknown line>
  1505. 70.61 s > 16: __clone3<unknown>
  1506. 70.61 s > at <unknown source file>:<unknown line>
  1507. 70.61 s >
  1508. 70.61 s > Run with COLORBT_SHOW_HIDDEN=1 environment variable to disable frame filtering.
  1509. 70.61 s > Run with RUST_BACKTRACE=full to include source snippets.
  1510. 70.61 s >
  1511. 70.61 s > FAIL [ 0.184s] (445/456) gammalooprs::test_renormalization finite_part_quark_lo
  1512. 70.61 s > stdout ---
  1513. 70.61 s >
  1514. 70.61 s > running 1 test
  1515. 70.61 s > test finite_part_quark_lo ... FAILED
  1516. 70.61 s >
  1517. 70.61 s > failures:
  1518. 70.61 s >
  1519. 70.61 s > failures:
  1520. 70.61 s > finite_part_quark_lo
  1521. 70.61 s >
  1522. 70.61 s > test result: FAILED. 0 passed; 1 failed; 0 ignored; 0 measured; 5 filtered out; finished in 0.17s
  1523. 70.61 s >
  1524. 70.61 s > stderr ---
  1525. 70.61 s > The application panicked (crashed).
  1526. 70.61 s > Message: called `Result::unwrap()` on an `Err` value: "Symbol spenso::mink redefined with new attributes:\n\t- new user data specified: List([String(\"spenso::representation-v2\"), String(\"inline-metric\"), List([String(\"symbol\"), String(\"mink\")]), List([String(\"cyclic\"), Integer(1), List([List([String(\"symbol\"), String(\"mu\")]), List([String(\"symbol\"), String(\"nu\")]), List([String(\"symbol\"), String(\"rho\")]), List([String(\"symbol\"), String(\"sigma\")])])]), String(\"top\")]) vs None\n"
  1527. 70.61 s > Location: crates/vakint/src/lib.rs:4766
  1528. 70.61 s >
  1529. 70.61 s > ━━━━━━━━━━━━━━━━━━━━━━━━━━━━━━━━━━ BACKTRACE ━━━━━━━━━━━━━━━━━━━━━━━━━━━━━━━━━━━
  1530. 70.61 s > 1: <color_eyre[5722b77bc20a64cf]::config::PanicHook>::panic_report<unknown>
  1531. 70.61 s > at <unknown source file>:<unknown line>
  1532. 70.61 s > 2: <color_eyre[5722b77bc20a64cf]::config::PanicHook>::into_panic_hook::{closure#0}<unknown>
  1533. 70.61 s > at <unknown source file>:<unknown line>
  1534. 70.61 s > 3: std[bcb96dfbba0ab899]::panicking::panic_with_hook<unknown>
  1535. 70.61 s > at <unknown source file>:<unknown line>
  1536. 70.61 s > 4: std[bcb96dfbba0ab899]::panicking::panic_handler::{closure#0}<unknown>
  1537. 70.61 s > at <unknown source file>:<unknown line>
  1538. 70.61 s > 5: std[bcb96dfbba0ab899]::sys::backtrace::__rust_end_short_backtrace::<std[bcb96dfbba0ab899]::panicking::panic_handler::{closure#0}, !><unknown>
  1539. 70.61 s > at <unknown source file>:<unknown line>
  1540. 70.61 s > 6: __rustc[6c289b9f9c454d21]::rust_begin_unwind<unknown>
  1541. 70.61 s > at <unknown source file>:<unknown line>
  1542. 70.61 s > 7: core[940e698046960fd5]::panicking::panic_fmt<unknown>
  1543. 70.61 s > at <unknown source file>:<unknown line>
  1544. 70.61 s > 8: core[940e698046960fd5]::result::unwrap_failed<unknown>
  1545. 70.61 s > at <unknown source file>:<unknown line>
  1546. 70.61 s > 9: <vakint[eb7a1daa8ec05e1f]::Vakint>::sanitize_user_expressions<unknown>
  1547. 70.61 s > at <unknown source file>:<unknown line>
  1548. 70.61 s > 10: <vakint[eb7a1daa8ec05e1f]::Vakint>::prepare_expression_for_form<unknown>
  1549. 70.61 s > at <unknown source file>:<unknown line>
  1550. 70.61 s > 11: <vakint[eb7a1daa8ec05e1f]::VakintTerm>::tensor_reduce<unknown>
  1551. 70.61 s > at <unknown source file>:<unknown line>
  1552. 70.61 s > 12: <vakint[eb7a1daa8ec05e1f]::VakintExpression>::tensor_reduce<unknown>
  1553. 70.61 s > at <unknown source file>:<unknown line>
  1554. 70.61 s > 13: <gammalooprs[822fc56666e1de73]::uv::approx::integrated::Integrated>::integrate::<gammalooprs[822fc56666e1de73]::uv::hedge_poset::ForestNode><unknown>
  1555. 70.61 s > at <unknown source file>:<unknown line>
  1556. 70.61 s > 14: <gammalooprs[822fc56666e1de73]::uv::approx::integrated::Integrated>::run::<gammalooprs[822fc56666e1de73]::uv::hedge_poset::ForestNode, gammalooprs[822fc56666e1de73]::uv::hedge_poset::ForestNode><unknown>
  1557. 70.61 s > at <unknown source file>:<unknown line>
  1558. 70.61 s > 15: <gammalooprs[822fc56666e1de73]::uv::hedge_poset::Forests>::integrate<unknown>
  1559. 70.61 s > at <unknown source file>:<unknown line>
  1560. 70.61 s > 16: gammalooprs[822fc56666e1de73]::uv::orchestrator::hedge_poset_renormalization_part<unknown>
  1561. 70.61 s > at <unknown source file>:<unknown line>
  1562. 70.61 s > 17: <gammalooprs[822fc56666e1de73]::uv::settings::UVOrchestrator>::renormalization_part<unknown>
  1563. 70.61 s > at <unknown source file>:<unknown line>
  1564. 70.61 s > 18: <gammalooprs[822fc56666e1de73]::processes::amplitude::AmplitudeGraph>::renormalization_part<unknown>
  1565. 70.61 s > at <unknown source file>:<unknown line>
  1566. 70.61 s > 19: <test_renormalization[9f554b029f822e2d]::finite_part_quark_lo::{closure#0} as core[940e698046960fd5]::ops::function::FnOnce<()>>::call_once<unknown>
  1567. 70.61 s > at <unknown source file>:<unknown line>
  1568. 70.61 s > 20: test[75d6903177b1d7e9]::__rust_begin_short_backtrace::<core[940e698046960fd5]::result::Result<(), alloc[2ea6bcb46fca0c42]::string::String>, fn() -> core[940e698046960fd5]::result::Result<(), alloc[2ea6bcb46fca0c42]::string::String>><unknown>
  1569. 70.61 s > at <unknown source file>:<unknown line>
  1570. 70.61 s > 21: test[75d6903177b1d7e9]::run_test::{closure#0}<unknown>
  1571. 70.61 s > at <unknown source file>:<unknown line>
  1572. 70.61 s > 22: std[bcb96dfbba0ab899]::sys::backtrace::__rust_begin_short_backtrace::<test[75d6903177b1d7e9]::run_test::{closure#1}, ()><unknown>
  1573. 70.61 s > at <unknown source file>:<unknown line>
  1574. 70.61 s > 23: <std[bcb96dfbba0ab899]::thread::lifecycle::spawn_unchecked<test[75d6903177b1d7e9]::run_test::{closure#1}, ()>::{closure#1} as core[940e698046960fd5]::ops::function::FnOnce<()>>::call_once::{shim:vtable#0}<unknown>
  1575. 70.61 s > at <unknown source file>:<unknown line>
  1576. 70.61 s > 24: <std[bcb96dfbba0ab899]::sys::thread::unix::Thread>::new::thread_start<unknown>
  1577. 70.61 s > at <unknown source file>:<unknown line>
  1578. 70.61 s > 25: start_thread<unknown>
  1579. 70.61 s > at <unknown source file>:<unknown line>
  1580. 70.61 s > 26: __clone3<unknown>
  1581. 70.61 s > at <unknown source file>:<unknown line>
  1582. 70.61 s >
  1583. 70.61 s > Run with COLORBT_SHOW_HIDDEN=1 environment variable to disable frame filtering.
  1584. 70.61 s > Run with RUST_BACKTRACE=full to include source snippets.
  1585. 70.61 s >
  1586. 70.61 s > ------------
  1587. 70.61 s > Summary [ 7.665s] 456 tests run: 453 passed, 3 failed, 61 skipped
  1588. 70.61 s > FAIL [ 0.148s] (442/456) gammalooprs::test_renormalization finite_part_ghost_2loop
  1589. 70.61 s > stdout ---
  1590. 70.61 s >
  1591. 70.61 s > running 1 test
  1592. 70.61 s > test finite_part_ghost_2loop ... FAILED
  1593. 70.61 s >
  1594. 70.61 s > failures:
  1595. 70.61 s >
  1596. 70.61 s > failures:
  1597. 70.61 s > finite_part_ghost_2loop
  1598. 70.61 s >
  1599. 70.61 s > test result: FAILED. 0 passed; 1 failed; 0 ignored; 0 measured; 5 filtered out; finished in 0.14s
  1600. 70.61 s >
  1601. 70.61 s > stderr ---
  1602. 70.61 s > The application panicked (crashed).
  1603. 70.61 s > Message: called `Result::unwrap()` on an `Err` value: "Symbol spenso::mink redefined with new attributes:\n\t- new user data specified: List([String(\"spenso::representation-v2\"), String(\"inline-metric\"), List([String(\"symbol\"), String(\"mink\")]), List([String(\"cyclic\"), Integer(1), List([List([String(\"symbol\"), String(\"mu\")]), List([String(\"symbol\"), String(\"nu\")]), List([String(\"symbol\"), String(\"rho\")]), List([String(\"symbol\"), String(\"sigma\")])])]), String(\"top\")]) vs None\n"
  1604. 70.61 s > Location: crates/vakint/src/lib.rs:4766
  1605. 70.61 s >
  1606. 70.61 s > ━━━━━━━━━━━━━━━━━━━━━━━━━━━━━━━━━━ BACKTRACE ━━━━━━━━━━━━━━━━━━━━━━━━━━━━━━━━━━━
  1607. 70.61 s > 1: <color_eyre[5722b77bc20a64cf]::config::PanicHook>::panic_report<unknown>
  1608. 70.61 s > at <unknown source file>:<unknown line>
  1609. 70.61 s > 2: <color_eyre[5722b77bc20a64cf]::config::PanicHook>::into_panic_hook::{closure#0}<unknown>
  1610. 70.61 s > at <unknown source file>:<unknown line>
  1611. 70.61 s > 3: std[bcb96dfbba0ab899]::panicking::panic_with_hook<unknown>
  1612. 70.61 s > at <unknown source file>:<unknown line>
  1613. 70.61 s > 4: std[bcb96dfbba0ab899]::panicking::panic_handler::{closure#0}<unknown>
  1614. 70.61 s > at <unknown source file>:<unknown line>
  1615. 70.61 s > 5: std[bcb96dfbba0ab899]::sys::backtrace::__rust_end_short_backtrace::<std[bcb96dfbba0ab899]::panicking::panic_handler::{closure#0}, !><unknown>
  1616. 70.61 s > at <unknown source file>:<unknown line>
  1617. 70.61 s > 6: __rustc[6c289b9f9c454d21]::rust_begin_unwind<unknown>
  1618. 70.61 s > at <unknown source file>:<unknown line>
  1619. 70.61 s > 7: core[940e698046960fd5]::panicking::panic_fmt<unknown>
  1620. 70.61 s > at <unknown source file>:<unknown line>
  1621. 70.61 s > 8: core[940e698046960fd5]::result::unwrap_failed<unknown>
  1622. 70.61 s > at <unknown source file>:<unknown line>
  1623. 70.61 s > 9: <vakint[eb7a1daa8ec05e1f]::Vakint>::sanitize_user_expressions<unknown>
  1624. 70.61 s > at <unknown source file>:<unknown line>
  1625. 70.61 s > 10: <vakint[eb7a1daa8ec05e1f]::Vakint>::prepare_expression_for_form<unknown>
  1626. 70.61 s > at <unknown source file>:<unknown line>
  1627. 70.61 s > 11: <vakint[eb7a1daa8ec05e1f]::VakintTerm>::tensor_reduce<unknown>
  1628. 70.61 s > at <unknown source file>:<unknown line>
  1629. 70.61 s > 12: <vakint[eb7a1daa8ec05e1f]::VakintExpression>::tensor_reduce<unknown>
  1630. 70.61 s > at <unknown source file>:<unknown line>
  1631. 70.61 s > 13: <gammalooprs[822fc56666e1de73]::uv::approx::integrated::Integrated>::integrate::<gammalooprs[822fc56666e1de73]::uv::approx::Approximation><unknown>
  1632. 70.61 s > at <unknown source file>:<unknown line>
  1633. 70.61 s > 14: <gammalooprs[822fc56666e1de73]::uv::approx::integrated::Integrated>::run::<gammalooprs[822fc56666e1de73]::uv::approx::Approximation, gammalooprs[822fc56666e1de73]::uv::approx::Approximation><unknown>
  1634. 70.61 s > at <unknown source file>:<unknown line>
  1635. 70.61 s > 15: <gammalooprs[822fc56666e1de73]::uv::forest::Forest>::compute<unknown>
  1636. 70.61 s > at <unknown source file>:<unknown line>
  1637. 70.61 s > 16: gammalooprs[822fc56666e1de73]::uv::orchestrator::legacy_renormalization_part<unknown>
  1638. 70.61 s > at <unknown source file>:<unknown line>
  1639. 70.61 s > 17: <gammalooprs[822fc56666e1de73]::uv::settings::UVOrchestrator>::renormalization_part<unknown>
  1640. 70.61 s > at <unknown source file>:<unknown line>
  1641. 70.61 s > 18: <gammalooprs[822fc56666e1de73]::processes::amplitude::AmplitudeGraph>::renormalization_part<unknown>
  1642. 70.61 s > at <unknown source file>:<unknown line>
  1643. 70.61 s > 19: test_renormalization[9f554b029f822e2d]::finite_part_ghost_2loop<unknown>
  1644. 70.61 s > at <unknown source file>:<unknown line>
  1645. 70.61 s > 20: <test_renormalization[9f554b029f822e2d]::finite_part_ghost_2loop::{closure#0} as core[940e698046960fd5]::ops::function::FnOnce<()>>::call_once<unknown>
  1646. 70.61 s > at <unknown source file>:<unknown line>
  1647. 70.61 s > 21: test[75d6903177b1d7e9]::__rust_begin_short_backtrace::<core[940e698046960fd5]::result::Result<(), alloc[2ea6bcb46fca0c42]::string::String>, fn() -> core[940e698046960fd5]::result::Result<(), alloc[2ea6bcb46fca0c42]::string::String>><unknown>
  1648. 70.61 s > at <unknown source file>:<unknown line>
  1649. 70.61 s > 22: test[75d6903177b1d7e9]::run_test::{closure#0}<unknown>
  1650. 70.61 s > at <unknown source file>:<unknown line>
  1651. 70.61 s > 23: std[bcb96dfbba0ab899]::sys::backtrace::__rust_begin_short_backtrace::<test[75d6903177b1d7e9]::run_test::{closure#1}, ()><unknown>
  1652. 70.61 s > at <unknown source file>:<unknown line>
  1653. 70.61 s > 24: <std[bcb96dfbba0ab899]::thread::lifecycle::spawn_unchecked<test[75d6903177b1d7e9]::run_test::{closure#1}, ()>::{closure#1} as core[940e698046960fd5]::ops::function::FnOnce<()>>::call_once::{shim:vtable#0}<unknown>
  1654. 70.61 s > at <unknown source file>:<unknown line>
  1655. 70.61 s > 25: <std[bcb96dfbba0ab899]::sys::thread::unix::Thread>::new::thread_start<unknown>
  1656. 70.61 s > at <unknown source file>:<unknown line>
  1657. 70.61 s > 26: start_thread<unknown>
  1658. 70.61 s > at <unknown source file>:<unknown line>
  1659. 70.61 s > 27: __clone3<unknown>
  1660. 70.61 s > at <unknown source file>:<unknown line>
  1661. 70.61 s >
  1662. 70.61 s > Run with COLORBT_SHOW_HIDDEN=1 environment variable to disable frame filtering.
  1663. 70.61 s > Run with RUST_BACKTRACE=full to include source snippets.
  1664. 70.61 s >
  1665. 70.61 s > FAIL [ 0.198s] (444/456) gammalooprs::test_renormalization finit_part_ghlo
  1666. 70.61 s > stdout ---
  1667. 70.61 s >
  1668. 70.61 s > running 1 test
  1669. 70.61 s > test finit_part_ghlo ... FAILED
  1670. 70.61 s >
  1671. 70.61 s > failures:
  1672. 70.61 s >
  1673. 70.61 s > failures:
  1674. 70.61 s > finit_part_ghlo
  1675. 70.61 s >
  1676. 70.61 s > test result: FAILED. 0 passed; 1 failed; 0 ignored; 0 measured; 5 filtered out; finished in 0.18s
  1677. 70.61 s >
  1678. 70.61 s > stderr ---
  1679. 70.61 s > The application panicked (crashed).
  1680. 70.61 s > Message: called `Result::unwrap()` on an `Err` value:
  1681. 70.61 s > 0: Symbolica could not parse FORM output:
  1682. 70.61 s > [spenso::{antisymmetric,real,spenso::tensor}::f]([spenso::{spenso::representat\
  1683. 70.61 s > ion,spenso::self_dual}::coad](8,[gammalooprs::{spenso::index}::hedge](0)
  1684. 70.61 s > ),[spenso::{spenso::representation,spenso::self_dual}::coad](8,[gammaloo\
  1685. 70.61 s > prs::{spenso::index}::hedge](3)),[spenso::{spenso::representation,spenso\
  1686. 70.61 s > ::self_dual}::coad](8,[gammalooprs::{spenso::index}::hedge](5)))*
  1687. 70.61 s > [spenso::{antisymmetric,real,spenso::tensor}::f]([spenso::{spenso::repre\
  1688. 70.61 s > sentation,spenso::self_dual}::coad](8,[gammalooprs::{spenso::index}::hed\
  1689. 70.61 s > ge](1)),[spenso::{spenso::representation,spenso::self_dual}::coad](8,
  1690. 70.61 s > [gammalooprs::{spenso::index}::hedge](3)),[spenso::{spenso::representati\
  1691. 70.61 s > on,spenso::self_dual}::coad](8,[gammalooprs::{spenso::index}::hedge](5))
  1692. 70.61 s > )*dot(p1,p0)*[UFO::{}::GC_10]^2*rat(-1,1)
  1693. 70.61 s >
  1694. 70.61 s > Error:Symbol spenso::coad redefined with new attributes:
  1695. 70.61 s > - new user data specified: List([String("spenso::representation-v2"), String("self-dual"), List([String("symbol"), String("coad")]), List([String("cyclic"), Integer(1), List([List([String("symbol"), String("a")]), List([String("symbol"), String("b")]), List([String("symbol"), String("c")]), List([String("symbol"), String("d")])])]), String("top")]) vs None
  1696. 70.61 s >
  1697. 70.61 s >
  1698. 70.61 s > Location:
  1699. 70.61 s > crates/gammalooprs/src/uv/approx/integrated.rs:332
  1700. 70.61 s >
  1701. 70.61 s > ━━━━━━━━━━━━━━━━━━━━━━━━━━━━━━━━━━ BACKTRACE ━━━━━━━━━━━━━━━━━━━━━━━━━━━━━━━━━━━
  1702. 70.61 s > 1: <color_eyre[5722b77bc20a64cf]::config::EyreHook>::into_eyre_hook::{closure#0}<unknown>
  1703. 70.61 s > at <unknown source file>:<unknown line>
  1704. 70.61 s > 2: eyre[cb2fd339c0c40fca]::capture_handler<unknown>
  1705. 70.61 s > at <unknown source file>:<unknown line>
  1706. 70.61 s > 3: <eyre[cb2fd339c0c40fca]::Report>::from_std::<vakint[eb7a1daa8ec05e1f]::VakintError><unknown>
  1707. 70.61 s > at <unknown source file>:<unknown line>
  1708. 70.61 s > 4: <gammalooprs[822fc56666e1de73]::uv::approx::integrated::Integrated>::integrate::<gammalooprs[822fc56666e1de73]::uv::hedge_poset::ForestNode><unknown>
  1709. 70.61 s > at <unknown source file>:<unknown line>
  1710. 70.61 s > 5: <gammalooprs[822fc56666e1de73]::uv::approx::integrated::Integrated>::run::<gammalooprs[822fc56666e1de73]::uv::hedge_poset::ForestNode, gammalooprs[822fc56666e1de73]::uv::hedge_poset::ForestNode><unknown>
  1711. 70.61 s > at <unknown source file>:<unknown line>
  1712. 70.61 s > 6: <gammalooprs[822fc56666e1de73]::uv::hedge_poset::Forests>::integrate<unknown>
  1713. 70.61 s > at <unknown source file>:<unknown line>
  1714. 70.61 s > 7: gammalooprs[822fc56666e1de73]::uv::orchestrator::hedge_poset_renormalization_part<unknown>
  1715. 70.61 s > at <unknown source file>:<unknown line>
  1716. 70.61 s > 8: <gammalooprs[822fc56666e1de73]::uv::settings::UVOrchestrator>::renormalization_part<unknown>
  1717. 70.61 s > at <unknown source file>:<unknown line>
  1718. 70.61 s > 9: <gammalooprs[822fc56666e1de73]::processes::amplitude::AmplitudeGraph>::renormalization_part<unknown>
  1719. 70.61 s > at <unknown source file>:<unknown line>
  1720. 70.61 s > 10: <test_renormalization[9f554b029f822e2d]::finit_part_ghlo::{closure#0} as core[940e698046960fd5]::ops::function::FnOnce<()>>::call_once<unknown>
  1721. 70.61 s > at <unknown source file>:<unknown line>
  1722. 70.61 s > 11: test[75d6903177b1d7e9]::__rust_begin_short_backtrace::<core[940e698046960fd5]::result::Result<(), alloc[2ea6bcb46fca0c42]::string::String>, fn() -> core[940e698046960fd5]::result::Result<(), alloc[2ea6bcb46fca0c42]::string::String>><unknown>
  1723. 70.61 s > at <unknown source file>:<unknown line>
  1724. 70.61 s > 12: test[75d6903177b1d7e9]::run_test::{closure#0}<unknown>
  1725. 70.61 s > at <unknown source file>:<unknown line>
  1726. 70.61 s > 13: std[bcb96dfbba0ab899]::sys::backtrace::__rust_begin_short_backtrace::<test[75d6903177b1d7e9]::run_test::{closure#1}, ()><unknown>
  1727. 70.61 s > at <unknown source file>:<unknown line>
  1728. 70.61 s > 14: <std[bcb96dfbba0ab899]::thread::lifecycle::spawn_unchecked<test[75d6903177b1d7e9]::run_test::{closure#1}, ()>::{closure#1} as core[940e698046960fd5]::ops::function::FnOnce<()>>::call_once::{shim:vtable#0}<unknown>
  1729. 70.61 s > at <unknown source file>:<unknown line>
  1730. 70.61 s > 15: <std[bcb96dfbba0ab899]::sys::thread::unix::Thread>::new::thread_start<unknown>
  1731. 70.61 s > at <unknown source file>:<unknown line>
  1732. 70.61 s > 16: start_thread<unknown>
  1733. 70.61 s > at <unknown source file>:<unknown line>
  1734. 70.61 s > 17: __clone3<unknown>
  1735. 70.61 s > at <unknown source file>:<unknown line>
  1736. 70.61 s >
  1737. 70.61 s > Run with COLORBT_SHOW_HIDDEN=1 environment variable to disable frame filtering.
  1738. 70.61 s > Run with RUST_BACKTRACE=full to include source snippets.
  1739. 70.61 s > Location: crates/gammalooprs/tests/test_renormalization.rs:550
  1740. 70.61 s >
  1741. 70.61 s > ━━━━━━━━━━━━━━━━━━━━━━━━━━━━━━━━━━ BACKTRACE ━━━━━━━━━━━━━━━━━━━━━━━━━━━━━━━━━━━
  1742. 70.61 s > 1: <color_eyre[5722b77bc20a64cf]::config::PanicHook>::panic_report<unknown>
  1743. 70.61 s > at <unknown source file>:<unknown line>
  1744. 70.61 s > 2: <color_eyre[5722b77bc20a64cf]::config::PanicHook>::into_panic_hook::{closure#0}<unknown>
  1745. 70.61 s > at <unknown source file>:<unknown line>
  1746. 70.61 s > 3: std[bcb96dfbba0ab899]::panicking::panic_with_hook<unknown>
  1747. 70.61 s > at <unknown source file>:<unknown line>
  1748. 70.61 s > 4: std[bcb96dfbba0ab899]::panicking::panic_handler::{closure#0}<unknown>
  1749. 70.61 s > at <unknown source file>:<unknown line>
  1750. 70.61 s > 5: std[bcb96dfbba0ab899]::sys::backtrace::__rust_end_short_backtrace::<std[bcb96dfbba0ab899]::panicking::panic_handler::{closure#0}, !><unknown>
  1751. 70.61 s > at <unknown source file>:<unknown line>
  1752. 70.61 s > 6: __rustc[6c289b9f9c454d21]::rust_begin_unwind<unknown>
  1753. 70.61 s > at <unknown source file>:<unknown line>
  1754. 70.61 s > 7: core[940e698046960fd5]::panicking::panic_fmt<unknown>
  1755. 70.61 s > at <unknown source file>:<unknown line>
  1756. 70.61 s > 8: core[940e698046960fd5]::result::unwrap_failed<unknown>
  1757. 70.61 s > at <unknown source file>:<unknown line>
  1758. 70.61 s > 9: <test_renormalization[9f554b029f822e2d]::finit_part_ghlo::{closure#0} as core[940e698046960fd5]::ops::function::FnOnce<()>>::call_once<unknown>
  1759. 70.61 s > at <unknown source file>:<unknown line>
  1760. 70.61 s > 10: test[75d6903177b1d7e9]::__rust_begin_short_backtrace::<core[940e698046960fd5]::result::Result<(), alloc[2ea6bcb46fca0c42]::string::String>, fn() -> core[940e698046960fd5]::result::Result<(), alloc[2ea6bcb46fca0c42]::string::String>><unknown>
  1761. 70.61 s > at <unknown source file>:<unknown line>
  1762. 70.61 s > 11: test[75d6903177b1d7e9]::run_test::{closure#0}<unknown>
  1763. 70.61 s > at <unknown source file>:<unknown line>
  1764. 70.61 s > 12: std[bcb96dfbba0ab899]::sys::backtrace::__rust_begin_short_backtrace::<test[75d6903177b1d7e9]::run_test::{closure#1}, ()><unknown>
  1765. 70.61 s > at <unknown source file>:<unknown line>
  1766. 70.61 s > 13: <std[bcb96dfbba0ab899]::thread::lifecycle::spawn_unchecked<test[75d6903177b1d7e9]::run_test::{closure#1}, ()>::{closure#1} as core[940e698046960fd5]::ops::function::FnOnce<()>>::call_once::{shim:vtable#0}<unknown>
  1767. 70.61 s > at <unknown source file>:<unknown line>
  1768. 70.61 s > 14: <std[bcb96dfbba0ab899]::sys::thread::unix::Thread>::new::thread_start<unknown>
  1769. 70.61 s > at <unknown source file>:<unknown line>
  1770. 70.61 s > 15: start_thread<unknown>
  1771. 70.61 s > at <unknown source file>:<unknown line>
  1772. 70.61 s > 16: __clone3<unknown>
  1773. 70.61 s > at <unknown source file>:<unknown line>
  1774. 70.61 s >
  1775. 70.61 s > Run with COLORBT_SHOW_HIDDEN=1 environment variable to disable frame filtering.
  1776. 70.61 s > Run with RUST_BACKTRACE=full to include source snippets.
  1777. 70.61 s >
  1778. 70.61 s > FAIL [ 0.184s] (445/456) gammalooprs::test_renormalization finite_part_quark_lo
  1779. 70.61 s > stdout ---
  1780. 70.61 s >
  1781. 70.61 s > running 1 test
  1782. 70.61 s > test finite_part_quark_lo ... FAILED
  1783. 70.61 s >
  1784. 70.61 s > failures:
  1785. 70.61 s >
  1786. 70.61 s > failures:
  1787. 70.61 s > finite_part_quark_lo
  1788. 70.61 s >
  1789. 70.61 s > test result: FAILED. 0 passed; 1 failed; 0 ignored; 0 measured; 5 filtered out; finished in 0.17s
  1790. 70.61 s >
  1791. 70.61 s > stderr ---
  1792. 70.61 s > The application panicked (crashed).
  1793. 70.61 s > Message: called `Result::unwrap()` on an `Err` value: "Symbol spenso::mink redefined with new attributes:\n\t- new user data specified: List([String(\"spenso::representation-v2\"), String(\"inline-metric\"), List([String(\"symbol\"), String(\"mink\")]), List([String(\"cyclic\"), Integer(1), List([List([String(\"symbol\"), String(\"mu\")]), List([String(\"symbol\"), String(\"nu\")]), List([String(\"symbol\"), String(\"rho\")]), List([String(\"symbol\"), String(\"sigma\")])])]), String(\"top\")]) vs None\n"
  1794. 70.61 s > Location: crates/vakint/src/lib.rs:4766
  1795. 70.61 s >
  1796. 70.61 s > ━━━━━━━━━━━━━━━━━━━━━━━━━━━━━━━━━━ BACKTRACE ━━━━━━━━━━━━━━━━━━━━━━━━━━━━━━━━━━━
  1797. 70.61 s > 1: <color_eyre[5722b77bc20a64cf]::config::PanicHook>::panic_report<unknown>
  1798. 70.61 s > at <unknown source file>:<unknown line>
  1799. 70.61 s > 2: <color_eyre[5722b77bc20a64cf]::config::PanicHook>::into_panic_hook::{closure#0}<unknown>
  1800. 70.61 s > at <unknown source file>:<unknown line>
  1801. 70.61 s > 3: std[bcb96dfbba0ab899]::panicking::panic_with_hook<unknown>
  1802. 70.61 s > at <unknown source file>:<unknown line>
  1803. 70.61 s > 4: std[bcb96dfbba0ab899]::panicking::panic_handler::{closure#0}<unknown>
  1804. 70.61 s > at <unknown source file>:<unknown line>
  1805. 70.61 s > 5: std[bcb96dfbba0ab899]::sys::backtrace::__rust_end_short_backtrace::<std[bcb96dfbba0ab899]::panicking::panic_handler::{closure#0}, !><unknown>
  1806. 70.61 s > at <unknown source file>:<unknown line>
  1807. 70.61 s > 6: __rustc[6c289b9f9c454d21]::rust_begin_unwind<unknown>
  1808. 70.61 s > at <unknown source file>:<unknown line>
  1809. 70.61 s > 7: core[940e698046960fd5]::panicking::panic_fmt<unknown>
  1810. 70.61 s > at <unknown source file>:<unknown line>
  1811. 70.61 s > 8: core[940e698046960fd5]::result::unwrap_failed<unknown>
  1812. 70.61 s > at <unknown source file>:<unknown line>
  1813. 70.61 s > 9: <vakint[eb7a1daa8ec05e1f]::Vakint>::sanitize_user_expressions<unknown>
  1814. 70.61 s > at <unknown source file>:<unknown line>
  1815. 70.61 s > 10: <vakint[eb7a1daa8ec05e1f]::Vakint>::prepare_expression_for_form<unknown>
  1816. 70.61 s > at <unknown source file>:<unknown line>
  1817. 70.61 s > 11: <vakint[eb7a1daa8ec05e1f]::VakintTerm>::tensor_reduce<unknown>
  1818. 70.61 s > at <unknown source file>:<unknown line>
  1819. 70.61 s > 12: <vakint[eb7a1daa8ec05e1f]::VakintExpression>::tensor_reduce<unknown>
  1820. 70.61 s > at <unknown source file>:<unknown line>
  1821. 70.61 s > 13: <gammalooprs[822fc56666e1de73]::uv::approx::integrated::Integrated>::integrate::<gammalooprs[822fc56666e1de73]::uv::hedge_poset::ForestNode><unknown>
  1822. 70.61 s > at <unknown source file>:<unknown line>
  1823. 70.61 s > 14: <gammalooprs[822fc56666e1de73]::uv::approx::integrated::Integrated>::run::<gammalooprs[822fc56666e1de73]::uv::hedge_poset::ForestNode, gammalooprs[822fc56666e1de73]::uv::hedge_poset::ForestNode><unknown>
  1824. 70.61 s > at <unknown source file>:<unknown line>
  1825. 70.61 s > 15: <gammalooprs[822fc56666e1de73]::uv::hedge_poset::Forests>::integrate<unknown>
  1826. 70.61 s > at <unknown source file>:<unknown line>
  1827. 70.61 s > 16: gammalooprs[822fc56666e1de73]::uv::orchestrator::hedge_poset_renormalization_part<unknown>
  1828. 70.61 s > at <unknown source file>:<unknown line>
  1829. 70.61 s > 17: <gammalooprs[822fc56666e1de73]::uv::settings::UVOrchestrator>::renormalization_part<unknown>
  1830. 70.61 s > at <unknown source file>:<unknown line>
  1831. 70.61 s > 18: <gammalooprs[822fc56666e1de73]::processes::amplitude::AmplitudeGraph>::renormalization_part<unknown>
  1832. 70.61 s > at <unknown source file>:<unknown line>
  1833. 70.61 s > 19: <test_renormalization[9f554b029f822e2d]::finite_part_quark_lo::{closure#0} as core[940e698046960fd5]::ops::function::FnOnce<()>>::call_once<unknown>
  1834. 70.61 s > at <unknown source file>:<unknown line>
  1835. 70.61 s > 20: test[75d6903177b1d7e9]::__rust_begin_short_backtrace::<core[940e698046960fd5]::result::Result<(), alloc[2ea6bcb46fca0c42]::string::String>, fn() -> core[940e698046960fd5]::result::Result<(), alloc[2ea6bcb46fca0c42]::string::String>><unknown>
  1836. 70.61 s > at <unknown source file>:<unknown line>
  1837. 70.61 s > 21: test[75d6903177b1d7e9]::run_test::{closure#0}<unknown>
  1838. 70.61 s > at <unknown source file>:<unknown line>
  1839. 70.61 s > 22: std[bcb96dfbba0ab899]::sys::backtrace::__rust_begin_short_backtrace::<test[75d6903177b1d7e9]::run_test::{closure#1}, ()><unknown>
  1840. 70.61 s > at <unknown source file>:<unknown line>
  1841. 70.61 s > 23: <std[bcb96dfbba0ab899]::thread::lifecycle::spawn_unchecked<test[75d6903177b1d7e9]::run_test::{closure#1}, ()>::{closure#1} as core[940e698046960fd5]::ops::function::FnOnce<()>>::call_once::{shim:vtable#0}<unknown>
  1842. 70.61 s > at <unknown source file>:<unknown line>
  1843. 70.61 s > 24: <std[bcb96dfbba0ab899]::sys::thread::unix::Thread>::new::thread_start<unknown>
  1844. 70.61 s > at <unknown source file>:<unknown line>
  1845. 70.61 s > 25: start_thread<unknown>
  1846. 70.61 s > at <unknown source file>:<unknown line>
  1847. 70.61 s > 26: __clone3<unknown>
  1848. 70.61 s > at <unknown source file>:<unknown line>
  1849. 70.61 s >
  1850. 70.61 s > Run with COLORBT_SHOW_HIDDEN=1 environment variable to disable frame filtering.
  1851. 70.61 s > Run with RUST_BACKTRACE=full to include source snippets.
  1852. 70.61 s >
  1853. 70.61 s > error: test run failed
  1854. 70.61 s >
  1855. 70.61 s > ========== nextest test summary ==========
  1856. 70.61 s > report: target/nextest/ci_gammaloop/junit.xml
  1857. 70.61 s > tests: 456, failures: 3, errors: 0
  1858. 70.61 s >
  1859. 70.61 s > 1. gammalooprs::test_renormalization::finite_part_ghost_2loop
  1860. 70.61 s > failure: test failure with exit code 101
  1861. 70.61 s > system-out
  1862. 70.61 s > running 1 test
  1863. 70.61 s > test finite_part_ghost_2loop ... FAILED
  1864. 70.61 s >
  1865. 70.61 s > failures:
  1866. 70.61 s >
  1867. 70.61 s > failures:
  1868. 70.61 s > finite_part_ghost_2loop
  1869. 70.61 s >
  1870. 70.61 s > test result: FAILED. 0 passed; 1 failed; 0 ignored; 0 measured; 5 filtered out; finished in 0.14s
  1871. 70.61 s > system-err
  1872. 70.61 s > The application panicked (crashed).
  1873. 70.61 s > Message: called `Result::unwrap()` on an `Err` value: "Symbol spenso::mink redefined with new attributes:\n\t- new user data specified: List([String(\"spenso::representation-v2\"), String(\"inline-metric\"), List([String(\"symbol\"), String(\"mink\")]), List([String(\"cyclic\"), Integer(1), List([List([String(\"symbol\"), String(\"mu\")]), List([String(\"symbol\"), String(\"nu\")]), List([String(\"symbol\"), String(\"rho\")]), List([String(\"symbol\"), String(\"sigma\")])])]), String(\"top\")]) vs None\n"
  1874. 70.61 s > Location: crates/vakint/src/lib.rs:4766
  1875. 70.61 s >
  1876. 70.62 s > ━━━━━━━━━━━━━━━━━━━━━━━━━━━━━━━━━━ BACKTRACE ━━━━━━━━━━━━━━━━━━━━━━━━━━━━━━━━━━━
  1877. 70.62 s > 1: <color_eyre[5722b77bc20a64cf]::config::PanicHook>::panic_report<unknown>
  1878. 70.62 s > at <unknown source file>:<unknown line>
  1879. 70.62 s > 2: <color_eyre[5722b77bc20a64cf]::config::PanicHook>::into_panic_hook::{closure#0}<unknown>
  1880. 70.62 s > at <unknown source file>:<unknown line>
  1881. 70.62 s > 3: std[bcb96dfbba0ab899]::panicking::panic_with_hook<unknown>
  1882. 70.62 s > at <unknown source file>:<unknown line>
  1883. 70.62 s > 4: std[bcb96dfbba0ab899]::panicking::panic_handler::{closure#0}<unknown>
  1884. 70.62 s > at <unknown source file>:<unknown line>
  1885. 70.62 s > 5: std[bcb96dfbba0ab899]::sys::backtrace::__rust_end_short_backtrace::<std[bcb96dfbba0ab899]::panicking::panic_handler::{closure#0}, !><unknown>
  1886. 70.62 s > at <unknown source file>:<unknown line>
  1887. 70.62 s > 6: __rustc[6c289b9f9c454d21]::rust_begin_unwind<unknown>
  1888. 70.62 s > at <unknown source file>:<unknown line>
  1889. 70.62 s > 7: core[940e698046960fd5]::panicking::panic_fmt<unknown>
  1890. 70.62 s > at <unknown source file>:<unknown line>
  1891. 70.62 s > 8: core[940e698046960fd5]::result::unwrap_failed<unknown>
  1892. 70.62 s > at <unknown source file>:<unknown line>
  1893. 70.62 s > 9: <vakint[eb7a1daa8ec05e1f]::Vakint>::sanitize_user_expressions<unknown>
  1894. 70.62 s > at <unknown source file>:<unknown line>
  1895. 70.62 s > 10: <vakint[eb7a1daa8ec05e1f]::Vakint>::prepare_expression_for_form<unknown>
  1896. 70.62 s > at <unknown source file>:<unknown line>
  1897. 70.62 s > 11: <vakint[eb7a1daa8ec05e1f]::VakintTerm>::tensor_reduce<unknown>
  1898. 70.62 s > at <unknown source file>:<unknown line>
  1899. 70.62 s > 12: <vakint[eb7a1daa8ec05e1f]::VakintExpression>::tensor_reduce<unknown>
  1900. 70.62 s > at <unknown source file>:<unknown line>
  1901. 70.62 s > 13: <gammalooprs[822fc56666e1de73]::uv::approx::integrated::Integrated>::integrate::<gammalooprs[822fc56666e1de73]::uv::approx::Approximation><unknown>
  1902. 70.62 s > at <unknown source file>:<unknown line>
  1903. 70.62 s > 14: <gammalooprs[822fc56666e1de73]::uv::approx::integrated::Integrated>::run::<gammalooprs[822fc56666e1de73]::uv::approx::Approximation, gammalooprs[822fc56666e1de73]::uv::approx::Approximation><unknown>
  1904. 70.62 s > at <unknown source file>:<unknown line>
  1905. 70.62 s > 15: <gammalooprs[822fc56666e1de73]::uv::forest::Forest>::compute<unknown>
  1906. 70.62 s > at <unknown source file>:<unknown line>
  1907. 70.62 s > 16: gammalooprs[822fc56666e1de73]::uv::orchestrator::legacy_renormalization_part<unknown>
  1908. 70.62 s > at <unknown source file>:<unknown line>
  1909. 70.62 s > 17: <gammalooprs[822fc56666e1de73]::uv::settings::UVOrchestrator>::renormalization_part<unknown>
  1910. 70.62 s > at <unknown source file>:<unknown line>
  1911. 70.62 s > 18: <gammalooprs[822fc56666e1de73]::processes::amplitude::AmplitudeGraph>::renormalization_part<unknown>
  1912. 70.62 s > at <unknown source file>:<unknown line>
  1913. 70.62 s > 19: test_renormalization[9f554b029f822e2d]::finite_part_ghost_2loop<unknown>
  1914. 70.62 s > at <unknown source file>:<unknown line>
  1915. 70.62 s > 20: <test_renormalization[9f554b029f822e2d]::finite_part_ghost_2loop::{closure#0} as core[940e698046960fd5]::ops::function::FnOnce<()>>::call_once<unknown>
  1916. 70.62 s > at <unknown source file>:<unknown line>
  1917. 70.62 s > 21: test[75d6903177b1d7e9]::__rust_begin_short_backtrace::<core[940e698046960fd5]::result::Result<(), alloc[2ea6bcb46fca0c42]::string::String>, fn() -> core[940e698046960fd5]::result::Result<(), alloc[2ea6bcb46fca0c42]::string::String>><unknown>
  1918. 70.62 s > at <unknown source file>:<unknown line>
  1919. 70.62 s > 22: test[75d6903177b1d7e9]::run_test::{closure#0}<unknown>
  1920. 70.62 s > at <unknown source file>:<unknown line>
  1921. 70.62 s > 23: std[bcb96dfbba0ab899]::sys::backtrace::__rust_begin_short_backtrace::<test[75d6903177b1d7e9]::run_test::{closure#1}, ()><unknown>
  1922. 70.62 s > at <unknown source file>:<unknown line>
  1923. 70.62 s > 24: <std[bcb96dfbba0ab899]::thread::lifecycle::spawn_unchecked<test[75d6903177b1d7e9]::run_test::{closure#1}, ()>::{closure#1} as core[940e698046960fd5]::ops::function::FnOnce<()>>::call_once::{shim:vtable#0}<unknown>
  1924. 70.62 s > at <unknown source file>:<unknown line>
  1925. 70.62 s > 25: <std[bcb96dfbba0ab899]::sys::thread::unix::Thread>::new::thread_start<unknown>
  1926. 70.62 s > at <unknown source file>:<unknown line>
  1927. 70.62 s > 26: start_thread<unknown>
  1928. 70.62 s > at <unknown source file>:<unknown line>
  1929. 70.62 s > 27: __clone3<unknown>
  1930. 70.62 s > at <unknown source file>:<unknown line>
  1931. 70.62 s >
  1932. 70.62 s > Run with COLORBT_SHOW_HIDDEN=1 environment variable to disable frame filtering.
  1933. 70.62 s > Run with RUST_BACKTRACE=full to include source snippets.
  1934. 70.62 s >
  1935. 70.62 s > 2. gammalooprs::test_renormalization::finit_part_ghlo
  1936. 70.62 s > failure: test failure with exit code 101
  1937. 70.62 s > system-out
  1938. 70.62 s > running 1 test
  1939. 70.62 s > test finit_part_ghlo ... FAILED
  1940. 70.62 s >
  1941. 70.62 s > failures:
  1942. 70.62 s >
  1943. 70.62 s > failures:
  1944. 70.62 s > finit_part_ghlo
  1945. 70.62 s >
  1946. 70.62 s > test result: FAILED. 0 passed; 1 failed; 0 ignored; 0 measured; 5 filtered out; finished in 0.18s
  1947. 70.62 s > system-err
  1948. 70.62 s > The application panicked (crashed).
  1949. 70.62 s > Message: called `Result::unwrap()` on an `Err` value:
  1950. 70.62 s > 0: Symbolica could not parse FORM output:
  1951. 70.62 s > [spenso::{antisymmetric,real,spenso::tensor}::f]([spenso::{spenso::representat\
  1952. 70.62 s > ion,spenso::self_dual}::coad](8,[gammalooprs::{spenso::index}::hedge](0)
  1953. 70.62 s > ),[spenso::{spenso::representation,spenso::self_dual}::coad](8,[gammaloo\
  1954. 70.62 s > prs::{spenso::index}::hedge](3)),[spenso::{spenso::representation,spenso\
  1955. 70.62 s > ::self_dual}::coad](8,[gammalooprs::{spenso::index}::hedge](5)))*
  1956. 70.62 s > [spenso::{antisymmetric,real,spenso::tensor}::f]([spenso::{spenso::repre\
  1957. 70.62 s > sentation,spenso::self_dual}::coad](8,[gammalooprs::{spenso::index}::hed\
  1958. 70.62 s > ge](1)),[spenso::{spenso::representation,spenso::self_dual}::coad](8,
  1959. 70.62 s > [gammalooprs::{spenso::index}::hedge](3)),[spenso::{spenso::representati\
  1960. 70.62 s > on,spenso::self_dual}::coad](8,[gammalooprs::{spenso::index}::hedge](5))
  1961. 70.62 s > )*dot(p1,p0)*[UFO::{}::GC_10]^2*rat(-1,1)
  1962. 70.62 s >
  1963. 70.62 s > Error:Symbol spenso::coad redefined with new attributes:
  1964. 70.62 s > - new user data specified: List([String("spenso::representation-v2"), String("self-dual"), List([String("symbol"), String("coad")]), List([String("cyclic"), Integer(1), List([List([String("symbol"), String("a")]), List([String("symbol"), String("b")]), List([String("symbol"), String("c")]), List([String("symbol"), String("d")])])]), String("top")]) vs None
  1965. 70.62 s >
  1966. 70.62 s >
  1967. 70.62 s > Location:
  1968. 70.62 s > crates/gammalooprs/src/uv/approx/integrated.rs:332
  1969. 70.62 s >
  1970. 70.62 s > ━━━━━━━━━━━━━━━━━━━━━━━━━━━━━━━━━━ BACKTRACE ━━━━━━━━━━━━━━━━━━━━━━━━━━━━━━━━━━━
  1971. 70.62 s > 1: <color_eyre[5722b77bc20a64cf]::config::EyreHook>::into_eyre_hook::{closure#0}<unknown>
  1972. 70.62 s > at <unknown source file>:<unknown line>
  1973. 70.62 s > 2: eyre[cb2fd339c0c40fca]::capture_handler<unknown>
  1974. 70.62 s > at <unknown source file>:<unknown line>
  1975. 70.62 s > 3: <eyre[cb2fd339c0c40fca]::Report>::from_std::<vakint[eb7a1daa8ec05e1f]::VakintError><unknown>
  1976. 70.62 s > at <unknown source file>:<unknown line>
  1977. 70.62 s > 4: <gammalooprs[822fc56666e1de73]::uv::approx::integrated::Integrated>::integrate::<gammalooprs[822fc56666e1de73]::uv::hedge_poset::ForestNode><unknown>
  1978. 70.62 s > at <unknown source file>:<unknown line>
  1979. 70.62 s > 5: <gammalooprs[822fc56666e1de73]::uv::approx::integrated::Integrated>::run::<gammalooprs[822fc56666e1de73]::uv::hedge_poset::ForestNode, gammalooprs[822fc56666e1de73]::uv::hedge_poset::ForestNode><unknown>
  1980. 70.62 s > at <unknown source file>:<unknown line>
  1981. 70.62 s > 6: <gammalooprs[822fc56666e1de73]::uv::hedge_poset::Forests>::integrate<unknown>
  1982. 70.62 s > at <unknown source file>:<unknown line>
  1983. 70.62 s > 7: gammalooprs[822fc56666e1de73]::uv::orchestrator::hedge_poset_renormalization_part<unknown>
  1984. 70.62 s > at <unknown source file>:<unknown line>
  1985. 70.62 s > 8: <gammalooprs[822fc56666e1de73]::uv::settings::UVOrchestrator>::renormalization_part<unknown>
  1986. 70.62 s > at <unknown source file>:<unknown line>
  1987. 70.62 s > 9: <gammalooprs[822fc56666e1de73]::processes::amplitude::AmplitudeGraph>::renormalization_part<unknown>
  1988. 70.62 s > at <unknown source file>:<unknown line>
  1989. 70.62 s > 10: <test_renormalization[9f554b029f822e2d]::finit_part_ghlo::{closure#0} as core[940e698046960fd5]::ops::function::FnOnce<()>>::call_once<unknown>
  1990. 70.62 s > at <unknown source file>:<unknown line>
  1991. 70.62 s > 11: test[75d6903177b1d7e9]::__rust_begin_short_backtrace::<core[940e698046960fd5]::result::Result<(), alloc[2ea6bcb46fca0c42]::string::String>, fn() -> core[940e698046960fd5]::result::Result<(), alloc[2ea6bcb46fca0c42]::string::String>><unknown>
  1992. 70.62 s > at <unknown source file>:<unknown line>
  1993. 70.62 s > 12: test[75d6903177b1d7e9]::run_test::{closure#0}<unknown>
  1994. 70.62 s > at <unknown source file>:<unknown line>
  1995. 70.62 s > 13: std[bcb96dfbba0ab899]::sys::backtrace::__rust_begin_short_backtrace::<test[75d6903177b1d7e9]::run_test::{closure#1}, ()><unknown>
  1996. 70.62 s > at <unknown source file>:<unknown line>
  1997. 70.62 s > 14: <std[bcb96dfbba0ab899]::thread::lifecycle::spawn_unchecked<test[75d6903177b1d7e9]::run_test::{closure#1}, ()>::{closure#1} as core[940e698046960fd5]::ops::function::FnOnce<()>>::call_once::{shim:vtable#0}<unknown>
  1998. 70.62 s > at <unknown source file>:<unknown line>
  1999. 70.62 s > 15: <std[bcb96dfbba0ab899]::sys::thread::unix::Thread>::new::thread_start<unknown>
  2000. 70.62 s > at <unknown source file>:<unknown line>
  2001. 70.62 s > 16: start_thread<unknown>
  2002. 70.62 s > at <unknown source file>:<unknown line>
  2003. 70.62 s > 17: __clone3<unknown>
  2004. 70.62 s > at <unknown source file>:<unknown line>
  2005. 70.62 s >
  2006. 70.62 s > Run with COLORBT_SHOW_HIDDEN=1 environment variable to disable frame filtering.
  2007. 70.62 s > Run with RUST_BACKTRACE=full to include source snippets.
  2008. 70.62 s > Location: crates/gammalooprs/tests/test_renormalization.rs:550
  2009. 70.62 s >
  2010. 70.62 s > ━━━━━━━━━━━━━━━━━━━━━━━━━━━━━━━━━━ BACKTRACE ━━━━━━━━━━━━━━━━━━━━━━━━━━━━━━━━━━━
  2011. 70.62 s > 1: <color_eyre[5722b77bc20a64cf]::config::PanicHook>::panic_report<unknown>
  2012. 70.62 s > at <unknown source file>:<unknown line>
  2013. 70.62 s > 2: <color_eyre[5722b77bc20a64cf]::config::PanicHook>::into_panic_hook::{closure#0}<unknown>
  2014. 70.62 s > at <unknown source file>:<unknown line>
  2015. 70.62 s > 3: std[bcb96dfbba0ab899]::panicking::panic_with_hook<unknown>
  2016. 70.62 s > at <unknown source file>:<unknown line>
  2017. 70.62 s > 4: std[bcb96dfbba0ab899]::panicking::panic_handler::{closure#0}<unknown>
  2018. 70.62 s > at <unknown source file>:<unknown line>
  2019. 70.62 s > 5: std[bcb96dfbba0ab899]::sys::backtrace::__rust_end_short_backtrace::<std[bcb96dfbba0ab899]::panicking::panic_handler::{closure#0}, !><unknown>
  2020. 70.62 s > at <unknown source file>:<unknown line>
  2021. 70.62 s > 6: __rustc[6c289b9f9c454d21]::rust_begin_unwind<unknown>
  2022. 70.62 s > at <unknown source file>:<unknown line>
  2023. 70.62 s > 7: core[940e698046960fd5]::panicking::panic_fmt<unknown>
  2024. 70.62 s > at <unknown source file>:<unknown line>
  2025. 70.62 s > 8: core[940e698046960fd5]::result::unwrap_failed<unknown>
  2026. 70.62 s > at <unknown source file>:<unknown line>
  2027. 70.62 s > 9: <test_renormalization[9f554b029f822e2d]::finit_part_ghlo::{closure#0} as core[940e698046960fd5]::ops::function::FnOnce<()>>::call_once<unknown>
  2028. 70.62 s > at <unknown source file>:<unknown line>
  2029. 70.62 s > 10: test[75d6903177b1d7e9]::__rust_begin_short_backtrace::<core[940e698046960fd5]::result::Result<(), alloc[2ea6bcb46fca0c42]::string::String>, fn() -> core[940e698046960fd5]::result::Result<(), alloc[2ea6bcb46fca0c42]::string::String>><unknown>
  2030. 70.62 s > at <unknown source file>:<unknown line>
  2031. 70.62 s > 11: test[75d6903177b1d7e9]::run_test::{closure#0}<unknown>
  2032. 70.62 s > at <unknown source file>:<unknown line>
  2033. 70.62 s > 12: std[bcb96dfbba0ab899]::sys::backtrace::__rust_begin_short_backtrace::<test[75d6903177b1d7e9]::run_test::{closure#1}, ()><unknown>
  2034. 70.62 s > at <unknown source file>:<unknown line>
  2035. 70.62 s > 13: <std[bcb96dfbba0ab899]::thread::lifecycle::spawn_unchecked<test[75d6903177b1d7e9]::run_test::{closure#1}, ()>::{closure#1} as core[940e698046960fd5]::ops::function::FnOnce<()>>::call_once::{shim:vtable#0}<unknown>
  2036. 70.62 s > at <unknown source file>:<unknown line>
  2037. 70.62 s > 14: <std[bcb96dfbba0ab899]::sys::thread::unix::Thread>::new::thread_start<unknown>
  2038. 70.62 s > at <unknown source file>:<unknown line>
  2039. 70.62 s > 15: start_thread<unknown>
  2040. 70.62 s > at <unknown source file>:<unknown line>
  2041. 70.62 s > 16: __clone3<unknown>
  2042. 70.62 s > at <unknown source file>:<unknown line>
  2043. 70.62 s >
  2044. 70.62 s > Run with COLORBT_SHOW_HIDDEN=1 environment variable to disable frame filtering.
  2045. 70.62 s > Run with RUST_BACKTRACE=full to include source snippets.
  2046. 70.62 s >
  2047. 70.62 s > 3. gammalooprs::test_renormalization::finite_part_quark_lo
  2048. 70.62 s > failure: test failure with exit code 101
  2049. 70.62 s > system-out
  2050. 70.62 s > running 1 test
  2051. 70.62 s > test finite_part_quark_lo ... FAILED
  2052. 70.62 s >
  2053. 70.62 s > failures:
  2054. 70.62 s >
  2055. 70.62 s > failures:
  2056. 70.62 s > finite_part_quark_lo
  2057. 70.62 s >
  2058. 70.62 s > test result: FAILED. 0 passed; 1 failed; 0 ignored; 0 measured; 5 filtered out; finished in 0.17s
  2059. 70.62 s > system-err
  2060. 70.62 s > The application panicked (crashed).
  2061. 70.62 s > Message: called `Result::unwrap()` on an `Err` value: "Symbol spenso::mink redefined with new attributes:\n\t- new user data specified: List([String(\"spenso::representation-v2\"), String(\"inline-metric\"), List([String(\"symbol\"), String(\"mink\")]), List([String(\"cyclic\"), Integer(1), List([List([String(\"symbol\"), String(\"mu\")]), List([String(\"symbol\"), String(\"nu\")]), List([String(\"symbol\"), String(\"rho\")]), List([String(\"symbol\"), String(\"sigma\")])])]), String(\"top\")]) vs None\n"
  2062. 70.62 s > Location: crates/vakint/src/lib.rs:4766
  2063. 70.62 s >
  2064. 70.62 s > ━━━━━━━━━━━━━━━━━━━━━━━━━━━━━━━━━━ BACKTRACE ━━━━━━━━━━━━━━━━━━━━━━━━━━━━━━━━━━━
  2065. 70.62 s > 1: <color_eyre[5722b77bc20a64cf]::config::PanicHook>::panic_report<unknown>
  2066. 70.62 s > at <unknown source file>:<unknown line>
  2067. 70.62 s > 2: <color_eyre[5722b77bc20a64cf]::config::PanicHook>::into_panic_hook::{closure#0}<unknown>
  2068. 70.62 s > at <unknown source file>:<unknown line>
  2069. 70.62 s > 3: std[bcb96dfbba0ab899]::panicking::panic_with_hook<unknown>
  2070. 70.62 s > at <unknown source file>:<unknown line>
  2071. 70.62 s > 4: std[bcb96dfbba0ab899]::panicking::panic_handler::{closure#0}<unknown>
  2072. 70.62 s > at <unknown source file>:<unknown line>
  2073. 70.62 s > 5: std[bcb96dfbba0ab899]::sys::backtrace::__rust_end_short_backtrace::<std[bcb96dfbba0ab899]::panicking::panic_handler::{closure#0}, !><unknown>
  2074. 70.62 s > at <unknown source file>:<unknown line>
  2075. 70.62 s > 6: __rustc[6c289b9f9c454d21]::rust_begin_unwind<unknown>
  2076. 70.62 s > at <unknown source file>:<unknown line>
  2077. 70.62 s > 7: core[940e698046960fd5]::panicking::panic_fmt<unknown>
  2078. 70.62 s > at <unknown source file>:<unknown line>
  2079. 70.62 s > 8: core[940e698046960fd5]::result::unwrap_failed<unknown>
  2080. 70.62 s > at <unknown source file>:<unknown line>
  2081. 70.62 s > 9: <vakint[eb7a1daa8ec05e1f]::Vakint>::sanitize_user_expressions<unknown>
  2082. 70.62 s > at <unknown source file>:<unknown line>
  2083. 70.62 s > 10: <vakint[eb7a1daa8ec05e1f]::Vakint>::prepare_expression_for_form<unknown>
  2084. 70.62 s > at <unknown source file>:<unknown line>
  2085. 70.62 s > 11: <vakint[eb7a1daa8ec05e1f]::VakintTerm>::tensor_reduce<unknown>
  2086. 70.62 s > at <unknown source file>:<unknown line>
  2087. 70.62 s > 12: <vakint[eb7a1daa8ec05e1f]::VakintExpression>::tensor_reduce<unknown>
  2088. 70.62 s > at <unknown source file>:<unknown line>
  2089. 70.62 s > 13: <gammalooprs[822fc56666e1de73]::uv::approx::integrated::Integrated>::integrate::<gammalooprs[822fc56666e1de73]::uv::hedge_poset::ForestNode><unknown>
  2090. 70.62 s > at <unknown source file>:<unknown line>
  2091. 70.62 s > 14: <gammalooprs[822fc56666e1de73]::uv::approx::integrated::Integrated>::run::<gammalooprs[822fc56666e1de73]::uv::hedge_poset::ForestNode, gammalooprs[822fc56666e1de73]::uv::hedge_poset::ForestNode><unknown>
  2092. 70.62 s > at <unknown source file>:<unknown line>
  2093. 70.62 s > 15: <gammalooprs[822fc56666e1de73]::uv::hedge_poset::Forests>::integrate<unknown>
  2094. 70.62 s > at <unknown source file>:<unknown line>
  2095. 70.62 s > 16: gammalooprs[822fc56666e1de73]::uv::orchestrator::hedge_poset_renormalization_part<unknown>
  2096. 70.62 s > at <unknown source file>:<unknown line>
  2097. 70.62 s > 17: <gammalooprs[822fc56666e1de73]::uv::settings::UVOrchestrator>::renormalization_part<unknown>
  2098. 70.62 s > at <unknown source file>:<unknown line>
  2099. 70.62 s > 18: <gammalooprs[822fc56666e1de73]::processes::amplitude::AmplitudeGraph>::renormalization_part<unknown>
  2100. 70.62 s > at <unknown source file>:<unknown line>
  2101. 70.62 s > 19: <test_renormalization[9f554b029f822e2d]::finite_part_quark_lo::{closure#0} as core[940e698046960fd5]::ops::function::FnOnce<()>>::call_once<unknown>
  2102. 70.62 s > at <unknown source file>:<unknown line>
  2103. 70.62 s > 20: test[75d6903177b1d7e9]::__rust_begin_short_backtrace::<core[940e698046960fd5]::result::Result<(), alloc[2ea6bcb46fca0c42]::string::String>, fn() -> core[940e698046960fd5]::result::Result<(), alloc[2ea6bcb46fca0c42]::string::String>><unknown>
  2104. 70.62 s > at <unknown source file>:<unknown line>
  2105. 70.62 s > 21: test[75d6903177b1d7e9]::run_test::{closure#0}<unknown>
  2106. 70.62 s > at <unknown source file>:<unknown line>
  2107. 70.62 s > 22: std[bcb96dfbba0ab899]::sys::backtrace::__rust_begin_short_backtrace::<test[75d6903177b1d7e9]::run_test::{closure#1}, ()><unknown>
  2108. 70.62 s > at <unknown source file>:<unknown line>
  2109. 70.62 s > 23: <std[bcb96dfbba0ab899]::thread::lifecycle::spawn_unchecked<test[75d6903177b1d7e9]::run_test::{closure#1}, ()>::{closure#1} as core[940e698046960fd5]::ops::function::FnOnce<()>>::call_once::{shim:vtable#0}<unknown>
  2110. 70.62 s > at <unknown source file>:<unknown line>
  2111. 70.62 s > 24: <std[bcb96dfbba0ab899]::sys::thread::unix::Thread>::new::thread_start<unknown>
  2112. 70.62 s > at <unknown source file>:<unknown line>
  2113. 70.62 s > 25: start_thread<unknown>
  2114. 70.62 s > at <unknown source file>:<unknown line>
  2115. 70.62 s > 26: __clone3<unknown>
  2116. 70.62 s > at <unknown source file>:<unknown line>
  2117. 70.62 s >
  2118. 70.62 s > Run with COLORBT_SHOW_HIDDEN=1 environment variable to disable frame filtering.
  2119. 70.62 s > Run with RUST_BACKTRACE=full to include source snippets.
  2120. 70.62 s > =========================================
  2121. 70.62 s For full logs, run:
  2122. 70.62 s nix log /nix/store/zinbrvppkmzalr7ws9scxa6mjscpn55x-gammaloop-nextest-core.drv
  2123. 70.71 s Run failed.