0.01 s
$ /nix/store/9ypz3flqsrl5xl495mm8h645gadjsxi1-coreutils-9.11/bin/timeout --kill-after=15s 7200s /nix/store/23zk8sgzamrbmj1fday15szf7f2279s8-nix-2.34.7/bin/nix --extra-experimental-features nix-command --extra-experimental-features flakes flake clone git+https://github.com/alphal00p/gammaloop --dest /tmp/nix-ci-worker/stable-pwd/repo/
0.09 s
Cloning into '/tmp/nix-ci-worker/stable-pwd/repo'...
1.61 s
remote: Enumerating objects: 83696, done.
1.84 s
remote: Counting objects: 0% (1/9893)
remote: Counting objects: 1% (99/9893)
remote: Counting objects: 2% (198/9893)
remote: Counting objects: 3% (297/9893)
remote: Counting objects: 4% (396/9893)
remote: Counting objects: 5% (495/9893)
remote: Counting objects: 6% (594/9893)
remote: Counting objects: 7% (693/9893)
remote: Counting objects: 8% (792/9893)
remote: Counting objects: 9% (891/9893)
remote: Counting objects: 10% (990/9893)
remote: Counting objects: 11% (1089/9893)
remote: Counting objects: 12% (1188/9893)
remote: Counting objects: 13% (1287/9893)
remote: Counting objects: 14% (1386/9893)
remote: Counting objects: 15% (1484/9893)
remote: Counting objects: 16% (1583/9893)
remote: Counting objects: 17% (1682/9893)
remote: Counting objects: 18% (1781/9893)
remote: Counting objects: 19% (1880/9893)
remote: Counting objects: 20% (1979/9893)
remote: Counting objects: 21% (2078/9893)
remote: Counting objects: 22% (2177/9893)
remote: Counting objects: 23% (2276/9893)
remote: Counting objects: 24% (2375/9893)
remote: Counting objects: 25% (2474/9893)
remote: Counting objects: 26% (2573/9893)
remote: Counting objects: 27% (2672/9893)
remote: Counting objects: 28% (2771/9893)
remote: Counting objects: 29% (2869/9893)
remote: Counting objects: 30% (2968/9893)
remote: Counting objects: 31% (3067/9893)
remote: Counting objects: 32% (3166/9893)
remote: Counting objects: 33% (3265/9893)
remote: Counting objects: 34% (3364/9893)
remote: Counting objects: 35% (3463/9893)
remote: Counting objects: 36% (3562/9893)
remote: Counting objects: 37% (3661/9893)
remote: Counting objects: 38% (3760/9893)
remote: Counting objects: 39% (3859/9893)
remote: Counting objects: 40% (3958/9893)
remote: Counting objects: 41% (4057/9893)
remote: Counting objects: 42% (4156/9893)
remote: Counting objects: 43% (4254/9893)
remote: Counting objects: 44% (4353/9893)
remote: Counting objects: 45% (4452/9893)
remote: Counting objects: 46% (4551/9893)
remote: Counting objects: 47% (4650/9893)
remote: Counting objects: 48% (4749/9893)
remote: Counting objects: 49% (4848/9893)
remote: Counting objects: 50% (4947/9893)
remote: Counting objects: 51% (5046/9893)
remote: Counting objects: 52% (5145/9893)
remote: Counting objects: 53% (5244/9893)
remote: Counting objects: 54% (5343/9893)
remote: Counting objects: 55% (5442/9893)
remote: Counting objects: 56% (5541/9893)
remote: Counting objects: 57% (5640/9893)
remote: Counting objects: 58% (5738/9893)
remote: Counting objects: 59% (5837/9893)
remote: Counting objects: 60% (5936/9893)
remote: Counting objects: 61% (6035/9893)
remote: Counting objects: 62% (6134/9893)
remote: Counting objects: 63% (6233/9893)
remote: Counting objects: 64% (6332/9893)
remote: Counting objects: 65% (6431/9893)
remote: Counting objects: 66% (6530/9893)
remote: Counting objects: 67% (6629/9893)
remote: Counting objects: 68% (6728/9893)
remote: Counting objects: 69% (6827/9893)
remote: Counting objects: 70% (6926/9893)
remote: Counting objects: 71% (7025/9893)
remote: Counting objects: 72% (7123/9893)
remote: Counting objects: 73% (7222/9893)
remote: Counting objects: 74% (7321/9893)
remote: Counting objects: 75% (7420/9893)
remote: Counting objects: 76% (7519/9893)
remote: Counting objects: 77% (7618/9893)
remote: Counting objects: 78% (7717/9893)
remote: Counting objects: 79% (7816/9893)
remote: Counting objects: 80% (7915/9893)
remote: Counting objects: 81% (8014/9893)
remote: Counting objects: 82% (8113/9893)
remote: Counting objects: 83% (8212/9893)
remote: Counting objects: 84% (8311/9893)
remote: Counting objects: 85% (8410/9893)
remote: Counting objects: 86% (8508/9893)
remote: Counting objects: 87% (8607/9893)
remote: Counting objects: 88% (8706/9893)
remote: Counting objects: 89% (8805/9893)
remote: Counting objects: 90% (8904/9893)
remote: Counting objects: 91% (9003/9893)
remote: Counting objects: 92% (9102/9893)
remote: Counting objects: 93% (9201/9893)
remote: Counting objects: 94% (9300/9893)
remote: Counting objects: 95% (9399/9893)
remote: Counting objects: 96% (9498/9893)
remote: Counting objects: 97% (9597/9893)
remote: Counting objects: 98% (9696/9893)
remote: Counting objects: 99% (9795/9893)
remote: Counting objects: 100% (9893/9893)
remote: Counting objects: 100% (9893/9893), done.
4.38 s
remote: Compressing objects: 0% (1/2138)
remote: Compressing objects: 1% (22/2138)
remote: Compressing objects: 2% (43/2138)
remote: Compressing objects: 3% (65/2138)
remote: Compressing objects: 4% (86/2138)
remote: Compressing objects: 5% (107/2138)
remote: Compressing objects: 6% (129/2138)
remote: Compressing objects: 7% (150/2138)
remote: Compressing objects: 8% (172/2138)
remote: Compressing objects: 9% (193/2138)
remote: Compressing objects: 10% (214/2138)
remote: Compressing objects: 11% (236/2138)
remote: Compressing objects: 12% (257/2138)
remote: Compressing objects: 13% (278/2138)
remote: Compressing objects: 14% (300/2138)
remote: Compressing objects: 15% (321/2138)
remote: Compressing objects: 15% (334/2138)
remote: Compressing objects: 16% (343/2138)
remote: Compressing objects: 17% (364/2138)
remote: Compressing objects: 18% (385/2138)
remote: Compressing objects: 19% (407/2138)
remote: Compressing objects: 20% (428/2138)
remote: Compressing objects: 21% (449/2138)
remote: Compressing objects: 21% (466/2138)
remote: Compressing objects: 22% (471/2138)
remote: Compressing objects: 23% (492/2138)
remote: Compressing objects: 24% (514/2138)
remote: Compressing objects: 25% (535/2138)
remote: Compressing objects: 26% (556/2138)
remote: Compressing objects: 27% (578/2138)
remote: Compressing objects: 28% (599/2138)
remote: Compressing objects: 29% (621/2138)
remote: Compressing objects: 30% (642/2138)
remote: Compressing objects: 31% (663/2138)
remote: Compressing objects: 32% (685/2138)
remote: Compressing objects: 33% (706/2138)
remote: Compressing objects: 34% (727/2138)
remote: Compressing objects: 35% (749/2138)
remote: Compressing objects: 36% (770/2138)
remote: Compressing objects: 37% (792/2138)
remote: Compressing objects: 38% (813/2138)
remote: Compressing objects: 39% (834/2138)
remote: Compressing objects: 40% (856/2138)
remote: Compressing objects: 41% (877/2138)
remote: Compressing objects: 42% (898/2138)
remote: Compressing objects: 43% (920/2138)
remote: Compressing objects: 44% (941/2138)
remote: Compressing objects: 45% (963/2138)
remote: Compressing objects: 46% (984/2138)
remote: Compressing objects: 47% (1005/2138)
remote: Compressing objects: 48% (1027/2138)
remote: Compressing objects: 49% (1048/2138)
remote: Compressing objects: 50% (1069/2138)
remote: Compressing objects: 51% (1091/2138)
remote: Compressing objects: 52% (1112/2138)
remote: Compressing objects: 53% (1134/2138)
remote: Compressing objects: 54% (1155/2138)
remote: Compressing objects: 55% (1176/2138)
remote: Compressing objects: 56% (1198/2138)
remote: Compressing objects: 57% (1219/2138)
remote: Compressing objects: 58% (1241/2138)
remote: Compressing objects: 59% (1262/2138)
remote: Compressing objects: 60% (1283/2138)
remote: Compressing objects: 61% (1305/2138)
remote: Compressing objects: 62% (1326/2138)
remote: Compressing objects: 63% (1347/2138)
remote: Compressing objects: 64% (1369/2138)
remote: Compressing objects: 65% (1390/2138)
remote: Compressing objects: 66% (1412/2138)
remote: Compressing objects: 67% (1433/2138)
remote: Compressing objects: 68% (1454/2138)
remote: Compressing objects: 69% (1476/2138)
remote: Compressing objects: 70% (1497/2138)
remote: Compressing objects: 71% (1518/2138)
remote: Compressing objects: 72% (1540/2138)
remote: Compressing objects: 73% (1561/2138)
remote: Compressing objects: 74% (1583/2138)
remote: Compressing objects: 75% (1604/2138)
remote: Compressing objects: 76% (1625/2138)
remote: Compressing objects: 77% (1647/2138)
remote: Compressing objects: 78% (1668/2138)
remote: Compressing objects: 79% (1690/2138)
remote: Compressing objects: 80% (1711/2138)
remote: Compressing objects: 81% (1732/2138)
remote: Compressing objects: 82% (1754/2138)
remote: Compressing objects: 83% (1775/2138)
remote: Compressing objects: 84% (1796/2138)
remote: Compressing objects: 85% (1818/2138)
remote: Compressing objects: 86% (1839/2138)
remote: Compressing objects: 87% (1861/2138)
remote: Compressing objects: 88% (1882/2138)
remote: Compressing objects: 89% (1903/2138)
remote: Compressing objects: 90% (1925/2138)
remote: Compressing objects: 91% (1946/2138)
remote: Compressing objects: 92% (1967/2138)
remote: Compressing objects: 93% (1989/2138)
remote: Compressing objects: 94% (2010/2138)
remote: Compressing objects: 95% (2032/2138)
remote: Compressing objects: 96% (2053/2138)
remote: Compressing objects: 97% (2074/2138)
remote: Compressing objects: 98% (2096/2138)
remote: Compressing objects: 99% (2117/2138)
remote: Compressing objects: 100% (2138/2138)
remote: Compressing objects: 100% (2138/2138), done.
8.67 s
Receiving objects: 0% (1/83696)
Receiving objects: 1% (837/83696)
Receiving objects: 2% (1674/83696)
Receiving objects: 3% (2511/83696)
Receiving objects: 4% (3348/83696)
Receiving objects: 5% (4185/83696)
Receiving objects: 6% (5022/83696)
Receiving objects: 7% (5859/83696)
Receiving objects: 8% (6696/83696)
Receiving objects: 9% (7533/83696), 11.05 MiB | 22.08 MiB/s
Receiving objects: 10% (8370/83696), 11.05 MiB | 22.08 MiB/s
Receiving objects: 11% (9207/83696), 11.05 MiB | 22.08 MiB/s
Receiving objects: 12% (10044/83696), 11.05 MiB | 22.08 MiB/s
Receiving objects: 13% (10881/83696), 11.05 MiB | 22.08 MiB/s
Receiving objects: 14% (11718/83696), 11.05 MiB | 22.08 MiB/s
Receiving objects: 15% (12555/83696), 11.05 MiB | 22.08 MiB/s
Receiving objects: 16% (13392/83696), 11.05 MiB | 22.08 MiB/s
Receiving objects: 17% (14229/83696), 11.05 MiB | 22.08 MiB/s
Receiving objects: 18% (15066/83696), 11.05 MiB | 22.08 MiB/s
Receiving objects: 19% (15903/83696), 11.05 MiB | 22.08 MiB/s
Receiving objects: 20% (16740/83696), 11.05 MiB | 22.08 MiB/s
Receiving objects: 21% (17577/83696), 11.05 MiB | 22.08 MiB/s
Receiving objects: 22% (18414/83696), 11.05 MiB | 22.08 MiB/s
Receiving objects: 23% (19251/83696), 11.05 MiB | 22.08 MiB/s
Receiving objects: 24% (20088/83696), 11.05 MiB | 22.08 MiB/s
Receiving objects: 25% (20924/83696), 11.05 MiB | 22.08 MiB/s
Receiving objects: 26% (21761/83696), 11.05 MiB | 22.08 MiB/s
Receiving objects: 27% (22598/83696), 11.05 MiB | 22.08 MiB/s
Receiving objects: 28% (23435/83696), 11.05 MiB | 22.08 MiB/s
Receiving objects: 29% (24272/83696), 11.05 MiB | 22.08 MiB/s
Receiving objects: 30% (25109/83696), 11.05 MiB | 22.08 MiB/s
Receiving objects: 31% (25946/83696), 11.05 MiB | 22.08 MiB/s
Receiving objects: 32% (26783/83696), 11.05 MiB | 22.08 MiB/s
Receiving objects: 33% (27620/83696), 11.05 MiB | 22.08 MiB/s
Receiving objects: 34% (28457/83696), 11.05 MiB | 22.08 MiB/s
Receiving objects: 35% (29294/83696), 11.05 MiB | 22.08 MiB/s
Receiving objects: 36% (30131/83696), 11.05 MiB | 22.08 MiB/s
Receiving objects: 37% (30968/83696), 11.05 MiB | 22.08 MiB/s
Receiving objects: 37% (31798/83696), 11.05 MiB | 22.08 MiB/s
Receiving objects: 38% (31805/83696), 11.05 MiB | 22.08 MiB/s
Receiving objects: 39% (32642/83696), 29.61 MiB | 29.60 MiB/s
Receiving objects: 40% (33479/83696), 29.61 MiB | 29.60 MiB/s
Receiving objects: 41% (34316/83696), 29.61 MiB | 29.60 MiB/s
Receiving objects: 42% (35153/83696), 29.61 MiB | 29.60 MiB/s
Receiving objects: 43% (35990/83696), 29.61 MiB | 29.60 MiB/s
Receiving objects: 44% (36827/83696), 29.61 MiB | 29.60 MiB/s
Receiving objects: 45% (37664/83696), 29.61 MiB | 29.60 MiB/s
Receiving objects: 46% (38501/83696), 29.61 MiB | 29.60 MiB/s
Receiving objects: 47% (39338/83696), 29.61 MiB | 29.60 MiB/s
Receiving objects: 48% (40175/83696), 46.31 MiB | 30.77 MiB/s
Receiving objects: 49% (41012/83696), 46.31 MiB | 30.77 MiB/s
Receiving objects: 50% (41848/83696), 46.31 MiB | 30.77 MiB/s
Receiving objects: 51% (42685/83696), 46.31 MiB | 30.77 MiB/s
Receiving objects: 52% (43522/83696), 46.31 MiB | 30.77 MiB/s
Receiving objects: 53% (44359/83696), 46.31 MiB | 30.77 MiB/s
Receiving objects: 54% (45196/83696), 46.31 MiB | 30.77 MiB/s
Receiving objects: 55% (46033/83696), 46.31 MiB | 30.77 MiB/s
Receiving objects: 56% (46870/83696), 46.31 MiB | 30.77 MiB/s
Receiving objects: 57% (47707/83696), 46.31 MiB | 30.77 MiB/s
Receiving objects: 58% (48544/83696), 46.31 MiB | 30.77 MiB/s
Receiving objects: 58% (48725/83696), 63.18 MiB | 31.51 MiB/s
Receiving objects: 59% (49381/83696), 63.18 MiB | 31.51 MiB/s
Receiving objects: 60% (50218/83696), 63.18 MiB | 31.51 MiB/s
Receiving objects: 61% (51055/83696), 63.18 MiB | 31.51 MiB/s
Receiving objects: 62% (51892/83696), 63.18 MiB | 31.51 MiB/s
Receiving objects: 63% (52729/83696), 63.18 MiB | 31.51 MiB/s
Receiving objects: 64% (53566/83696), 63.18 MiB | 31.51 MiB/s
Receiving objects: 65% (54403/83696), 79.60 MiB | 31.74 MiB/s
Receiving objects: 66% (55240/83696), 79.60 MiB | 31.74 MiB/s
Receiving objects: 67% (56077/83696), 79.60 MiB | 31.74 MiB/s
Receiving objects: 68% (56914/83696), 79.60 MiB | 31.74 MiB/s
Receiving objects: 69% (57751/83696), 79.60 MiB | 31.74 MiB/s
Receiving objects: 70% (58588/83696), 79.60 MiB | 31.74 MiB/s
Receiving objects: 71% (59425/83696), 79.60 MiB | 31.74 MiB/s
Receiving objects: 72% (60262/83696), 79.60 MiB | 31.74 MiB/s
Receiving objects: 73% (61099/83696), 79.60 MiB | 31.74 MiB/s
Receiving objects: 74% (61936/83696), 79.60 MiB | 31.74 MiB/s
Receiving objects: 74% (62533/83696), 79.60 MiB | 31.74 MiB/s
Receiving objects: 75% (62772/83696), 79.60 MiB | 31.74 MiB/s
Receiving objects: 76% (63609/83696), 96.62 MiB | 32.12 MiB/s
Receiving objects: 77% (64446/83696), 96.62 MiB | 32.12 MiB/s
Receiving objects: 78% (65283/83696), 96.62 MiB | 32.12 MiB/s
Receiving objects: 79% (66120/83696), 96.62 MiB | 32.12 MiB/s
Receiving objects: 80% (66957/83696), 96.62 MiB | 32.12 MiB/s
Receiving objects: 81% (67794/83696), 113.37 MiB | 32.32 MiB/s
Receiving objects: 82% (68631/83696), 113.37 MiB | 32.32 MiB/s
Receiving objects: 83% (69468/83696), 113.37 MiB | 32.32 MiB/s
Receiving objects: 84% (70305/83696), 113.37 MiB | 32.32 MiB/s
Receiving objects: 85% (71142/83696), 113.37 MiB | 32.32 MiB/s
Receiving objects: 86% (71979/83696), 113.37 MiB | 32.32 MiB/s
Receiving objects: 87% (72816/83696), 113.37 MiB | 32.32 MiB/s
Receiving objects: 88% (73653/83696), 113.37 MiB | 32.32 MiB/s
Receiving objects: 89% (74490/83696), 113.37 MiB | 32.32 MiB/s
Receiving objects: 90% (75327/83696), 113.37 MiB | 32.32 MiB/s
Receiving objects: 91% (76164/83696), 113.37 MiB | 32.32 MiB/s
Receiving objects: 92% (77001/83696), 113.37 MiB | 32.32 MiB/s
Receiving objects: 93% (77838/83696), 113.37 MiB | 32.32 MiB/s
Receiving objects: 94% (78675/83696), 113.37 MiB | 32.32 MiB/s
Receiving objects: 95% (79512/83696), 113.37 MiB | 32.32 MiB/s
Receiving objects: 96% (80349/83696), 113.37 MiB | 32.32 MiB/s
Receiving objects: 97% (81186/83696), 113.37 MiB | 32.32 MiB/s
Receiving objects: 98% (82023/83696), 113.37 MiB | 32.32 MiB/s
Receiving objects: 98% (82592/83696), 113.37 MiB | 32.32 MiB/s
Receiving objects: 99% (82860/83696), 130.29 MiB | 32.44 MiB/s
remote: Total 83696 (delta 7944), reused 8038 (delta 7222), pack-reused 73803 (from 3)
8.67 s
Receiving objects: 100% (83696/83696), 130.29 MiB | 32.44 MiB/s
Receiving objects: 100% (83696/83696), 139.23 MiB | 32.52 MiB/s, done.
9.65 s
Resolving deltas: 0% (0/56218)
Resolving deltas: 1% (563/56218)
Resolving deltas: 2% (1125/56218)
Resolving deltas: 3% (1687/56218)
Resolving deltas: 4% (2251/56218)
Resolving deltas: 5% (2811/56218)
Resolving deltas: 6% (3374/56218)
Resolving deltas: 7% (3936/56218)
Resolving deltas: 8% (4498/56218)
Resolving deltas: 9% (5061/56218)
Resolving deltas: 10% (5622/56218)
Resolving deltas: 11% (6184/56218)
Resolving deltas: 12% (6747/56218)
Resolving deltas: 13% (7309/56218)
Resolving deltas: 14% (7871/56218)
Resolving deltas: 15% (8433/56218)
Resolving deltas: 16% (8995/56218)
Resolving deltas: 17% (9558/56218)
Resolving deltas: 18% (10120/56218)
Resolving deltas: 19% (10682/56218)
Resolving deltas: 20% (11244/56218)
Resolving deltas: 21% (11808/56218)
Resolving deltas: 22% (12369/56218)
Resolving deltas: 23% (12932/56218)
Resolving deltas: 24% (13493/56218)
Resolving deltas: 25% (14055/56218)
Resolving deltas: 26% (14618/56218)
Resolving deltas: 27% (15179/56218)
Resolving deltas: 28% (15742/56218)
Resolving deltas: 29% (16304/56218)
Resolving deltas: 30% (16866/56218)
Resolving deltas: 31% (17429/56218)
Resolving deltas: 32% (17990/56218)
Resolving deltas: 33% (18555/56218)
Resolving deltas: 34% (19116/56218)
Resolving deltas: 35% (19677/56218)
Resolving deltas: 36% (20239/56218)
Resolving deltas: 37% (20801/56218)
Resolving deltas: 38% (21363/56218)
Resolving deltas: 39% (21926/56218)
Resolving deltas: 40% (22489/56218)
Resolving deltas: 41% (23050/56218)
Resolving deltas: 42% (23612/56218)
Resolving deltas: 43% (24174/56218)
Resolving deltas: 44% (24736/56218)
Resolving deltas: 45% (25299/56218)
Resolving deltas: 46% (25861/56218)
Resolving deltas: 47% (26423/56218)
Resolving deltas: 48% (26985/56218)
Resolving deltas: 49% (27547/56218)
Resolving deltas: 50% (28110/56218)
Resolving deltas: 51% (28673/56218)
Resolving deltas: 52% (29237/56218)
Resolving deltas: 53% (29796/56218)
Resolving deltas: 54% (30358/56218)
Resolving deltas: 55% (30920/56218)
Resolving deltas: 56% (31483/56218)
Resolving deltas: 57% (32045/56218)
Resolving deltas: 58% (32608/56218)
Resolving deltas: 59% (33170/56218)
Resolving deltas: 60% (33732/56218)
Resolving deltas: 61% (34295/56218)
Resolving deltas: 62% (34856/56218)
Resolving deltas: 63% (35418/56218)
Resolving deltas: 64% (35980/56218)
Resolving deltas: 65% (36542/56218)
Resolving deltas: 66% (37104/56218)
Resolving deltas: 67% (37668/56218)
Resolving deltas: 68% (38229/56218)
Resolving deltas: 69% (38791/56218)
Resolving deltas: 70% (39353/56218)
Resolving deltas: 71% (39915/56218)
Resolving deltas: 72% (40477/56218)
Resolving deltas: 73% (41040/56218)
Resolving deltas: 74% (41602/56218)
Resolving deltas: 75% (42164/56218)
Resolving deltas: 76% (42726/56218)
Resolving deltas: 77% (43289/56218)
Resolving deltas: 78% (43851/56218)
Resolving deltas: 79% (44413/56218)
Resolving deltas: 80% (44975/56218)
Resolving deltas: 81% (45537/56218)
Resolving deltas: 82% (46099/56218)
Resolving deltas: 83% (46662/56218)
Resolving deltas: 84% (47226/56218)
Resolving deltas: 85% (47786/56218)
Resolving deltas: 86% (48348/56218)
Resolving deltas: 87% (48910/56218)
Resolving deltas: 88% (49472/56218)
Resolving deltas: 89% (50035/56218)
Resolving deltas: 90% (50597/56218)
Resolving deltas: 91% (51159/56218)
Resolving deltas: 92% (51721/56218)
Resolving deltas: 93% (52283/56218)
Resolving deltas: 94% (52845/56218)
Resolving deltas: 95% (53408/56218)
Resolving deltas: 96% (53970/56218)
Resolving deltas: 97% (54532/56218)
Resolving deltas: 98% (55094/56218)
Resolving deltas: 99% (55656/56218)
Resolving deltas: 100% (56218/56218)
Resolving deltas: 100% (56218/56218), done.
9.97 s
Fetching commit 5aadd389efabb7b039af74edad02a90d486a1c07 for simplify-spenso-api ...
9.97 s
$ /nix/store/bcnisk3ydfgv26v2gw3zlky24g00yww2-git-2.54.0/bin/git fetch origin 5aadd389efabb7b039af74edad02a90d486a1c07
10.51 s
From https://github.com/alphal00p/gammaloop
10.51 s
* branch 5aadd389efabb7b039af74edad02a90d486a1c07 -> FETCH_HEAD
10.52 s
$ /nix/store/9ypz3flqsrl5xl495mm8h645gadjsxi1-coreutils-9.11/bin/timeout --kill-after=15s 7200s /nix/store/bcnisk3ydfgv26v2gw3zlky24g00yww2-git-2.54.0/bin/git -c advice.detachedHead=false checkout 5aadd389efabb7b039af74edad02a90d486a1c07
10.72 s
HEAD is now at 5aadd389e restore public gamma arguments to storage order
10.72 s
$ /nix/store/9ypz3flqsrl5xl495mm8h645gadjsxi1-coreutils-9.11/bin/timeout --kill-after=15s 7200s /nix/store/23zk8sgzamrbmj1fday15szf7f2279s8-nix-2.34.7/bin/nix --extra-experimental-features nix-command --extra-experimental-features flakes --log-format internal-json run .#packages.x86_64-linux.nix-ci-check-gammaloop-nextest-core --print-build-logs
11.16 s
12.17 s
Downloading cached source from https://cache.nix-ci.com
19.49 s
Downloaded cached source (199.4 MiB) in 7.3s
19.49 s
Progress: 1 of 1 downloaded from cache
26.71 s
fetching Git repository 'https://github.com/symbolica-dev/symbolica'
27.42 s
remote: Enumerating objects: 17195, done.
27.47 s
remote: Counting objects: 0% (1/646)
remote: Counting objects: 1% (7/646)
remote: Counting objects: 2% (13/646)
remote: Counting objects: 3% (20/646)
remote: Counting objects: 4% (26/646)
remote: Counting objects: 5% (33/646)
remote: Counting objects: 6% (39/646)
remote: Counting objects: 7% (46/646)
remote: Counting objects: 8% (52/646)
remote: Counting objects: 9% (59/646)
remote: Counting objects: 10% (65/646)
remote: Counting objects: 11% (72/646)
remote: Counting objects: 12% (78/646)
remote: Counting objects: 13% (84/646)
remote: Counting objects: 14% (91/646)
remote: Counting objects: 15% (97/646)
remote: Counting objects: 16% (104/646)
remote: Counting objects: 17% (110/646)
remote: Counting objects: 18% (117/646)
remote: Counting objects: 19% (123/646)
remote: Counting objects: 20% (130/646)
remote: Counting objects: 21% (136/646)
remote: Counting objects: 22% (143/646)
remote: Counting objects: 23% (149/646)
remote: Counting objects: 24% (156/646)
remote: Counting objects: 25% (162/646)
remote: Counting objects: 26% (168/646)
remote: Counting objects: 27% (175/646)
remote: Counting objects: 28% (181/646)
remote: Counting objects: 29% (188/646)
remote: Counting objects: 30% (194/646)
remote: Counting objects: 31% (201/646)
remote: Counting objects: 32% (207/646)
remote: Counting objects: 33% (214/646)
remote: Counting objects: 34% (220/646)
remote: Counting objects: 35% (227/646)
remote: Counting objects: 36% (233/646)
remote: Counting objects: 37% (240/646)
remote: Counting objects: 38% (246/646)
remote: Counting objects: 39% (252/646)
remote: Counting objects: 40% (259/646)
remote: Counting objects: 41% (265/646)
remote: Counting objects: 42% (272/646)
remote: Counting objects: 43% (278/646)
remote: Counting objects: 44% (285/646)
remote: Counting objects: 45% (291/646)
remote: Counting objects: 46% (298/646)
remote: Counting objects: 47% (304/646)
remote: Counting objects: 48% (311/646)
remote: Counting objects: 49% (317/646)
remote: Counting objects: 50% (323/646)
remote: Counting objects: 51% (330/646)
remote: Counting objects: 52% (336/646)
remote: Counting objects: 53% (343/646)
remote: Counting objects: 54% (349/646)
remote: Counting objects: 55% (356/646)
remote: Counting objects: 56% (362/646)
remote: Counting objects: 57% (369/646)
remote: Counting objects: 58% (375/646)
remote: Counting objects: 59% (382/646)
remote: Counting objects: 60% (388/646)
remote: Counting objects: 61% (395/646)
remote: Counting objects: 62% (401/646)
remote: Counting objects: 63% (407/646)
remote: Counting objects: 64% (414/646)
remote: Counting objects: 65% (420/646)
remote: Counting objects: 66% (427/646)
remote: Counting objects: 67% (433/646)
remote: Counting objects: 68% (440/646)
remote: Counting objects: 69% (446/646)
remote: Counting objects: 70% (453/646)
remote: Counting objects: 71% (459/646)
remote: Counting objects: 72% (466/646)
remote: Counting objects: 73% (472/646)
remote: Counting objects: 74% (479/646)
remote: Counting objects: 75% (485/646)
remote: Counting objects: 76% (491/646)
remote: Counting objects: 77% (498/646)
remote: Counting objects: 78% (504/646)
remote: Counting objects: 79% (511/646)
remote: Counting objects: 80% (517/646)
remote: Counting objects: 81% (524/646)
remote: Counting objects: 82% (530/646)
remote: Counting objects: 83% (537/646)
remote: Counting objects: 84% (543/646)
remote: Counting objects: 85% (550/646)
remote: Counting objects: 86% (556/646)
remote: Counting objects: 87% (563/646)
remote: Counting objects: 88% (569/646)
remote: Counting objects: 89% (575/646)
remote: Counting objects: 90% (582/646)
remote: Counting objects: 91% (588/646)
remote: Counting objects: 92% (595/646)
remote: Counting objects: 93% (601/646)
remote: Counting objects: 94% (608/646)
remote: Counting objects: 95% (614/646)
remote: Counting objects: 96% (621/646)
remote: Counting objects: 97% (627/646)
remote: Counting objects: 98% (634/646)
remote: Counting objects: 99% (640/646)
remote: Counting objects: 100% (646/646)
remote: Counting objects: 100% (646/646), done.
27.47 s
remote: Compressing objects: 1% (1/71)
remote: Compressing objects: 2% (2/71)
remote: Compressing objects: 4% (3/71)
remote: Compressing objects: 5% (4/71)
remote: Compressing objects: 7% (5/71)
remote: Compressing objects: 8% (6/71)
remote: Compressing objects: 9% (7/71)
remote: Compressing objects: 11% (8/71)
remote: Compressing objects: 12% (9/71)
remote: Compressing objects: 14% (10/71)
remote: Compressing objects: 15% (11/71)
remote: Compressing objects: 16% (12/71)
remote: Compressing objects: 18% (13/71)
remote: Compressing objects: 19% (14/71)
remote: Compressing objects: 21% (15/71)
remote: Compressing objects: 22% (16/71)
remote: Compressing objects: 23% (17/71)
remote: Compressing objects: 25% (18/71)
remote: Compressing objects: 26% (19/71)
remote: Compressing objects: 28% (20/71)
remote: Compressing objects: 29% (21/71)
remote: Compressing objects: 30% (22/71)
remote: Compressing objects: 32% (23/71)
remote: Compressing objects: 33% (24/71)
remote: Compressing objects: 35% (25/71)
remote: Compressing objects: 36% (26/71)
remote: Compressing objects: 38% (27/71)
remote: Compressing objects: 39% (28/71)
remote: Compressing objects: 40% (29/71)
remote: Compressing objects: 42% (30/71)
remote: Compressing objects: 43% (31/71)
remote: Compressing objects: 45% (32/71)
remote: Compressing objects: 46% (33/71)
remote: Compressing objects: 47% (34/71)
remote: Compressing objects: 49% (35/71)
remote: Compressing objects: 50% (36/71)
remote: Compressing objects: 52% (37/71)
remote: Compressing objects: 53% (38/71)
remote: Compressing objects: 54% (39/71)
remote: Compressing objects: 56% (40/71)
remote: Compressing objects: 57% (41/71)
remote: Compressing objects: 59% (42/71)
remote: Compressing objects: 60% (43/71)
remote: Compressing objects: 61% (44/71)
remote: Compressing objects: 63% (45/71)
remote: Compressing objects: 64% (46/71)
remote: Compressing objects: 66% (47/71)
remote: Compressing objects: 67% (48/71)
remote: Compressing objects: 69% (49/71)
remote: Compressing objects: 70% (50/71)
remote: Compressing objects: 71% (51/71)
remote: Compressing objects: 73% (52/71)
remote: Compressing objects: 74% (53/71)
remote: Compressing objects: 76% (54/71)
remote: Compressing objects: 77% (55/71)
remote: Compressing objects: 78% (56/71)
remote: Compressing objects: 80% (57/71)
remote: Compressing objects: 81% (58/71)
remote: Compressing objects: 83% (59/71)
remote: Compressing objects: 84% (60/71)
remote: Compressing objects: 85% (61/71)
remote: Compressing objects: 87% (62/71)
remote: Compressing objects: 88% (63/71)
remote: Compressing objects: 90% (64/71)
remote: Compressing objects: 91% (65/71)
remote: Compressing objects: 92% (66/71)
remote: Compressing objects: 94% (67/71)
remote: Compressing objects: 95% (68/71)
remote: Compressing objects: 97% (69/71)
remote: Compressing objects: 98% (70/71)
remote: Compressing objects: 100% (71/71)
remote: Compressing objects: 100% (71/71), done.
28.82 s
Receiving objects: 0% (1/17195)
Receiving objects: 0% (31/17195), 30.94 MiB | 30.70 MiB/s
Receiving objects: 1% (172/17195), 30.94 MiB | 30.70 MiB/s
Receiving objects: 2% (344/17195), 30.94 MiB | 30.70 MiB/s
Receiving objects: 3% (516/17195), 30.94 MiB | 30.70 MiB/s
Receiving objects: 4% (688/17195), 30.94 MiB | 30.70 MiB/s
Receiving objects: 5% (860/17195), 30.94 MiB | 30.70 MiB/s
Receiving objects: 6% (1032/17195), 30.94 MiB | 30.70 MiB/s
Receiving objects: 7% (1204/17195), 30.94 MiB | 30.70 MiB/s
Receiving objects: 8% (1376/17195), 30.94 MiB | 30.70 MiB/s
Receiving objects: 9% (1548/17195), 30.94 MiB | 30.70 MiB/s
Receiving objects: 10% (1720/17195), 30.94 MiB | 30.70 MiB/s
Receiving objects: 11% (1892/17195), 30.94 MiB | 30.70 MiB/s
Receiving objects: 12% (2064/17195), 30.94 MiB | 30.70 MiB/s
Receiving objects: 13% (2236/17195), 30.94 MiB | 30.70 MiB/s
Receiving objects: 14% (2408/17195), 30.94 MiB | 30.70 MiB/s
Receiving objects: 15% (2580/17195), 30.94 MiB | 30.70 MiB/s
Receiving objects: 16% (2752/17195), 30.94 MiB | 30.70 MiB/s
Receiving objects: 17% (2924/17195), 30.94 MiB | 30.70 MiB/s
Receiving objects: 18% (3096/17195), 30.94 MiB | 30.70 MiB/s
Receiving objects: 19% (3268/17195), 30.94 MiB | 30.70 MiB/s
Receiving objects: 20% (3439/17195), 30.94 MiB | 30.70 MiB/s
Receiving objects: 21% (3611/17195), 30.94 MiB | 30.70 MiB/s
Receiving objects: 22% (3783/17195), 30.94 MiB | 30.70 MiB/s
Receiving objects: 23% (3955/17195), 30.94 MiB | 30.70 MiB/s
Receiving objects: 24% (4127/17195), 30.94 MiB | 30.70 MiB/s
Receiving objects: 25% (4299/17195), 30.94 MiB | 30.70 MiB/s
Receiving objects: 26% (4471/17195), 30.94 MiB | 30.70 MiB/s
Receiving objects: 27% (4643/17195), 30.94 MiB | 30.70 MiB/s
Receiving objects: 28% (4815/17195), 30.94 MiB | 30.70 MiB/s
Receiving objects: 29% (4987/17195), 30.94 MiB | 30.70 MiB/s
Receiving objects: 30% (5159/17195), 30.94 MiB | 30.70 MiB/s
Receiving objects: 31% (5331/17195), 30.94 MiB | 30.70 MiB/s
Receiving objects: 32% (5503/17195), 30.94 MiB | 30.70 MiB/s
Receiving objects: 33% (5675/17195), 30.94 MiB | 30.70 MiB/s
Receiving objects: 34% (5847/17195), 30.94 MiB | 30.70 MiB/s
Receiving objects: 35% (6019/17195), 30.94 MiB | 30.70 MiB/s
Receiving objects: 36% (6191/17195), 30.94 MiB | 30.70 MiB/s
Receiving objects: 37% (6363/17195), 30.94 MiB | 30.70 MiB/s
Receiving objects: 38% (6535/17195), 30.94 MiB | 30.70 MiB/s
Receiving objects: 39% (6707/17195), 30.94 MiB | 30.70 MiB/s
Receiving objects: 40% (6878/17195), 30.94 MiB | 30.70 MiB/s
Receiving objects: 41% (7050/17195), 30.94 MiB | 30.70 MiB/s
Receiving objects: 42% (7222/17195), 30.94 MiB | 30.70 MiB/s
Receiving objects: 43% (7394/17195), 30.94 MiB | 30.70 MiB/s
Receiving objects: 44% (7566/17195), 30.94 MiB | 30.70 MiB/s
Receiving objects: 45% (7738/17195), 30.94 MiB | 30.70 MiB/s
Receiving objects: 46% (7910/17195), 30.94 MiB | 30.70 MiB/s
Receiving objects: 47% (8082/17195), 30.94 MiB | 30.70 MiB/s
Receiving objects: 48% (8254/17195), 30.94 MiB | 30.70 MiB/s
Receiving objects: 49% (8426/17195), 30.94 MiB | 30.70 MiB/s
Receiving objects: 50% (8598/17195), 30.94 MiB | 30.70 MiB/s
Receiving objects: 51% (8770/17195), 30.94 MiB | 30.70 MiB/s
Receiving objects: 52% (8942/17195), 30.94 MiB | 30.70 MiB/s
Receiving objects: 53% (9114/17195), 30.94 MiB | 30.70 MiB/s
Receiving objects: 54% (9286/17195), 30.94 MiB | 30.70 MiB/s
Receiving objects: 55% (9458/17195), 30.94 MiB | 30.70 MiB/s
Receiving objects: 56% (9630/17195), 30.94 MiB | 30.70 MiB/s
Receiving objects: 57% (9802/17195), 30.94 MiB | 30.70 MiB/s
Receiving objects: 58% (9974/17195), 30.94 MiB | 30.70 MiB/s
Receiving objects: 59% (10146/17195), 30.94 MiB | 30.70 MiB/s
Receiving objects: 60% (10317/17195), 30.94 MiB | 30.70 MiB/s
Receiving objects: 61% (10489/17195), 30.94 MiB | 30.70 MiB/s
Receiving objects: 62% (10661/17195), 30.94 MiB | 30.70 MiB/s
Receiving objects: 63% (10833/17195), 30.94 MiB | 30.70 MiB/s
Receiving objects: 64% (11005/17195), 30.94 MiB | 30.70 MiB/s
Receiving objects: 65% (11177/17195), 30.94 MiB | 30.70 MiB/s
Receiving objects: 66% (11349/17195), 30.94 MiB | 30.70 MiB/s
Receiving objects: 67% (11521/17195), 30.94 MiB | 30.70 MiB/s
Receiving objects: 68% (11693/17195), 30.94 MiB | 30.70 MiB/s
Receiving objects: 69% (11865/17195), 30.94 MiB | 30.70 MiB/s
Receiving objects: 70% (12037/17195), 30.94 MiB | 30.70 MiB/s
Receiving objects: 71% (12209/17195), 30.94 MiB | 30.70 MiB/s
Receiving objects: 72% (12381/17195), 30.94 MiB | 30.70 MiB/s
Receiving objects: 73% (12553/17195), 30.94 MiB | 30.70 MiB/s
Receiving objects: 74% (12725/17195), 30.94 MiB | 30.70 MiB/s
Receiving objects: 75% (12897/17195), 30.94 MiB | 30.70 MiB/s
Receiving objects: 76% (13069/17195), 30.94 MiB | 30.70 MiB/s
Receiving objects: 77% (13241/17195), 30.94 MiB | 30.70 MiB/s
Receiving objects: 78% (13413/17195), 30.94 MiB | 30.70 MiB/s
Receiving objects: 79% (13585/17195), 30.94 MiB | 30.70 MiB/s
Receiving objects: 80% (13756/17195), 30.94 MiB | 30.70 MiB/s
Receiving objects: 81% (13928/17195), 30.94 MiB | 30.70 MiB/s
Receiving objects: 82% (14100/17195), 30.94 MiB | 30.70 MiB/s
Receiving objects: 83% (14272/17195), 30.94 MiB | 30.70 MiB/s
Receiving objects: 84% (14444/17195), 30.94 MiB | 30.70 MiB/s
Receiving objects: 85% (14616/17195), 30.94 MiB | 30.70 MiB/s
Receiving objects: 86% (14788/17195), 30.94 MiB | 30.70 MiB/s
Receiving objects: 87% (14960/17195), 30.94 MiB | 30.70 MiB/s
Receiving objects: 88% (15132/17195), 30.94 MiB | 30.70 MiB/s
Receiving objects: 89% (15304/17195), 30.94 MiB | 30.70 MiB/s
Receiving objects: 90% (15476/17195), 30.94 MiB | 30.70 MiB/s
Receiving objects: 91% (15648/17195), 30.94 MiB | 30.70 MiB/s
Receiving objects: 92% (15820/17195), 30.94 MiB | 30.70 MiB/s
Receiving objects: 93% (15992/17195), 30.94 MiB | 30.70 MiB/s
Receiving objects: 94% (16164/17195), 30.94 MiB | 30.70 MiB/s
Receiving objects: 95% (16336/17195), 30.94 MiB | 30.70 MiB/s
Receiving objects: 96% (16508/17195), 30.94 MiB | 30.70 MiB/s
Receiving objects: 97% (16680/17195), 30.94 MiB | 30.70 MiB/s
Receiving objects: 98% (16852/17195), 30.94 MiB | 30.70 MiB/s
Receiving objects: 99% (17024/17195), 30.94 MiB | 30.70 MiB/s
remote: Total 17195 (delta 614), reused 575 (delta 575), pack-reused 16549 (from 1)
28.82 s
Receiving objects: 100% (17195/17195), 30.94 MiB | 30.70 MiB/s
Receiving objects: 100% (17195/17195), 43.06 MiB | 31.93 MiB/s, done.
29.04 s
Resolving deltas: 0% (0/13290)
Resolving deltas: 1% (134/13290)
Resolving deltas: 2% (266/13290)
Resolving deltas: 3% (399/13290)
Resolving deltas: 4% (532/13290)
Resolving deltas: 5% (669/13290)
Resolving deltas: 6% (798/13290)
Resolving deltas: 7% (931/13290)
Resolving deltas: 8% (1064/13290)
Resolving deltas: 9% (1197/13290)
Resolving deltas: 10% (1329/13290)
Resolving deltas: 11% (1462/13290)
Resolving deltas: 12% (1595/13290)
Resolving deltas: 13% (1728/13290)
Resolving deltas: 14% (1861/13290)
Resolving deltas: 15% (1994/13290)
Resolving deltas: 16% (2127/13290)
Resolving deltas: 17% (2260/13290)
Resolving deltas: 18% (2393/13290)
Resolving deltas: 19% (2526/13290)
Resolving deltas: 20% (2658/13290)
Resolving deltas: 21% (2791/13290)
Resolving deltas: 22% (2924/13290)
Resolving deltas: 23% (3057/13290)
Resolving deltas: 24% (3190/13290)
Resolving deltas: 25% (3323/13290)
Resolving deltas: 26% (3457/13290)
Resolving deltas: 27% (3589/13290)
Resolving deltas: 28% (3722/13290)
Resolving deltas: 29% (3855/13290)
Resolving deltas: 30% (3987/13290)
Resolving deltas: 31% (4120/13290)
Resolving deltas: 32% (4253/13290)
Resolving deltas: 33% (4386/13290)
Resolving deltas: 34% (4519/13290)
Resolving deltas: 35% (4652/13290)
Resolving deltas: 36% (4785/13290)
Resolving deltas: 37% (4918/13290)
Resolving deltas: 38% (5051/13290)
Resolving deltas: 39% (5184/13290)
Resolving deltas: 40% (5316/13290)
Resolving deltas: 41% (5449/13290)
Resolving deltas: 42% (5582/13290)
Resolving deltas: 43% (5715/13290)
Resolving deltas: 44% (5849/13290)
Resolving deltas: 45% (5981/13290)
Resolving deltas: 46% (6114/13290)
Resolving deltas: 47% (6247/13290)
Resolving deltas: 48% (6382/13290)
Resolving deltas: 49% (6514/13290)
Resolving deltas: 50% (6646/13290)
Resolving deltas: 51% (6779/13290)
Resolving deltas: 52% (6911/13290)
Resolving deltas: 53% (7044/13290)
Resolving deltas: 54% (7178/13290)
Resolving deltas: 55% (7310/13290)
Resolving deltas: 56% (7444/13290)
Resolving deltas: 57% (7576/13290)
Resolving deltas: 58% (7709/13290)
Resolving deltas: 59% (7842/13290)
Resolving deltas: 60% (7974/13290)
Resolving deltas: 61% (8107/13290)
Resolving deltas: 62% (8241/13290)
Resolving deltas: 63% (8373/13290)
Resolving deltas: 64% (8506/13290)
Resolving deltas: 65% (8639/13290)
Resolving deltas: 66% (8772/13290)
Resolving deltas: 67% (8905/13290)
Resolving deltas: 68% (9038/13290)
Resolving deltas: 69% (9171/13290)
Resolving deltas: 70% (9303/13290)
Resolving deltas: 71% (9437/13290)
Resolving deltas: 72% (9571/13290)
Resolving deltas: 73% (9702/13290)
Resolving deltas: 74% (9835/13290)
Resolving deltas: 75% (9968/13290)
Resolving deltas: 76% (10101/13290)
Resolving deltas: 77% (10235/13290)
Resolving deltas: 78% (10369/13290)
Resolving deltas: 79% (10500/13290)
Resolving deltas: 80% (10632/13290)
Resolving deltas: 81% (10766/13290)
Resolving deltas: 82% (10899/13290)
Resolving deltas: 83% (11031/13290)
Resolving deltas: 84% (11165/13290)
Resolving deltas: 85% (11297/13290)
Resolving deltas: 86% (11431/13290)
Resolving deltas: 87% (11563/13290)
Resolving deltas: 88% (11696/13290)
Resolving deltas: 89% (11829/13290)
Resolving deltas: 90% (11961/13290)
Resolving deltas: 91% (12095/13290)
Resolving deltas: 92% (12227/13290)
Resolving deltas: 93% (12360/13290)
Resolving deltas: 94% (12493/13290)
Resolving deltas: 95% (12626/13290)
Resolving deltas: 96% (12759/13290)
Resolving deltas: 97% (12892/13290)
Resolving deltas: 98% (13025/13290)
Resolving deltas: 99% (13158/13290)
Resolving deltas: 100% (13290/13290)
Resolving deltas: 100% (13290/13290), done.
29.14 s
From https://github.com/symbolica-dev/symbolica
29.14 s
* [new branch] algebraic_rational -> algebraic_rational
29.14 s
* [new branch] alias -> alias
29.14 s
* [new branch] arm_asm -> arm_asm
29.14 s
* [new branch] bincode -> bincode
29.14 s
* [new branch] borrowed_atom -> borrowed_atom
29.14 s
* [new branch] branching_evaluate -> branching_evaluate
29.14 s
* [new branch] chi_sq_fix -> chi_sq_fix
29.14 s
* [new branch] coeff -> coeff
29.14 s
* [new branch] coeff_first -> coeff_first
29.14 s
* [new branch] complex_coeff -> complex_coeff
29.14 s
* [new branch] complex_ring -> complex_ring
29.14 s
* [new branch] computational_graph -> computational_graph
29.14 s
* [new branch] conditions -> conditions
29.14 s
* [new branch] delay -> delay
29.14 s
* [new branch] dense_mul -> dense_mul
29.14 s
* [new branch] dev -> dev
29.14 s
* [new branch] dev-cleanup-release-2.0 -> dev-cleanup-release-2.0
29.14 s
* [new branch] dev-cleanup-release-2.0-numerica2-bisectable -> dev-cleanup-release-2.0-numerica2-bisectable
29.14 s
* [new branch] dev_poly -> dev_poly
29.14 s
* [new branch] dual -> dual
29.14 s
* [new branch] error_tracking_coeff -> error_tracking_coeff
29.14 s
* [new branch] evaluate -> evaluate
29.14 s
* [new branch] evaluate_merge -> evaluate_merge
29.14 s
* [new branch] export -> export
29.14 s
* [new branch] export_serde -> export_serde
29.14 s
* [new branch] fac_div -> fac_div
29.14 s
* [new branch] factorint -> factorint
29.14 s
* [new branch] float -> float
29.14 s
* [new branch] floatmerge -> floatmerge
29.14 s
* [new branch] format -> format
29.14 s
* [new branch] function_simplify -> function_simplify
29.14 s
* [new branch] graph_filter -> graph_filter
29.14 s
* [new branch] infinity -> infinity
29.14 s
* [new branch] int_i128 -> int_i128
29.14 s
* [new branch] lib_merge -> lib_merge
29.14 s
* [new branch] logging -> logging
29.14 s
* [new branch] main -> main
29.14 s
* [new branch] merge_evaluator -> merge_evaluator
29.14 s
* [new branch] modules -> modules
29.14 s
* [new branch] name_check -> name_check
29.14 s
* [new branch] nested_evaluate -> nested_evaluate
29.14 s
* [new branch] nested_symmetrize -> nested_symmetrize
29.14 s
* [new branch] newton -> newton
29.14 s
* [new branch] no_namespace -> no_namespace
29.14 s
* [new branch] numer_coeff -> numer_coeff
29.14 s
* [new branch] numpy -> numpy
29.14 s
* [new branch] oem -> oem
29.14 s
* [new branch] optim -> optim
29.14 s
* [new branch] optional_patterns -> optional_patterns
29.14 s
* [new branch] oss_repo_split -> oss_repo_split
29.14 s
* [new branch] oss_split -> oss_split
29.14 s
* [new branch] packed_exp -> packed_exp
29.14 s
* [new branch] prep -> prep
29.14 s
* [new branch] rat_parser -> rat_parser
29.14 s
* [new branch] ratpolyfac -> ratpolyfac
29.14 s
* [new branch] register_symbols -> register_symbols
29.14 s
* [new branch] replace_builder -> replace_builder
29.14 s
* [new branch] rewrite -> rewrite
29.14 s
* [new branch] rug_patch -> rug_patch
29.14 s
* [new branch] series -> series
29.14 s
* [new branch] simd -> simd
29.14 s
* [new branch] simple_stub -> simple_stub
29.14 s
* [new branch] skip-license-scopes -> skip-license-scopes
29.14 s
* [new branch] smaller_poly -> smaller_poly
29.14 s
* [new branch] specialize_pattern -> specialize_pattern
29.14 s
* [new branch] split_asm -> split_asm
29.14 s
* [new branch] sub-evaluators -> sub-evaluators
29.14 s
* [new branch] symbol_data -> symbol_data
29.14 s
* [new branch] symbol_der -> symbol_der
29.14 s
* [new branch] symbol_group -> symbol_group
29.14 s
* [new branch] symjit -> symjit
29.14 s
* [new branch] tmp_merge -> tmp_merge
29.14 s
* [new branch] transformer -> transformer
29.14 s
* [new branch] vector_evaluate -> vector_evaluate
29.14 s
* [new branch] wasm -> wasm
29.14 s
* [new branch] wasm2 -> wasm2
29.14 s
* [new branch] windows -> windows
29.14 s
* [new branch] windows_ci -> windows_ci
29.14 s
* [new branch] zeroflow -> zeroflow
29.14 s
* [new ref] refs/pull/12/head -> refs/pull/12/head
29.14 s
* [new ref] refs/pull/13/head -> refs/pull/13/head
29.14 s
* [new ref] refs/pull/14/head -> refs/pull/14/head
29.14 s
* [new ref] refs/pull/19/head -> refs/pull/19/head
29.14 s
* [new ref] refs/pull/2/head -> refs/pull/2/head
29.14 s
* [new ref] refs/pull/20/head -> refs/pull/20/head
29.14 s
* [new ref] refs/pull/22/head -> refs/pull/22/head
29.14 s
* [new ref] refs/pull/26/head -> refs/pull/26/head
29.14 s
* [new ref] refs/pull/29/head -> refs/pull/29/head
29.14 s
* [new ref] refs/pull/30/head -> refs/pull/30/head
29.14 s
* [new ref] refs/pull/31/head -> refs/pull/31/head
29.14 s
* [new ref] refs/pull/32/head -> refs/pull/32/head
29.14 s
* [new ref] refs/pull/39/head -> refs/pull/39/head
29.14 s
* [new ref] refs/pull/40/head -> refs/pull/40/head
29.14 s
* [new ref] refs/pull/41/head -> refs/pull/41/head
29.14 s
* [new ref] refs/pull/43/head -> refs/pull/43/head
29.14 s
* [new ref] refs/pull/44/head -> refs/pull/44/head
29.14 s
* [new ref] refs/pull/45/head -> refs/pull/45/head
29.14 s
* [new ref] refs/pull/46/head -> refs/pull/46/head
29.14 s
* [new ref] refs/pull/47/head -> refs/pull/47/head
29.14 s
* [new ref] refs/pull/47/merge -> refs/pull/47/merge
29.14 s
* [new ref] refs/pull/48/head -> refs/pull/48/head
29.14 s
* [new ref] refs/pull/48/merge -> refs/pull/48/merge
29.14 s
* [new ref] refs/pull/5/head -> refs/pull/5/head
29.14 s
* [new ref] refs/pull/6/head -> refs/pull/6/head
29.14 s
* [new ref] refs/pull/7/head -> refs/pull/7/head
29.14 s
* [new ref] refs/pull/8/head -> refs/pull/8/head
29.14 s
* [new tag] v0.1.0 -> v0.1.0
29.14 s
* [new tag] v0.1.1 -> v0.1.1
29.14 s
* [new tag] v0.1.2 -> v0.1.2
29.14 s
* [new tag] v0.1.3 -> v0.1.3
29.14 s
* [new tag] v0.1.4 -> v0.1.4
29.14 s
* [new tag] v0.10.0 -> v0.10.0
29.14 s
* [new tag] v0.11.0 -> v0.11.0
29.14 s
* [new tag] v0.12.0 -> v0.12.0
29.14 s
* [new tag] v0.12.1 -> v0.12.1
29.14 s
* [new tag] v0.13.0 -> v0.13.0
29.14 s
* [new tag] v0.14.0 -> v0.14.0
29.14 s
* [new tag] v0.15.0 -> v0.15.0
29.14 s
* [new tag] v0.15.1 -> v0.15.1
29.14 s
* [new tag] v0.16.0 -> v0.16.0
29.14 s
* [new tag] v0.17.0 -> v0.17.0
29.14 s
* [new tag] v0.18.0 -> v0.18.0
29.14 s
* [new tag] v0.19.0 -> v0.19.0
29.14 s
* [new tag] v0.2.0 -> v0.2.0
29.14 s
* [new tag] v0.20.0 -> v0.20.0
29.14 s
* [new tag] v0.3.0 -> v0.3.0
29.14 s
* [new tag] v0.4.0 -> v0.4.0
29.14 s
* [new tag] v0.5.0 -> v0.5.0
29.14 s
* [new tag] v0.6.0 -> v0.6.0
29.14 s
* [new tag] v0.7.0 -> v0.7.0
29.14 s
* [new tag] v0.8.0 -> v0.8.0
29.14 s
* [new tag] v0.8.1 -> v0.8.1
29.14 s
* [new tag] v0.8.2 -> v0.8.2
29.14 s
* [new tag] v0.9.0 -> v0.9.0
29.14 s
* [new tag] v1.0.0 -> v1.0.0
29.14 s
* [new tag] v1.0.1 -> v1.0.1
29.14 s
* [new tag] v1.1.0 -> v1.1.0
29.14 s
* [new tag] v1.2.0 -> v1.2.0
29.14 s
* [new tag] v1.3.0 -> v1.3.0
29.14 s
* [new tag] v1.4.0 -> v1.4.0
29.14 s
* [new tag] v1.5.0 -> v1.5.0
29.14 s
* [new tag] v1.5.1 -> v1.5.1
29.14 s
* [new tag] v2.0.0 -> v2.0.0
29.14 s
* [new tag] v2.1.0 -> v2.1.0
29.14 s
* [new tag] v2.2.0 -> v2.2.0
29.72 s
fetching Git repository 'https://github.com/lcnbr/tymbolica'
30.39 s
remote: Enumerating objects: 1056, done.
36.19 s
Receiving objects: 0% (1/1056)
Receiving objects: 1% (11/1056)
Receiving objects: 2% (22/1056)
Receiving objects: 3% (32/1056)
Receiving objects: 4% (43/1056)
Receiving objects: 5% (53/1056)
Receiving objects: 6% (64/1056)
Receiving objects: 7% (74/1056)
Receiving objects: 8% (85/1056)
Receiving objects: 9% (96/1056)
Receiving objects: 10% (106/1056)
Receiving objects: 11% (117/1056)
Receiving objects: 12% (127/1056)
Receiving objects: 13% (138/1056)
Receiving objects: 14% (148/1056)
Receiving objects: 15% (159/1056)
Receiving objects: 16% (169/1056), 14.66 MiB | 27.59 MiB/s
Receiving objects: 17% (180/1056), 14.66 MiB | 27.59 MiB/s
Receiving objects: 18% (191/1056), 14.66 MiB | 27.59 MiB/s
Receiving objects: 19% (201/1056), 14.66 MiB | 27.59 MiB/s
Receiving objects: 20% (212/1056), 14.66 MiB | 27.59 MiB/s
Receiving objects: 20% (221/1056), 30.73 MiB | 29.79 MiB/s
Receiving objects: 21% (222/1056), 30.73 MiB | 29.79 MiB/s
Receiving objects: 22% (233/1056), 30.73 MiB | 29.79 MiB/s
Receiving objects: 23% (243/1056), 30.73 MiB | 29.79 MiB/s
Receiving objects: 24% (254/1056), 30.73 MiB | 29.79 MiB/s
Receiving objects: 25% (264/1056), 30.73 MiB | 29.79 MiB/s
Receiving objects: 26% (275/1056), 30.73 MiB | 29.79 MiB/s
Receiving objects: 27% (286/1056), 30.73 MiB | 29.79 MiB/s
Receiving objects: 28% (296/1056), 45.89 MiB | 29.80 MiB/s
Receiving objects: 29% (307/1056), 45.89 MiB | 29.80 MiB/s
Receiving objects: 30% (317/1056), 45.89 MiB | 29.80 MiB/s
Receiving objects: 30% (321/1056), 60.92 MiB | 29.83 MiB/s
Receiving objects: 31% (328/1056), 60.92 MiB | 29.83 MiB/s
Receiving objects: 32% (338/1056), 60.92 MiB | 29.83 MiB/s
Receiving objects: 33% (349/1056), 60.92 MiB | 29.83 MiB/s
Receiving objects: 34% (360/1056), 77.46 MiB | 30.46 MiB/s
Receiving objects: 35% (370/1056), 77.46 MiB | 30.46 MiB/s
Receiving objects: 36% (381/1056), 77.46 MiB | 30.46 MiB/s
Receiving objects: 37% (391/1056), 77.46 MiB | 30.46 MiB/s
Receiving objects: 38% (402/1056), 77.46 MiB | 30.46 MiB/s
Receiving objects: 39% (412/1056), 77.46 MiB | 30.46 MiB/s
Receiving objects: 40% (423/1056), 77.46 MiB | 30.46 MiB/s
Receiving objects: 41% (433/1056), 77.46 MiB | 30.46 MiB/s
Receiving objects: 42% (444/1056), 77.46 MiB | 30.46 MiB/s
Receiving objects: 43% (455/1056), 77.46 MiB | 30.46 MiB/s
Receiving objects: 44% (465/1056), 77.46 MiB | 30.46 MiB/s
Receiving objects: 45% (476/1056), 77.46 MiB | 30.46 MiB/s
Receiving objects: 46% (486/1056), 77.46 MiB | 30.46 MiB/s
Receiving objects: 47% (497/1056), 77.46 MiB | 30.46 MiB/s
Receiving objects: 48% (507/1056), 77.46 MiB | 30.46 MiB/s
Receiving objects: 49% (518/1056), 77.46 MiB | 30.46 MiB/s
Receiving objects: 50% (528/1056), 77.46 MiB | 30.46 MiB/s
Receiving objects: 51% (539/1056), 77.46 MiB | 30.46 MiB/s
Receiving objects: 52% (550/1056), 77.46 MiB | 30.46 MiB/s
Receiving objects: 53% (560/1056), 77.46 MiB | 30.46 MiB/s
Receiving objects: 54% (571/1056), 77.46 MiB | 30.46 MiB/s
Receiving objects: 55% (581/1056), 77.46 MiB | 30.46 MiB/s
Receiving objects: 56% (592/1056), 77.46 MiB | 30.46 MiB/s
Receiving objects: 57% (602/1056), 77.46 MiB | 30.46 MiB/s
Receiving objects: 58% (613/1056), 77.46 MiB | 30.46 MiB/s
Receiving objects: 58% (621/1056), 94.57 MiB | 31.08 MiB/s
Receiving objects: 59% (624/1056), 94.57 MiB | 31.08 MiB/s
Receiving objects: 60% (634/1056), 94.57 MiB | 31.08 MiB/s
Receiving objects: 61% (645/1056), 94.57 MiB | 31.08 MiB/s
Receiving objects: 62% (655/1056), 110.74 MiB | 31.17 MiB/s
Receiving objects: 63% (666/1056), 110.74 MiB | 31.17 MiB/s
Receiving objects: 64% (676/1056), 110.74 MiB | 31.17 MiB/s
Receiving objects: 65% (687/1056), 110.74 MiB | 31.17 MiB/s
Receiving objects: 66% (697/1056), 110.74 MiB | 31.17 MiB/s
Receiving objects: 67% (708/1056), 110.74 MiB | 31.17 MiB/s
Receiving objects: 67% (717/1056), 127.27 MiB | 31.40 MiB/s
Receiving objects: 68% (719/1056), 127.27 MiB | 31.40 MiB/s
Receiving objects: 69% (729/1056), 127.27 MiB | 31.40 MiB/s
Receiving objects: 70% (740/1056), 127.27 MiB | 31.40 MiB/s
Receiving objects: 71% (750/1056), 144.45 MiB | 31.73 MiB/s
Receiving objects: 72% (761/1056), 144.45 MiB | 31.73 MiB/s
Receiving objects: 73% (771/1056), 144.45 MiB | 31.73 MiB/s
Receiving objects: 74% (782/1056), 144.45 MiB | 31.73 MiB/s
Receiving objects: 75% (792/1056), 144.45 MiB | 31.73 MiB/s
Receiving objects: 76% (803/1056), 144.45 MiB | 31.73 MiB/s
Receiving objects: 77% (814/1056), 144.45 MiB | 31.73 MiB/s
Receiving objects: 78% (824/1056), 144.45 MiB | 31.73 MiB/s
Receiving objects: 79% (835/1056), 144.45 MiB | 31.73 MiB/s
Receiving objects: 80% (845/1056), 144.45 MiB | 31.73 MiB/s
Receiving objects: 81% (856/1056), 144.45 MiB | 31.73 MiB/s
Receiving objects: 82% (866/1056), 144.45 MiB | 31.73 MiB/s
Receiving objects: 83% (877/1056), 144.45 MiB | 31.73 MiB/s
Receiving objects: 84% (888/1056), 144.45 MiB | 31.73 MiB/s
Receiving objects: 85% (898/1056), 144.45 MiB | 31.73 MiB/s
Receiving objects: 86% (909/1056), 144.45 MiB | 31.73 MiB/s
Receiving objects: 87% (919/1056), 144.45 MiB | 31.73 MiB/s
Receiving objects: 88% (930/1056), 144.45 MiB | 31.73 MiB/s
Receiving objects: 89% (940/1056), 144.45 MiB | 31.73 MiB/s
Receiving objects: 89% (950/1056), 160.11 MiB | 32.03 MiB/s
Receiving objects: 90% (951/1056), 160.11 MiB | 32.03 MiB/s
Receiving objects: 91% (961/1056), 160.11 MiB | 32.03 MiB/s
Receiving objects: 92% (972/1056), 176.53 MiB | 32.06 MiB/s
Receiving objects: 93% (983/1056), 176.53 MiB | 32.06 MiB/s
Receiving objects: 94% (993/1056), 176.53 MiB | 32.06 MiB/s
Receiving objects: 95% (1004/1056), 176.53 MiB | 32.06 MiB/s
Receiving objects: 96% (1014/1056), 176.53 MiB | 32.06 MiB/s
Receiving objects: 97% (1025/1056), 176.53 MiB | 32.06 MiB/s
Receiving objects: 98% (1035/1056), 176.53 MiB | 32.06 MiB/s
Receiving objects: 99% (1046/1056), 176.53 MiB | 32.06 MiB/s
remote: Total 1056 (delta 0), reused 0 (delta 0), pack-reused 1056 (from 1)
36.19 s
Receiving objects: 100% (1056/1056), 176.53 MiB | 32.06 MiB/s
Receiving objects: 100% (1056/1056), 182.85 MiB | 31.79 MiB/s, done.
36.41 s
Resolving deltas: 0% (0/560)
Resolving deltas: 1% (6/560)
Resolving deltas: 2% (13/560)
Resolving deltas: 3% (18/560)
Resolving deltas: 4% (23/560)
Resolving deltas: 5% (28/560)
Resolving deltas: 6% (34/560)
Resolving deltas: 7% (40/560)
Resolving deltas: 8% (45/560)
Resolving deltas: 9% (51/560)
Resolving deltas: 10% (56/560)
Resolving deltas: 11% (62/560)
Resolving deltas: 12% (68/560)
Resolving deltas: 13% (73/560)
Resolving deltas: 14% (79/560)
Resolving deltas: 15% (85/560)
Resolving deltas: 16% (93/560)
Resolving deltas: 17% (96/560)
Resolving deltas: 18% (101/560)
Resolving deltas: 19% (107/560)
Resolving deltas: 20% (112/560)
Resolving deltas: 21% (119/560)
Resolving deltas: 22% (124/560)
Resolving deltas: 23% (129/560)
Resolving deltas: 24% (136/560)
Resolving deltas: 25% (140/560)
Resolving deltas: 26% (146/560)
Resolving deltas: 27% (152/560)
Resolving deltas: 28% (157/560)
Resolving deltas: 29% (167/560)
Resolving deltas: 30% (169/560)
Resolving deltas: 31% (174/560)
Resolving deltas: 32% (180/560)
Resolving deltas: 33% (185/560)
Resolving deltas: 34% (191/560)
Resolving deltas: 35% (196/560)
Resolving deltas: 36% (202/560)
Resolving deltas: 37% (208/560)
Resolving deltas: 38% (213/560)
Resolving deltas: 39% (219/560)
Resolving deltas: 40% (224/560)
Resolving deltas: 41% (230/560)
Resolving deltas: 42% (236/560)
Resolving deltas: 43% (241/560)
Resolving deltas: 44% (247/560)
Resolving deltas: 45% (252/560)
Resolving deltas: 46% (258/560)
Resolving deltas: 47% (264/560)
Resolving deltas: 48% (269/560)
Resolving deltas: 49% (275/560)
Resolving deltas: 50% (280/560)
Resolving deltas: 51% (288/560)
Resolving deltas: 52% (292/560)
Resolving deltas: 53% (297/560)
Resolving deltas: 54% (303/560)
Resolving deltas: 55% (309/560)
Resolving deltas: 56% (314/560)
Resolving deltas: 57% (320/560)
Resolving deltas: 58% (325/560)
Resolving deltas: 59% (331/560)
Resolving deltas: 60% (336/560)
Resolving deltas: 61% (342/560)
Resolving deltas: 62% (348/560)
Resolving deltas: 63% (353/560)
Resolving deltas: 64% (360/560)
Resolving deltas: 65% (364/560)
Resolving deltas: 66% (370/560)
Resolving deltas: 67% (377/560)
Resolving deltas: 68% (381/560)
Resolving deltas: 69% (387/560)
Resolving deltas: 70% (392/560)
Resolving deltas: 71% (398/560)
Resolving deltas: 72% (404/560)
Resolving deltas: 73% (414/560)
Resolving deltas: 74% (415/560)
Resolving deltas: 75% (420/560)
Resolving deltas: 76% (426/560)
Resolving deltas: 77% (434/560)
Resolving deltas: 78% (438/560)
Resolving deltas: 79% (444/560)
Resolving deltas: 80% (448/560)
Resolving deltas: 81% (454/560)
Resolving deltas: 82% (460/560)
Resolving deltas: 83% (468/560)
Resolving deltas: 84% (471/560)
Resolving deltas: 85% (476/560)
Resolving deltas: 86% (482/560)
Resolving deltas: 87% (488/560)
Resolving deltas: 88% (493/560)
Resolving deltas: 89% (500/560)
Resolving deltas: 90% (504/560)
Resolving deltas: 91% (510/560)
Resolving deltas: 92% (517/560)
Resolving deltas: 93% (521/560)
Resolving deltas: 94% (527/560)
Resolving deltas: 95% (534/560)
Resolving deltas: 96% (539/560)
Resolving deltas: 97% (544/560)
Resolving deltas: 98% (549/560)
Resolving deltas: 99% (555/560)
Resolving deltas: 100% (560/560)
Resolving deltas: 100% (560/560), done.
36.53 s
From https://github.com/lcnbr/tymbolica
36.53 s
* [new branch] main -> main
36.53 s
* [new branch] shared-symbolica-interface -> shared-symbolica-interface
38.91 s
38.91 s
Downloading cached gammaloop-nextest-binaries-core-gammaloop-api from https://cache.nix-ci.com
38.91 s
Downloading cached gammaloop-nextest-binaries-core-gammaloop-tracing-filter from https://cache.nix-ci.com
38.91 s
Downloading cached gammaloop-nextest-binaries-core-gammaloop-tracing-filter-macros from https://cache.nix-ci.com
38.91 s
Downloading cached gammaloop-nextest-binaries-core-gammalooprs from https://cache.nix-ci.com
38.92 s
Downloading cached xgcc-15.2.0-libgcc from https://cache.nix-ci.com
38.92 s
Downloading cached busybox from https://cache.nix-ci.com
38.92 s
Downloading cached gcc-15.2.0-libgcc from https://cache.nix-ci.com
38.92 s
Downloading cached libunistring from https://cache.nix-ci.com
38.92 s
Downloading cached publicsuffix-list-0-unstable-2026-05 from https://cache.nix-ci.com
39.08 s
Downloaded cached publicsuffix-list-0-unstable-2026-05 (329 KiB) in 162ms
39.08 s
Progress: 0 of 1 built, 1 of 71 downloaded from cache (8 downloading)
39.08 s
Downloaded cached gcc-15.2.0-libgcc (193 KiB) in 165ms
39.08 s
Progress: 0 of 1 built, 2 of 71 downloaded from cache (7 downloading)
39.09 s
Downloaded cached busybox (230 KiB) in 166ms
39.09 s
Progress: 0 of 1 built, 3 of 71 downloaded from cache (6 downloading)
39.09 s
Downloaded cached xgcc-15.2.0-libgcc (193 KiB) in 172ms
39.09 s
Progress: 0 of 1 built, 4 of 71 downloaded from cache (5 downloading)
39.10 s
Downloaded cached libunistring (2 MiB) in 180ms
39.10 s
Progress: 0 of 1 built, 5 of 71 downloaded from cache (4 downloading)
39.10 s
Downloading cached libidn2 from https://cache.nix-ci.com
39.15 s
Downloaded cached gammaloop-nextest-binaries-core-gammaloop-tracing-filter-macros (1.7 MiB) in 230ms
39.15 s
Progress: 0 of 1 built, 6 of 71 downloaded from cache (4 downloading)
39.21 s
Downloaded cached libidn2 (359 KiB) in 106ms
39.21 s
Progress: 0 of 1 built, 7 of 71 downloaded from cache (3 downloading)
39.21 s
Downloading cached glibc-2.42 from https://cache.nix-ci.com
39.59 s
Downloaded cached glibc-2.42 (33.5 MiB) in 380ms
39.59 s
Progress: 0 of 1 built, 8 of 71 downloaded from cache (3 downloading)
39.59 s
Downloading cached attr from https://cache.nix-ci.com
39.59 s
Downloading cached aws-c-common from https://cache.nix-ci.com
39.59 s
Downloading cached bash from https://cache.nix-ci.com
39.59 s
Downloading cached brotli-1.2.0-lib from https://cache.nix-ci.com
39.59 s
Downloading cached bzip2 from https://cache.nix-ci.com
39.59 s
Downloading cached editline-1.17.1-unstable-2025-05 from https://cache.nix-ci.com
39.59 s
Downloading cached gcc-15.2.0-lib from https://cache.nix-ci.com
39.59 s
Downloading cached hwloc-2.14.0-lib from https://cache.nix-ci.com
39.59 s
Downloading cached libcpuid from https://cache.nix-ci.com
39.59 s
Downloading cached keyutils-1.6.3-lib from https://cache.nix-ci.com
39.59 s
Downloading cached libpsl from https://cache.nix-ci.com
39.60 s
Downloading cached libseccomp-2.6.0-lib from https://cache.nix-ci.com
39.60 s
Downloading cached libsodium-1.0.22-unstable-2026-04 from https://cache.nix-ci.com
39.68 s
Downloaded cached attr (90 KiB) in 88ms
39.68 s
Progress: 0 of 1 built, 9 of 71 downloaded from cache (15 downloading)
39.68 s
Downloading cached libxml2 from https://cache.nix-ci.com
39.70 s
Downloaded cached editline-1.17.1-unstable-2025-05 (58 KiB) in 113ms
39.70 s
Progress: 0 of 1 built, 10 of 71 downloaded from cache (15 downloading)
39.70 s
Downloading cached acl from https://cache.nix-ci.com
39.70 s
Downloaded cached bzip2 (86 KiB) in 115ms
39.70 s
Progress: 0 of 1 built, 11 of 71 downloaded from cache (15 downloading)
39.70 s
Downloading cached llhttp from https://cache.nix-ci.com
39.71 s
Downloaded cached libpsl (114 KiB) in 115ms
39.71 s
Progress: 0 of 1 built, 12 of 71 downloaded from cache (15 downloading)
39.71 s
Downloading cached lowdown-3.0.1-lib from https://cache.nix-ci.com
39.73 s
Downloaded cached brotli-1.2.0-lib (961 KiB) in 137ms
39.73 s
Progress: 0 of 1 built, 13 of 71 downloaded from cache (15 downloading)
39.73 s
Downloading cached nghttp2-1.69.0-lib from https://cache.nix-ci.com
39.74 s
Downloaded cached bash (1.8 MiB) in 155ms
39.74 s
Progress: 0 of 1 built, 14 of 71 downloaded from cache (15 downloading)
39.74 s
Downloading cached nghttp3 from https://cache.nix-ci.com
39.75 s
Downloaded cached aws-c-common (1.1 MiB) in 159ms
39.75 s
Progress: 0 of 1 built, 15 of 71 downloaded from cache (15 downloading)
39.75 s
Downloading cached openssl from https://cache.nix-ci.com
39.75 s
Downloaded cached libcpuid (326 KiB) in 160ms
39.75 s
Progress: 0 of 1 built, 16 of 71 downloaded from cache (15 downloading)
39.75 s
Downloading cached aws-c-compression from https://cache.nix-ci.com
39.75 s
Downloaded cached keyutils-1.6.3-lib (41 KiB) in 165ms
39.75 s
Progress: 0 of 1 built, 17 of 71 downloaded from cache (15 downloading)
39.76 s
Downloading cached aws-c-sdkutils from https://cache.nix-ci.com
39.76 s
Downloaded cached libsodium-1.0.22-unstable-2026-04 (666 KiB) in 159ms
39.76 s
Progress: 0 of 1 built, 18 of 71 downloaded from cache (15 downloading)
39.76 s
Downloading cached aws-checksums from https://cache.nix-ci.com
39.77 s
Downloaded cached hwloc-2.14.0-lib (459 KiB) in 177ms
39.77 s
Progress: 0 of 1 built, 19 of 71 downloaded from cache (15 downloading)
39.77 s
Downloading cached pcre2 from https://cache.nix-ci.com
39.77 s
Downloaded cached libseccomp-2.6.0-lib (193 KiB) in 170ms
39.77 s
Progress: 0 of 1 built, 20 of 71 downloaded from cache (15 downloading)
39.77 s
Downloading cached xz from https://cache.nix-ci.com
39.85 s
Downloaded cached libxml2 (1.4 MiB) in 168ms
39.85 s
Progress: 0 of 1 built, 21 of 71 downloaded from cache (15 downloading)
39.85 s
Downloading cached zlib from https://cache.nix-ci.com
39.85 s
Downloaded cached acl (125 KiB) in 147ms
39.85 s
Progress: 0 of 1 built, 22 of 71 downloaded from cache (15 downloading)
39.85 s
Downloaded cached lowdown-3.0.1-lib (341 KiB) in 148ms
39.85 s
Progress: 0 of 1 built, 23 of 71 downloaded from cache (14 downloading)
39.85 s
Downloaded cached llhttp (89 KiB) in 149ms
39.85 s
Progress: 0 of 1 built, 24 of 71 downloaded from cache (13 downloading)
39.86 s
Downloaded cached nghttp2-1.69.0-lib (225 KiB) in 130ms
39.86 s
Progress: 0 of 1 built, 25 of 71 downloaded from cache (12 downloading)
39.86 s
Downloaded cached nghttp3 (228 KiB) in 114ms
39.86 s
Progress: 0 of 1 built, 26 of 71 downloaded from cache (11 downloading)
39.86 s
Downloaded cached aws-c-sdkutils (155 KiB) in 105ms
39.86 s
Progress: 0 of 1 built, 27 of 71 downloaded from cache (10 downloading)
39.86 s
Downloaded cached aws-checksums (86 KiB) in 103ms
39.86 s
Progress: 0 of 1 built, 28 of 71 downloaded from cache (9 downloading)
39.86 s
Downloaded cached aws-c-compression (31 KiB) in 111ms
39.86 s
Progress: 0 of 1 built, 29 of 71 downloaded from cache (8 downloading)
39.88 s
Downloaded cached gcc-15.2.0-lib (9.8 MiB) in 287ms
39.88 s
Progress: 0 of 1 built, 30 of 71 downloaded from cache (7 downloading)
39.88 s
Downloading cached boehm-gc from https://cache.nix-ci.com
39.88 s
Downloading cached icu4c from https://cache.nix-ci.com
39.88 s
Downloading cached onetbb from https://cache.nix-ci.com
39.88 s
Downloading cached zstd from https://cache.nix-ci.com
39.95 s
Downloaded cached openssl (8.9 MiB) in 206ms
39.95 s
Progress: 0 of 1 built, 31 of 71 downloaded from cache (10 downloading)
39.96 s
Downloading cached aws-c-cal from https://cache.nix-ci.com
39.96 s
Downloading cached krb5-1.22.2-lib from https://cache.nix-ci.com
39.96 s
Downloading cached ngtcp2 from https://cache.nix-ci.com
39.96 s
Downloading cached s2n-tls from https://cache.nix-ci.com
39.98 s
Downloaded cached pcre2 (2 MiB) in 210ms
39.98 s
Progress: 0 of 1 built, 32 of 71 downloaded from cache (13 downloading)
39.98 s
Downloaded cached xz (837 KiB) in 208ms
39.98 s
Progress: 0 of 1 built, 33 of 71 downloaded from cache (12 downloading)
40.04 s
Downloaded cached zlib (129 KiB) in 196ms
40.04 s
Progress: 0 of 1 built, 34 of 71 downloaded from cache (11 downloading)
40.04 s
Downloading cached libssh2 from https://cache.nix-ci.com
40.04 s
Downloading cached sqlite from https://cache.nix-ci.com
40.05 s
Downloaded cached aws-c-cal (158 KiB) in 92ms
40.05 s
Progress: 0 of 1 built, 35 of 71 downloaded from cache (12 downloading)
40.05 s
Downloaded cached boehm-gc (312 KiB) in 175ms
40.05 s
Progress: 0 of 1 built, 36 of 71 downloaded from cache (11 downloading)
40.06 s
Downloaded cached onetbb (626 KiB) in 183ms
40.06 s
Progress: 0 of 1 built, 37 of 71 downloaded from cache (10 downloading)
40.06 s
Downloading cached libblake3 from https://cache.nix-ci.com
40.07 s
Downloaded cached zstd (1.1 MiB) in 195ms
40.07 s
Progress: 0 of 1 built, 38 of 71 downloaded from cache (10 downloading)
40.07 s
Downloading cached libarchive-3.8.8-lib from https://cache.nix-ci.com
40.18 s
Downloaded cached ngtcp2 (515 KiB) in 226ms
40.18 s
Progress: 0 of 1 built, 39 of 71 downloaded from cache (10 downloading)
40.19 s
Downloaded cached s2n-tls (1.3 MiB) in 235ms
40.19 s
Progress: 0 of 1 built, 40 of 71 downloaded from cache (9 downloading)
40.19 s
Downloading cached aws-c-io from https://cache.nix-ci.com
40.23 s
Downloaded cached libblake3 (117 KiB) in 173ms
40.23 s
Progress: 0 of 1 built, 41 of 71 downloaded from cache (9 downloading)
40.24 s
Downloaded cached krb5-1.22.2-lib (2.7 MiB) in 279ms
40.24 s
Progress: 0 of 1 built, 42 of 71 downloaded from cache (8 downloading)
40.24 s
Downloaded cached libssh2 (330 KiB) in 200ms
40.24 s
Progress: 0 of 1 built, 43 of 71 downloaded from cache (7 downloading)
40.24 s
Downloading cached curl from https://cache.nix-ci.com
40.24 s
Downloading cached libgit2-1.9.4-lib from https://cache.nix-ci.com
40.29 s
Downloaded cached libarchive-3.8.8-lib (953 KiB) in 220ms
40.29 s
Progress: 0 of 1 built, 44 of 71 downloaded from cache (8 downloading)
40.34 s
Downloaded cached sqlite (5.7 MiB) in 299ms
40.34 s
Progress: 0 of 1 built, 45 of 71 downloaded from cache (7 downloading)
40.37 s
Downloaded cached aws-c-io (648 KiB) in 172ms
40.37 s
Progress: 0 of 1 built, 46 of 71 downloaded from cache (6 downloading)
40.37 s
Downloading cached aws-c-event-stream from https://cache.nix-ci.com
40.37 s
Downloading cached aws-c-http from https://cache.nix-ci.com
40.45 s
Downloaded cached curl (1.2 MiB) in 204ms
40.45 s
Progress: 0 of 1 built, 47 of 71 downloaded from cache (7 downloading)
40.45 s
Downloaded cached libgit2-1.9.4-lib (1.6 MiB) in 207ms
40.45 s
Progress: 0 of 1 built, 48 of 71 downloaded from cache (6 downloading)
40.50 s
Downloaded cached gammaloop-nextest-binaries-core-gammaloop-api (70 MiB) in 1.5s
40.50 s
Progress: 0 of 1 built, 49 of 71 downloaded from cache (5 downloading)
40.53 s
Downloaded cached aws-c-event-stream (176 KiB) in 161ms
40.53 s
Progress: 0 of 1 built, 50 of 71 downloaded from cache (4 downloading)
40.53 s
Downloaded cached aws-c-http (641 KiB) in 167ms
40.53 s
Progress: 0 of 1 built, 51 of 71 downloaded from cache (3 downloading)
40.53 s
Downloading cached aws-c-auth from https://cache.nix-ci.com
40.53 s
Downloading cached aws-c-mqtt from https://cache.nix-ci.com
40.58 s
Downloaded cached icu4c (38.2 MiB) in 701ms
40.58 s
Progress: 0 of 1 built, 52 of 71 downloaded from cache (4 downloading)
40.58 s
Downloading cached boost from https://cache.nix-ci.com
40.61 s
Downloaded cached aws-c-mqtt (557 KiB) in 80ms
40.61 s
Progress: 0 of 1 built, 53 of 71 downloaded from cache (4 downloading)
40.62 s
Downloaded cached aws-c-auth (387 KiB) in 81ms
40.62 s
Progress: 0 of 1 built, 54 of 71 downloaded from cache (3 downloading)
40.62 s
Downloading cached aws-c-s3 from https://cache.nix-ci.com
40.75 s
Downloaded cached boost (14.5 MiB) in 170ms
40.75 s
Progress: 0 of 1 built, 55 of 71 downloaded from cache (3 downloading)
40.75 s
Downloading cached nix-util from https://cache.nix-ci.com
40.75 s
Downloaded cached aws-c-s3 (384 KiB) in 136ms
40.75 s
Progress: 0 of 1 built, 56 of 71 downloaded from cache (3 downloading)
40.75 s
Downloading cached aws-crt-cpp from https://cache.nix-ci.com
40.79 s
Downloaded cached gammaloop-nextest-binaries-core-gammaloop-tracing-filter (8 MiB) in 1.8s
40.79 s
Progress: 0 of 1 built, 57 of 71 downloaded from cache (3 downloading)
40.83 s
Downloaded cached aws-crt-cpp (979 KiB) in 80ms
40.83 s
Progress: 0 of 1 built, 58 of 71 downloaded from cache (2 downloading)
40.85 s
Downloaded cached nix-util (2.4 MiB) in 101ms
40.85 s
Progress: 0 of 1 built, 59 of 71 downloaded from cache (1 downloading)
40.85 s
Downloading cached nix-nswrapper from https://cache.nix-ci.com
40.85 s
Downloading cached nix-store from https://cache.nix-ci.com
40.94 s
Downloaded cached nix-nswrapper (131 KiB) in 82ms
40.94 s
Progress: 0 of 1 built, 60 of 71 downloaded from cache (2 downloading)
40.97 s
Downloaded cached nix-store (5.8 MiB) in 122ms
40.97 s
Progress: 0 of 1 built, 61 of 71 downloaded from cache (1 downloading)
40.97 s
Downloading cached nix-fetchers from https://cache.nix-ci.com
40.98 s
Downloading cached nix-main from https://cache.nix-ci.com
41.05 s
Downloaded cached nix-main (393 KiB) in 75ms
41.05 s
Progress: 0 of 1 built, 62 of 71 downloaded from cache (2 downloading)
41.06 s
Downloaded cached nix-fetchers (1.5 MiB) in 85ms
41.06 s
Progress: 0 of 1 built, 63 of 71 downloaded from cache (1 downloading)
41.06 s
Downloading cached nix-expr from https://cache.nix-ci.com
41.14 s
Downloaded cached nix-expr (3.3 MiB) in 82ms
41.14 s
Progress: 0 of 1 built, 64 of 71 downloaded from cache (1 downloading)
41.14 s
Downloading cached nix-flake from https://cache.nix-ci.com
41.22 s
Downloaded cached nix-flake (956 KiB) in 75ms
41.22 s
Progress: 0 of 1 built, 65 of 71 downloaded from cache (1 downloading)
41.22 s
Downloading cached nix-cmd from https://cache.nix-ci.com
41.29 s
Downloaded cached nix-cmd (1 MiB) in 69ms
41.29 s
Progress: 0 of 1 built, 66 of 71 downloaded from cache (1 downloading)
41.29 s
Downloading cached nix from https://cache.nix-ci.com
41.39 s
Downloaded cached nix (3.9 MiB) in 98ms
41.39 s
Progress: 0 of 1 built, 67 of 71 downloaded from cache (1 downloading)
41.39 s
Downloading cached nix from https://cache.nix-ci.com
41.45 s
Downloaded cached nix (8848 B) in 61ms
41.45 s
Progress: 0 of 1 built, 68 of 71 downloaded from cache (1 downloading)
41.90 s
Downloaded cached gammaloop-nextest-binaries-core-gammalooprs (84.2 MiB) in 2.9s
41.90 s
Progress: 0 of 1 built, 69 of 71 downloaded from cache
41.90 s
Downloading cached gammaloop-nextest-binaries-core from https://cache.nix-ci.com
41.94 s
Downloaded cached gammaloop-nextest-binaries-core (1640 B) in 40ms
41.94 s
Progress: 0 of 1 built, 70 of 71 downloaded from cache
41.94 s
Downloading cached nix-ci-check-gammaloop-nextest-core from https://cache.nix-ci.com
41.98 s
Downloaded cached nix-ci-check-gammaloop-nextest-core (1016 B) in 39ms
41.98 s
Progress: 0 of 1 built, 71 of 71 downloaded from cache
47.73 s
evaluating derivation 'g
copying '/nix/store/qism
evaluating derivation 'g
copying '/nix/store/qism
evaluating derivation 'g
copying '/nix/store/qism
evaluating derivation 'g
copying '/nix/store/qism
evaluating derivation 'g
copying '/nix/store/qism
evaluating derivation 'g
copying '/nix/store/qism
evaluating derivation 'g
copying '/nix/store/qism
evaluating derivation 'g
querying gammaloop-nexte
[0.0 KiB DL] querying mp
[4.2 KiB DL] querying mp
[16.2 KiB DL] querying f
[28.4 KiB DL] querying m
[44.2 KiB DL] querying b
[49.0 KiB DL] querying g
[0 /20 built, 16 /0 /63 cop
[0 /22 built, 16 /1 /63 cop
[0 /22 built, 16 /8 /63 cop
[0 /21 built, 16 /14 /63 co
[0 /21 built, 16 /16 /63 co
[0 /20 built, 16 /17 /63 co
[0 /20 built, 16 /22 /63 co
[0 /19 built, 16 /28 /63 co
[0 /18 built, 16 /29 /63 co
[0 /18 built, 16 /32 /63 co
[0 /18 built, 16 /36 /63 co
[0 /18 built, 16 /38 /63 co
[0 /18 built, 16 /39 /63 co
[0 /17 built, 12 /43 /63 co
[0 /17 built, 10 /45 /63 co
[0 /17 built, 10 /48 /63 co
[0 /17 built, 9 /50 /63 cop
[0 /16 built, 8 /51 /63 cop
[2 /0 /15 built, 7 /52 /63 ccrane-dummy-cargo-target.rs (post)> Uploading to the NixCI cache: /nix/store/hd50hqi25fymr09a2w4xdiy5jmb2cfl5-crane-dummy-cargo-target.rs
47.78 s
crane-dummy-cargo-target.rs (post)> warning: 'warn-short-path-literals' is deprecated, use 'lint-short-path-literals = ignore' instead
47.90 s
crane-dummy-cargo-target.rs (post)> copying 0 paths...
47.95 s
crane-dummy-cargo-target.rs (post)> warning: 'warn-short-path-literals' is deprecated, use 'lint-short-path-literals = ignore' instead
49.22 s
crane-dummy-cargo-target.rs (post)> copying 0 paths...
49.25 s
[1 /1 /15 built, 6 /53 /63 ccrane-dummy-proc-macro-cargo-target.rs (post)> Uploading to the NixCI cache: /nix/store/z0b4s6pznqwlbyw5v4bbq7k1kp721g19-crane-dummy-proc-macro-cargo-target.rs
49.30 s
crane-dummy-proc-macro-cargo-target.rs (post)> warning: 'warn-short-path-literals' is deprecated, use 'lint-short-path-literals = ignore' instead
49.42 s
crane-dummy-proc-macro-cargo-target.rs (post)> copying 0 paths...
49.47 s
crane-dummy-proc-macro-cargo-target.rs (post)> warning: 'warn-short-path-literals' is deprecated, use 'lint-short-path-literals = ignore' instead
49.60 s
crane-dummy-proc-macro-cargo-target.rs (post)> copying 0 paths...
59.08 s
[2 /14 built, 7 /54 /63 cop
[2 /12 built, 5 /57 /63 cop
[2 /11 built, 4 /58 /63 cop
[2 /10 built, 4 /59 /63 cop
[2 /9 built, 3 /60 /63 copi
[2 /8 built, 2 /61 /63 copi
[2 /7 built, 1 /62 /63 copi
[1 /2 /6 built, 63 copied
[2 /2 /6 built, 63 copied rust-stable-with-std (post)> Uploading to the NixCI cache: /nix/store/imnwv6nazijihjlgf2h3l1qm63m7l9wk-rust-stable-with-std-2026-07-09
59.12 s
rust-stable-with-std (post)> warning: 'warn-short-path-literals' is deprecated, use 'lint-short-path-literals = ignore' instead
59.24 s
rust-stable-with-std (post)> copying 0 paths...
59.28 s
rust-stable-with-std (post)> warning: 'warn-short-path-literals' is deprecated, use 'lint-short-path-literals = ignore' instead
59.56 s
rust-stable-with-std (post)> copying 0 paths...
59.73 s
[1 /3 /7 built, 63 copied clippy-stable-with-std (post)> Uploading to the NixCI cache: /nix/store/r4bjy93lvnfma1awpi480n2mz3af0adx-clippy-stable-with-std-2026-07-09
59.76 s
clippy-stable-with-std (post)> warning: 'warn-short-path-literals' is deprecated, use 'lint-short-path-literals = ignore' instead
59.88 s
clippy-stable-with-std (post)> copying 0 paths...
59.93 s
clippy-stable-with-std (post)> warning: 'warn-short-path-literals' is deprecated, use 'lint-short-path-literals = ignore' instead
60.06 s
clippy-stable-with-std (post)> copying 0 paths...
60.15 s
[4 /7 built, 63 copied (1
[1 /4 /6 built, 63 copied rust-stable-with-components> /nix/store/imnwv6nazijihjlgf2h3l1qm63m7l9wk-rust-stable-with-std-2026-07-09/lib:
60.15 s
rust-stable-with-components> librustc_driver-a39fc8bf9e61dbb9.so: Keeping existing link to /nix/store/r4bjy93lvnfma1awpi480n2mz3af0adx-clippy-stable-with-std-2026-07-09/lib/librustc_driver-a39fc8bf9e61dbb9.so
60.15 s
rust-stable-with-components> /nix/store/imnwv6nazijihjlgf2h3l1qm63m7l9wk-rust-stable-with-std-2026-07-09/bin:
60.15 s
rust-stable-with-components> rust-gdb: Keeping existing link to /nix/store/r4bjy93lvnfma1awpi480n2mz3af0adx-clippy-stable-with-std-2026-07-09/bin/rust-gdb
60.15 s
rust-stable-with-components> rust-lldb: Keeping existing link to /nix/store/r4bjy93lvnfma1awpi480n2mz3af0adx-clippy-stable-with-std-2026-07-09/bin/rust-lldb
60.15 s
rust-stable-with-components> rustdoc: Keeping existing link to /nix/store/r4bjy93lvnfma1awpi480n2mz3af0adx-clippy-stable-with-std-2026-07-09/bin/rustdoc
60.15 s
rust-stable-with-components> rustc: Keeping existing link to /nix/store/r4bjy93lvnfma1awpi480n2mz3af0adx-clippy-stable-with-std-2026-07-09/bin/rustc
60.15 s
rust-stable-with-components> rust-gdbgui: Keeping existing link to /nix/store/r4bjy93lvnfma1awpi480n2mz3af0adx-clippy-stable-with-std-2026-07-09/bin/rust-gdbgui
60.61 s
rust-stable-with-components (post)> Uploading to the NixCI cache: /nix/store/9pb4ikjdw4gp766ayxl6gg3b7hqm6ds4-rust-stable-with-components-2026-07-09
60.64 s
rust-stable-with-components (post)> warning: 'warn-short-path-literals' is deprecated, use 'lint-short-path-literals = ignore' instead
60.76 s
rust-stable-with-components (post)> copying 0 paths...
60.81 s
rust-stable-with-components (post)> warning: 'warn-short-path-literals' is deprecated, use 'lint-short-path-literals = ignore' instead
60.96 s
rust-stable-with-components (post)> copying 0 paths...
61.27 s
[5 /7 built, 63 copied (1
[1 /5 /6 built, 63 copied gammaloop-nextest-core> Extracting 3 binaries (including 1 non-test binary), 1 build script output directory, and 2 linked paths to /build/nextest-archive-esWNw0
61.68 s
gammaloop-nextest-core> Extracted 18 files to /build/nextest-archive-esWNw0 in 0.41s
61.69 s
gammaloop-nextest-core> ------------
61.69 s
gammaloop-nextest-core> Nextest run ID b7aa5d21-d207-403b-8270-11bcda2dd794 with nextest profile: ci_gammaloop
61.69 s
gammaloop-nextest-core> Starting 339 tests across 2 binaries
62.11 s
gammaloop-nextest-core> ------------
62.11 s
gammaloop-nextest-core> Summary [ 0.421s] 339 tests run: 339 passed , 0 skipped
62.19 s
gammaloop-nextest-core>
62.19 s
gammaloop-nextest-core> ========== nextest test summary ==========
62.19 s
gammaloop-nextest-core> report: target/nextest/ci_gammaloop/junit.xml
62.19 s
gammaloop-nextest-core> tests: 339, failures: 0, errors: 0
62.19 s
gammaloop-nextest-core> No failing testcases found.
62.19 s
gammaloop-nextest-core> =========================================
62.20 s
gammaloop-nextest-core> Extracting 1 binary and 1 linked path to /build/nextest-archive-fjVL9V
62.26 s
gammaloop-nextest-core> Extracted 7 files to /build/nextest-archive-fjVL9V in 0.06s
62.27 s
gammaloop-nextest-core> ------------
62.27 s
gammaloop-nextest-core> Nextest run ID 998553e9-d599-483b-b8b3-858e4ecd3563 with nextest profile: ci_gammaloop
62.27 s
gammaloop-nextest-core> Starting 19 tests across 1 binary
62.28 s
gammaloop-nextest-core> ------------
62.28 s
gammaloop-nextest-core> Summary [ 0.010s] 19 tests run: 19 passed , 0 skipped
62.31 s
gammaloop-nextest-core>
62.31 s
gammaloop-nextest-core> ========== nextest test summary ==========
62.31 s
gammaloop-nextest-core> report: target/nextest/ci_gammaloop/junit.xml
62.31 s
gammaloop-nextest-core> tests: 19, failures: 0, errors: 0
62.31 s
gammaloop-nextest-core> No failing testcases found.
62.31 s
gammaloop-nextest-core> =========================================
62.32 s
gammaloop-nextest-core> Extracting 1 binary to /build/nextest-archive-uZJmKN
62.35 s
gammaloop-nextest-core> Extracted 4 files to /build/nextest-archive-uZJmKN in 0.03s
62.36 s
gammaloop-nextest-core> ------------
62.36 s
gammaloop-nextest-core> Nextest run ID 60cbc14f-f1bc-4186-b9b4-e8c188cc9192 with nextest profile: ci_gammaloop
62.36 s
gammaloop-nextest-core> Starting 0 tests across 1 binary
62.36 s
gammaloop-nextest-core> ------------
62.36 s
gammaloop-nextest-core> Summary [ 0.000s] 0 tests run: 0 passed , 0 skipped
62.38 s
gammaloop-nextest-core>
62.38 s
gammaloop-nextest-core> ========== nextest test summary ==========
62.38 s
gammaloop-nextest-core> report: target/nextest/ci_gammaloop/junit.xml
62.38 s
gammaloop-nextest-core> tests: 0, failures: 0, errors: 0
62.38 s
gammaloop-nextest-core> No failing testcases found.
62.38 s
gammaloop-nextest-core> =========================================
62.40 s
gammaloop-nextest-core> Extracting 4 binaries, 1 build script output directory, and 2 linked paths to /build/nextest-archive-NPuctH
62.82 s
gammaloop-nextest-core> Extracted 18 files to /build/nextest-archive-NPuctH in 0.42s
62.83 s
gammaloop-nextest-core> ------------
62.83 s
gammaloop-nextest-core> Nextest run ID 7b1e8638-3636-403f-84a3-574305cf339c with nextest profile: ci_gammaloop
62.83 s
gammaloop-nextest-core> Starting 456 tests across 4 binaries (61 tests skipped , including 60 tests via profile.ci_gammaloop.default-filter )
63.72 s
gammaloop-nextest-core> FAIL [ 0.148s] (442/456) gammalooprs::test_renormalization finite_part_ghost_2loop
63.72 s
gammaloop-nextest-core> stdout ---
63.72 s
gammaloop-nextest-core>
63.72 s
gammaloop-nextest-core> running 1 test
63.72 s
gammaloop-nextest-core> test finite_part_ghost_2loop ... FAILED
63.72 s
gammaloop-nextest-core>
63.72 s
gammaloop-nextest-core> failures:
63.72 s
gammaloop-nextest-core>
63.72 s
gammaloop-nextest-core> failures:
63.72 s
gammaloop-nextest-core> finite_part_ghost_2loop
63.72 s
gammaloop-nextest-core>
63.72 s
gammaloop-nextest-core> test result: FAILED. 0 passed; 1 failed; 0 ignored; 0 measured; 5 filtered out; finished in 0.14s
63.72 s
gammaloop-nextest-core>
63.72 s
gammaloop-nextest-core> stderr ---
63.72 s
gammaloop-nextest-core> The application panicked (crashed).
63.72 s
gammaloop-nextest-core> Message: called `Result::unwrap()` on an `Err` value: "Symbol spenso::mink redefined with new attributes:\n\t- new user data specified: List([String(\"spenso::representation-v2\"), String(\"inline-metric\"), List([String(\"symbol\"), String(\"mink\")]), List([String(\"cyclic\"), Integer(1), List([List([String(\"symbol\"), String(\"mu\")]), List([String(\"symbol\"), String(\"nu\")]), List([String(\"symbol\"), String(\"rho\")]), List([String(\"symbol\"), String(\"sigma\")])])]), String(\"top\")]) vs None\n"
63.72 s
gammaloop-nextest-core> Location: crates/vakint/src/lib.rs :4766
63.72 s
gammaloop-nextest-core>
63.72 s
gammaloop-nextest-core> ━━━━━━━━━━━━━━━━━━━━━━━━━━━━━━━━━━ BACKTRACE ━━━━━━━━━━━━━━━━━━━━━━━━━━━━━━━━━━━
63.72 s
gammaloop-nextest-core> 1: <color_eyre[5722b77bc20a64cf]::config::PanicHook>::panic_report <unknown>
63.72 s
gammaloop-nextest-core> at <unknown source file> :<unknown line>
63.72 s
gammaloop-nextest-core> 2: <color_eyre[5722b77bc20a64cf]::config::PanicHook>::into_panic_hook::{closure#0} <unknown>
63.72 s
gammaloop-nextest-core> at <unknown source file> :<unknown line>
63.72 s
gammaloop-nextest-core> 3: std[bcb96dfbba0ab899]::panicking::panic_with_hook <unknown>
63.72 s
gammaloop-nextest-core> at <unknown source file> :<unknown line>
63.72 s
gammaloop-nextest-core> 4: std[bcb96dfbba0ab899]::panicking::panic_handler::{closure#0} <unknown>
63.72 s
gammaloop-nextest-core> at <unknown source file> :<unknown line>
63.72 s
gammaloop-nextest-core> 5: std[bcb96dfbba0ab899]::sys::backtrace::__rust_end_short_backtrace::<std[bcb96dfbba0ab899]::panicking::panic_handler::{closure#0}, !> <unknown>
63.72 s
gammaloop-nextest-core> at <unknown source file> :<unknown line>
63.72 s
gammaloop-nextest-core> 6: __rustc[6c289b9f9c454d21]::rust_begin_unwind <unknown>
63.72 s
gammaloop-nextest-core> at <unknown source file> :<unknown line>
63.72 s
gammaloop-nextest-core> 7: core[940e698046960fd5]::panicking::panic_fmt <unknown>
63.72 s
gammaloop-nextest-core> at <unknown source file> :<unknown line>
63.72 s
gammaloop-nextest-core> 8: core[940e698046960fd5]::result::unwrap_failed <unknown>
63.72 s
gammaloop-nextest-core> at <unknown source file> :<unknown line>
63.72 s
gammaloop-nextest-core> 9: <vakint[eb7a1daa8ec05e1f]::Vakint>::sanitize_user_expressions <unknown>
63.72 s
gammaloop-nextest-core> at <unknown source file> :<unknown line>
63.72 s
gammaloop-nextest-core> 10: <vakint[eb7a1daa8ec05e1f]::Vakint>::prepare_expression_for_form <unknown>
63.72 s
gammaloop-nextest-core> at <unknown source file> :<unknown line>
63.72 s
gammaloop-nextest-core> 11: <vakint[eb7a1daa8ec05e1f]::VakintTerm>::tensor_reduce <unknown>
63.72 s
gammaloop-nextest-core> at <unknown source file> :<unknown line>
63.72 s
gammaloop-nextest-core> 12: <vakint[eb7a1daa8ec05e1f]::VakintExpression>::tensor_reduce <unknown>
63.72 s
gammaloop-nextest-core> at <unknown source file> :<unknown line>
63.72 s
gammaloop-nextest-core> 13: <gammalooprs[822fc56666e1de73]::uv::approx::integrated::Integrated>::integrate::<gammalooprs[822fc56666e1de73]::uv::approx::Approximation> <unknown>
63.72 s
gammaloop-nextest-core> at <unknown source file> :<unknown line>
63.72 s
gammaloop-nextest-core> 14: <gammalooprs[822fc56666e1de73]::uv::approx::integrated::Integrated>::run::<gammalooprs[822fc56666e1de73]::uv::approx::Approximation, gammalooprs[822fc56666e1de73]::uv::approx::Approximation> <unknown>
63.72 s
gammaloop-nextest-core> at <unknown source file> :<unknown line>
63.72 s
gammaloop-nextest-core> 15: <gammalooprs[822fc56666e1de73]::uv::forest::Forest>::compute <unknown>
63.72 s
gammaloop-nextest-core> at <unknown source file> :<unknown line>
63.72 s
gammaloop-nextest-core> 16: gammalooprs[822fc56666e1de73]::uv::orchestrator::legacy_renormalization_part <unknown>
63.72 s
gammaloop-nextest-core> at <unknown source file> :<unknown line>
63.72 s
gammaloop-nextest-core> 17: <gammalooprs[822fc56666e1de73]::uv::settings::UVOrchestrator>::renormalization_part <unknown>
63.72 s
gammaloop-nextest-core> at <unknown source file> :<unknown line>
63.72 s
gammaloop-nextest-core> 18: <gammalooprs[822fc56666e1de73]::processes::amplitude::AmplitudeGraph>::renormalization_part <unknown>
63.72 s
gammaloop-nextest-core> at <unknown source file> :<unknown line>
63.72 s
gammaloop-nextest-core> 19: test_renormalization[9f554b029f822e2d]::finite_part_ghost_2loop <unknown>
63.72 s
gammaloop-nextest-core> at <unknown source file> :<unknown line>
63.72 s
gammaloop-nextest-core> 20: <test_renormalization[9f554b029f822e2d]::finite_part_ghost_2loop::{closure#0} as core[940e698046960fd5]::ops::function::FnOnce<()>>::call_once <unknown>
63.72 s
gammaloop-nextest-core> at <unknown source file> :<unknown line>
63.72 s
gammaloop-nextest-core> 21: test[75d6903177b1d7e9]::__rust_begin_short_backtrace::<core[940e698046960fd5]::result::Result<(), alloc[2ea6bcb46fca0c42]::string::String>, fn() -> core[940e698046960fd5]::result::Result<(), alloc[2ea6bcb46fca0c42]::string::String>> <unknown>
63.72 s
gammaloop-nextest-core> at <unknown source file> :<unknown line>
63.72 s
gammaloop-nextest-core> 22: test[75d6903177b1d7e9]::run_test::{closure#0} <unknown>
63.72 s
gammaloop-nextest-core> at <unknown source file> :<unknown line>
63.72 s
gammaloop-nextest-core> 23: std[bcb96dfbba0ab899]::sys::backtrace::__rust_begin_short_backtrace::<test[75d6903177b1d7e9]::run_test::{closure#1}, ()> <unknown>
63.72 s
gammaloop-nextest-core> at <unknown source file> :<unknown line>
63.72 s
gammaloop-nextest-core> 24: <std[bcb96dfbba0ab899]::thread::lifecycle::spawn_unchecked<test[75d6903177b1d7e9]::run_test::{closure#1}, ()>::{closure#1} as core[940e698046960fd5]::ops::function::FnOnce<()>>::call_once::{shim:vtable#0} <unknown>
63.72 s
gammaloop-nextest-core> at <unknown source file> :<unknown line>
63.72 s
gammaloop-nextest-core> 25: <std[bcb96dfbba0ab899]::sys::thread::unix::Thread>::new::thread_start <unknown>
63.72 s
gammaloop-nextest-core> at <unknown source file> :<unknown line>
63.72 s
gammaloop-nextest-core> 26: start_thread <unknown>
63.72 s
gammaloop-nextest-core> at <unknown source file> :<unknown line>
63.72 s
gammaloop-nextest-core> 27: __clone3 <unknown>
63.72 s
gammaloop-nextest-core> at <unknown source file> :<unknown line>
63.72 s
gammaloop-nextest-core>
63.72 s
gammaloop-nextest-core> Run with COLORBT_SHOW_HIDDEN=1 environment variable to disable frame filtering.
63.72 s
gammaloop-nextest-core> Run with RUST_BACKTRACE=full to include source snippets.
63.72 s
gammaloop-nextest-core>
63.77 s
gammaloop-nextest-core> FAIL [ 0.198s] (444/456) gammalooprs::test_renormalization finit_part_ghlo
63.77 s
gammaloop-nextest-core> stdout ---
63.77 s
gammaloop-nextest-core>
63.77 s
gammaloop-nextest-core> running 1 test
63.77 s
gammaloop-nextest-core> test finit_part_ghlo ... FAILED
63.77 s
gammaloop-nextest-core>
63.77 s
gammaloop-nextest-core> failures:
63.77 s
gammaloop-nextest-core>
63.77 s
gammaloop-nextest-core> failures:
63.77 s
gammaloop-nextest-core> finit_part_ghlo
63.77 s
gammaloop-nextest-core>
63.77 s
gammaloop-nextest-core> test result: FAILED. 0 passed; 1 failed; 0 ignored; 0 measured; 5 filtered out; finished in 0.18s
63.77 s
gammaloop-nextest-core>
63.77 s
gammaloop-nextest-core> stderr ---
63.77 s
gammaloop-nextest-core> The application panicked (crashed).
63.77 s
gammaloop-nextest-core> Message: called `Result::unwrap()` on an `Err` value:
63.77 s
gammaloop-nextest-core> 0: Symbolica could not parse FORM output:
63.77 s
gammaloop-nextest-core> [spenso::{antisymmetric,real,spenso::tensor}::f]([spenso::{spenso::representat\
63.77 s
gammaloop-nextest-core> ion,spenso::self_dual}::coad](8,[gammalooprs::{spenso::index}::hedge](0)
63.77 s
gammaloop-nextest-core> ),[spenso::{spenso::representation,spenso::self_dual}::coad](8,[gammaloo\
63.77 s
gammaloop-nextest-core> prs::{spenso::index}::hedge](3)),[spenso::{spenso::representation,spenso\
63.77 s
gammaloop-nextest-core> ::self_dual}::coad](8,[gammalooprs::{spenso::index}::hedge](5)))*
63.77 s
gammaloop-nextest-core> [spenso::{antisymmetric,real,spenso::tensor}::f]([spenso::{spenso::repre\
63.77 s
gammaloop-nextest-core> sentation,spenso::self_dual}::coad](8,[gammalooprs::{spenso::index}::hed\
63.77 s
gammaloop-nextest-core> ge](1)),[spenso::{spenso::representation,spenso::self_dual}::coad](8,
63.77 s
gammaloop-nextest-core> [gammalooprs::{spenso::index}::hedge](3)),[spenso::{spenso::representati\
63.77 s
gammaloop-nextest-core> on,spenso::self_dual}::coad](8,[gammalooprs::{spenso::index}::hedge](5))
63.77 s
gammaloop-nextest-core> )*dot(p1,p0)*[UFO::{}::GC_10]^2*rat(-1,1)
63.77 s
gammaloop-nextest-core>
63.77 s
gammaloop-nextest-core> Error:Symbol spenso::coad redefined with new attributes:
63.77 s
gammaloop-nextest-core> - new user data specified: List([String("spenso::representation-v2"), String("self-dual"), List([String("symbol"), String("coad")]), List([String("cyclic"), Integer(1), List([List([String("symbol"), String("a")]), List([String("symbol"), String("b")]), List([String("symbol"), String("c")]), List([String("symbol"), String("d")])])]), String("top")]) vs None
63.77 s
gammaloop-nextest-core>
63.77 s
gammaloop-nextest-core>
63.77 s
gammaloop-nextest-core> Location:
63.77 s
gammaloop-nextest-core> crates/gammalooprs/src/uv/approx/integrated.rs :332
63.77 s
gammaloop-nextest-core>
63.77 s
gammaloop-nextest-core> ━━━━━━━━━━━━━━━━━━━━━━━━━━━━━━━━━━ BACKTRACE ━━━━━━━━━━━━━━━━━━━━━━━━━━━━━━━━━━━
63.77 s
gammaloop-nextest-core> 1: <color_eyre[5722b77bc20a64cf]::config::EyreHook>::into_eyre_hook::{closure#0} <unknown>
63.77 s
gammaloop-nextest-core> at <unknown source file> :<unknown line>
63.77 s
gammaloop-nextest-core> 2: eyre[cb2fd339c0c40fca]::capture_handler <unknown>
63.77 s
gammaloop-nextest-core> at <unknown source file> :<unknown line>
63.77 s
gammaloop-nextest-core> 3: <eyre[cb2fd339c0c40fca]::Report>::from_std::<vakint[eb7a1daa8ec05e1f]::VakintError> <unknown>
63.77 s
gammaloop-nextest-core> at <unknown source file> :<unknown line>
63.77 s
gammaloop-nextest-core> 4: <gammalooprs[822fc56666e1de73]::uv::approx::integrated::Integrated>::integrate::<gammalooprs[822fc56666e1de73]::uv::hedge_poset::ForestNode> <unknown>
63.77 s
gammaloop-nextest-core> at <unknown source file> :<unknown line>
63.77 s
gammaloop-nextest-core> 5: <gammalooprs[822fc56666e1de73]::uv::approx::integrated::Integrated>::run::<gammalooprs[822fc56666e1de73]::uv::hedge_poset::ForestNode, gammalooprs[822fc56666e1de73]::uv::hedge_poset::ForestNode> <unknown>
63.77 s
gammaloop-nextest-core> at <unknown source file> :<unknown line>
63.77 s
gammaloop-nextest-core> 6: <gammalooprs[822fc56666e1de73]::uv::hedge_poset::Forests>::integrate <unknown>
63.77 s
gammaloop-nextest-core> at <unknown source file> :<unknown line>
63.77 s
gammaloop-nextest-core> 7: gammalooprs[822fc56666e1de73]::uv::orchestrator::hedge_poset_renormalization_part <unknown>
63.77 s
gammaloop-nextest-core> at <unknown source file> :<unknown line>
63.77 s
gammaloop-nextest-core> 8: <gammalooprs[822fc56666e1de73]::uv::settings::UVOrchestrator>::renormalization_part <unknown>
63.77 s
gammaloop-nextest-core> at <unknown source file> :<unknown line>
63.77 s
gammaloop-nextest-core> 9: <gammalooprs[822fc56666e1de73]::processes::amplitude::AmplitudeGraph>::renormalization_part <unknown>
63.77 s
gammaloop-nextest-core> at <unknown source file> :<unknown line>
63.77 s
gammaloop-nextest-core> 10: <test_renormalization[9f554b029f822e2d]::finit_part_ghlo::{closure#0} as core[940e698046960fd5]::ops::function::FnOnce<()>>::call_once <unknown>
63.77 s
gammaloop-nextest-core> at <unknown source file> :<unknown line>
63.77 s
gammaloop-nextest-core> 11: test[75d6903177b1d7e9]::__rust_begin_short_backtrace::<core[940e698046960fd5]::result::Result<(), alloc[2ea6bcb46fca0c42]::string::String>, fn() -> core[940e698046960fd5]::result::Result<(), alloc[2ea6bcb46fca0c42]::string::String>> <unknown>
63.77 s
gammaloop-nextest-core> at <unknown source file> :<unknown line>
63.77 s
gammaloop-nextest-core> 12: test[75d6903177b1d7e9]::run_test::{closure#0} <unknown>
63.77 s
gammaloop-nextest-core> at <unknown source file> :<unknown line>
63.77 s
gammaloop-nextest-core> 13: std[bcb96dfbba0ab899]::sys::backtrace::__rust_begin_short_backtrace::<test[75d6903177b1d7e9]::run_test::{closure#1}, ()> <unknown>
63.77 s
gammaloop-nextest-core> at <unknown source file> :<unknown line>
63.77 s
gammaloop-nextest-core> 14: <std[bcb96dfbba0ab899]::thread::lifecycle::spawn_unchecked<test[75d6903177b1d7e9]::run_test::{closure#1}, ()>::{closure#1} as core[940e698046960fd5]::ops::function::FnOnce<()>>::call_once::{shim:vtable#0} <unknown>
63.77 s
gammaloop-nextest-core> at <unknown source file> :<unknown line>
63.77 s
gammaloop-nextest-core> 15: <std[bcb96dfbba0ab899]::sys::thread::unix::Thread>::new::thread_start <unknown>
63.77 s
gammaloop-nextest-core> at <unknown source file> :<unknown line>
63.77 s
gammaloop-nextest-core> 16: start_thread <unknown>
63.77 s
gammaloop-nextest-core> at <unknown source file> :<unknown line>
63.77 s
gammaloop-nextest-core> 17: __clone3 <unknown>
63.77 s
gammaloop-nextest-core> at <unknown source file> :<unknown line>
63.77 s
gammaloop-nextest-core>
63.77 s
gammaloop-nextest-core> Run with COLORBT_SHOW_HIDDEN=1 environment variable to disable frame filtering.
63.77 s
gammaloop-nextest-core> Run with RUST_BACKTRACE=full to include source snippets.
63.77 s
gammaloop-nextest-core> Location: crates/gammalooprs/tests/test_renormalization.rs :550
63.77 s
gammaloop-nextest-core>
63.77 s
gammaloop-nextest-core> ━━━━━━━━━━━━━━━━━━━━━━━━━━━━━━━━━━ BACKTRACE ━━━━━━━━━━━━━━━━━━━━━━━━━━━━━━━━━━━
63.77 s
gammaloop-nextest-core> 1: <color_eyre[5722b77bc20a64cf]::config::PanicHook>::panic_report <unknown>
63.77 s
gammaloop-nextest-core> at <unknown source file> :<unknown line>
63.77 s
gammaloop-nextest-core> 2: <color_eyre[5722b77bc20a64cf]::config::PanicHook>::into_panic_hook::{closure#0} <unknown>
63.77 s
gammaloop-nextest-core> at <unknown source file> :<unknown line>
63.77 s
gammaloop-nextest-core> 3: std[bcb96dfbba0ab899]::panicking::panic_with_hook <unknown>
63.77 s
gammaloop-nextest-core> at <unknown source file> :<unknown line>
63.77 s
gammaloop-nextest-core> 4: std[bcb96dfbba0ab899]::panicking::panic_handler::{closure#0} <unknown>
63.77 s
gammaloop-nextest-core> at <unknown source file> :<unknown line>
63.77 s
gammaloop-nextest-core> 5: std[bcb96dfbba0ab899]::sys::backtrace::__rust_end_short_backtrace::<std[bcb96dfbba0ab899]::panicking::panic_handler::{closure#0}, !> <unknown>
63.77 s
gammaloop-nextest-core> at <unknown source file> :<unknown line>
63.77 s
gammaloop-nextest-core> 6: __rustc[6c289b9f9c454d21]::rust_begin_unwind <unknown>
63.77 s
gammaloop-nextest-core> at <unknown source file> :<unknown line>
63.77 s
gammaloop-nextest-core> 7: core[940e698046960fd5]::panicking::panic_fmt <unknown>
63.77 s
gammaloop-nextest-core> at <unknown source file> :<unknown line>
63.77 s
gammaloop-nextest-core> 8: core[940e698046960fd5]::result::unwrap_failed <unknown>
63.77 s
gammaloop-nextest-core> at <unknown source file> :<unknown line>
63.77 s
gammaloop-nextest-core> 9: <test_renormalization[9f554b029f822e2d]::finit_part_ghlo::{closure#0} as core[940e698046960fd5]::ops::function::FnOnce<()>>::call_once <unknown>
63.77 s
gammaloop-nextest-core> at <unknown source file> :<unknown line>
63.77 s
gammaloop-nextest-core> 10: test[75d6903177b1d7e9]::__rust_begin_short_backtrace::<core[940e698046960fd5]::result::Result<(), alloc[2ea6bcb46fca0c42]::string::String>, fn() -> core[940e698046960fd5]::result::Result<(), alloc[2ea6bcb46fca0c42]::string::String>> <unknown>
63.77 s
gammaloop-nextest-core> at <unknown source file> :<unknown line>
63.77 s
gammaloop-nextest-core> 11: test[75d6903177b1d7e9]::run_test::{closure#0} <unknown>
63.77 s
gammaloop-nextest-core> at <unknown source file> :<unknown line>
63.77 s
gammaloop-nextest-core> 12: std[bcb96dfbba0ab899]::sys::backtrace::__rust_begin_short_backtrace::<test[75d6903177b1d7e9]::run_test::{closure#1}, ()> <unknown>
63.77 s
gammaloop-nextest-core> at <unknown source file> :<unknown line>
63.77 s
gammaloop-nextest-core> 13: <std[bcb96dfbba0ab899]::thread::lifecycle::spawn_unchecked<test[75d6903177b1d7e9]::run_test::{closure#1}, ()>::{closure#1} as core[940e698046960fd5]::ops::function::FnOnce<()>>::call_once::{shim:vtable#0} <unknown>
63.77 s
gammaloop-nextest-core> at <unknown source file> :<unknown line>
63.77 s
gammaloop-nextest-core> 14: <std[bcb96dfbba0ab899]::sys::thread::unix::Thread>::new::thread_start <unknown>
63.77 s
gammaloop-nextest-core> at <unknown source file> :<unknown line>
63.77 s
gammaloop-nextest-core> 15: start_thread <unknown>
63.77 s
gammaloop-nextest-core> at <unknown source file> :<unknown line>
63.77 s
gammaloop-nextest-core> 16: __clone3 <unknown>
63.77 s
gammaloop-nextest-core> at <unknown source file> :<unknown line>
63.77 s
gammaloop-nextest-core>
63.77 s
gammaloop-nextest-core> Run with COLORBT_SHOW_HIDDEN=1 environment variable to disable frame filtering.
63.77 s
gammaloop-nextest-core> Run with RUST_BACKTRACE=full to include source snippets.
63.77 s
gammaloop-nextest-core>
63.77 s
gammaloop-nextest-core> FAIL [ 0.184s] (445/456) gammalooprs::test_renormalization finite_part_quark_lo
63.77 s
gammaloop-nextest-core> stdout ---
63.77 s
gammaloop-nextest-core>
63.77 s
gammaloop-nextest-core> running 1 test
63.77 s
gammaloop-nextest-core> test finite_part_quark_lo ... FAILED
63.77 s
gammaloop-nextest-core>
63.77 s
gammaloop-nextest-core> failures:
63.77 s
gammaloop-nextest-core>
63.77 s
gammaloop-nextest-core> failures:
63.77 s
gammaloop-nextest-core> finite_part_quark_lo
63.77 s
gammaloop-nextest-core>
63.77 s
gammaloop-nextest-core> test result: FAILED. 0 passed; 1 failed; 0 ignored; 0 measured; 5 filtered out; finished in 0.17s
63.77 s
gammaloop-nextest-core>
63.77 s
gammaloop-nextest-core> stderr ---
63.77 s
gammaloop-nextest-core> The application panicked (crashed).
63.77 s
gammaloop-nextest-core> Message: called `Result::unwrap()` on an `Err` value: "Symbol spenso::mink redefined with new attributes:\n\t- new user data specified: List([String(\"spenso::representation-v2\"), String(\"inline-metric\"), List([String(\"symbol\"), String(\"mink\")]), List([String(\"cyclic\"), Integer(1), List([List([String(\"symbol\"), String(\"mu\")]), List([String(\"symbol\"), String(\"nu\")]), List([String(\"symbol\"), String(\"rho\")]), List([String(\"symbol\"), String(\"sigma\")])])]), String(\"top\")]) vs None\n"
63.77 s
gammaloop-nextest-core> Location: crates/vakint/src/lib.rs :4766
63.77 s
gammaloop-nextest-core>
63.77 s
gammaloop-nextest-core> ━━━━━━━━━━━━━━━━━━━━━━━━━━━━━━━━━━ BACKTRACE ━━━━━━━━━━━━━━━━━━━━━━━━━━━━━━━━━━━
63.77 s
gammaloop-nextest-core> 1: <color_eyre[5722b77bc20a64cf]::config::PanicHook>::panic_report <unknown>
63.77 s
gammaloop-nextest-core> at <unknown source file> :<unknown line>
63.77 s
gammaloop-nextest-core> 2: <color_eyre[5722b77bc20a64cf]::config::PanicHook>::into_panic_hook::{closure#0} <unknown>
63.77 s
gammaloop-nextest-core> at <unknown source file> :<unknown line>
63.77 s
gammaloop-nextest-core> 3: std[bcb96dfbba0ab899]::panicking::panic_with_hook <unknown>
63.77 s
gammaloop-nextest-core> at <unknown source file> :<unknown line>
63.77 s
gammaloop-nextest-core> 4: std[bcb96dfbba0ab899]::panicking::panic_handler::{closure#0} <unknown>
63.77 s
gammaloop-nextest-core> at <unknown source file> :<unknown line>
63.77 s
gammaloop-nextest-core> 5: std[bcb96dfbba0ab899]::sys::backtrace::__rust_end_short_backtrace::<std[bcb96dfbba0ab899]::panicking::panic_handler::{closure#0}, !> <unknown>
63.77 s
gammaloop-nextest-core> at <unknown source file> :<unknown line>
63.77 s
gammaloop-nextest-core> 6: __rustc[6c289b9f9c454d21]::rust_begin_unwind <unknown>
63.77 s
gammaloop-nextest-core> at <unknown source file> :<unknown line>
63.77 s
gammaloop-nextest-core> 7: core[940e698046960fd5]::panicking::panic_fmt <unknown>
63.77 s
gammaloop-nextest-core> at <unknown source file> :<unknown line>
63.77 s
gammaloop-nextest-core> 8: core[940e698046960fd5]::result::unwrap_failed <unknown>
63.77 s
gammaloop-nextest-core> at <unknown source file> :<unknown line>
63.77 s
gammaloop-nextest-core> 9: <vakint[eb7a1daa8ec05e1f]::Vakint>::sanitize_user_expressions <unknown>
63.77 s
gammaloop-nextest-core> at <unknown source file> :<unknown line>
63.77 s
gammaloop-nextest-core> 10: <vakint[eb7a1daa8ec05e1f]::Vakint>::prepare_expression_for_form <unknown>
63.77 s
gammaloop-nextest-core> at <unknown source file> :<unknown line>
63.77 s
gammaloop-nextest-core> 11: <vakint[eb7a1daa8ec05e1f]::VakintTerm>::tensor_reduce <unknown>
63.77 s
gammaloop-nextest-core> at <unknown source file> :<unknown line>
63.77 s
gammaloop-nextest-core> 12: <vakint[eb7a1daa8ec05e1f]::VakintExpression>::tensor_reduce <unknown>
63.77 s
gammaloop-nextest-core> at <unknown source file> :<unknown line>
63.77 s
gammaloop-nextest-core> 13: <gammalooprs[822fc56666e1de73]::uv::approx::integrated::Integrated>::integrate::<gammalooprs[822fc56666e1de73]::uv::hedge_poset::ForestNode> <unknown>
63.77 s
gammaloop-nextest-core> at <unknown source file> :<unknown line>
63.77 s
gammaloop-nextest-core> 14: <gammalooprs[822fc56666e1de73]::uv::approx::integrated::Integrated>::run::<gammalooprs[822fc56666e1de73]::uv::hedge_poset::ForestNode, gammalooprs[822fc56666e1de73]::uv::hedge_poset::ForestNode> <unknown>
63.77 s
gammaloop-nextest-core> at <unknown source file> :<unknown line>
63.77 s
gammaloop-nextest-core> 15: <gammalooprs[822fc56666e1de73]::uv::hedge_poset::Forests>::integrate <unknown>
63.77 s
gammaloop-nextest-core> at <unknown source file> :<unknown line>
63.77 s
gammaloop-nextest-core> 16: gammalooprs[822fc56666e1de73]::uv::orchestrator::hedge_poset_renormalization_part <unknown>
63.77 s
gammaloop-nextest-core> at <unknown source file> :<unknown line>
63.77 s
gammaloop-nextest-core> 17: <gammalooprs[822fc56666e1de73]::uv::settings::UVOrchestrator>::renormalization_part <unknown>
63.77 s
gammaloop-nextest-core> at <unknown source file> :<unknown line>
63.77 s
gammaloop-nextest-core> 18: <gammalooprs[822fc56666e1de73]::processes::amplitude::AmplitudeGraph>::renormalization_part <unknown>
63.77 s
gammaloop-nextest-core> at <unknown source file> :<unknown line>
63.77 s
gammaloop-nextest-core> 19: <test_renormalization[9f554b029f822e2d]::finite_part_quark_lo::{closure#0} as core[940e698046960fd5]::ops::function::FnOnce<()>>::call_once <unknown>
63.77 s
gammaloop-nextest-core> at <unknown source file> :<unknown line>
63.77 s
gammaloop-nextest-core> 20: test[75d6903177b1d7e9]::__rust_begin_short_backtrace::<core[940e698046960fd5]::result::Result<(), alloc[2ea6bcb46fca0c42]::string::String>, fn() -> core[940e698046960fd5]::result::Result<(), alloc[2ea6bcb46fca0c42]::string::String>> <unknown>
63.77 s
gammaloop-nextest-core> at <unknown source file> :<unknown line>
63.77 s
gammaloop-nextest-core> 21: test[75d6903177b1d7e9]::run_test::{closure#0} <unknown>
63.77 s
gammaloop-nextest-core> at <unknown source file> :<unknown line>
63.77 s
gammaloop-nextest-core> 22: std[bcb96dfbba0ab899]::sys::backtrace::__rust_begin_short_backtrace::<test[75d6903177b1d7e9]::run_test::{closure#1}, ()> <unknown>
63.77 s
gammaloop-nextest-core> at <unknown source file> :<unknown line>
63.77 s
gammaloop-nextest-core> 23: <std[bcb96dfbba0ab899]::thread::lifecycle::spawn_unchecked<test[75d6903177b1d7e9]::run_test::{closure#1}, ()>::{closure#1} as core[940e698046960fd5]::ops::function::FnOnce<()>>::call_once::{shim:vtable#0} <unknown>
63.77 s
gammaloop-nextest-core> at <unknown source file> :<unknown line>
63.77 s
gammaloop-nextest-core> 24: <std[bcb96dfbba0ab899]::sys::thread::unix::Thread>::new::thread_start <unknown>
63.77 s
gammaloop-nextest-core> at <unknown source file> :<unknown line>
63.77 s
gammaloop-nextest-core> 25: start_thread <unknown>
63.77 s
gammaloop-nextest-core> at <unknown source file> :<unknown line>
63.77 s
gammaloop-nextest-core> 26: __clone3 <unknown>
63.77 s
gammaloop-nextest-core> at <unknown source file> :<unknown line>
63.77 s
gammaloop-nextest-core>
63.77 s
gammaloop-nextest-core> Run with COLORBT_SHOW_HIDDEN=1 environment variable to disable frame filtering.
63.77 s
gammaloop-nextest-core> Run with RUST_BACKTRACE=full to include source snippets.
63.77 s
gammaloop-nextest-core>
70.49 s
gammaloop-nextest-core> ------------
70.49 s
gammaloop-nextest-core> Summary [ 7.665s] 456 tests run: 453 passed , 3 failed , 61 skipped
70.49 s
gammaloop-nextest-core> FAIL [ 0.148s] (442/456) gammalooprs::test_renormalization finite_part_ghost_2loop
70.50 s
gammaloop-nextest-core> stdout ---
70.50 s
gammaloop-nextest-core>
70.50 s
gammaloop-nextest-core> running 1 test
70.50 s
gammaloop-nextest-core> test finite_part_ghost_2loop ... FAILED
70.50 s
gammaloop-nextest-core>
70.50 s
gammaloop-nextest-core> failures:
70.50 s
gammaloop-nextest-core>
70.50 s
gammaloop-nextest-core> failures:
70.50 s
gammaloop-nextest-core> finite_part_ghost_2loop
70.50 s
gammaloop-nextest-core>
70.50 s
gammaloop-nextest-core> test result: FAILED. 0 passed; 1 failed; 0 ignored; 0 measured; 5 filtered out; finished in 0.14s
70.50 s
gammaloop-nextest-core>
70.50 s
gammaloop-nextest-core> stderr ---
70.50 s
gammaloop-nextest-core> The application panicked (crashed).
70.50 s
gammaloop-nextest-core> Message: called `Result::unwrap()` on an `Err` value: "Symbol spenso::mink redefined with new attributes:\n\t- new user data specified: List([String(\"spenso::representation-v2\"), String(\"inline-metric\"), List([String(\"symbol\"), String(\"mink\")]), List([String(\"cyclic\"), Integer(1), List([List([String(\"symbol\"), String(\"mu\")]), List([String(\"symbol\"), String(\"nu\")]), List([String(\"symbol\"), String(\"rho\")]), List([String(\"symbol\"), String(\"sigma\")])])]), String(\"top\")]) vs None\n"
70.50 s
gammaloop-nextest-core> Location: crates/vakint/src/lib.rs :4766
70.50 s
gammaloop-nextest-core>
70.50 s
gammaloop-nextest-core> ━━━━━━━━━━━━━━━━━━━━━━━━━━━━━━━━━━ BACKTRACE ━━━━━━━━━━━━━━━━━━━━━━━━━━━━━━━━━━━
70.50 s
gammaloop-nextest-core> 1: <color_eyre[5722b77bc20a64cf]::config::PanicHook>::panic_report <unknown>
70.50 s
gammaloop-nextest-core> at <unknown source file> :<unknown line>
70.50 s
gammaloop-nextest-core> 2: <color_eyre[5722b77bc20a64cf]::config::PanicHook>::into_panic_hook::{closure#0} <unknown>
70.50 s
gammaloop-nextest-core> at <unknown source file> :<unknown line>
70.50 s
gammaloop-nextest-core> 3: std[bcb96dfbba0ab899]::panicking::panic_with_hook <unknown>
70.50 s
gammaloop-nextest-core> at <unknown source file> :<unknown line>
70.50 s
gammaloop-nextest-core> 4: std[bcb96dfbba0ab899]::panicking::panic_handler::{closure#0} <unknown>
70.50 s
gammaloop-nextest-core> at <unknown source file> :<unknown line>
70.50 s
gammaloop-nextest-core> 5: std[bcb96dfbba0ab899]::sys::backtrace::__rust_end_short_backtrace::<std[bcb96dfbba0ab899]::panicking::panic_handler::{closure#0}, !> <unknown>
70.50 s
gammaloop-nextest-core> at <unknown source file> :<unknown line>
70.50 s
gammaloop-nextest-core> 6: __rustc[6c289b9f9c454d21]::rust_begin_unwind <unknown>
70.50 s
gammaloop-nextest-core> at <unknown source file> :<unknown line>
70.50 s
gammaloop-nextest-core> 7: core[940e698046960fd5]::panicking::panic_fmt <unknown>
70.50 s
gammaloop-nextest-core> at <unknown source file> :<unknown line>
70.50 s
gammaloop-nextest-core> 8: core[940e698046960fd5]::result::unwrap_failed <unknown>
70.50 s
gammaloop-nextest-core> at <unknown source file> :<unknown line>
70.50 s
gammaloop-nextest-core> 9: <vakint[eb7a1daa8ec05e1f]::Vakint>::sanitize_user_expressions <unknown>
70.50 s
gammaloop-nextest-core> at <unknown source file> :<unknown line>
70.50 s
gammaloop-nextest-core> 10: <vakint[eb7a1daa8ec05e1f]::Vakint>::prepare_expression_for_form <unknown>
70.50 s
gammaloop-nextest-core> at <unknown source file> :<unknown line>
70.50 s
gammaloop-nextest-core> 11: <vakint[eb7a1daa8ec05e1f]::VakintTerm>::tensor_reduce <unknown>
70.50 s
gammaloop-nextest-core> at <unknown source file> :<unknown line>
70.50 s
gammaloop-nextest-core> 12: <vakint[eb7a1daa8ec05e1f]::VakintExpression>::tensor_reduce <unknown>
70.50 s
gammaloop-nextest-core> at <unknown source file> :<unknown line>
70.50 s
gammaloop-nextest-core> 13: <gammalooprs[822fc56666e1de73]::uv::approx::integrated::Integrated>::integrate::<gammalooprs[822fc56666e1de73]::uv::approx::Approximation> <unknown>
70.50 s
gammaloop-nextest-core> at <unknown source file> :<unknown line>
70.50 s
gammaloop-nextest-core> 14: <gammalooprs[822fc56666e1de73]::uv::approx::integrated::Integrated>::run::<gammalooprs[822fc56666e1de73]::uv::approx::Approximation, gammalooprs[822fc56666e1de73]::uv::approx::Approximation> <unknown>
70.50 s
gammaloop-nextest-core> at <unknown source file> :<unknown line>
70.50 s
gammaloop-nextest-core> 15: <gammalooprs[822fc56666e1de73]::uv::forest::Forest>::compute <unknown>
70.50 s
gammaloop-nextest-core> at <unknown source file> :<unknown line>
70.50 s
gammaloop-nextest-core> 16: gammalooprs[822fc56666e1de73]::uv::orchestrator::legacy_renormalization_part <unknown>
70.50 s
gammaloop-nextest-core> at <unknown source file> :<unknown line>
70.50 s
gammaloop-nextest-core> 17: <gammalooprs[822fc56666e1de73]::uv::settings::UVOrchestrator>::renormalization_part <unknown>
70.50 s
gammaloop-nextest-core> at <unknown source file> :<unknown line>
70.50 s
gammaloop-nextest-core> 18: <gammalooprs[822fc56666e1de73]::processes::amplitude::AmplitudeGraph>::renormalization_part <unknown>
70.50 s
gammaloop-nextest-core> at <unknown source file> :<unknown line>
70.50 s
gammaloop-nextest-core> 19: test_renormalization[9f554b029f822e2d]::finite_part_ghost_2loop <unknown>
70.50 s
gammaloop-nextest-core> at <unknown source file> :<unknown line>
70.50 s
gammaloop-nextest-core> 20: <test_renormalization[9f554b029f822e2d]::finite_part_ghost_2loop::{closure#0} as core[940e698046960fd5]::ops::function::FnOnce<()>>::call_once <unknown>
70.50 s
gammaloop-nextest-core> at <unknown source file> :<unknown line>
70.50 s
gammaloop-nextest-core> 21: test[75d6903177b1d7e9]::__rust_begin_short_backtrace::<core[940e698046960fd5]::result::Result<(), alloc[2ea6bcb46fca0c42]::string::String>, fn() -> core[940e698046960fd5]::result::Result<(), alloc[2ea6bcb46fca0c42]::string::String>> <unknown>
70.50 s
gammaloop-nextest-core> at <unknown source file> :<unknown line>
70.50 s
gammaloop-nextest-core> 22: test[75d6903177b1d7e9]::run_test::{closure#0} <unknown>
70.50 s
gammaloop-nextest-core> at <unknown source file> :<unknown line>
70.50 s
gammaloop-nextest-core> 23: std[bcb96dfbba0ab899]::sys::backtrace::__rust_begin_short_backtrace::<test[75d6903177b1d7e9]::run_test::{closure#1}, ()> <unknown>
70.50 s
gammaloop-nextest-core> at <unknown source file> :<unknown line>
70.50 s
gammaloop-nextest-core> 24: <std[bcb96dfbba0ab899]::thread::lifecycle::spawn_unchecked<test[75d6903177b1d7e9]::run_test::{closure#1}, ()>::{closure#1} as core[940e698046960fd5]::ops::function::FnOnce<()>>::call_once::{shim:vtable#0} <unknown>
70.50 s
gammaloop-nextest-core> at <unknown source file> :<unknown line>
70.50 s
gammaloop-nextest-core> 25: <std[bcb96dfbba0ab899]::sys::thread::unix::Thread>::new::thread_start <unknown>
70.50 s
gammaloop-nextest-core> at <unknown source file> :<unknown line>
70.50 s
gammaloop-nextest-core> 26: start_thread <unknown>
70.50 s
gammaloop-nextest-core> at <unknown source file> :<unknown line>
70.50 s
gammaloop-nextest-core> 27: __clone3 <unknown>
70.50 s
gammaloop-nextest-core> at <unknown source file> :<unknown line>
70.50 s
gammaloop-nextest-core>
70.50 s
gammaloop-nextest-core> Run with COLORBT_SHOW_HIDDEN=1 environment variable to disable frame filtering.
70.50 s
gammaloop-nextest-core> Run with RUST_BACKTRACE=full to include source snippets.
70.50 s
gammaloop-nextest-core>
70.50 s
gammaloop-nextest-core> FAIL [ 0.198s] (444/456) gammalooprs::test_renormalization finit_part_ghlo
70.50 s
gammaloop-nextest-core> stdout ---
70.50 s
gammaloop-nextest-core>
70.50 s
gammaloop-nextest-core> running 1 test
70.50 s
gammaloop-nextest-core> test finit_part_ghlo ... FAILED
70.50 s
gammaloop-nextest-core>
70.50 s
gammaloop-nextest-core> failures:
70.50 s
gammaloop-nextest-core>
70.50 s
gammaloop-nextest-core> failures:
70.50 s
gammaloop-nextest-core> finit_part_ghlo
70.50 s
gammaloop-nextest-core>
70.50 s
gammaloop-nextest-core> test result: FAILED. 0 passed; 1 failed; 0 ignored; 0 measured; 5 filtered out; finished in 0.18s
70.50 s
gammaloop-nextest-core>
70.50 s
gammaloop-nextest-core> stderr ---
70.50 s
gammaloop-nextest-core> The application panicked (crashed).
70.50 s
gammaloop-nextest-core> Message: called `Result::unwrap()` on an `Err` value:
70.50 s
gammaloop-nextest-core> 0: Symbolica could not parse FORM output:
70.50 s
gammaloop-nextest-core> [spenso::{antisymmetric,real,spenso::tensor}::f]([spenso::{spenso::representat\
70.50 s
gammaloop-nextest-core> ion,spenso::self_dual}::coad](8,[gammalooprs::{spenso::index}::hedge](0)
70.50 s
gammaloop-nextest-core> ),[spenso::{spenso::representation,spenso::self_dual}::coad](8,[gammaloo\
70.50 s
gammaloop-nextest-core> prs::{spenso::index}::hedge](3)),[spenso::{spenso::representation,spenso\
70.50 s
gammaloop-nextest-core> ::self_dual}::coad](8,[gammalooprs::{spenso::index}::hedge](5)))*
70.50 s
gammaloop-nextest-core> [spenso::{antisymmetric,real,spenso::tensor}::f]([spenso::{spenso::repre\
70.50 s
gammaloop-nextest-core> sentation,spenso::self_dual}::coad](8,[gammalooprs::{spenso::index}::hed\
70.50 s
gammaloop-nextest-core> ge](1)),[spenso::{spenso::representation,spenso::self_dual}::coad](8,
70.50 s
gammaloop-nextest-core> [gammalooprs::{spenso::index}::hedge](3)),[spenso::{spenso::representati\
70.50 s
gammaloop-nextest-core> on,spenso::self_dual}::coad](8,[gammalooprs::{spenso::index}::hedge](5))
70.50 s
gammaloop-nextest-core> )*dot(p1,p0)*[UFO::{}::GC_10]^2*rat(-1,1)
70.50 s
gammaloop-nextest-core>
70.50 s
gammaloop-nextest-core> Error:Symbol spenso::coad redefined with new attributes:
70.50 s
gammaloop-nextest-core> - new user data specified: List([String("spenso::representation-v2"), String("self-dual"), List([String("symbol"), String("coad")]), List([String("cyclic"), Integer(1), List([List([String("symbol"), String("a")]), List([String("symbol"), String("b")]), List([String("symbol"), String("c")]), List([String("symbol"), String("d")])])]), String("top")]) vs None
70.50 s
gammaloop-nextest-core>
70.50 s
gammaloop-nextest-core>
70.50 s
gammaloop-nextest-core> Location:
70.50 s
gammaloop-nextest-core> crates/gammalooprs/src/uv/approx/integrated.rs :332
70.50 s
gammaloop-nextest-core>
70.50 s
gammaloop-nextest-core> ━━━━━━━━━━━━━━━━━━━━━━━━━━━━━━━━━━ BACKTRACE ━━━━━━━━━━━━━━━━━━━━━━━━━━━━━━━━━━━
70.50 s
gammaloop-nextest-core> 1: <color_eyre[5722b77bc20a64cf]::config::EyreHook>::into_eyre_hook::{closure#0} <unknown>
70.50 s
gammaloop-nextest-core> at <unknown source file> :<unknown line>
70.50 s
gammaloop-nextest-core> 2: eyre[cb2fd339c0c40fca]::capture_handler <unknown>
70.50 s
gammaloop-nextest-core> at <unknown source file> :<unknown line>
70.50 s
gammaloop-nextest-core> 3: <eyre[cb2fd339c0c40fca]::Report>::from_std::<vakint[eb7a1daa8ec05e1f]::VakintError> <unknown>
70.50 s
gammaloop-nextest-core> at <unknown source file> :<unknown line>
70.50 s
gammaloop-nextest-core> 4: <gammalooprs[822fc56666e1de73]::uv::approx::integrated::Integrated>::integrate::<gammalooprs[822fc56666e1de73]::uv::hedge_poset::ForestNode> <unknown>
70.50 s
gammaloop-nextest-core> at <unknown source file> :<unknown line>
70.50 s
gammaloop-nextest-core> 5: <gammalooprs[822fc56666e1de73]::uv::approx::integrated::Integrated>::run::<gammalooprs[822fc56666e1de73]::uv::hedge_poset::ForestNode, gammalooprs[822fc56666e1de73]::uv::hedge_poset::ForestNode> <unknown>
70.50 s
gammaloop-nextest-core> at <unknown source file> :<unknown line>
70.50 s
gammaloop-nextest-core> 6: <gammalooprs[822fc56666e1de73]::uv::hedge_poset::Forests>::integrate <unknown>
70.50 s
gammaloop-nextest-core> at <unknown source file> :<unknown line>
70.50 s
gammaloop-nextest-core> 7: gammalooprs[822fc56666e1de73]::uv::orchestrator::hedge_poset_renormalization_part <unknown>
70.50 s
gammaloop-nextest-core> at <unknown source file> :<unknown line>
70.50 s
gammaloop-nextest-core> 8: <gammalooprs[822fc56666e1de73]::uv::settings::UVOrchestrator>::renormalization_part <unknown>
70.50 s
gammaloop-nextest-core> at <unknown source file> :<unknown line>
70.50 s
gammaloop-nextest-core> 9: <gammalooprs[822fc56666e1de73]::processes::amplitude::AmplitudeGraph>::renormalization_part <unknown>
70.50 s
gammaloop-nextest-core> at <unknown source file> :<unknown line>
70.50 s
gammaloop-nextest-core> 10: <test_renormalization[9f554b029f822e2d]::finit_part_ghlo::{closure#0} as core[940e698046960fd5]::ops::function::FnOnce<()>>::call_once <unknown>
70.50 s
gammaloop-nextest-core> at <unknown source file> :<unknown line>
70.50 s
gammaloop-nextest-core> 11: test[75d6903177b1d7e9]::__rust_begin_short_backtrace::<core[940e698046960fd5]::result::Result<(), alloc[2ea6bcb46fca0c42]::string::String>, fn() -> core[940e698046960fd5]::result::Result<(), alloc[2ea6bcb46fca0c42]::string::String>> <unknown>
70.50 s
gammaloop-nextest-core> at <unknown source file> :<unknown line>
70.50 s
gammaloop-nextest-core> 12: test[75d6903177b1d7e9]::run_test::{closure#0} <unknown>
70.50 s
gammaloop-nextest-core> at <unknown source file> :<unknown line>
70.50 s
gammaloop-nextest-core> 13: std[bcb96dfbba0ab899]::sys::backtrace::__rust_begin_short_backtrace::<test[75d6903177b1d7e9]::run_test::{closure#1}, ()> <unknown>
70.50 s
gammaloop-nextest-core> at <unknown source file> :<unknown line>
70.50 s
gammaloop-nextest-core> 14: <std[bcb96dfbba0ab899]::thread::lifecycle::spawn_unchecked<test[75d6903177b1d7e9]::run_test::{closure#1}, ()>::{closure#1} as core[940e698046960fd5]::ops::function::FnOnce<()>>::call_once::{shim:vtable#0} <unknown>
70.50 s
gammaloop-nextest-core> at <unknown source file> :<unknown line>
70.50 s
gammaloop-nextest-core> 15: <std[bcb96dfbba0ab899]::sys::thread::unix::Thread>::new::thread_start <unknown>
70.50 s
gammaloop-nextest-core> at <unknown source file> :<unknown line>
70.50 s
gammaloop-nextest-core> 16: start_thread <unknown>
70.50 s
gammaloop-nextest-core> at <unknown source file> :<unknown line>
70.50 s
gammaloop-nextest-core> 17: __clone3 <unknown>
70.50 s
gammaloop-nextest-core> at <unknown source file> :<unknown line>
70.50 s
gammaloop-nextest-core>
70.50 s
gammaloop-nextest-core> Run with COLORBT_SHOW_HIDDEN=1 environment variable to disable frame filtering.
70.50 s
gammaloop-nextest-core> Run with RUST_BACKTRACE=full to include source snippets.
70.50 s
gammaloop-nextest-core> Location: crates/gammalooprs/tests/test_renormalization.rs :550
70.50 s
gammaloop-nextest-core>
70.50 s
gammaloop-nextest-core> ━━━━━━━━━━━━━━━━━━━━━━━━━━━━━━━━━━ BACKTRACE ━━━━━━━━━━━━━━━━━━━━━━━━━━━━━━━━━━━
70.50 s
gammaloop-nextest-core> 1: <color_eyre[5722b77bc20a64cf]::config::PanicHook>::panic_report <unknown>
70.50 s
gammaloop-nextest-core> at <unknown source file> :<unknown line>
70.50 s
gammaloop-nextest-core> 2: <color_eyre[5722b77bc20a64cf]::config::PanicHook>::into_panic_hook::{closure#0} <unknown>
70.50 s
gammaloop-nextest-core> at <unknown source file> :<unknown line>
70.50 s
gammaloop-nextest-core> 3: std[bcb96dfbba0ab899]::panicking::panic_with_hook <unknown>
70.50 s
gammaloop-nextest-core> at <unknown source file> :<unknown line>
70.50 s
gammaloop-nextest-core> 4: std[bcb96dfbba0ab899]::panicking::panic_handler::{closure#0} <unknown>
70.50 s
gammaloop-nextest-core> at <unknown source file> :<unknown line>
70.50 s
gammaloop-nextest-core> 5: std[bcb96dfbba0ab899]::sys::backtrace::__rust_end_short_backtrace::<std[bcb96dfbba0ab899]::panicking::panic_handler::{closure#0}, !> <unknown>
70.50 s
gammaloop-nextest-core> at <unknown source file> :<unknown line>
70.50 s
gammaloop-nextest-core> 6: __rustc[6c289b9f9c454d21]::rust_begin_unwind <unknown>
70.50 s
gammaloop-nextest-core> at <unknown source file> :<unknown line>
70.50 s
gammaloop-nextest-core> 7: core[940e698046960fd5]::panicking::panic_fmt <unknown>
70.50 s
gammaloop-nextest-core> at <unknown source file> :<unknown line>
70.50 s
gammaloop-nextest-core> 8: core[940e698046960fd5]::result::unwrap_failed <unknown>
70.50 s
gammaloop-nextest-core> at <unknown source file> :<unknown line>
70.50 s
gammaloop-nextest-core> 9: <test_renormalization[9f554b029f822e2d]::finit_part_ghlo::{closure#0} as core[940e698046960fd5]::ops::function::FnOnce<()>>::call_once <unknown>
70.50 s
gammaloop-nextest-core> at <unknown source file> :<unknown line>
70.50 s
gammaloop-nextest-core> 10: test[75d6903177b1d7e9]::__rust_begin_short_backtrace::<core[940e698046960fd5]::result::Result<(), alloc[2ea6bcb46fca0c42]::string::String>, fn() -> core[940e698046960fd5]::result::Result<(), alloc[2ea6bcb46fca0c42]::string::String>> <unknown>
70.50 s
gammaloop-nextest-core> at <unknown source file> :<unknown line>
70.50 s
gammaloop-nextest-core> 11: test[75d6903177b1d7e9]::run_test::{closure#0} <unknown>
70.50 s
gammaloop-nextest-core> at <unknown source file> :<unknown line>
70.50 s
gammaloop-nextest-core> 12: std[bcb96dfbba0ab899]::sys::backtrace::__rust_begin_short_backtrace::<test[75d6903177b1d7e9]::run_test::{closure#1}, ()> <unknown>
70.50 s
gammaloop-nextest-core> at <unknown source file> :<unknown line>
70.50 s
gammaloop-nextest-core> 13: <std[bcb96dfbba0ab899]::thread::lifecycle::spawn_unchecked<test[75d6903177b1d7e9]::run_test::{closure#1}, ()>::{closure#1} as core[940e698046960fd5]::ops::function::FnOnce<()>>::call_once::{shim:vtable#0} <unknown>
70.50 s
gammaloop-nextest-core> at <unknown source file> :<unknown line>
70.50 s
gammaloop-nextest-core> 14: <std[bcb96dfbba0ab899]::sys::thread::unix::Thread>::new::thread_start <unknown>
70.50 s
gammaloop-nextest-core> at <unknown source file> :<unknown line>
70.50 s
gammaloop-nextest-core> 15: start_thread <unknown>
70.50 s
gammaloop-nextest-core> at <unknown source file> :<unknown line>
70.50 s
gammaloop-nextest-core> 16: __clone3 <unknown>
70.50 s
gammaloop-nextest-core> at <unknown source file> :<unknown line>
70.50 s
gammaloop-nextest-core>
70.50 s
gammaloop-nextest-core> Run with COLORBT_SHOW_HIDDEN=1 environment variable to disable frame filtering.
70.50 s
gammaloop-nextest-core> Run with RUST_BACKTRACE=full to include source snippets.
70.50 s
gammaloop-nextest-core>
70.50 s
gammaloop-nextest-core> FAIL [ 0.184s] (445/456) gammalooprs::test_renormalization finite_part_quark_lo
70.50 s
gammaloop-nextest-core> stdout ---
70.50 s
gammaloop-nextest-core>
70.50 s
gammaloop-nextest-core> running 1 test
70.50 s
gammaloop-nextest-core> test finite_part_quark_lo ... FAILED
70.50 s
gammaloop-nextest-core>
70.50 s
gammaloop-nextest-core> failures:
70.50 s
gammaloop-nextest-core>
70.50 s
gammaloop-nextest-core> failures:
70.50 s
gammaloop-nextest-core> finite_part_quark_lo
70.50 s
gammaloop-nextest-core>
70.50 s
gammaloop-nextest-core> test result: FAILED. 0 passed; 1 failed; 0 ignored; 0 measured; 5 filtered out; finished in 0.17s
70.50 s
gammaloop-nextest-core>
70.50 s
gammaloop-nextest-core> stderr ---
70.50 s
gammaloop-nextest-core> The application panicked (crashed).
70.50 s
gammaloop-nextest-core> Message: called `Result::unwrap()` on an `Err` value: "Symbol spenso::mink redefined with new attributes:\n\t- new user data specified: List([String(\"spenso::representation-v2\"), String(\"inline-metric\"), List([String(\"symbol\"), String(\"mink\")]), List([String(\"cyclic\"), Integer(1), List([List([String(\"symbol\"), String(\"mu\")]), List([String(\"symbol\"), String(\"nu\")]), List([String(\"symbol\"), String(\"rho\")]), List([String(\"symbol\"), String(\"sigma\")])])]), String(\"top\")]) vs None\n"
70.50 s
gammaloop-nextest-core> Location: crates/vakint/src/lib.rs :4766
70.50 s
gammaloop-nextest-core>
70.50 s
gammaloop-nextest-core> ━━━━━━━━━━━━━━━━━━━━━━━━━━━━━━━━━━ BACKTRACE ━━━━━━━━━━━━━━━━━━━━━━━━━━━━━━━━━━━
70.50 s
gammaloop-nextest-core> 1: <color_eyre[5722b77bc20a64cf]::config::PanicHook>::panic_report <unknown>
70.50 s
gammaloop-nextest-core> at <unknown source file> :<unknown line>
70.50 s
gammaloop-nextest-core> 2: <color_eyre[5722b77bc20a64cf]::config::PanicHook>::into_panic_hook::{closure#0} <unknown>
70.50 s
gammaloop-nextest-core> at <unknown source file> :<unknown line>
70.50 s
gammaloop-nextest-core> 3: std[bcb96dfbba0ab899]::panicking::panic_with_hook <unknown>
70.50 s
gammaloop-nextest-core> at <unknown source file> :<unknown line>
70.50 s
gammaloop-nextest-core> 4: std[bcb96dfbba0ab899]::panicking::panic_handler::{closure#0} <unknown>
70.50 s
gammaloop-nextest-core> at <unknown source file> :<unknown line>
70.50 s
gammaloop-nextest-core> 5: std[bcb96dfbba0ab899]::sys::backtrace::__rust_end_short_backtrace::<std[bcb96dfbba0ab899]::panicking::panic_handler::{closure#0}, !> <unknown>
70.50 s
gammaloop-nextest-core> at <unknown source file> :<unknown line>
70.50 s
gammaloop-nextest-core> 6: __rustc[6c289b9f9c454d21]::rust_begin_unwind <unknown>
70.50 s
gammaloop-nextest-core> at <unknown source file> :<unknown line>
70.50 s
gammaloop-nextest-core> 7: core[940e698046960fd5]::panicking::panic_fmt <unknown>
70.50 s
gammaloop-nextest-core> at <unknown source file> :<unknown line>
70.50 s
gammaloop-nextest-core> 8: core[940e698046960fd5]::result::unwrap_failed <unknown>
70.50 s
gammaloop-nextest-core> at <unknown source file> :<unknown line>
70.50 s
gammaloop-nextest-core> 9: <vakint[eb7a1daa8ec05e1f]::Vakint>::sanitize_user_expressions <unknown>
70.50 s
gammaloop-nextest-core> at <unknown source file> :<unknown line>
70.50 s
gammaloop-nextest-core> 10: <vakint[eb7a1daa8ec05e1f]::Vakint>::prepare_expression_for_form <unknown>
70.50 s
gammaloop-nextest-core> at <unknown source file> :<unknown line>
70.50 s
gammaloop-nextest-core> 11: <vakint[eb7a1daa8ec05e1f]::VakintTerm>::tensor_reduce <unknown>
70.50 s
gammaloop-nextest-core> at <unknown source file> :<unknown line>
70.50 s
gammaloop-nextest-core> 12: <vakint[eb7a1daa8ec05e1f]::VakintExpression>::tensor_reduce <unknown>
70.50 s
gammaloop-nextest-core> at <unknown source file> :<unknown line>
70.50 s
gammaloop-nextest-core> 13: <gammalooprs[822fc56666e1de73]::uv::approx::integrated::Integrated>::integrate::<gammalooprs[822fc56666e1de73]::uv::hedge_poset::ForestNode> <unknown>
70.50 s
gammaloop-nextest-core> at <unknown source file> :<unknown line>
70.50 s
gammaloop-nextest-core> 14: <gammalooprs[822fc56666e1de73]::uv::approx::integrated::Integrated>::run::<gammalooprs[822fc56666e1de73]::uv::hedge_poset::ForestNode, gammalooprs[822fc56666e1de73]::uv::hedge_poset::ForestNode> <unknown>
70.50 s
gammaloop-nextest-core> at <unknown source file> :<unknown line>
70.50 s
gammaloop-nextest-core> 15: <gammalooprs[822fc56666e1de73]::uv::hedge_poset::Forests>::integrate <unknown>
70.50 s
gammaloop-nextest-core> at <unknown source file> :<unknown line>
70.50 s
gammaloop-nextest-core> 16: gammalooprs[822fc56666e1de73]::uv::orchestrator::hedge_poset_renormalization_part <unknown>
70.50 s
gammaloop-nextest-core> at <unknown source file> :<unknown line>
70.50 s
gammaloop-nextest-core> 17: <gammalooprs[822fc56666e1de73]::uv::settings::UVOrchestrator>::renormalization_part <unknown>
70.50 s
gammaloop-nextest-core> at <unknown source file> :<unknown line>
70.50 s
gammaloop-nextest-core> 18: <gammalooprs[822fc56666e1de73]::processes::amplitude::AmplitudeGraph>::renormalization_part <unknown>
70.50 s
gammaloop-nextest-core> at <unknown source file> :<unknown line>
70.50 s
gammaloop-nextest-core> 19: <test_renormalization[9f554b029f822e2d]::finite_part_quark_lo::{closure#0} as core[940e698046960fd5]::ops::function::FnOnce<()>>::call_once <unknown>
70.50 s
gammaloop-nextest-core> at <unknown source file> :<unknown line>
70.50 s
gammaloop-nextest-core> 20: test[75d6903177b1d7e9]::__rust_begin_short_backtrace::<core[940e698046960fd5]::result::Result<(), alloc[2ea6bcb46fca0c42]::string::String>, fn() -> core[940e698046960fd5]::result::Result<(), alloc[2ea6bcb46fca0c42]::string::String>> <unknown>
70.50 s
gammaloop-nextest-core> at <unknown source file> :<unknown line>
70.50 s
gammaloop-nextest-core> 21: test[75d6903177b1d7e9]::run_test::{closure#0} <unknown>
70.50 s
gammaloop-nextest-core> at <unknown source file> :<unknown line>
70.50 s
gammaloop-nextest-core> 22: std[bcb96dfbba0ab899]::sys::backtrace::__rust_begin_short_backtrace::<test[75d6903177b1d7e9]::run_test::{closure#1}, ()> <unknown>
70.50 s
gammaloop-nextest-core> at <unknown source file> :<unknown line>
70.50 s
gammaloop-nextest-core> 23: <std[bcb96dfbba0ab899]::thread::lifecycle::spawn_unchecked<test[75d6903177b1d7e9]::run_test::{closure#1}, ()>::{closure#1} as core[940e698046960fd5]::ops::function::FnOnce<()>>::call_once::{shim:vtable#0} <unknown>
70.50 s
gammaloop-nextest-core> at <unknown source file> :<unknown line>
70.50 s
gammaloop-nextest-core> 24: <std[bcb96dfbba0ab899]::sys::thread::unix::Thread>::new::thread_start <unknown>
70.50 s
gammaloop-nextest-core> at <unknown source file> :<unknown line>
70.50 s
gammaloop-nextest-core> 25: start_thread <unknown>
70.50 s
gammaloop-nextest-core> at <unknown source file> :<unknown line>
70.50 s
gammaloop-nextest-core> 26: __clone3 <unknown>
70.50 s
gammaloop-nextest-core> at <unknown source file> :<unknown line>
70.50 s
gammaloop-nextest-core>
70.50 s
gammaloop-nextest-core> Run with COLORBT_SHOW_HIDDEN=1 environment variable to disable frame filtering.
70.50 s
gammaloop-nextest-core> Run with RUST_BACKTRACE=full to include source snippets.
70.50 s
gammaloop-nextest-core>
70.55 s
gammaloop-nextest-core> error : test run failed
70.57 s
gammaloop-nextest-core>
70.57 s
gammaloop-nextest-core> ========== nextest test summary ==========
70.57 s
gammaloop-nextest-core> report: target/nextest/ci_gammaloop/junit.xml
70.57 s
gammaloop-nextest-core> tests: 456, failures: 3, errors: 0
70.57 s
gammaloop-nextest-core>
70.57 s
gammaloop-nextest-core> 1. gammalooprs::test_renormalization::finite_part_ghost_2loop
70.57 s
gammaloop-nextest-core> failure: test failure with exit code 101
70.57 s
gammaloop-nextest-core> system-out
70.57 s
gammaloop-nextest-core> running 1 test
70.57 s
gammaloop-nextest-core> test finite_part_ghost_2loop ... FAILED
70.57 s
gammaloop-nextest-core>
70.57 s
gammaloop-nextest-core> failures:
70.57 s
gammaloop-nextest-core>
70.57 s
gammaloop-nextest-core> failures:
70.57 s
gammaloop-nextest-core> finite_part_ghost_2loop
70.57 s
gammaloop-nextest-core>
70.57 s
gammaloop-nextest-core> test result: FAILED. 0 passed; 1 failed; 0 ignored; 0 measured; 5 filtered out; finished in 0.14s
70.57 s
gammaloop-nextest-core> system-err
70.57 s
gammaloop-nextest-core> The application panicked (crashed).
70.57 s
gammaloop-nextest-core> Message: called `Result::unwrap()` on an `Err` value: "Symbol spenso::mink redefined with new attributes:\n\t- new user data specified: List([String(\"spenso::representation-v2\"), String(\"inline-metric\"), List([String(\"symbol\"), String(\"mink\")]), List([String(\"cyclic\"), Integer(1), List([List([String(\"symbol\"), String(\"mu\")]), List([String(\"symbol\"), String(\"nu\")]), List([String(\"symbol\"), String(\"rho\")]), List([String(\"symbol\"), String(\"sigma\")])])]), String(\"top\")]) vs None\n"
70.57 s
gammaloop-nextest-core> Location: crates/vakint/src/lib.rs:4766
70.57 s
gammaloop-nextest-core>
70.57 s
gammaloop-nextest-core> ━━━━━━━━━━━━━━━━━━━━━━━━━━━━━━━━━━ BACKTRACE ━━━━━━━━━━━━━━━━━━━━━━━━━━━━━━━━━━━
70.57 s
gammaloop-nextest-core> 1: <color_eyre[5722b77bc20a64cf]::config::PanicHook>::panic_report<unknown>
70.57 s
gammaloop-nextest-core> at <unknown source file>:<unknown line>
70.57 s
gammaloop-nextest-core> 2: <color_eyre[5722b77bc20a64cf]::config::PanicHook>::into_panic_hook::{closure#0}<unknown>
70.57 s
gammaloop-nextest-core> at <unknown source file>:<unknown line>
70.57 s
gammaloop-nextest-core> 3: std[bcb96dfbba0ab899]::panicking::panic_with_hook<unknown>
70.57 s
gammaloop-nextest-core> at <unknown source file>:<unknown line>
70.57 s
gammaloop-nextest-core> 4: std[bcb96dfbba0ab899]::panicking::panic_handler::{closure#0}<unknown>
70.57 s
gammaloop-nextest-core> at <unknown source file>:<unknown line>
70.57 s
gammaloop-nextest-core> 5: std[bcb96dfbba0ab899]::sys::backtrace::__rust_end_short_backtrace::<std[bcb96dfbba0ab899]::panicking::panic_handler::{closure#0}, !><unknown>
70.57 s
gammaloop-nextest-core> at <unknown source file>:<unknown line>
70.57 s
gammaloop-nextest-core> 6: __rustc[6c289b9f9c454d21]::rust_begin_unwind<unknown>
70.57 s
gammaloop-nextest-core> at <unknown source file>:<unknown line>
70.57 s
gammaloop-nextest-core> 7: core[940e698046960fd5]::panicking::panic_fmt<unknown>
70.57 s
gammaloop-nextest-core> at <unknown source file>:<unknown line>
70.57 s
gammaloop-nextest-core> 8: core[940e698046960fd5]::result::unwrap_failed<unknown>
70.57 s
gammaloop-nextest-core> at <unknown source file>:<unknown line>
70.57 s
gammaloop-nextest-core> 9: <vakint[eb7a1daa8ec05e1f]::Vakint>::sanitize_user_expressions<unknown>
70.57 s
gammaloop-nextest-core> at <unknown source file>:<unknown line>
70.57 s
gammaloop-nextest-core> 10: <vakint[eb7a1daa8ec05e1f]::Vakint>::prepare_expression_for_form<unknown>
70.57 s
gammaloop-nextest-core> at <unknown source file>:<unknown line>
70.57 s
gammaloop-nextest-core> 11: <vakint[eb7a1daa8ec05e1f]::VakintTerm>::tensor_reduce<unknown>
70.57 s
gammaloop-nextest-core> at <unknown source file>:<unknown line>
70.57 s
gammaloop-nextest-core> 12: <vakint[eb7a1daa8ec05e1f]::VakintExpression>::tensor_reduce<unknown>
70.57 s
gammaloop-nextest-core> at <unknown source file>:<unknown line>
70.57 s
gammaloop-nextest-core> 13: <gammalooprs[822fc56666e1de73]::uv::approx::integrated::Integrated>::integrate::<gammalooprs[822fc56666e1de73]::uv::approx::Approximation><unknown>
70.57 s
gammaloop-nextest-core> at <unknown source file>:<unknown line>
70.57 s
gammaloop-nextest-core> 14: <gammalooprs[822fc56666e1de73]::uv::approx::integrated::Integrated>::run::<gammalooprs[822fc56666e1de73]::uv::approx::Approximation, gammalooprs[822fc56666e1de73]::uv::approx::Approximation><unknown>
70.57 s
gammaloop-nextest-core> at <unknown source file>:<unknown line>
70.57 s
gammaloop-nextest-core> 15: <gammalooprs[822fc56666e1de73]::uv::forest::Forest>::compute<unknown>
70.57 s
gammaloop-nextest-core> at <unknown source file>:<unknown line>
70.57 s
gammaloop-nextest-core> 16: gammalooprs[822fc56666e1de73]::uv::orchestrator::legacy_renormalization_part<unknown>
70.57 s
gammaloop-nextest-core> at <unknown source file>:<unknown line>
70.57 s
gammaloop-nextest-core> 17: <gammalooprs[822fc56666e1de73]::uv::settings::UVOrchestrator>::renormalization_part<unknown>
70.57 s
gammaloop-nextest-core> at <unknown source file>:<unknown line>
70.57 s
gammaloop-nextest-core> 18: <gammalooprs[822fc56666e1de73]::processes::amplitude::AmplitudeGraph>::renormalization_part<unknown>
70.57 s
gammaloop-nextest-core> at <unknown source file>:<unknown line>
70.57 s
gammaloop-nextest-core> 19: test_renormalization[9f554b029f822e2d]::finite_part_ghost_2loop<unknown>
70.57 s
gammaloop-nextest-core> at <unknown source file>:<unknown line>
70.57 s
gammaloop-nextest-core> 20: <test_renormalization[9f554b029f822e2d]::finite_part_ghost_2loop::{closure#0} as core[940e698046960fd5]::ops::function::FnOnce<()>>::call_once<unknown>
70.57 s
gammaloop-nextest-core> at <unknown source file>:<unknown line>
70.57 s
gammaloop-nextest-core> 21: test[75d6903177b1d7e9]::__rust_begin_short_backtrace::<core[940e698046960fd5]::result::Result<(), alloc[2ea6bcb46fca0c42]::string::String>, fn() -> core[940e698046960fd5]::result::Result<(), alloc[2ea6bcb46fca0c42]::string::String>><unknown>
70.57 s
gammaloop-nextest-core> at <unknown source file>:<unknown line>
70.57 s
gammaloop-nextest-core> 22: test[75d6903177b1d7e9]::run_test::{closure#0}<unknown>
70.57 s
gammaloop-nextest-core> at <unknown source file>:<unknown line>
70.57 s
gammaloop-nextest-core> 23: std[bcb96dfbba0ab899]::sys::backtrace::__rust_begin_short_backtrace::<test[75d6903177b1d7e9]::run_test::{closure#1}, ()><unknown>
70.57 s
gammaloop-nextest-core> at <unknown source file>:<unknown line>
70.57 s
gammaloop-nextest-core> 24: <std[bcb96dfbba0ab899]::thread::lifecycle::spawn_unchecked<test[75d6903177b1d7e9]::run_test::{closure#1}, ()>::{closure#1} as core[940e698046960fd5]::ops::function::FnOnce<()>>::call_once::{shim:vtable#0}<unknown>
70.57 s
gammaloop-nextest-core> at <unknown source file>:<unknown line>
70.57 s
gammaloop-nextest-core> 25: <std[bcb96dfbba0ab899]::sys::thread::unix::Thread>::new::thread_start<unknown>
70.57 s
gammaloop-nextest-core> at <unknown source file>:<unknown line>
70.57 s
gammaloop-nextest-core> 26: start_thread<unknown>
70.57 s
gammaloop-nextest-core> at <unknown source file>:<unknown line>
70.57 s
gammaloop-nextest-core> 27: __clone3<unknown>
70.57 s
gammaloop-nextest-core> at <unknown source file>:<unknown line>
70.57 s
gammaloop-nextest-core>
70.57 s
gammaloop-nextest-core> Run with COLORBT_SHOW_HIDDEN=1 environment variable to disable frame filtering.
70.57 s
gammaloop-nextest-core> Run with RUST_BACKTRACE=full to include source snippets.
70.57 s
gammaloop-nextest-core>
70.57 s
gammaloop-nextest-core> 2. gammalooprs::test_renormalization::finit_part_ghlo
70.57 s
gammaloop-nextest-core> failure: test failure with exit code 101
70.57 s
gammaloop-nextest-core> system-out
70.57 s
gammaloop-nextest-core> running 1 test
70.57 s
gammaloop-nextest-core> test finit_part_ghlo ... FAILED
70.57 s
gammaloop-nextest-core>
70.57 s
gammaloop-nextest-core> failures:
70.57 s
gammaloop-nextest-core>
70.57 s
gammaloop-nextest-core> failures:
70.57 s
gammaloop-nextest-core> finit_part_ghlo
70.57 s
gammaloop-nextest-core>
70.57 s
gammaloop-nextest-core> test result: FAILED. 0 passed; 1 failed; 0 ignored; 0 measured; 5 filtered out; finished in 0.18s
70.57 s
gammaloop-nextest-core> system-err
70.57 s
gammaloop-nextest-core> The application panicked (crashed).
70.57 s
gammaloop-nextest-core> Message: called `Result::unwrap()` on an `Err` value:
70.57 s
gammaloop-nextest-core> 0: Symbolica could not parse FORM output:
70.57 s
gammaloop-nextest-core> [spenso::{antisymmetric,real,spenso::tensor}::f]([spenso::{spenso::representat\
70.57 s
gammaloop-nextest-core> ion,spenso::self_dual}::coad](8,[gammalooprs::{spenso::index}::hedge](0)
70.57 s
gammaloop-nextest-core> ),[spenso::{spenso::representation,spenso::self_dual}::coad](8,[gammaloo\
70.57 s
gammaloop-nextest-core> prs::{spenso::index}::hedge](3)),[spenso::{spenso::representation,spenso\
70.57 s
gammaloop-nextest-core> ::self_dual}::coad](8,[gammalooprs::{spenso::index}::hedge](5)))*
70.57 s
gammaloop-nextest-core> [spenso::{antisymmetric,real,spenso::tensor}::f]([spenso::{spenso::repre\
70.57 s
gammaloop-nextest-core> sentation,spenso::self_dual}::coad](8,[gammalooprs::{spenso::index}::hed\
70.57 s
gammaloop-nextest-core> ge](1)),[spenso::{spenso::representation,spenso::self_dual}::coad](8,
70.57 s
gammaloop-nextest-core> [gammalooprs::{spenso::index}::hedge](3)),[spenso::{spenso::representati\
70.57 s
gammaloop-nextest-core> on,spenso::self_dual}::coad](8,[gammalooprs::{spenso::index}::hedge](5))
70.57 s
gammaloop-nextest-core> )*dot(p1,p0)*[UFO::{}::GC_10]^2*rat(-1,1)
70.57 s
gammaloop-nextest-core>
70.57 s
gammaloop-nextest-core> Error:Symbol spenso::coad redefined with new attributes:
70.57 s
gammaloop-nextest-core> - new user data specified: List([String("spenso::representation-v2"), String("self-dual"), List([String("symbol"), String("coad")]), List([String("cyclic"), Integer(1), List([List([String("symbol"), String("a")]), List([String("symbol"), String("b")]), List([String("symbol"), String("c")]), List([String("symbol"), String("d")])])]), String("top")]) vs None
70.57 s
gammaloop-nextest-core>
70.57 s
gammaloop-nextest-core>
70.57 s
gammaloop-nextest-core> Location:
70.57 s
gammaloop-nextest-core> crates/gammalooprs/src/uv/approx/integrated.rs:332
70.57 s
gammaloop-nextest-core>
70.57 s
gammaloop-nextest-core> ━━━━━━━━━━━━━━━━━━━━━━━━━━━━━━━━━━ BACKTRACE ━━━━━━━━━━━━━━━━━━━━━━━━━━━━━━━━━━━
70.57 s
gammaloop-nextest-core> 1: <color_eyre[5722b77bc20a64cf]::config::EyreHook>::into_eyre_hook::{closure#0}<unknown>
70.57 s
gammaloop-nextest-core> at <unknown source file>:<unknown line>
70.57 s
gammaloop-nextest-core> 2: eyre[cb2fd339c0c40fca]::capture_handler<unknown>
70.57 s
gammaloop-nextest-core> at <unknown source file>:<unknown line>
70.57 s
gammaloop-nextest-core> 3: <eyre[cb2fd339c0c40fca]::Report>::from_std::<vakint[eb7a1daa8ec05e1f]::VakintError><unknown>
70.57 s
gammaloop-nextest-core> at <unknown source file>:<unknown line>
70.57 s
gammaloop-nextest-core> 4: <gammalooprs[822fc56666e1de73]::uv::approx::integrated::Integrated>::integrate::<gammalooprs[822fc56666e1de73]::uv::hedge_poset::ForestNode><unknown>
70.57 s
gammaloop-nextest-core> at <unknown source file>:<unknown line>
70.57 s
gammaloop-nextest-core> 5: <gammalooprs[822fc56666e1de73]::uv::approx::integrated::Integrated>::run::<gammalooprs[822fc56666e1de73]::uv::hedge_poset::ForestNode, gammalooprs[822fc56666e1de73]::uv::hedge_poset::ForestNode><unknown>
70.57 s
gammaloop-nextest-core> at <unknown source file>:<unknown line>
70.57 s
gammaloop-nextest-core> 6: <gammalooprs[822fc56666e1de73]::uv::hedge_poset::Forests>::integrate<unknown>
70.57 s
gammaloop-nextest-core> at <unknown source file>:<unknown line>
70.57 s
gammaloop-nextest-core> 7: gammalooprs[822fc56666e1de73]::uv::orchestrator::hedge_poset_renormalization_part<unknown>
70.57 s
gammaloop-nextest-core> at <unknown source file>:<unknown line>
70.57 s
gammaloop-nextest-core> 8: <gammalooprs[822fc56666e1de73]::uv::settings::UVOrchestrator>::renormalization_part<unknown>
70.57 s
gammaloop-nextest-core> at <unknown source file>:<unknown line>
70.58 s
gammaloop-nextest-core> 9: <gammalooprs[822fc56666e1de73]::processes::amplitude::AmplitudeGraph>::renormalization_part<unknown>
70.58 s
gammaloop-nextest-core> at <unknown source file>:<unknown line>
70.58 s
gammaloop-nextest-core> 10: <test_renormalization[9f554b029f822e2d]::finit_part_ghlo::{closure#0} as core[940e698046960fd5]::ops::function::FnOnce<()>>::call_once<unknown>
70.58 s
gammaloop-nextest-core> at <unknown source file>:<unknown line>
70.58 s
gammaloop-nextest-core> 11: test[75d6903177b1d7e9]::__rust_begin_short_backtrace::<core[940e698046960fd5]::result::Result<(), alloc[2ea6bcb46fca0c42]::string::String>, fn() -> core[940e698046960fd5]::result::Result<(), alloc[2ea6bcb46fca0c42]::string::String>><unknown>
70.58 s
gammaloop-nextest-core> at <unknown source file>:<unknown line>
70.58 s
gammaloop-nextest-core> 12: test[75d6903177b1d7e9]::run_test::{closure#0}<unknown>
70.58 s
gammaloop-nextest-core> at <unknown source file>:<unknown line>
70.58 s
gammaloop-nextest-core> 13: std[bcb96dfbba0ab899]::sys::backtrace::__rust_begin_short_backtrace::<test[75d6903177b1d7e9]::run_test::{closure#1}, ()><unknown>
70.58 s
gammaloop-nextest-core> at <unknown source file>:<unknown line>
70.58 s
gammaloop-nextest-core> 14: <std[bcb96dfbba0ab899]::thread::lifecycle::spawn_unchecked<test[75d6903177b1d7e9]::run_test::{closure#1}, ()>::{closure#1} as core[940e698046960fd5]::ops::function::FnOnce<()>>::call_once::{shim:vtable#0}<unknown>
70.58 s
gammaloop-nextest-core> at <unknown source file>:<unknown line>
70.58 s
gammaloop-nextest-core> 15: <std[bcb96dfbba0ab899]::sys::thread::unix::Thread>::new::thread_start<unknown>
70.58 s
gammaloop-nextest-core> at <unknown source file>:<unknown line>
70.58 s
gammaloop-nextest-core> 16: start_thread<unknown>
70.58 s
gammaloop-nextest-core> at <unknown source file>:<unknown line>
70.58 s
gammaloop-nextest-core> 17: __clone3<unknown>
70.58 s
gammaloop-nextest-core> at <unknown source file>:<unknown line>
70.58 s
gammaloop-nextest-core>
70.58 s
gammaloop-nextest-core> Run with COLORBT_SHOW_HIDDEN=1 environment variable to disable frame filtering.
70.58 s
gammaloop-nextest-core> Run with RUST_BACKTRACE=full to include source snippets.
70.58 s
gammaloop-nextest-core> Location: crates/gammalooprs/tests/test_renormalization.rs:550
70.58 s
gammaloop-nextest-core>
70.58 s
gammaloop-nextest-core> ━━━━━━━━━━━━━━━━━━━━━━━━━━━━━━━━━━ BACKTRACE ━━━━━━━━━━━━━━━━━━━━━━━━━━━━━━━━━━━
70.58 s
gammaloop-nextest-core> 1: <color_eyre[5722b77bc20a64cf]::config::PanicHook>::panic_report<unknown>
70.58 s
gammaloop-nextest-core> at <unknown source file>:<unknown line>
70.58 s
gammaloop-nextest-core> 2: <color_eyre[5722b77bc20a64cf]::config::PanicHook>::into_panic_hook::{closure#0}<unknown>
70.58 s
gammaloop-nextest-core> at <unknown source file>:<unknown line>
70.58 s
gammaloop-nextest-core> 3: std[bcb96dfbba0ab899]::panicking::panic_with_hook<unknown>
70.58 s
gammaloop-nextest-core> at <unknown source file>:<unknown line>
70.58 s
gammaloop-nextest-core> 4: std[bcb96dfbba0ab899]::panicking::panic_handler::{closure#0}<unknown>
70.58 s
gammaloop-nextest-core> at <unknown source file>:<unknown line>
70.58 s
gammaloop-nextest-core> 5: std[bcb96dfbba0ab899]::sys::backtrace::__rust_end_short_backtrace::<std[bcb96dfbba0ab899]::panicking::panic_handler::{closure#0}, !><unknown>
70.58 s
gammaloop-nextest-core> at <unknown source file>:<unknown line>
70.58 s
gammaloop-nextest-core> 6: __rustc[6c289b9f9c454d21]::rust_begin_unwind<unknown>
70.58 s
gammaloop-nextest-core> at <unknown source file>:<unknown line>
70.58 s
gammaloop-nextest-core> 7: core[940e698046960fd5]::panicking::panic_fmt<unknown>
70.58 s
gammaloop-nextest-core> at <unknown source file>:<unknown line>
70.58 s
gammaloop-nextest-core> 8: core[940e698046960fd5]::result::unwrap_failed<unknown>
70.58 s
gammaloop-nextest-core> at <unknown source file>:<unknown line>
70.58 s
gammaloop-nextest-core> 9: <test_renormalization[9f554b029f822e2d]::finit_part_ghlo::{closure#0} as core[940e698046960fd5]::ops::function::FnOnce<()>>::call_once<unknown>
70.58 s
gammaloop-nextest-core> at <unknown source file>:<unknown line>
70.58 s
gammaloop-nextest-core> 10: test[75d6903177b1d7e9]::__rust_begin_short_backtrace::<core[940e698046960fd5]::result::Result<(), alloc[2ea6bcb46fca0c42]::string::String>, fn() -> core[940e698046960fd5]::result::Result<(), alloc[2ea6bcb46fca0c42]::string::String>><unknown>
70.58 s
gammaloop-nextest-core> at <unknown source file>:<unknown line>
70.58 s
gammaloop-nextest-core> 11: test[75d6903177b1d7e9]::run_test::{closure#0}<unknown>
70.58 s
gammaloop-nextest-core> at <unknown source file>:<unknown line>
70.58 s
gammaloop-nextest-core> 12: std[bcb96dfbba0ab899]::sys::backtrace::__rust_begin_short_backtrace::<test[75d6903177b1d7e9]::run_test::{closure#1}, ()><unknown>
70.58 s
gammaloop-nextest-core> at <unknown source file>:<unknown line>
70.58 s
gammaloop-nextest-core> 13: <std[bcb96dfbba0ab899]::thread::lifecycle::spawn_unchecked<test[75d6903177b1d7e9]::run_test::{closure#1}, ()>::{closure#1} as core[940e698046960fd5]::ops::function::FnOnce<()>>::call_once::{shim:vtable#0}<unknown>
70.58 s
gammaloop-nextest-core> at <unknown source file>:<unknown line>
70.58 s
gammaloop-nextest-core> 14: <std[bcb96dfbba0ab899]::sys::thread::unix::Thread>::new::thread_start<unknown>
70.58 s
gammaloop-nextest-core> at <unknown source file>:<unknown line>
70.58 s
gammaloop-nextest-core> 15: start_thread<unknown>
70.58 s
gammaloop-nextest-core> at <unknown source file>:<unknown line>
70.58 s
gammaloop-nextest-core> 16: __clone3<unknown>
70.58 s
gammaloop-nextest-core> at <unknown source file>:<unknown line>
70.58 s
gammaloop-nextest-core>
70.58 s
gammaloop-nextest-core> Run with COLORBT_SHOW_HIDDEN=1 environment variable to disable frame filtering.
70.58 s
gammaloop-nextest-core> Run with RUST_BACKTRACE=full to include source snippets.
70.58 s
gammaloop-nextest-core>
70.58 s
gammaloop-nextest-core> 3. gammalooprs::test_renormalization::finite_part_quark_lo
70.58 s
gammaloop-nextest-core> failure: test failure with exit code 101
70.58 s
gammaloop-nextest-core> system-out
70.58 s
gammaloop-nextest-core> running 1 test
70.58 s
gammaloop-nextest-core> test finite_part_quark_lo ... FAILED
70.58 s
gammaloop-nextest-core>
70.58 s
gammaloop-nextest-core> failures:
70.58 s
gammaloop-nextest-core>
70.58 s
gammaloop-nextest-core> failures:
70.58 s
gammaloop-nextest-core> finite_part_quark_lo
70.58 s
gammaloop-nextest-core>
70.58 s
gammaloop-nextest-core> test result: FAILED. 0 passed; 1 failed; 0 ignored; 0 measured; 5 filtered out; finished in 0.17s
70.58 s
gammaloop-nextest-core> system-err
70.58 s
gammaloop-nextest-core> The application panicked (crashed).
70.58 s
gammaloop-nextest-core> Message: called `Result::unwrap()` on an `Err` value: "Symbol spenso::mink redefined with new attributes:\n\t- new user data specified: List([String(\"spenso::representation-v2\"), String(\"inline-metric\"), List([String(\"symbol\"), String(\"mink\")]), List([String(\"cyclic\"), Integer(1), List([List([String(\"symbol\"), String(\"mu\")]), List([String(\"symbol\"), String(\"nu\")]), List([String(\"symbol\"), String(\"rho\")]), List([String(\"symbol\"), String(\"sigma\")])])]), String(\"top\")]) vs None\n"
70.58 s
gammaloop-nextest-core> Location: crates/vakint/src/lib.rs:4766
70.58 s
gammaloop-nextest-core>
70.58 s
gammaloop-nextest-core> ━━━━━━━━━━━━━━━━━━━━━━━━━━━━━━━━━━ BACKTRACE ━━━━━━━━━━━━━━━━━━━━━━━━━━━━━━━━━━━
70.58 s
gammaloop-nextest-core> 1: <color_eyre[5722b77bc20a64cf]::config::PanicHook>::panic_report<unknown>
70.58 s
gammaloop-nextest-core> at <unknown source file>:<unknown line>
70.58 s
gammaloop-nextest-core> 2: <color_eyre[5722b77bc20a64cf]::config::PanicHook>::into_panic_hook::{closure#0}<unknown>
70.58 s
gammaloop-nextest-core> at <unknown source file>:<unknown line>
70.58 s
gammaloop-nextest-core> 3: std[bcb96dfbba0ab899]::panicking::panic_with_hook<unknown>
70.58 s
gammaloop-nextest-core> at <unknown source file>:<unknown line>
70.58 s
gammaloop-nextest-core> 4: std[bcb96dfbba0ab899]::panicking::panic_handler::{closure#0}<unknown>
70.58 s
gammaloop-nextest-core> at <unknown source file>:<unknown line>
70.58 s
gammaloop-nextest-core> 5: std[bcb96dfbba0ab899]::sys::backtrace::__rust_end_short_backtrace::<std[bcb96dfbba0ab899]::panicking::panic_handler::{closure#0}, !><unknown>
70.58 s
gammaloop-nextest-core> at <unknown source file>:<unknown line>
70.58 s
gammaloop-nextest-core> 6: __rustc[6c289b9f9c454d21]::rust_begin_unwind<unknown>
70.58 s
gammaloop-nextest-core> at <unknown source file>:<unknown line>
70.58 s
gammaloop-nextest-core> 7: core[940e698046960fd5]::panicking::panic_fmt<unknown>
70.58 s
gammaloop-nextest-core> at <unknown source file>:<unknown line>
70.58 s
gammaloop-nextest-core> 8: core[940e698046960fd5]::result::unwrap_failed<unknown>
70.58 s
gammaloop-nextest-core> at <unknown source file>:<unknown line>
70.58 s
gammaloop-nextest-core> 9: <vakint[eb7a1daa8ec05e1f]::Vakint>::sanitize_user_expressions<unknown>
70.58 s
gammaloop-nextest-core> at <unknown source file>:<unknown line>
70.58 s
gammaloop-nextest-core> 10: <vakint[eb7a1daa8ec05e1f]::Vakint>::prepare_expression_for_form<unknown>
70.58 s
gammaloop-nextest-core> at <unknown source file>:<unknown line>
70.58 s
gammaloop-nextest-core> 11: <vakint[eb7a1daa8ec05e1f]::VakintTerm>::tensor_reduce<unknown>
70.58 s
gammaloop-nextest-core> at <unknown source file>:<unknown line>
70.58 s
gammaloop-nextest-core> 12: <vakint[eb7a1daa8ec05e1f]::VakintExpression>::tensor_reduce<unknown>
70.58 s
gammaloop-nextest-core> at <unknown source file>:<unknown line>
70.58 s
gammaloop-nextest-core> 13: <gammalooprs[822fc56666e1de73]::uv::approx::integrated::Integrated>::integrate::<gammalooprs[822fc56666e1de73]::uv::hedge_poset::ForestNode><unknown>
70.58 s
gammaloop-nextest-core> at <unknown source file>:<unknown line>
70.58 s
gammaloop-nextest-core> 14: <gammalooprs[822fc56666e1de73]::uv::approx::integrated::Integrated>::run::<gammalooprs[822fc56666e1de73]::uv::hedge_poset::ForestNode, gammalooprs[822fc56666e1de73]::uv::hedge_poset::ForestNode><unknown>
70.58 s
gammaloop-nextest-core> at <unknown source file>:<unknown line>
70.58 s
gammaloop-nextest-core> 15: <gammalooprs[822fc56666e1de73]::uv::hedge_poset::Forests>::integrate<unknown>
70.58 s
gammaloop-nextest-core> at <unknown source file>:<unknown line>
70.58 s
gammaloop-nextest-core> 16: gammalooprs[822fc56666e1de73]::uv::orchestrator::hedge_poset_renormalization_part<unknown>
70.58 s
gammaloop-nextest-core> at <unknown source file>:<unknown line>
70.58 s
gammaloop-nextest-core> 17: <gammalooprs[822fc56666e1de73]::uv::settings::UVOrchestrator>::renormalization_part<unknown>
70.58 s
gammaloop-nextest-core> at <unknown source file>:<unknown line>
70.58 s
gammaloop-nextest-core> 18: <gammalooprs[822fc56666e1de73]::processes::amplitude::AmplitudeGraph>::renormalization_part<unknown>
70.58 s
gammaloop-nextest-core> at <unknown source file>:<unknown line>
70.58 s
gammaloop-nextest-core> 19: <test_renormalization[9f554b029f822e2d]::finite_part_quark_lo::{closure#0} as core[940e698046960fd5]::ops::function::FnOnce<()>>::call_once<unknown>
70.58 s
gammaloop-nextest-core> at <unknown source file>:<unknown line>
70.58 s
gammaloop-nextest-core> 20: test[75d6903177b1d7e9]::__rust_begin_short_backtrace::<core[940e698046960fd5]::result::Result<(), alloc[2ea6bcb46fca0c42]::string::String>, fn() -> core[940e698046960fd5]::result::Result<(), alloc[2ea6bcb46fca0c42]::string::String>><unknown>
70.58 s
gammaloop-nextest-core> at <unknown source file>:<unknown line>
70.58 s
gammaloop-nextest-core> 21: test[75d6903177b1d7e9]::run_test::{closure#0}<unknown>
70.58 s
gammaloop-nextest-core> at <unknown source file>:<unknown line>
70.58 s
gammaloop-nextest-core> 22: std[bcb96dfbba0ab899]::sys::backtrace::__rust_begin_short_backtrace::<test[75d6903177b1d7e9]::run_test::{closure#1}, ()><unknown>
70.58 s
gammaloop-nextest-core> at <unknown source file>:<unknown line>
70.58 s
gammaloop-nextest-core> 23: <std[bcb96dfbba0ab899]::thread::lifecycle::spawn_unchecked<test[75d6903177b1d7e9]::run_test::{closure#1}, ()>::{closure#1} as core[940e698046960fd5]::ops::function::FnOnce<()>>::call_once::{shim:vtable#0}<unknown>
70.58 s
gammaloop-nextest-core> at <unknown source file>:<unknown line>
70.58 s
gammaloop-nextest-core> 24: <std[bcb96dfbba0ab899]::sys::thread::unix::Thread>::new::thread_start<unknown>
70.58 s
gammaloop-nextest-core> at <unknown source file>:<unknown line>
70.58 s
gammaloop-nextest-core> 25: start_thread<unknown>
70.58 s
gammaloop-nextest-core> at <unknown source file>:<unknown line>
70.58 s
gammaloop-nextest-core> 26: __clone3<unknown>
70.58 s
gammaloop-nextest-core> at <unknown source file>:<unknown line>
70.58 s
gammaloop-nextest-core>
70.58 s
gammaloop-nextest-core> Run with COLORBT_SHOW_HIDDEN=1 environment variable to disable frame filtering.
70.58 s
gammaloop-nextest-core> Run with RUST_BACKTRACE=full to include source snippets.
70.58 s
gammaloop-nextest-core> =========================================
70.61 s
[5 built (1 failed ), 63 error: Cannot build '/nix/store/zinbrvppkmzalr7ws9scxa6mjscpn55x-gammaloop-nextest-core.drv '.
70.61 s
Reason: builder failed with exit code 100 .
70.61 s
Output paths:
70.61 s
/nix/store/k5v8ghl7chk97jbw3f7b7213dk976a9s-gammaloop-nextest-core
70.61 s
Last 844 log lines:
70.61 s
> Extracting 3 binaries (including 1 non-test binary), 1 build script output directory, and 2 linked paths to /build/nextest-archive-esWNw0
70.61 s
> Extracted 18 files to /build/nextest-archive-esWNw0 in 0.41s
70.61 s
> ------------
70.61 s
> Nextest run ID b7aa5d21-d207-403b-8270-11bcda2dd794 with nextest profile: ci_gammaloop
70.61 s
> Starting 339 tests across 2 binaries
70.61 s
> ------------
70.61 s
> Summary [ 0.421s] 339 tests run: 339 passed , 0 skipped
70.61 s
>
70.61 s
> ========== nextest test summary ==========
70.61 s
> report: target/nextest/ci_gammaloop/junit.xml
70.61 s
> tests: 339, failures: 0, errors: 0
70.61 s
> No failing testcases found.
70.61 s
> =========================================
70.61 s
> Extracting 1 binary and 1 linked path to /build/nextest-archive-fjVL9V
70.61 s
> Extracted 7 files to /build/nextest-archive-fjVL9V in 0.06s
70.61 s
> ------------
70.61 s
> Nextest run ID 998553e9-d599-483b-b8b3-858e4ecd3563 with nextest profile: ci_gammaloop
70.61 s
> Starting 19 tests across 1 binary
70.61 s
> ------------
70.61 s
> Summary [ 0.010s] 19 tests run: 19 passed , 0 skipped
70.61 s
>
70.61 s
> ========== nextest test summary ==========
70.61 s
> report: target/nextest/ci_gammaloop/junit.xml
70.61 s
> tests: 19, failures: 0, errors: 0
70.61 s
> No failing testcases found.
70.61 s
> =========================================
70.61 s
> Extracting 1 binary to /build/nextest-archive-uZJmKN
70.61 s
> Extracted 4 files to /build/nextest-archive-uZJmKN in 0.03s
70.61 s
> ------------
70.61 s
> Nextest run ID 60cbc14f-f1bc-4186-b9b4-e8c188cc9192 with nextest profile: ci_gammaloop
70.61 s
> Starting 0 tests across 1 binary
70.61 s
> ------------
70.61 s
> Summary [ 0.000s] 0 tests run: 0 passed , 0 skipped
70.61 s
>
70.61 s
> ========== nextest test summary ==========
70.61 s
> report: target/nextest/ci_gammaloop/junit.xml
70.61 s
> tests: 0, failures: 0, errors: 0
70.61 s
> No failing testcases found.
70.61 s
> =========================================
70.61 s
> Extracting 4 binaries, 1 build script output directory, and 2 linked paths to /build/nextest-archive-NPuctH
70.61 s
> Extracted 18 files to /build/nextest-archive-NPuctH in 0.42s
70.61 s
> ------------
70.61 s
> Nextest run ID 7b1e8638-3636-403f-84a3-574305cf339c with nextest profile: ci_gammaloop
70.61 s
> Starting 456 tests across 4 binaries (61 tests skipped , including 60 tests via profile.ci_gammaloop.default-filter )
70.61 s
> FAIL [ 0.148s] (442/456) gammalooprs::test_renormalization finite_part_ghost_2loop
70.61 s
> stdout ---
70.61 s
>
70.61 s
> running 1 test
70.61 s
> test finite_part_ghost_2loop ... FAILED
70.61 s
>
70.61 s
> failures:
70.61 s
>
70.61 s
> failures:
70.61 s
> finite_part_ghost_2loop
70.61 s
>
70.61 s
> test result: FAILED. 0 passed; 1 failed; 0 ignored; 0 measured; 5 filtered out; finished in 0.14s
70.61 s
>
70.61 s
> stderr ---
70.61 s
> The application panicked (crashed).
70.61 s
> Message: called `Result::unwrap()` on an `Err` value: "Symbol spenso::mink redefined with new attributes:\n\t- new user data specified: List([String(\"spenso::representation-v2\"), String(\"inline-metric\"), List([String(\"symbol\"), String(\"mink\")]), List([String(\"cyclic\"), Integer(1), List([List([String(\"symbol\"), String(\"mu\")]), List([String(\"symbol\"), String(\"nu\")]), List([String(\"symbol\"), String(\"rho\")]), List([String(\"symbol\"), String(\"sigma\")])])]), String(\"top\")]) vs None\n"
70.61 s
> Location: crates/vakint/src/lib.rs :4766
70.61 s
>
70.61 s
> ━━━━━━━━━━━━━━━━━━━━━━━━━━━━━━━━━━ BACKTRACE ━━━━━━━━━━━━━━━━━━━━━━━━━━━━━━━━━━━
70.61 s
> 1: <color_eyre[5722b77bc20a64cf]::config::PanicHook>::panic_report <unknown>
70.61 s
> at <unknown source file> :<unknown line>
70.61 s
> 2: <color_eyre[5722b77bc20a64cf]::config::PanicHook>::into_panic_hook::{closure#0} <unknown>
70.61 s
> at <unknown source file> :<unknown line>
70.61 s
> 3: std[bcb96dfbba0ab899]::panicking::panic_with_hook <unknown>
70.61 s
> at <unknown source file> :<unknown line>
70.61 s
> 4: std[bcb96dfbba0ab899]::panicking::panic_handler::{closure#0} <unknown>
70.61 s
> at <unknown source file> :<unknown line>
70.61 s
> 5: std[bcb96dfbba0ab899]::sys::backtrace::__rust_end_short_backtrace::<std[bcb96dfbba0ab899]::panicking::panic_handler::{closure#0}, !> <unknown>
70.61 s
> at <unknown source file> :<unknown line>
70.61 s
> 6: __rustc[6c289b9f9c454d21]::rust_begin_unwind <unknown>
70.61 s
> at <unknown source file> :<unknown line>
70.61 s
> 7: core[940e698046960fd5]::panicking::panic_fmt <unknown>
70.61 s
> at <unknown source file> :<unknown line>
70.61 s
> 8: core[940e698046960fd5]::result::unwrap_failed <unknown>
70.61 s
> at <unknown source file> :<unknown line>
70.61 s
> 9: <vakint[eb7a1daa8ec05e1f]::Vakint>::sanitize_user_expressions <unknown>
70.61 s
> at <unknown source file> :<unknown line>
70.61 s
> 10: <vakint[eb7a1daa8ec05e1f]::Vakint>::prepare_expression_for_form <unknown>
70.61 s
> at <unknown source file> :<unknown line>
70.61 s
> 11: <vakint[eb7a1daa8ec05e1f]::VakintTerm>::tensor_reduce <unknown>
70.61 s
> at <unknown source file> :<unknown line>
70.61 s
> 12: <vakint[eb7a1daa8ec05e1f]::VakintExpression>::tensor_reduce <unknown>
70.61 s
> at <unknown source file> :<unknown line>
70.61 s
> 13: <gammalooprs[822fc56666e1de73]::uv::approx::integrated::Integrated>::integrate::<gammalooprs[822fc56666e1de73]::uv::approx::Approximation> <unknown>
70.61 s
> at <unknown source file> :<unknown line>
70.61 s
> 14: <gammalooprs[822fc56666e1de73]::uv::approx::integrated::Integrated>::run::<gammalooprs[822fc56666e1de73]::uv::approx::Approximation, gammalooprs[822fc56666e1de73]::uv::approx::Approximation> <unknown>
70.61 s
> at <unknown source file> :<unknown line>
70.61 s
> 15: <gammalooprs[822fc56666e1de73]::uv::forest::Forest>::compute <unknown>
70.61 s
> at <unknown source file> :<unknown line>
70.61 s
> 16: gammalooprs[822fc56666e1de73]::uv::orchestrator::legacy_renormalization_part <unknown>
70.61 s
> at <unknown source file> :<unknown line>
70.61 s
> 17: <gammalooprs[822fc56666e1de73]::uv::settings::UVOrchestrator>::renormalization_part <unknown>
70.61 s
> at <unknown source file> :<unknown line>
70.61 s
> 18: <gammalooprs[822fc56666e1de73]::processes::amplitude::AmplitudeGraph>::renormalization_part <unknown>
70.61 s
> at <unknown source file> :<unknown line>
70.61 s
> 19: test_renormalization[9f554b029f822e2d]::finite_part_ghost_2loop <unknown>
70.61 s
> at <unknown source file> :<unknown line>
70.61 s
> 20: <test_renormalization[9f554b029f822e2d]::finite_part_ghost_2loop::{closure#0} as core[940e698046960fd5]::ops::function::FnOnce<()>>::call_once <unknown>
70.61 s
> at <unknown source file> :<unknown line>
70.61 s
> 21: test[75d6903177b1d7e9]::__rust_begin_short_backtrace::<core[940e698046960fd5]::result::Result<(), alloc[2ea6bcb46fca0c42]::string::String>, fn() -> core[940e698046960fd5]::result::Result<(), alloc[2ea6bcb46fca0c42]::string::String>> <unknown>
70.61 s
> at <unknown source file> :<unknown line>
70.61 s
> 22: test[75d6903177b1d7e9]::run_test::{closure#0} <unknown>
70.61 s
> at <unknown source file> :<unknown line>
70.61 s
> 23: std[bcb96dfbba0ab899]::sys::backtrace::__rust_begin_short_backtrace::<test[75d6903177b1d7e9]::run_test::{closure#1}, ()> <unknown>
70.61 s
> at <unknown source file> :<unknown line>
70.61 s
> 24: <std[bcb96dfbba0ab899]::thread::lifecycle::spawn_unchecked<test[75d6903177b1d7e9]::run_test::{closure#1}, ()>::{closure#1} as core[940e698046960fd5]::ops::function::FnOnce<()>>::call_once::{shim:vtable#0} <unknown>
70.61 s
> at <unknown source file> :<unknown line>
70.61 s
> 25: <std[bcb96dfbba0ab899]::sys::thread::unix::Thread>::new::thread_start <unknown>
70.61 s
> at <unknown source file> :<unknown line>
70.61 s
> 26: start_thread <unknown>
70.61 s
> at <unknown source file> :<unknown line>
70.61 s
> 27: __clone3 <unknown>
70.61 s
> at <unknown source file> :<unknown line>
70.61 s
>
70.61 s
> Run with COLORBT_SHOW_HIDDEN=1 environment variable to disable frame filtering.
70.61 s
> Run with RUST_BACKTRACE=full to include source snippets.
70.61 s
>
70.61 s
> FAIL [ 0.198s] (444/456) gammalooprs::test_renormalization finit_part_ghlo
70.61 s
> stdout ---
70.61 s
>
70.61 s
> running 1 test
70.61 s
> test finit_part_ghlo ... FAILED
70.61 s
>
70.61 s
> failures:
70.61 s
>
70.61 s
> failures:
70.61 s
> finit_part_ghlo
70.61 s
>
70.61 s
> test result: FAILED. 0 passed; 1 failed; 0 ignored; 0 measured; 5 filtered out; finished in 0.18s
70.61 s
>
70.61 s
> stderr ---
70.61 s
> The application panicked (crashed).
70.61 s
> Message: called `Result::unwrap()` on an `Err` value:
70.61 s
> 0: Symbolica could not parse FORM output:
70.61 s
> [spenso::{antisymmetric,real,spenso::tensor}::f]([spenso::{spenso::representat\
70.61 s
> ion,spenso::self_dual}::coad](8,[gammalooprs::{spenso::index}::hedge](0)
70.61 s
> ),[spenso::{spenso::representation,spenso::self_dual}::coad](8,[gammaloo\
70.61 s
> prs::{spenso::index}::hedge](3)),[spenso::{spenso::representation,spenso\
70.61 s
> ::self_dual}::coad](8,[gammalooprs::{spenso::index}::hedge](5)))*
70.61 s
> [spenso::{antisymmetric,real,spenso::tensor}::f]([spenso::{spenso::repre\
70.61 s
> sentation,spenso::self_dual}::coad](8,[gammalooprs::{spenso::index}::hed\
70.61 s
> ge](1)),[spenso::{spenso::representation,spenso::self_dual}::coad](8,
70.61 s
> [gammalooprs::{spenso::index}::hedge](3)),[spenso::{spenso::representati\
70.61 s
> on,spenso::self_dual}::coad](8,[gammalooprs::{spenso::index}::hedge](5))
70.61 s
> )*dot(p1,p0)*[UFO::{}::GC_10]^2*rat(-1,1)
70.61 s
>
70.61 s
> Error:Symbol spenso::coad redefined with new attributes:
70.61 s
> - new user data specified: List([String("spenso::representation-v2"), String("self-dual"), List([String("symbol"), String("coad")]), List([String("cyclic"), Integer(1), List([List([String("symbol"), String("a")]), List([String("symbol"), String("b")]), List([String("symbol"), String("c")]), List([String("symbol"), String("d")])])]), String("top")]) vs None
70.61 s
>
70.61 s
>
70.61 s
> Location:
70.61 s
> crates/gammalooprs/src/uv/approx/integrated.rs :332
70.61 s
>
70.61 s
> ━━━━━━━━━━━━━━━━━━━━━━━━━━━━━━━━━━ BACKTRACE ━━━━━━━━━━━━━━━━━━━━━━━━━━━━━━━━━━━
70.61 s
> 1: <color_eyre[5722b77bc20a64cf]::config::EyreHook>::into_eyre_hook::{closure#0} <unknown>
70.61 s
> at <unknown source file> :<unknown line>
70.61 s
> 2: eyre[cb2fd339c0c40fca]::capture_handler <unknown>
70.61 s
> at <unknown source file> :<unknown line>
70.61 s
> 3: <eyre[cb2fd339c0c40fca]::Report>::from_std::<vakint[eb7a1daa8ec05e1f]::VakintError> <unknown>
70.61 s
> at <unknown source file> :<unknown line>
70.61 s
> 4: <gammalooprs[822fc56666e1de73]::uv::approx::integrated::Integrated>::integrate::<gammalooprs[822fc56666e1de73]::uv::hedge_poset::ForestNode> <unknown>
70.61 s
> at <unknown source file> :<unknown line>
70.61 s
> 5: <gammalooprs[822fc56666e1de73]::uv::approx::integrated::Integrated>::run::<gammalooprs[822fc56666e1de73]::uv::hedge_poset::ForestNode, gammalooprs[822fc56666e1de73]::uv::hedge_poset::ForestNode> <unknown>
70.61 s
> at <unknown source file> :<unknown line>
70.61 s
> 6: <gammalooprs[822fc56666e1de73]::uv::hedge_poset::Forests>::integrate <unknown>
70.61 s
> at <unknown source file> :<unknown line>
70.61 s
> 7: gammalooprs[822fc56666e1de73]::uv::orchestrator::hedge_poset_renormalization_part <unknown>
70.61 s
> at <unknown source file> :<unknown line>
70.61 s
> 8: <gammalooprs[822fc56666e1de73]::uv::settings::UVOrchestrator>::renormalization_part <unknown>
70.61 s
> at <unknown source file> :<unknown line>
70.61 s
> 9: <gammalooprs[822fc56666e1de73]::processes::amplitude::AmplitudeGraph>::renormalization_part <unknown>
70.61 s
> at <unknown source file> :<unknown line>
70.61 s
> 10: <test_renormalization[9f554b029f822e2d]::finit_part_ghlo::{closure#0} as core[940e698046960fd5]::ops::function::FnOnce<()>>::call_once <unknown>
70.61 s
> at <unknown source file> :<unknown line>
70.61 s
> 11: test[75d6903177b1d7e9]::__rust_begin_short_backtrace::<core[940e698046960fd5]::result::Result<(), alloc[2ea6bcb46fca0c42]::string::String>, fn() -> core[940e698046960fd5]::result::Result<(), alloc[2ea6bcb46fca0c42]::string::String>> <unknown>
70.61 s
> at <unknown source file> :<unknown line>
70.61 s
> 12: test[75d6903177b1d7e9]::run_test::{closure#0} <unknown>
70.61 s
> at <unknown source file> :<unknown line>
70.61 s
> 13: std[bcb96dfbba0ab899]::sys::backtrace::__rust_begin_short_backtrace::<test[75d6903177b1d7e9]::run_test::{closure#1}, ()> <unknown>
70.61 s
> at <unknown source file> :<unknown line>
70.61 s
> 14: <std[bcb96dfbba0ab899]::thread::lifecycle::spawn_unchecked<test[75d6903177b1d7e9]::run_test::{closure#1}, ()>::{closure#1} as core[940e698046960fd5]::ops::function::FnOnce<()>>::call_once::{shim:vtable#0} <unknown>
70.61 s
> at <unknown source file> :<unknown line>
70.61 s
> 15: <std[bcb96dfbba0ab899]::sys::thread::unix::Thread>::new::thread_start <unknown>
70.61 s
> at <unknown source file> :<unknown line>
70.61 s
> 16: start_thread <unknown>
70.61 s
> at <unknown source file> :<unknown line>
70.61 s
> 17: __clone3 <unknown>
70.61 s
> at <unknown source file> :<unknown line>
70.61 s
>
70.61 s
> Run with COLORBT_SHOW_HIDDEN=1 environment variable to disable frame filtering.
70.61 s
> Run with RUST_BACKTRACE=full to include source snippets.
70.61 s
> Location: crates/gammalooprs/tests/test_renormalization.rs :550
70.61 s
>
70.61 s
> ━━━━━━━━━━━━━━━━━━━━━━━━━━━━━━━━━━ BACKTRACE ━━━━━━━━━━━━━━━━━━━━━━━━━━━━━━━━━━━
70.61 s
> 1: <color_eyre[5722b77bc20a64cf]::config::PanicHook>::panic_report <unknown>
70.61 s
> at <unknown source file> :<unknown line>
70.61 s
> 2: <color_eyre[5722b77bc20a64cf]::config::PanicHook>::into_panic_hook::{closure#0} <unknown>
70.61 s
> at <unknown source file> :<unknown line>
70.61 s
> 3: std[bcb96dfbba0ab899]::panicking::panic_with_hook <unknown>
70.61 s
> at <unknown source file> :<unknown line>
70.61 s
> 4: std[bcb96dfbba0ab899]::panicking::panic_handler::{closure#0} <unknown>
70.61 s
> at <unknown source file> :<unknown line>
70.61 s
> 5: std[bcb96dfbba0ab899]::sys::backtrace::__rust_end_short_backtrace::<std[bcb96dfbba0ab899]::panicking::panic_handler::{closure#0}, !> <unknown>
70.61 s
> at <unknown source file> :<unknown line>
70.61 s
> 6: __rustc[6c289b9f9c454d21]::rust_begin_unwind <unknown>
70.61 s
> at <unknown source file> :<unknown line>
70.61 s
> 7: core[940e698046960fd5]::panicking::panic_fmt <unknown>
70.61 s
> at <unknown source file> :<unknown line>
70.61 s
> 8: core[940e698046960fd5]::result::unwrap_failed <unknown>
70.61 s
> at <unknown source file> :<unknown line>
70.61 s
> 9: <test_renormalization[9f554b029f822e2d]::finit_part_ghlo::{closure#0} as core[940e698046960fd5]::ops::function::FnOnce<()>>::call_once <unknown>
70.61 s
> at <unknown source file> :<unknown line>
70.61 s
> 10: test[75d6903177b1d7e9]::__rust_begin_short_backtrace::<core[940e698046960fd5]::result::Result<(), alloc[2ea6bcb46fca0c42]::string::String>, fn() -> core[940e698046960fd5]::result::Result<(), alloc[2ea6bcb46fca0c42]::string::String>> <unknown>
70.61 s
> at <unknown source file> :<unknown line>
70.61 s
> 11: test[75d6903177b1d7e9]::run_test::{closure#0} <unknown>
70.61 s
> at <unknown source file> :<unknown line>
70.61 s
> 12: std[bcb96dfbba0ab899]::sys::backtrace::__rust_begin_short_backtrace::<test[75d6903177b1d7e9]::run_test::{closure#1}, ()> <unknown>
70.61 s
> at <unknown source file> :<unknown line>
70.61 s
> 13: <std[bcb96dfbba0ab899]::thread::lifecycle::spawn_unchecked<test[75d6903177b1d7e9]::run_test::{closure#1}, ()>::{closure#1} as core[940e698046960fd5]::ops::function::FnOnce<()>>::call_once::{shim:vtable#0} <unknown>
70.61 s
> at <unknown source file> :<unknown line>
70.61 s
> 14: <std[bcb96dfbba0ab899]::sys::thread::unix::Thread>::new::thread_start <unknown>
70.61 s
> at <unknown source file> :<unknown line>
70.61 s
> 15: start_thread <unknown>
70.61 s
> at <unknown source file> :<unknown line>
70.61 s
> 16: __clone3 <unknown>
70.61 s
> at <unknown source file> :<unknown line>
70.61 s
>
70.61 s
> Run with COLORBT_SHOW_HIDDEN=1 environment variable to disable frame filtering.
70.61 s
> Run with RUST_BACKTRACE=full to include source snippets.
70.61 s
>
70.61 s
> FAIL [ 0.184s] (445/456) gammalooprs::test_renormalization finite_part_quark_lo
70.61 s
> stdout ---
70.61 s
>
70.61 s
> running 1 test
70.61 s
> test finite_part_quark_lo ... FAILED
70.61 s
>
70.61 s
> failures:
70.61 s
>
70.61 s
> failures:
70.61 s
> finite_part_quark_lo
70.61 s
>
70.61 s
> test result: FAILED. 0 passed; 1 failed; 0 ignored; 0 measured; 5 filtered out; finished in 0.17s
70.61 s
>
70.61 s
> stderr ---
70.61 s
> The application panicked (crashed).
70.61 s
> Message: called `Result::unwrap()` on an `Err` value: "Symbol spenso::mink redefined with new attributes:\n\t- new user data specified: List([String(\"spenso::representation-v2\"), String(\"inline-metric\"), List([String(\"symbol\"), String(\"mink\")]), List([String(\"cyclic\"), Integer(1), List([List([String(\"symbol\"), String(\"mu\")]), List([String(\"symbol\"), String(\"nu\")]), List([String(\"symbol\"), String(\"rho\")]), List([String(\"symbol\"), String(\"sigma\")])])]), String(\"top\")]) vs None\n"
70.61 s
> Location: crates/vakint/src/lib.rs :4766
70.61 s
>
70.61 s
> ━━━━━━━━━━━━━━━━━━━━━━━━━━━━━━━━━━ BACKTRACE ━━━━━━━━━━━━━━━━━━━━━━━━━━━━━━━━━━━
70.61 s
> 1: <color_eyre[5722b77bc20a64cf]::config::PanicHook>::panic_report <unknown>
70.61 s
> at <unknown source file> :<unknown line>
70.61 s
> 2: <color_eyre[5722b77bc20a64cf]::config::PanicHook>::into_panic_hook::{closure#0} <unknown>
70.61 s
> at <unknown source file> :<unknown line>
70.61 s
> 3: std[bcb96dfbba0ab899]::panicking::panic_with_hook <unknown>
70.61 s
> at <unknown source file> :<unknown line>
70.61 s
> 4: std[bcb96dfbba0ab899]::panicking::panic_handler::{closure#0} <unknown>
70.61 s
> at <unknown source file> :<unknown line>
70.61 s
> 5: std[bcb96dfbba0ab899]::sys::backtrace::__rust_end_short_backtrace::<std[bcb96dfbba0ab899]::panicking::panic_handler::{closure#0}, !> <unknown>
70.61 s
> at <unknown source file> :<unknown line>
70.61 s
> 6: __rustc[6c289b9f9c454d21]::rust_begin_unwind <unknown>
70.61 s
> at <unknown source file> :<unknown line>
70.61 s
> 7: core[940e698046960fd5]::panicking::panic_fmt <unknown>
70.61 s
> at <unknown source file> :<unknown line>
70.61 s
> 8: core[940e698046960fd5]::result::unwrap_failed <unknown>
70.61 s
> at <unknown source file> :<unknown line>
70.61 s
> 9: <vakint[eb7a1daa8ec05e1f]::Vakint>::sanitize_user_expressions <unknown>
70.61 s
> at <unknown source file> :<unknown line>
70.61 s
> 10: <vakint[eb7a1daa8ec05e1f]::Vakint>::prepare_expression_for_form <unknown>
70.61 s
> at <unknown source file> :<unknown line>
70.61 s
> 11: <vakint[eb7a1daa8ec05e1f]::VakintTerm>::tensor_reduce <unknown>
70.61 s
> at <unknown source file> :<unknown line>
70.61 s
> 12: <vakint[eb7a1daa8ec05e1f]::VakintExpression>::tensor_reduce <unknown>
70.61 s
> at <unknown source file> :<unknown line>
70.61 s
> 13: <gammalooprs[822fc56666e1de73]::uv::approx::integrated::Integrated>::integrate::<gammalooprs[822fc56666e1de73]::uv::hedge_poset::ForestNode> <unknown>
70.61 s
> at <unknown source file> :<unknown line>
70.61 s
> 14: <gammalooprs[822fc56666e1de73]::uv::approx::integrated::Integrated>::run::<gammalooprs[822fc56666e1de73]::uv::hedge_poset::ForestNode, gammalooprs[822fc56666e1de73]::uv::hedge_poset::ForestNode> <unknown>
70.61 s
> at <unknown source file> :<unknown line>
70.61 s
> 15: <gammalooprs[822fc56666e1de73]::uv::hedge_poset::Forests>::integrate <unknown>
70.61 s
> at <unknown source file> :<unknown line>
70.61 s
> 16: gammalooprs[822fc56666e1de73]::uv::orchestrator::hedge_poset_renormalization_part <unknown>
70.61 s
> at <unknown source file> :<unknown line>
70.61 s
> 17: <gammalooprs[822fc56666e1de73]::uv::settings::UVOrchestrator>::renormalization_part <unknown>
70.61 s
> at <unknown source file> :<unknown line>
70.61 s
> 18: <gammalooprs[822fc56666e1de73]::processes::amplitude::AmplitudeGraph>::renormalization_part <unknown>
70.61 s
> at <unknown source file> :<unknown line>
70.61 s
> 19: <test_renormalization[9f554b029f822e2d]::finite_part_quark_lo::{closure#0} as core[940e698046960fd5]::ops::function::FnOnce<()>>::call_once <unknown>
70.61 s
> at <unknown source file> :<unknown line>
70.61 s
> 20: test[75d6903177b1d7e9]::__rust_begin_short_backtrace::<core[940e698046960fd5]::result::Result<(), alloc[2ea6bcb46fca0c42]::string::String>, fn() -> core[940e698046960fd5]::result::Result<(), alloc[2ea6bcb46fca0c42]::string::String>> <unknown>
70.61 s
> at <unknown source file> :<unknown line>
70.61 s
> 21: test[75d6903177b1d7e9]::run_test::{closure#0} <unknown>
70.61 s
> at <unknown source file> :<unknown line>
70.61 s
> 22: std[bcb96dfbba0ab899]::sys::backtrace::__rust_begin_short_backtrace::<test[75d6903177b1d7e9]::run_test::{closure#1}, ()> <unknown>
70.61 s
> at <unknown source file> :<unknown line>
70.61 s
> 23: <std[bcb96dfbba0ab899]::thread::lifecycle::spawn_unchecked<test[75d6903177b1d7e9]::run_test::{closure#1}, ()>::{closure#1} as core[940e698046960fd5]::ops::function::FnOnce<()>>::call_once::{shim:vtable#0} <unknown>
70.61 s
> at <unknown source file> :<unknown line>
70.61 s
> 24: <std[bcb96dfbba0ab899]::sys::thread::unix::Thread>::new::thread_start <unknown>
70.61 s
> at <unknown source file> :<unknown line>
70.61 s
> 25: start_thread <unknown>
70.61 s
> at <unknown source file> :<unknown line>
70.61 s
> 26: __clone3 <unknown>
70.61 s
> at <unknown source file> :<unknown line>
70.61 s
>
70.61 s
> Run with COLORBT_SHOW_HIDDEN=1 environment variable to disable frame filtering.
70.61 s
> Run with RUST_BACKTRACE=full to include source snippets.
70.61 s
>
70.61 s
> ------------
70.61 s
> Summary [ 7.665s] 456 tests run: 453 passed , 3 failed , 61 skipped
70.61 s
> FAIL [ 0.148s] (442/456) gammalooprs::test_renormalization finite_part_ghost_2loop
70.61 s
> stdout ---
70.61 s
>
70.61 s
> running 1 test
70.61 s
> test finite_part_ghost_2loop ... FAILED
70.61 s
>
70.61 s
> failures:
70.61 s
>
70.61 s
> failures:
70.61 s
> finite_part_ghost_2loop
70.61 s
>
70.61 s
> test result: FAILED. 0 passed; 1 failed; 0 ignored; 0 measured; 5 filtered out; finished in 0.14s
70.61 s
>
70.61 s
> stderr ---
70.61 s
> The application panicked (crashed).
70.61 s
> Message: called `Result::unwrap()` on an `Err` value: "Symbol spenso::mink redefined with new attributes:\n\t- new user data specified: List([String(\"spenso::representation-v2\"), String(\"inline-metric\"), List([String(\"symbol\"), String(\"mink\")]), List([String(\"cyclic\"), Integer(1), List([List([String(\"symbol\"), String(\"mu\")]), List([String(\"symbol\"), String(\"nu\")]), List([String(\"symbol\"), String(\"rho\")]), List([String(\"symbol\"), String(\"sigma\")])])]), String(\"top\")]) vs None\n"
70.61 s
> Location: crates/vakint/src/lib.rs :4766
70.61 s
>
70.61 s
> ━━━━━━━━━━━━━━━━━━━━━━━━━━━━━━━━━━ BACKTRACE ━━━━━━━━━━━━━━━━━━━━━━━━━━━━━━━━━━━
70.61 s
> 1: <color_eyre[5722b77bc20a64cf]::config::PanicHook>::panic_report <unknown>
70.61 s
> at <unknown source file> :<unknown line>
70.61 s
> 2: <color_eyre[5722b77bc20a64cf]::config::PanicHook>::into_panic_hook::{closure#0} <unknown>
70.61 s
> at <unknown source file> :<unknown line>
70.61 s
> 3: std[bcb96dfbba0ab899]::panicking::panic_with_hook <unknown>
70.61 s
> at <unknown source file> :<unknown line>
70.61 s
> 4: std[bcb96dfbba0ab899]::panicking::panic_handler::{closure#0} <unknown>
70.61 s
> at <unknown source file> :<unknown line>
70.61 s
> 5: std[bcb96dfbba0ab899]::sys::backtrace::__rust_end_short_backtrace::<std[bcb96dfbba0ab899]::panicking::panic_handler::{closure#0}, !> <unknown>
70.61 s
> at <unknown source file> :<unknown line>
70.61 s
> 6: __rustc[6c289b9f9c454d21]::rust_begin_unwind <unknown>
70.61 s
> at <unknown source file> :<unknown line>
70.61 s
> 7: core[940e698046960fd5]::panicking::panic_fmt <unknown>
70.61 s
> at <unknown source file> :<unknown line>
70.61 s
> 8: core[940e698046960fd5]::result::unwrap_failed <unknown>
70.61 s
> at <unknown source file> :<unknown line>
70.61 s
> 9: <vakint[eb7a1daa8ec05e1f]::Vakint>::sanitize_user_expressions <unknown>
70.61 s
> at <unknown source file> :<unknown line>
70.61 s
> 10: <vakint[eb7a1daa8ec05e1f]::Vakint>::prepare_expression_for_form <unknown>
70.61 s
> at <unknown source file> :<unknown line>
70.61 s
> 11: <vakint[eb7a1daa8ec05e1f]::VakintTerm>::tensor_reduce <unknown>
70.61 s
> at <unknown source file> :<unknown line>
70.61 s
> 12: <vakint[eb7a1daa8ec05e1f]::VakintExpression>::tensor_reduce <unknown>
70.61 s
> at <unknown source file> :<unknown line>
70.61 s
> 13: <gammalooprs[822fc56666e1de73]::uv::approx::integrated::Integrated>::integrate::<gammalooprs[822fc56666e1de73]::uv::approx::Approximation> <unknown>
70.61 s
> at <unknown source file> :<unknown line>
70.61 s
> 14: <gammalooprs[822fc56666e1de73]::uv::approx::integrated::Integrated>::run::<gammalooprs[822fc56666e1de73]::uv::approx::Approximation, gammalooprs[822fc56666e1de73]::uv::approx::Approximation> <unknown>
70.61 s
> at <unknown source file> :<unknown line>
70.61 s
> 15: <gammalooprs[822fc56666e1de73]::uv::forest::Forest>::compute <unknown>
70.61 s
> at <unknown source file> :<unknown line>
70.61 s
> 16: gammalooprs[822fc56666e1de73]::uv::orchestrator::legacy_renormalization_part <unknown>
70.61 s
> at <unknown source file> :<unknown line>
70.61 s
> 17: <gammalooprs[822fc56666e1de73]::uv::settings::UVOrchestrator>::renormalization_part <unknown>
70.61 s
> at <unknown source file> :<unknown line>
70.61 s
> 18: <gammalooprs[822fc56666e1de73]::processes::amplitude::AmplitudeGraph>::renormalization_part <unknown>
70.61 s
> at <unknown source file> :<unknown line>
70.61 s
> 19: test_renormalization[9f554b029f822e2d]::finite_part_ghost_2loop <unknown>
70.61 s
> at <unknown source file> :<unknown line>
70.61 s
> 20: <test_renormalization[9f554b029f822e2d]::finite_part_ghost_2loop::{closure#0} as core[940e698046960fd5]::ops::function::FnOnce<()>>::call_once <unknown>
70.61 s
> at <unknown source file> :<unknown line>
70.61 s
> 21: test[75d6903177b1d7e9]::__rust_begin_short_backtrace::<core[940e698046960fd5]::result::Result<(), alloc[2ea6bcb46fca0c42]::string::String>, fn() -> core[940e698046960fd5]::result::Result<(), alloc[2ea6bcb46fca0c42]::string::String>> <unknown>
70.61 s
> at <unknown source file> :<unknown line>
70.61 s
> 22: test[75d6903177b1d7e9]::run_test::{closure#0} <unknown>
70.61 s
> at <unknown source file> :<unknown line>
70.61 s
> 23: std[bcb96dfbba0ab899]::sys::backtrace::__rust_begin_short_backtrace::<test[75d6903177b1d7e9]::run_test::{closure#1}, ()> <unknown>
70.61 s
> at <unknown source file> :<unknown line>
70.61 s
> 24: <std[bcb96dfbba0ab899]::thread::lifecycle::spawn_unchecked<test[75d6903177b1d7e9]::run_test::{closure#1}, ()>::{closure#1} as core[940e698046960fd5]::ops::function::FnOnce<()>>::call_once::{shim:vtable#0} <unknown>
70.61 s
> at <unknown source file> :<unknown line>
70.61 s
> 25: <std[bcb96dfbba0ab899]::sys::thread::unix::Thread>::new::thread_start <unknown>
70.61 s
> at <unknown source file> :<unknown line>
70.61 s
> 26: start_thread <unknown>
70.61 s
> at <unknown source file> :<unknown line>
70.61 s
> 27: __clone3 <unknown>
70.61 s
> at <unknown source file> :<unknown line>
70.61 s
>
70.61 s
> Run with COLORBT_SHOW_HIDDEN=1 environment variable to disable frame filtering.
70.61 s
> Run with RUST_BACKTRACE=full to include source snippets.
70.61 s
>
70.61 s
> FAIL [ 0.198s] (444/456) gammalooprs::test_renormalization finit_part_ghlo
70.61 s
> stdout ---
70.61 s
>
70.61 s
> running 1 test
70.61 s
> test finit_part_ghlo ... FAILED
70.61 s
>
70.61 s
> failures:
70.61 s
>
70.61 s
> failures:
70.61 s
> finit_part_ghlo
70.61 s
>
70.61 s
> test result: FAILED. 0 passed; 1 failed; 0 ignored; 0 measured; 5 filtered out; finished in 0.18s
70.61 s
>
70.61 s
> stderr ---
70.61 s
> The application panicked (crashed).
70.61 s
> Message: called `Result::unwrap()` on an `Err` value:
70.61 s
> 0: Symbolica could not parse FORM output:
70.61 s
> [spenso::{antisymmetric,real,spenso::tensor}::f]([spenso::{spenso::representat\
70.61 s
> ion,spenso::self_dual}::coad](8,[gammalooprs::{spenso::index}::hedge](0)
70.61 s
> ),[spenso::{spenso::representation,spenso::self_dual}::coad](8,[gammaloo\
70.61 s
> prs::{spenso::index}::hedge](3)),[spenso::{spenso::representation,spenso\
70.61 s
> ::self_dual}::coad](8,[gammalooprs::{spenso::index}::hedge](5)))*
70.61 s
> [spenso::{antisymmetric,real,spenso::tensor}::f]([spenso::{spenso::repre\
70.61 s
> sentation,spenso::self_dual}::coad](8,[gammalooprs::{spenso::index}::hed\
70.61 s
> ge](1)),[spenso::{spenso::representation,spenso::self_dual}::coad](8,
70.61 s
> [gammalooprs::{spenso::index}::hedge](3)),[spenso::{spenso::representati\
70.61 s
> on,spenso::self_dual}::coad](8,[gammalooprs::{spenso::index}::hedge](5))
70.61 s
> )*dot(p1,p0)*[UFO::{}::GC_10]^2*rat(-1,1)
70.61 s
>
70.61 s
> Error:Symbol spenso::coad redefined with new attributes:
70.61 s
> - new user data specified: List([String("spenso::representation-v2"), String("self-dual"), List([String("symbol"), String("coad")]), List([String("cyclic"), Integer(1), List([List([String("symbol"), String("a")]), List([String("symbol"), String("b")]), List([String("symbol"), String("c")]), List([String("symbol"), String("d")])])]), String("top")]) vs None
70.61 s
>
70.61 s
>
70.61 s
> Location:
70.61 s
> crates/gammalooprs/src/uv/approx/integrated.rs :332
70.61 s
>
70.61 s
> ━━━━━━━━━━━━━━━━━━━━━━━━━━━━━━━━━━ BACKTRACE ━━━━━━━━━━━━━━━━━━━━━━━━━━━━━━━━━━━
70.61 s
> 1: <color_eyre[5722b77bc20a64cf]::config::EyreHook>::into_eyre_hook::{closure#0} <unknown>
70.61 s
> at <unknown source file> :<unknown line>
70.61 s
> 2: eyre[cb2fd339c0c40fca]::capture_handler <unknown>
70.61 s
> at <unknown source file> :<unknown line>
70.61 s
> 3: <eyre[cb2fd339c0c40fca]::Report>::from_std::<vakint[eb7a1daa8ec05e1f]::VakintError> <unknown>
70.61 s
> at <unknown source file> :<unknown line>
70.61 s
> 4: <gammalooprs[822fc56666e1de73]::uv::approx::integrated::Integrated>::integrate::<gammalooprs[822fc56666e1de73]::uv::hedge_poset::ForestNode> <unknown>
70.61 s
> at <unknown source file> :<unknown line>
70.61 s
> 5: <gammalooprs[822fc56666e1de73]::uv::approx::integrated::Integrated>::run::<gammalooprs[822fc56666e1de73]::uv::hedge_poset::ForestNode, gammalooprs[822fc56666e1de73]::uv::hedge_poset::ForestNode> <unknown>
70.61 s
> at <unknown source file> :<unknown line>
70.61 s
> 6: <gammalooprs[822fc56666e1de73]::uv::hedge_poset::Forests>::integrate <unknown>
70.61 s
> at <unknown source file> :<unknown line>
70.61 s
> 7: gammalooprs[822fc56666e1de73]::uv::orchestrator::hedge_poset_renormalization_part <unknown>
70.61 s
> at <unknown source file> :<unknown line>
70.61 s
> 8: <gammalooprs[822fc56666e1de73]::uv::settings::UVOrchestrator>::renormalization_part <unknown>
70.61 s
> at <unknown source file> :<unknown line>
70.61 s
> 9: <gammalooprs[822fc56666e1de73]::processes::amplitude::AmplitudeGraph>::renormalization_part <unknown>
70.61 s
> at <unknown source file> :<unknown line>
70.61 s
> 10: <test_renormalization[9f554b029f822e2d]::finit_part_ghlo::{closure#0} as core[940e698046960fd5]::ops::function::FnOnce<()>>::call_once <unknown>
70.61 s
> at <unknown source file> :<unknown line>
70.61 s
> 11: test[75d6903177b1d7e9]::__rust_begin_short_backtrace::<core[940e698046960fd5]::result::Result<(), alloc[2ea6bcb46fca0c42]::string::String>, fn() -> core[940e698046960fd5]::result::Result<(), alloc[2ea6bcb46fca0c42]::string::String>> <unknown>
70.61 s
> at <unknown source file> :<unknown line>
70.61 s
> 12: test[75d6903177b1d7e9]::run_test::{closure#0} <unknown>
70.61 s
> at <unknown source file> :<unknown line>
70.61 s
> 13: std[bcb96dfbba0ab899]::sys::backtrace::__rust_begin_short_backtrace::<test[75d6903177b1d7e9]::run_test::{closure#1}, ()> <unknown>
70.61 s
> at <unknown source file> :<unknown line>
70.61 s
> 14: <std[bcb96dfbba0ab899]::thread::lifecycle::spawn_unchecked<test[75d6903177b1d7e9]::run_test::{closure#1}, ()>::{closure#1} as core[940e698046960fd5]::ops::function::FnOnce<()>>::call_once::{shim:vtable#0} <unknown>
70.61 s
> at <unknown source file> :<unknown line>
70.61 s
> 15: <std[bcb96dfbba0ab899]::sys::thread::unix::Thread>::new::thread_start <unknown>
70.61 s
> at <unknown source file> :<unknown line>
70.61 s
> 16: start_thread <unknown>
70.61 s
> at <unknown source file> :<unknown line>
70.61 s
> 17: __clone3 <unknown>
70.61 s
> at <unknown source file> :<unknown line>
70.61 s
>
70.61 s
> Run with COLORBT_SHOW_HIDDEN=1 environment variable to disable frame filtering.
70.61 s
> Run with RUST_BACKTRACE=full to include source snippets.
70.61 s
> Location: crates/gammalooprs/tests/test_renormalization.rs :550
70.61 s
>
70.61 s
> ━━━━━━━━━━━━━━━━━━━━━━━━━━━━━━━━━━ BACKTRACE ━━━━━━━━━━━━━━━━━━━━━━━━━━━━━━━━━━━
70.61 s
> 1: <color_eyre[5722b77bc20a64cf]::config::PanicHook>::panic_report <unknown>
70.61 s
> at <unknown source file> :<unknown line>
70.61 s
> 2: <color_eyre[5722b77bc20a64cf]::config::PanicHook>::into_panic_hook::{closure#0} <unknown>
70.61 s
> at <unknown source file> :<unknown line>
70.61 s
> 3: std[bcb96dfbba0ab899]::panicking::panic_with_hook <unknown>
70.61 s
> at <unknown source file> :<unknown line>
70.61 s
> 4: std[bcb96dfbba0ab899]::panicking::panic_handler::{closure#0} <unknown>
70.61 s
> at <unknown source file> :<unknown line>
70.61 s
> 5: std[bcb96dfbba0ab899]::sys::backtrace::__rust_end_short_backtrace::<std[bcb96dfbba0ab899]::panicking::panic_handler::{closure#0}, !> <unknown>
70.61 s
> at <unknown source file> :<unknown line>
70.61 s
> 6: __rustc[6c289b9f9c454d21]::rust_begin_unwind <unknown>
70.61 s
> at <unknown source file> :<unknown line>
70.61 s
> 7: core[940e698046960fd5]::panicking::panic_fmt <unknown>
70.61 s
> at <unknown source file> :<unknown line>
70.61 s
> 8: core[940e698046960fd5]::result::unwrap_failed <unknown>
70.61 s
> at <unknown source file> :<unknown line>
70.61 s
> 9: <test_renormalization[9f554b029f822e2d]::finit_part_ghlo::{closure#0} as core[940e698046960fd5]::ops::function::FnOnce<()>>::call_once <unknown>
70.61 s
> at <unknown source file> :<unknown line>
70.61 s
> 10: test[75d6903177b1d7e9]::__rust_begin_short_backtrace::<core[940e698046960fd5]::result::Result<(), alloc[2ea6bcb46fca0c42]::string::String>, fn() -> core[940e698046960fd5]::result::Result<(), alloc[2ea6bcb46fca0c42]::string::String>> <unknown>
70.61 s
> at <unknown source file> :<unknown line>
70.61 s
> 11: test[75d6903177b1d7e9]::run_test::{closure#0} <unknown>
70.61 s
> at <unknown source file> :<unknown line>
70.61 s
> 12: std[bcb96dfbba0ab899]::sys::backtrace::__rust_begin_short_backtrace::<test[75d6903177b1d7e9]::run_test::{closure#1}, ()> <unknown>
70.61 s
> at <unknown source file> :<unknown line>
70.61 s
> 13: <std[bcb96dfbba0ab899]::thread::lifecycle::spawn_unchecked<test[75d6903177b1d7e9]::run_test::{closure#1}, ()>::{closure#1} as core[940e698046960fd5]::ops::function::FnOnce<()>>::call_once::{shim:vtable#0} <unknown>
70.61 s
> at <unknown source file> :<unknown line>
70.61 s
> 14: <std[bcb96dfbba0ab899]::sys::thread::unix::Thread>::new::thread_start <unknown>
70.61 s
> at <unknown source file> :<unknown line>
70.61 s
> 15: start_thread <unknown>
70.61 s
> at <unknown source file> :<unknown line>
70.61 s
> 16: __clone3 <unknown>
70.61 s
> at <unknown source file> :<unknown line>
70.61 s
>
70.61 s
> Run with COLORBT_SHOW_HIDDEN=1 environment variable to disable frame filtering.
70.61 s
> Run with RUST_BACKTRACE=full to include source snippets.
70.61 s
>
70.61 s
> FAIL [ 0.184s] (445/456) gammalooprs::test_renormalization finite_part_quark_lo
70.61 s
> stdout ---
70.61 s
>
70.61 s
> running 1 test
70.61 s
> test finite_part_quark_lo ... FAILED
70.61 s
>
70.61 s
> failures:
70.61 s
>
70.61 s
> failures:
70.61 s
> finite_part_quark_lo
70.61 s
>
70.61 s
> test result: FAILED. 0 passed; 1 failed; 0 ignored; 0 measured; 5 filtered out; finished in 0.17s
70.61 s
>
70.61 s
> stderr ---
70.61 s
> The application panicked (crashed).
70.61 s
> Message: called `Result::unwrap()` on an `Err` value: "Symbol spenso::mink redefined with new attributes:\n\t- new user data specified: List([String(\"spenso::representation-v2\"), String(\"inline-metric\"), List([String(\"symbol\"), String(\"mink\")]), List([String(\"cyclic\"), Integer(1), List([List([String(\"symbol\"), String(\"mu\")]), List([String(\"symbol\"), String(\"nu\")]), List([String(\"symbol\"), String(\"rho\")]), List([String(\"symbol\"), String(\"sigma\")])])]), String(\"top\")]) vs None\n"
70.61 s
> Location: crates/vakint/src/lib.rs :4766
70.61 s
>
70.61 s
> ━━━━━━━━━━━━━━━━━━━━━━━━━━━━━━━━━━ BACKTRACE ━━━━━━━━━━━━━━━━━━━━━━━━━━━━━━━━━━━
70.61 s
> 1: <color_eyre[5722b77bc20a64cf]::config::PanicHook>::panic_report <unknown>
70.61 s
> at <unknown source file> :<unknown line>
70.61 s
> 2: <color_eyre[5722b77bc20a64cf]::config::PanicHook>::into_panic_hook::{closure#0} <unknown>
70.61 s
> at <unknown source file> :<unknown line>
70.61 s
> 3: std[bcb96dfbba0ab899]::panicking::panic_with_hook <unknown>
70.61 s
> at <unknown source file> :<unknown line>
70.61 s
> 4: std[bcb96dfbba0ab899]::panicking::panic_handler::{closure#0} <unknown>
70.61 s
> at <unknown source file> :<unknown line>
70.61 s
> 5: std[bcb96dfbba0ab899]::sys::backtrace::__rust_end_short_backtrace::<std[bcb96dfbba0ab899]::panicking::panic_handler::{closure#0}, !> <unknown>
70.61 s
> at <unknown source file> :<unknown line>
70.61 s
> 6: __rustc[6c289b9f9c454d21]::rust_begin_unwind <unknown>
70.61 s
> at <unknown source file> :<unknown line>
70.61 s
> 7: core[940e698046960fd5]::panicking::panic_fmt <unknown>
70.61 s
> at <unknown source file> :<unknown line>
70.61 s
> 8: core[940e698046960fd5]::result::unwrap_failed <unknown>
70.61 s
> at <unknown source file> :<unknown line>
70.61 s
> 9: <vakint[eb7a1daa8ec05e1f]::Vakint>::sanitize_user_expressions <unknown>
70.61 s
> at <unknown source file> :<unknown line>
70.61 s
> 10: <vakint[eb7a1daa8ec05e1f]::Vakint>::prepare_expression_for_form <unknown>
70.61 s
> at <unknown source file> :<unknown line>
70.61 s
> 11: <vakint[eb7a1daa8ec05e1f]::VakintTerm>::tensor_reduce <unknown>
70.61 s
> at <unknown source file> :<unknown line>
70.61 s
> 12: <vakint[eb7a1daa8ec05e1f]::VakintExpression>::tensor_reduce <unknown>
70.61 s
> at <unknown source file> :<unknown line>
70.61 s
> 13: <gammalooprs[822fc56666e1de73]::uv::approx::integrated::Integrated>::integrate::<gammalooprs[822fc56666e1de73]::uv::hedge_poset::ForestNode> <unknown>
70.61 s
> at <unknown source file> :<unknown line>
70.61 s
> 14: <gammalooprs[822fc56666e1de73]::uv::approx::integrated::Integrated>::run::<gammalooprs[822fc56666e1de73]::uv::hedge_poset::ForestNode, gammalooprs[822fc56666e1de73]::uv::hedge_poset::ForestNode> <unknown>
70.61 s
> at <unknown source file> :<unknown line>
70.61 s
> 15: <gammalooprs[822fc56666e1de73]::uv::hedge_poset::Forests>::integrate <unknown>
70.61 s
> at <unknown source file> :<unknown line>
70.61 s
> 16: gammalooprs[822fc56666e1de73]::uv::orchestrator::hedge_poset_renormalization_part <unknown>
70.61 s
> at <unknown source file> :<unknown line>
70.61 s
> 17: <gammalooprs[822fc56666e1de73]::uv::settings::UVOrchestrator>::renormalization_part <unknown>
70.61 s
> at <unknown source file> :<unknown line>
70.61 s
> 18: <gammalooprs[822fc56666e1de73]::processes::amplitude::AmplitudeGraph>::renormalization_part <unknown>
70.61 s
> at <unknown source file> :<unknown line>
70.61 s
> 19: <test_renormalization[9f554b029f822e2d]::finite_part_quark_lo::{closure#0} as core[940e698046960fd5]::ops::function::FnOnce<()>>::call_once <unknown>
70.61 s
> at <unknown source file> :<unknown line>
70.61 s
> 20: test[75d6903177b1d7e9]::__rust_begin_short_backtrace::<core[940e698046960fd5]::result::Result<(), alloc[2ea6bcb46fca0c42]::string::String>, fn() -> core[940e698046960fd5]::result::Result<(), alloc[2ea6bcb46fca0c42]::string::String>> <unknown>
70.61 s
> at <unknown source file> :<unknown line>
70.61 s
> 21: test[75d6903177b1d7e9]::run_test::{closure#0} <unknown>
70.61 s
> at <unknown source file> :<unknown line>
70.61 s
> 22: std[bcb96dfbba0ab899]::sys::backtrace::__rust_begin_short_backtrace::<test[75d6903177b1d7e9]::run_test::{closure#1}, ()> <unknown>
70.61 s
> at <unknown source file> :<unknown line>
70.61 s
> 23: <std[bcb96dfbba0ab899]::thread::lifecycle::spawn_unchecked<test[75d6903177b1d7e9]::run_test::{closure#1}, ()>::{closure#1} as core[940e698046960fd5]::ops::function::FnOnce<()>>::call_once::{shim:vtable#0} <unknown>
70.61 s
> at <unknown source file> :<unknown line>
70.61 s
> 24: <std[bcb96dfbba0ab899]::sys::thread::unix::Thread>::new::thread_start <unknown>
70.61 s
> at <unknown source file> :<unknown line>
70.61 s
> 25: start_thread <unknown>
70.61 s
> at <unknown source file> :<unknown line>
70.61 s
> 26: __clone3 <unknown>
70.61 s
> at <unknown source file> :<unknown line>
70.61 s
>
70.61 s
> Run with COLORBT_SHOW_HIDDEN=1 environment variable to disable frame filtering.
70.61 s
> Run with RUST_BACKTRACE=full to include source snippets.
70.61 s
>
70.61 s
> error : test run failed
70.61 s
>
70.61 s
> ========== nextest test summary ==========
70.61 s
> report: target/nextest/ci_gammaloop/junit.xml
70.61 s
> tests: 456, failures: 3, errors: 0
70.61 s
>
70.61 s
> 1. gammalooprs::test_renormalization::finite_part_ghost_2loop
70.61 s
> failure: test failure with exit code 101
70.61 s
> system-out
70.61 s
> running 1 test
70.61 s
> test finite_part_ghost_2loop ... FAILED
70.61 s
>
70.61 s
> failures:
70.61 s
>
70.61 s
> failures:
70.61 s
> finite_part_ghost_2loop
70.61 s
>
70.61 s
> test result: FAILED. 0 passed; 1 failed; 0 ignored; 0 measured; 5 filtered out; finished in 0.14s
70.61 s
> system-err
70.61 s
> The application panicked (crashed).
70.61 s
> Message: called `Result::unwrap()` on an `Err` value: "Symbol spenso::mink redefined with new attributes:\n\t- new user data specified: List([String(\"spenso::representation-v2\"), String(\"inline-metric\"), List([String(\"symbol\"), String(\"mink\")]), List([String(\"cyclic\"), Integer(1), List([List([String(\"symbol\"), String(\"mu\")]), List([String(\"symbol\"), String(\"nu\")]), List([String(\"symbol\"), String(\"rho\")]), List([String(\"symbol\"), String(\"sigma\")])])]), String(\"top\")]) vs None\n"
70.61 s
> Location: crates/vakint/src/lib.rs:4766
70.61 s
>
70.62 s
> ━━━━━━━━━━━━━━━━━━━━━━━━━━━━━━━━━━ BACKTRACE ━━━━━━━━━━━━━━━━━━━━━━━━━━━━━━━━━━━
70.62 s
> 1: <color_eyre[5722b77bc20a64cf]::config::PanicHook>::panic_report<unknown>
70.62 s
> at <unknown source file>:<unknown line>
70.62 s
> 2: <color_eyre[5722b77bc20a64cf]::config::PanicHook>::into_panic_hook::{closure#0}<unknown>
70.62 s
> at <unknown source file>:<unknown line>
70.62 s
> 3: std[bcb96dfbba0ab899]::panicking::panic_with_hook<unknown>
70.62 s
> at <unknown source file>:<unknown line>
70.62 s
> 4: std[bcb96dfbba0ab899]::panicking::panic_handler::{closure#0}<unknown>
70.62 s
> at <unknown source file>:<unknown line>
70.62 s
> 5: std[bcb96dfbba0ab899]::sys::backtrace::__rust_end_short_backtrace::<std[bcb96dfbba0ab899]::panicking::panic_handler::{closure#0}, !><unknown>
70.62 s
> at <unknown source file>:<unknown line>
70.62 s
> 6: __rustc[6c289b9f9c454d21]::rust_begin_unwind<unknown>
70.62 s
> at <unknown source file>:<unknown line>
70.62 s
> 7: core[940e698046960fd5]::panicking::panic_fmt<unknown>
70.62 s
> at <unknown source file>:<unknown line>
70.62 s
> 8: core[940e698046960fd5]::result::unwrap_failed<unknown>
70.62 s
> at <unknown source file>:<unknown line>
70.62 s
> 9: <vakint[eb7a1daa8ec05e1f]::Vakint>::sanitize_user_expressions<unknown>
70.62 s
> at <unknown source file>:<unknown line>
70.62 s
> 10: <vakint[eb7a1daa8ec05e1f]::Vakint>::prepare_expression_for_form<unknown>
70.62 s
> at <unknown source file>:<unknown line>
70.62 s
> 11: <vakint[eb7a1daa8ec05e1f]::VakintTerm>::tensor_reduce<unknown>
70.62 s
> at <unknown source file>:<unknown line>
70.62 s
> 12: <vakint[eb7a1daa8ec05e1f]::VakintExpression>::tensor_reduce<unknown>
70.62 s
> at <unknown source file>:<unknown line>
70.62 s
> 13: <gammalooprs[822fc56666e1de73]::uv::approx::integrated::Integrated>::integrate::<gammalooprs[822fc56666e1de73]::uv::approx::Approximation><unknown>
70.62 s
> at <unknown source file>:<unknown line>
70.62 s
> 14: <gammalooprs[822fc56666e1de73]::uv::approx::integrated::Integrated>::run::<gammalooprs[822fc56666e1de73]::uv::approx::Approximation, gammalooprs[822fc56666e1de73]::uv::approx::Approximation><unknown>
70.62 s
> at <unknown source file>:<unknown line>
70.62 s
> 15: <gammalooprs[822fc56666e1de73]::uv::forest::Forest>::compute<unknown>
70.62 s
> at <unknown source file>:<unknown line>
70.62 s
> 16: gammalooprs[822fc56666e1de73]::uv::orchestrator::legacy_renormalization_part<unknown>
70.62 s
> at <unknown source file>:<unknown line>
70.62 s
> 17: <gammalooprs[822fc56666e1de73]::uv::settings::UVOrchestrator>::renormalization_part<unknown>
70.62 s
> at <unknown source file>:<unknown line>
70.62 s
> 18: <gammalooprs[822fc56666e1de73]::processes::amplitude::AmplitudeGraph>::renormalization_part<unknown>
70.62 s
> at <unknown source file>:<unknown line>
70.62 s
> 19: test_renormalization[9f554b029f822e2d]::finite_part_ghost_2loop<unknown>
70.62 s
> at <unknown source file>:<unknown line>
70.62 s
> 20: <test_renormalization[9f554b029f822e2d]::finite_part_ghost_2loop::{closure#0} as core[940e698046960fd5]::ops::function::FnOnce<()>>::call_once<unknown>
70.62 s
> at <unknown source file>:<unknown line>
70.62 s
> 21: test[75d6903177b1d7e9]::__rust_begin_short_backtrace::<core[940e698046960fd5]::result::Result<(), alloc[2ea6bcb46fca0c42]::string::String>, fn() -> core[940e698046960fd5]::result::Result<(), alloc[2ea6bcb46fca0c42]::string::String>><unknown>
70.62 s
> at <unknown source file>:<unknown line>
70.62 s
> 22: test[75d6903177b1d7e9]::run_test::{closure#0}<unknown>
70.62 s
> at <unknown source file>:<unknown line>
70.62 s
> 23: std[bcb96dfbba0ab899]::sys::backtrace::__rust_begin_short_backtrace::<test[75d6903177b1d7e9]::run_test::{closure#1}, ()><unknown>
70.62 s
> at <unknown source file>:<unknown line>
70.62 s
> 24: <std[bcb96dfbba0ab899]::thread::lifecycle::spawn_unchecked<test[75d6903177b1d7e9]::run_test::{closure#1}, ()>::{closure#1} as core[940e698046960fd5]::ops::function::FnOnce<()>>::call_once::{shim:vtable#0}<unknown>
70.62 s
> at <unknown source file>:<unknown line>
70.62 s
> 25: <std[bcb96dfbba0ab899]::sys::thread::unix::Thread>::new::thread_start<unknown>
70.62 s
> at <unknown source file>:<unknown line>
70.62 s
> 26: start_thread<unknown>
70.62 s
> at <unknown source file>:<unknown line>
70.62 s
> 27: __clone3<unknown>
70.62 s
> at <unknown source file>:<unknown line>
70.62 s
>
70.62 s
> Run with COLORBT_SHOW_HIDDEN=1 environment variable to disable frame filtering.
70.62 s
> Run with RUST_BACKTRACE=full to include source snippets.
70.62 s
>
70.62 s
> 2. gammalooprs::test_renormalization::finit_part_ghlo
70.62 s
> failure: test failure with exit code 101
70.62 s
> system-out
70.62 s
> running 1 test
70.62 s
> test finit_part_ghlo ... FAILED
70.62 s
>
70.62 s
> failures:
70.62 s
>
70.62 s
> failures:
70.62 s
> finit_part_ghlo
70.62 s
>
70.62 s
> test result: FAILED. 0 passed; 1 failed; 0 ignored; 0 measured; 5 filtered out; finished in 0.18s
70.62 s
> system-err
70.62 s
> The application panicked (crashed).
70.62 s
> Message: called `Result::unwrap()` on an `Err` value:
70.62 s
> 0: Symbolica could not parse FORM output:
70.62 s
> [spenso::{antisymmetric,real,spenso::tensor}::f]([spenso::{spenso::representat\
70.62 s
> ion,spenso::self_dual}::coad](8,[gammalooprs::{spenso::index}::hedge](0)
70.62 s
> ),[spenso::{spenso::representation,spenso::self_dual}::coad](8,[gammaloo\
70.62 s
> prs::{spenso::index}::hedge](3)),[spenso::{spenso::representation,spenso\
70.62 s
> ::self_dual}::coad](8,[gammalooprs::{spenso::index}::hedge](5)))*
70.62 s
> [spenso::{antisymmetric,real,spenso::tensor}::f]([spenso::{spenso::repre\
70.62 s
> sentation,spenso::self_dual}::coad](8,[gammalooprs::{spenso::index}::hed\
70.62 s
> ge](1)),[spenso::{spenso::representation,spenso::self_dual}::coad](8,
70.62 s
> [gammalooprs::{spenso::index}::hedge](3)),[spenso::{spenso::representati\
70.62 s
> on,spenso::self_dual}::coad](8,[gammalooprs::{spenso::index}::hedge](5))
70.62 s
> )*dot(p1,p0)*[UFO::{}::GC_10]^2*rat(-1,1)
70.62 s
>
70.62 s
> Error:Symbol spenso::coad redefined with new attributes:
70.62 s
> - new user data specified: List([String("spenso::representation-v2"), String("self-dual"), List([String("symbol"), String("coad")]), List([String("cyclic"), Integer(1), List([List([String("symbol"), String("a")]), List([String("symbol"), String("b")]), List([String("symbol"), String("c")]), List([String("symbol"), String("d")])])]), String("top")]) vs None
70.62 s
>
70.62 s
>
70.62 s
> Location:
70.62 s
> crates/gammalooprs/src/uv/approx/integrated.rs:332
70.62 s
>
70.62 s
> ━━━━━━━━━━━━━━━━━━━━━━━━━━━━━━━━━━ BACKTRACE ━━━━━━━━━━━━━━━━━━━━━━━━━━━━━━━━━━━
70.62 s
> 1: <color_eyre[5722b77bc20a64cf]::config::EyreHook>::into_eyre_hook::{closure#0}<unknown>
70.62 s
> at <unknown source file>:<unknown line>
70.62 s
> 2: eyre[cb2fd339c0c40fca]::capture_handler<unknown>
70.62 s
> at <unknown source file>:<unknown line>
70.62 s
> 3: <eyre[cb2fd339c0c40fca]::Report>::from_std::<vakint[eb7a1daa8ec05e1f]::VakintError><unknown>
70.62 s
> at <unknown source file>:<unknown line>
70.62 s
> 4: <gammalooprs[822fc56666e1de73]::uv::approx::integrated::Integrated>::integrate::<gammalooprs[822fc56666e1de73]::uv::hedge_poset::ForestNode><unknown>
70.62 s
> at <unknown source file>:<unknown line>
70.62 s
> 5: <gammalooprs[822fc56666e1de73]::uv::approx::integrated::Integrated>::run::<gammalooprs[822fc56666e1de73]::uv::hedge_poset::ForestNode, gammalooprs[822fc56666e1de73]::uv::hedge_poset::ForestNode><unknown>
70.62 s
> at <unknown source file>:<unknown line>
70.62 s
> 6: <gammalooprs[822fc56666e1de73]::uv::hedge_poset::Forests>::integrate<unknown>
70.62 s
> at <unknown source file>:<unknown line>
70.62 s
> 7: gammalooprs[822fc56666e1de73]::uv::orchestrator::hedge_poset_renormalization_part<unknown>
70.62 s
> at <unknown source file>:<unknown line>
70.62 s
> 8: <gammalooprs[822fc56666e1de73]::uv::settings::UVOrchestrator>::renormalization_part<unknown>
70.62 s
> at <unknown source file>:<unknown line>
70.62 s
> 9: <gammalooprs[822fc56666e1de73]::processes::amplitude::AmplitudeGraph>::renormalization_part<unknown>
70.62 s
> at <unknown source file>:<unknown line>
70.62 s
> 10: <test_renormalization[9f554b029f822e2d]::finit_part_ghlo::{closure#0} as core[940e698046960fd5]::ops::function::FnOnce<()>>::call_once<unknown>
70.62 s
> at <unknown source file>:<unknown line>
70.62 s
> 11: test[75d6903177b1d7e9]::__rust_begin_short_backtrace::<core[940e698046960fd5]::result::Result<(), alloc[2ea6bcb46fca0c42]::string::String>, fn() -> core[940e698046960fd5]::result::Result<(), alloc[2ea6bcb46fca0c42]::string::String>><unknown>
70.62 s
> at <unknown source file>:<unknown line>
70.62 s
> 12: test[75d6903177b1d7e9]::run_test::{closure#0}<unknown>
70.62 s
> at <unknown source file>:<unknown line>
70.62 s
> 13: std[bcb96dfbba0ab899]::sys::backtrace::__rust_begin_short_backtrace::<test[75d6903177b1d7e9]::run_test::{closure#1}, ()><unknown>
70.62 s
> at <unknown source file>:<unknown line>
70.62 s
> 14: <std[bcb96dfbba0ab899]::thread::lifecycle::spawn_unchecked<test[75d6903177b1d7e9]::run_test::{closure#1}, ()>::{closure#1} as core[940e698046960fd5]::ops::function::FnOnce<()>>::call_once::{shim:vtable#0}<unknown>
70.62 s
> at <unknown source file>:<unknown line>
70.62 s
> 15: <std[bcb96dfbba0ab899]::sys::thread::unix::Thread>::new::thread_start<unknown>
70.62 s
> at <unknown source file>:<unknown line>
70.62 s
> 16: start_thread<unknown>
70.62 s
> at <unknown source file>:<unknown line>
70.62 s
> 17: __clone3<unknown>
70.62 s
> at <unknown source file>:<unknown line>
70.62 s
>
70.62 s
> Run with COLORBT_SHOW_HIDDEN=1 environment variable to disable frame filtering.
70.62 s
> Run with RUST_BACKTRACE=full to include source snippets.
70.62 s
> Location: crates/gammalooprs/tests/test_renormalization.rs:550
70.62 s
>
70.62 s
> ━━━━━━━━━━━━━━━━━━━━━━━━━━━━━━━━━━ BACKTRACE ━━━━━━━━━━━━━━━━━━━━━━━━━━━━━━━━━━━
70.62 s
> 1: <color_eyre[5722b77bc20a64cf]::config::PanicHook>::panic_report<unknown>
70.62 s
> at <unknown source file>:<unknown line>
70.62 s
> 2: <color_eyre[5722b77bc20a64cf]::config::PanicHook>::into_panic_hook::{closure#0}<unknown>
70.62 s
> at <unknown source file>:<unknown line>
70.62 s
> 3: std[bcb96dfbba0ab899]::panicking::panic_with_hook<unknown>
70.62 s
> at <unknown source file>:<unknown line>
70.62 s
> 4: std[bcb96dfbba0ab899]::panicking::panic_handler::{closure#0}<unknown>
70.62 s
> at <unknown source file>:<unknown line>
70.62 s
> 5: std[bcb96dfbba0ab899]::sys::backtrace::__rust_end_short_backtrace::<std[bcb96dfbba0ab899]::panicking::panic_handler::{closure#0}, !><unknown>
70.62 s
> at <unknown source file>:<unknown line>
70.62 s
> 6: __rustc[6c289b9f9c454d21]::rust_begin_unwind<unknown>
70.62 s
> at <unknown source file>:<unknown line>
70.62 s
> 7: core[940e698046960fd5]::panicking::panic_fmt<unknown>
70.62 s
> at <unknown source file>:<unknown line>
70.62 s
> 8: core[940e698046960fd5]::result::unwrap_failed<unknown>
70.62 s
> at <unknown source file>:<unknown line>
70.62 s
> 9: <test_renormalization[9f554b029f822e2d]::finit_part_ghlo::{closure#0} as core[940e698046960fd5]::ops::function::FnOnce<()>>::call_once<unknown>
70.62 s
> at <unknown source file>:<unknown line>
70.62 s
> 10: test[75d6903177b1d7e9]::__rust_begin_short_backtrace::<core[940e698046960fd5]::result::Result<(), alloc[2ea6bcb46fca0c42]::string::String>, fn() -> core[940e698046960fd5]::result::Result<(), alloc[2ea6bcb46fca0c42]::string::String>><unknown>
70.62 s
> at <unknown source file>:<unknown line>
70.62 s
> 11: test[75d6903177b1d7e9]::run_test::{closure#0}<unknown>
70.62 s
> at <unknown source file>:<unknown line>
70.62 s
> 12: std[bcb96dfbba0ab899]::sys::backtrace::__rust_begin_short_backtrace::<test[75d6903177b1d7e9]::run_test::{closure#1}, ()><unknown>
70.62 s
> at <unknown source file>:<unknown line>
70.62 s
> 13: <std[bcb96dfbba0ab899]::thread::lifecycle::spawn_unchecked<test[75d6903177b1d7e9]::run_test::{closure#1}, ()>::{closure#1} as core[940e698046960fd5]::ops::function::FnOnce<()>>::call_once::{shim:vtable#0}<unknown>
70.62 s
> at <unknown source file>:<unknown line>
70.62 s
> 14: <std[bcb96dfbba0ab899]::sys::thread::unix::Thread>::new::thread_start<unknown>
70.62 s
> at <unknown source file>:<unknown line>
70.62 s
> 15: start_thread<unknown>
70.62 s
> at <unknown source file>:<unknown line>
70.62 s
> 16: __clone3<unknown>
70.62 s
> at <unknown source file>:<unknown line>
70.62 s
>
70.62 s
> Run with COLORBT_SHOW_HIDDEN=1 environment variable to disable frame filtering.
70.62 s
> Run with RUST_BACKTRACE=full to include source snippets.
70.62 s
>
70.62 s
> 3. gammalooprs::test_renormalization::finite_part_quark_lo
70.62 s
> failure: test failure with exit code 101
70.62 s
> system-out
70.62 s
> running 1 test
70.62 s
> test finite_part_quark_lo ... FAILED
70.62 s
>
70.62 s
> failures:
70.62 s
>
70.62 s
> failures:
70.62 s
> finite_part_quark_lo
70.62 s
>
70.62 s
> test result: FAILED. 0 passed; 1 failed; 0 ignored; 0 measured; 5 filtered out; finished in 0.17s
70.62 s
> system-err
70.62 s
> The application panicked (crashed).
70.62 s
> Message: called `Result::unwrap()` on an `Err` value: "Symbol spenso::mink redefined with new attributes:\n\t- new user data specified: List([String(\"spenso::representation-v2\"), String(\"inline-metric\"), List([String(\"symbol\"), String(\"mink\")]), List([String(\"cyclic\"), Integer(1), List([List([String(\"symbol\"), String(\"mu\")]), List([String(\"symbol\"), String(\"nu\")]), List([String(\"symbol\"), String(\"rho\")]), List([String(\"symbol\"), String(\"sigma\")])])]), String(\"top\")]) vs None\n"
70.62 s
> Location: crates/vakint/src/lib.rs:4766
70.62 s
>
70.62 s
> ━━━━━━━━━━━━━━━━━━━━━━━━━━━━━━━━━━ BACKTRACE ━━━━━━━━━━━━━━━━━━━━━━━━━━━━━━━━━━━
70.62 s
> 1: <color_eyre[5722b77bc20a64cf]::config::PanicHook>::panic_report<unknown>
70.62 s
> at <unknown source file>:<unknown line>
70.62 s
> 2: <color_eyre[5722b77bc20a64cf]::config::PanicHook>::into_panic_hook::{closure#0}<unknown>
70.62 s
> at <unknown source file>:<unknown line>
70.62 s
> 3: std[bcb96dfbba0ab899]::panicking::panic_with_hook<unknown>
70.62 s
> at <unknown source file>:<unknown line>
70.62 s
> 4: std[bcb96dfbba0ab899]::panicking::panic_handler::{closure#0}<unknown>
70.62 s
> at <unknown source file>:<unknown line>
70.62 s
> 5: std[bcb96dfbba0ab899]::sys::backtrace::__rust_end_short_backtrace::<std[bcb96dfbba0ab899]::panicking::panic_handler::{closure#0}, !><unknown>
70.62 s
> at <unknown source file>:<unknown line>
70.62 s
> 6: __rustc[6c289b9f9c454d21]::rust_begin_unwind<unknown>
70.62 s
> at <unknown source file>:<unknown line>
70.62 s
> 7: core[940e698046960fd5]::panicking::panic_fmt<unknown>
70.62 s
> at <unknown source file>:<unknown line>
70.62 s
> 8: core[940e698046960fd5]::result::unwrap_failed<unknown>
70.62 s
> at <unknown source file>:<unknown line>
70.62 s
> 9: <vakint[eb7a1daa8ec05e1f]::Vakint>::sanitize_user_expressions<unknown>
70.62 s
> at <unknown source file>:<unknown line>
70.62 s
> 10: <vakint[eb7a1daa8ec05e1f]::Vakint>::prepare_expression_for_form<unknown>
70.62 s
> at <unknown source file>:<unknown line>
70.62 s
> 11: <vakint[eb7a1daa8ec05e1f]::VakintTerm>::tensor_reduce<unknown>
70.62 s
> at <unknown source file>:<unknown line>
70.62 s
> 12: <vakint[eb7a1daa8ec05e1f]::VakintExpression>::tensor_reduce<unknown>
70.62 s
> at <unknown source file>:<unknown line>
70.62 s
> 13: <gammalooprs[822fc56666e1de73]::uv::approx::integrated::Integrated>::integrate::<gammalooprs[822fc56666e1de73]::uv::hedge_poset::ForestNode><unknown>
70.62 s
> at <unknown source file>:<unknown line>
70.62 s
> 14: <gammalooprs[822fc56666e1de73]::uv::approx::integrated::Integrated>::run::<gammalooprs[822fc56666e1de73]::uv::hedge_poset::ForestNode, gammalooprs[822fc56666e1de73]::uv::hedge_poset::ForestNode><unknown>
70.62 s
> at <unknown source file>:<unknown line>
70.62 s
> 15: <gammalooprs[822fc56666e1de73]::uv::hedge_poset::Forests>::integrate<unknown>
70.62 s
> at <unknown source file>:<unknown line>
70.62 s
> 16: gammalooprs[822fc56666e1de73]::uv::orchestrator::hedge_poset_renormalization_part<unknown>
70.62 s
> at <unknown source file>:<unknown line>
70.62 s
> 17: <gammalooprs[822fc56666e1de73]::uv::settings::UVOrchestrator>::renormalization_part<unknown>
70.62 s
> at <unknown source file>:<unknown line>
70.62 s
> 18: <gammalooprs[822fc56666e1de73]::processes::amplitude::AmplitudeGraph>::renormalization_part<unknown>
70.62 s
> at <unknown source file>:<unknown line>
70.62 s
> 19: <test_renormalization[9f554b029f822e2d]::finite_part_quark_lo::{closure#0} as core[940e698046960fd5]::ops::function::FnOnce<()>>::call_once<unknown>
70.62 s
> at <unknown source file>:<unknown line>
70.62 s
> 20: test[75d6903177b1d7e9]::__rust_begin_short_backtrace::<core[940e698046960fd5]::result::Result<(), alloc[2ea6bcb46fca0c42]::string::String>, fn() -> core[940e698046960fd5]::result::Result<(), alloc[2ea6bcb46fca0c42]::string::String>><unknown>
70.62 s
> at <unknown source file>:<unknown line>
70.62 s
> 21: test[75d6903177b1d7e9]::run_test::{closure#0}<unknown>
70.62 s
> at <unknown source file>:<unknown line>
70.62 s
> 22: std[bcb96dfbba0ab899]::sys::backtrace::__rust_begin_short_backtrace::<test[75d6903177b1d7e9]::run_test::{closure#1}, ()><unknown>
70.62 s
> at <unknown source file>:<unknown line>
70.62 s
> 23: <std[bcb96dfbba0ab899]::thread::lifecycle::spawn_unchecked<test[75d6903177b1d7e9]::run_test::{closure#1}, ()>::{closure#1} as core[940e698046960fd5]::ops::function::FnOnce<()>>::call_once::{shim:vtable#0}<unknown>
70.62 s
> at <unknown source file>:<unknown line>
70.62 s
> 24: <std[bcb96dfbba0ab899]::sys::thread::unix::Thread>::new::thread_start<unknown>
70.62 s
> at <unknown source file>:<unknown line>
70.62 s
> 25: start_thread<unknown>
70.62 s
> at <unknown source file>:<unknown line>
70.62 s
> 26: __clone3<unknown>
70.62 s
> at <unknown source file>:<unknown line>
70.62 s
>
70.62 s
> Run with COLORBT_SHOW_HIDDEN=1 environment variable to disable frame filtering.
70.62 s
> Run with RUST_BACKTRACE=full to include source snippets.
70.62 s
> =========================================
70.62 s
For full logs, run:
70.62 s
nix log /nix/store/zinbrvppkmzalr7ws9scxa6mjscpn55x-gammaloop-nextest-core.drv
70.71 s
Run failed.