1. 0.00 s $ /nix/store/9ypz3flqsrl5xl495mm8h645gadjsxi1-coreutils-9.11/bin/timeout --kill-after=15s 7200s /nix/store/23zk8sgzamrbmj1fday15szf7f2279s8-nix-2.34.7/bin/nix --extra-experimental-features nix-command --extra-experimental-features flakes --log-format internal-json build --no-link --print-out-paths git+https://github.com/alphal00p/gammaloop?ref=simplify-spenso-api&rev=ab00e4917295883add11f9855734aaee1d56926f&shallow=1#packages.x86_64-linux.alphal00p-docs-cargo-artifacts --print-build-logs
  2. 1.96 s
  3. 3.14 s Building /nix/store/623idw7bxrdblwflbqi3k630cvnna0if-alphal00p-docs-cargo-0.1.0.drv
  4. 3.20 s [alphal00p-docs-cargo] cargoArtifacts not set, will not reuse any cargo artifacts
  5. 3.25 s [alphal00p-docs-cargo] Phase: unpackPhase
  6. 3.27 s [alphal00p-docs-cargo] unpacking source archive /nix/store/zw5i19nvfc6y8mffi47icfczb0q4x6ip-source
  7. 4.93 s [alphal00p-docs-cargo] source root is source
  8. 4.97 s [alphal00p-docs-cargo] Phase: patchPhase
  9. 4.98 s [alphal00p-docs-cargo] Executing configureCargoCommonVars
  10. 4.99 s [alphal00p-docs-cargo] Phase: updateAutotoolsGnuConfigScriptsPhase
  11. 5.01 s [alphal00p-docs-cargo] Phase: configurePhase
  12. 5.01 s [alphal00p-docs-cargo] will append /build/source/.cargo-home/config.toml with contents of /nix/store/5dfb7akvi1k3080zqfndr6jw2ay3di2p-vendor-cargo-deps/config.toml
  13. 5.02 s [alphal00p-docs-cargo] default configurePhase, nothing to do
  14. 5.02 s [alphal00p-docs-cargo] Phase: buildPhase
  15. 5.03 s [alphal00p-docs-cargo] +++ command cargo --version
  16. 5.04 s [alphal00p-docs-cargo] cargo 1.98.1 (797e8a9bc 2026-08-05)
  17. 5.04 s [alphal00p-docs-cargo] +++ command cargo build --profile docs --locked -p alphal00p-docs-catalogs --bin alphal00p-docs-catalogs
  18. 5.42 s [alphal00p-docs-cargo] Compiling proc-macro2 v1.0.106
  19. 5.42 s [alphal00p-docs-cargo] Compiling quote v1.0.45
  20. 5.42 s [alphal00p-docs-cargo] Compiling unicode-ident v1.0.24
  21. 5.42 s [alphal00p-docs-cargo] Compiling serde_core v1.0.228
  22. 5.42 s [alphal00p-docs-cargo] Compiling memchr v2.8.0
  23. 5.42 s [alphal00p-docs-cargo] Compiling zmij v1.0.21
  24. 5.42 s [alphal00p-docs-cargo] Compiling utf8parse v0.2.2
  25. 5.43 s [alphal00p-docs-cargo] Compiling serde_json v1.0.149
  26. 5.43 s [alphal00p-docs-cargo] Compiling serde v1.0.228
  27. 5.43 s [alphal00p-docs-cargo] Compiling thiserror v2.0.18
  28. 5.43 s [alphal00p-docs-cargo] Compiling anstyle-query v1.1.5
  29. 5.43 s [alphal00p-docs-cargo] Compiling anstyle v1.0.14
  30. 5.43 s [alphal00p-docs-cargo] Compiling colorchoice v1.0.5
  31. 5.43 s [alphal00p-docs-cargo] Compiling is_terminal_polyfill v1.70.2
  32. 5.43 s [alphal00p-docs-cargo] Compiling hashbrown v0.17.1
  33. 5.43 s [alphal00p-docs-cargo] Compiling heck v0.5.0
  34. 5.54 s [alphal00p-docs-cargo] Compiling anstyle-parse v1.0.0
  35. 5.54 s [alphal00p-docs-cargo] Compiling itoa v1.0.18
  36. 5.56 s [alphal00p-docs-cargo] Compiling clap_lex v1.1.0
  37. 5.57 s [alphal00p-docs-cargo] Compiling strsim v0.11.1
  38. 5.66 s [alphal00p-docs-cargo] Compiling eyre v0.6.12
  39. 5.70 s [alphal00p-docs-cargo] Compiling regex-syntax v0.8.10
  40. 5.74 s [alphal00p-docs-cargo] Compiling equivalent v1.0.2
  41. 5.75 s [alphal00p-docs-cargo] Compiling indenter v0.3.4
  42. 5.76 s [alphal00p-docs-cargo] Compiling once_cell v1.21.4
  43. 5.80 s [alphal00p-docs-cargo] Compiling anstream v1.0.0
  44. 5.96 s [alphal00p-docs-cargo] Compiling aho-corasick v1.1.4
  45. 6.01 s [alphal00p-docs-cargo] Compiling clap_builder v4.6.0
  46. 6.47 s [alphal00p-docs-cargo] Compiling syn v2.0.117
  47. 7.27 s [alphal00p-docs-cargo] Compiling regex-automata v0.4.14
  48. 7.69 s [alphal00p-docs-cargo] Compiling indexmap v2.14.0
  49. 8.39 s [alphal00p-docs-cargo] Compiling thiserror-impl v2.0.18
  50. 8.39 s [alphal00p-docs-cargo] Compiling serde_derive v1.0.228
  51. 8.39 s [alphal00p-docs-cargo] Compiling clap_derive v4.6.1
  52. 8.39 s [alphal00p-docs-cargo] Compiling alphal00p-docs-macros v0.1.0 (/build/source/crates/alphal00p-docs-macros)
  53. 9.04 s [alphal00p-docs-cargo] Compiling regex v1.12.3
  54. 9.92 s [alphal00p-docs-cargo] Compiling clap v4.6.1
  55. 10.81 s [alphal00p-docs-cargo] Compiling alphal00p-docs-schema v0.1.0 (/build/source/crates/alphal00p-docs-schema)
  56. 11.42 s [alphal00p-docs-cargo] Compiling alphal00p-docs-catalogs v0.1.0 (/build/source/crates/alphal00p-docs-catalogs)
  57. 16.76 s [alphal00p-docs-cargo] Finished `docs` profile [unoptimized] target(s) in 11.72s
  58. 16.84 s [alphal00p-docs-cargo] +++ command cargo build --profile docs --locked -p alphal00p-docs-python-exporter --features gammaloop
  59. 17.30 s [alphal00p-docs-cargo] Compiling serde_core v1.0.228
  60. 17.30 s [alphal00p-docs-cargo] Compiling libc v0.2.186
  61. 17.30 s [alphal00p-docs-cargo] Compiling cfg-if v1.0.4
  62. 17.30 s [alphal00p-docs-cargo] Compiling serde v1.0.228
  63. 17.30 s [alphal00p-docs-cargo] Compiling memchr v2.8.0
  64. 17.30 s [alphal00p-docs-cargo] Compiling autocfg v1.5.0
  65. 17.30 s [alphal00p-docs-cargo] Compiling libm v0.2.16
  66. 17.30 s [alphal00p-docs-cargo] Compiling version_check v0.9.5
  67. 17.30 s [alphal00p-docs-cargo] Compiling either v1.15.0
  68. 17.30 s [alphal00p-docs-cargo] Compiling zerocopy v0.8.48
  69. 17.30 s [alphal00p-docs-cargo] Compiling crossbeam-utils v0.8.21
  70. 17.30 s [alphal00p-docs-cargo] Compiling log v0.4.29
  71. 17.30 s [alphal00p-docs-cargo] Compiling unicode-width v0.2.2
  72. 17.30 s [alphal00p-docs-cargo] Compiling rayon-core v1.13.0
  73. 17.30 s [alphal00p-docs-cargo] Compiling foldhash v0.2.0
  74. 17.30 s [alphal00p-docs-cargo] Compiling syn v2.0.117
  75. 17.40 s [alphal00p-docs-cargo] Compiling syn v3.0.4
  76. 17.54 s [alphal00p-docs-cargo] Compiling target-lexicon v0.13.5
  77. 17.56 s [alphal00p-docs-cargo] Compiling serde_json v1.0.149
  78. 17.57 s [alphal00p-docs-cargo] Compiling lazy_static v1.5.0
  79. 17.57 s [alphal00p-docs-cargo] Compiling siphasher v1.0.2
  80. 17.63 s [alphal00p-docs-cargo] Compiling crunchy v0.2.4
  81. 17.71 s [alphal00p-docs-cargo] Compiling getrandom v0.3.4
  82. 17.74 s [alphal00p-docs-cargo] Compiling num-traits v0.2.19
  83. 17.75 s [alphal00p-docs-cargo] Compiling paste v1.0.15
  84. 17.77 s [alphal00p-docs-cargo] Compiling anyhow v1.0.102
  85. 17.91 s [alphal00p-docs-cargo] Compiling tiny-keccak v2.0.2
  86. 17.93 s [alphal00p-docs-cargo] Compiling itertools v0.14.0
  87. 17.95 s [alphal00p-docs-cargo] Compiling static_assertions v1.1.0
  88. 18.03 s [alphal00p-docs-cargo] Compiling aho-corasick v1.1.4
  89. 18.16 s [alphal00p-docs-cargo] Compiling time-core v0.1.8
  90. 18.22 s [alphal00p-docs-cargo] Compiling num-conv v0.2.1
  91. 18.27 s [alphal00p-docs-cargo] Compiling powerfmt v0.2.0
  92. 18.27 s [alphal00p-docs-cargo] Compiling rustix v1.1.4
  93. 18.35 s [alphal00p-docs-cargo] Compiling time-macros v0.2.27
  94. 18.37 s [alphal00p-docs-cargo] Compiling num_threads v0.1.7
  95. 18.46 s [alphal00p-docs-cargo] Compiling deranged v0.5.8
  96. 18.47 s [alphal00p-docs-cargo] Compiling linux-raw-sys v0.12.1
  97. 18.71 s [alphal00p-docs-cargo] Compiling allocator-api2 v0.2.21
  98. 18.77 s [alphal00p-docs-cargo] Compiling crossbeam-epoch v0.9.18
  99. 18.85 s [alphal00p-docs-cargo] Compiling tracing-core v0.1.36
  100. 18.90 s [alphal00p-docs-cargo] Compiling arrayvec v0.7.6
  101. 19.05 s [alphal00p-docs-cargo] Compiling crossbeam-deque v0.8.6
  102. 19.08 s [alphal00p-docs-cargo] Compiling hashbrown v0.16.1
  103. 19.09 s [alphal00p-docs-cargo] Compiling virtue v0.0.18
  104. 19.12 s [alphal00p-docs-cargo] Compiling pyo3-build-config v0.28.3
  105. 19.14 s [alphal00p-docs-cargo] Compiling winnow v1.0.2
  106. 19.15 s [alphal00p-docs-cargo] Compiling phf_shared v0.11.3
  107. 19.28 s [alphal00p-docs-cargo] Compiling gmp-mpfr-sys v1.7.1
  108. 19.31 s [alphal00p-docs-cargo] Compiling toml_writer v1.1.1+spec-1.1.0
  109. 19.48 s [alphal00p-docs-cargo] Compiling unty v0.0.4
  110. 19.56 s [alphal00p-docs-cargo] Compiling pin-project-lite v0.2.17
  111. 19.58 s [alphal00p-docs-cargo] Compiling nu-ansi-term v0.50.3
  112. 19.63 s [alphal00p-docs-cargo] Compiling tracing-log v0.2.0
  113. 19.77 s [alphal00p-docs-cargo] Compiling regex-automata v0.4.14
  114. 19.81 s [alphal00p-docs-cargo] Compiling matrixmultiply v0.3.10
  115. 19.94 s [alphal00p-docs-cargo] Compiling sharded-slab v0.1.7
  116. 20.19 s [alphal00p-docs-cargo] Compiling getrandom v0.2.17
  117. 20.25 s [alphal00p-docs-cargo] Compiling rayon v1.12.0
  118. 20.39 s [alphal00p-docs-cargo] Compiling rand_core v0.6.4
  119. 20.40 s [alphal00p-docs-cargo] Compiling time v0.3.47
  120. 20.43 s [alphal00p-docs-cargo] Compiling bincode_derive v2.0.1
  121. 20.49 s [alphal00p-docs-cargo] Compiling rand_core v0.9.5
  122. 20.52 s [alphal00p-docs-cargo] Compiling hashbrown v0.17.1
  123. 20.61 s [alphal00p-docs-cargo] Compiling thread_local v1.1.9
  124. 20.66 s [alphal00p-docs-cargo] Compiling syn v1.0.109
  125. 20.69 s [alphal00p-docs-cargo] Compiling typenum v1.20.0
  126. 20.74 s [alphal00p-docs-cargo] Compiling rug v1.30.0
  127. 21.05 s [alphal00p-docs-cargo] Compiling option-ext v0.2.0
  128. 21.08 s [alphal00p-docs-cargo] Compiling toml_parser v1.1.2+spec-1.1.0
  129. 21.13 s [alphal00p-docs-cargo] Compiling dirs-sys v0.5.0
  130. 21.15 s [alphal00p-docs-cargo] Compiling alloc-no-stdlib v2.0.4
  131. 21.21 s [alphal00p-docs-cargo] Compiling az v1.3.0
  132. 21.27 s [alphal00p-docs-cargo] Compiling dyn-clone v1.0.20
  133. 21.30 s [alphal00p-docs-cargo] Compiling fnv v1.0.7
  134. 21.38 s [alphal00p-docs-cargo] Compiling num-integer v0.1.46
  135. 21.39 s [alphal00p-docs-cargo] Compiling approx v0.5.1
  136. 21.43 s [alphal00p-docs-cargo] Compiling num-complex v0.4.6
  137. 21.45 s [alphal00p-docs-cargo] Compiling rawpointer v0.2.1
  138. 21.51 s [alphal00p-docs-cargo] Compiling alloc-stdlib v0.2.2
  139. 21.60 s [alphal00p-docs-cargo] Compiling generic-array v0.14.7
  140. 21.64 s [alphal00p-docs-cargo] Compiling colored v3.1.1
  141. 21.77 s [alphal00p-docs-cargo] Compiling pyo3-ffi v0.28.3
  142. 21.82 s [alphal00p-docs-cargo] Compiling pyo3-macros-backend v0.28.3
  143. 21.97 s [alphal00p-docs-cargo] Compiling num-bigint v0.4.6
  144. 21.99 s [alphal00p-docs-cargo] Compiling bitflags v1.3.2
  145. 22.07 s [alphal00p-docs-cargo] Compiling errno v0.3.14
  146. 22.09 s [alphal00p-docs-cargo] Compiling getopts v0.2.24
  147. 22.12 s [alphal00p-docs-cargo] Compiling ident_case v1.0.1
  148. 22.21 s [alphal00p-docs-cargo] Compiling signal-hook v0.3.18
  149. 22.24 s [alphal00p-docs-cargo] Compiling parking_lot_core v0.9.12
  150. 22.27 s [alphal00p-docs-cargo] Compiling same-file v1.0.6
  151. 22.40 s [alphal00p-docs-cargo] Compiling walkdir v2.5.0
  152. 22.42 s [alphal00p-docs-cargo] Compiling signal-hook-registry v1.4.8
  153. 22.58 s [alphal00p-docs-cargo] Compiling region v3.0.2
  154. 22.60 s [alphal00p-docs-cargo] Compiling const-random-macro v0.1.16
  155. 22.68 s [alphal00p-docs-cargo] Compiling hugepage-rs v0.1.1
  156. 22.71 s [alphal00p-docs-cargo] Compiling wasmtime-jit-icache-coherence v34.0.2
  157. 22.78 s [alphal00p-docs-cargo] Compiling vte v0.14.1
  158. 22.79 s [alphal00p-docs-cargo] Compiling smartstring v1.0.1
  159. 22.84 s [alphal00p-docs-cargo] Compiling ahash v0.8.12
  160. 22.88 s [alphal00p-docs-cargo] Compiling spec_math v0.1.6
  161. 23.01 s [alphal00p-docs-cargo] Compiling unic-char-range v0.9.0
  162. 23.06 s [alphal00p-docs-cargo] Compiling bytemuck_derive v1.12.0
  163. 23.08 s [alphal00p-docs-cargo] Compiling inventory v0.3.24
  164. 23.08 s [alphal00p-docs-cargo] Compiling scopeguard v1.2.0
  165. 23.12 s [alphal00p-docs-cargo] Compiling unic-common v0.9.0
  166. 23.14 s [alphal00p-docs-cargo] Compiling lock_api v0.4.14
  167. 23.17 s [alphal00p-docs-cargo] Compiling matchers v0.2.0
  168. 23.24 s [alphal00p-docs-cargo] Compiling regex v1.12.3
  169. 23.27 s [alphal00p-docs-cargo] Compiling unic-ucd-version v0.9.0
  170. 23.34 s [alphal00p-docs-cargo] Compiling bitflags v2.11.1
  171. 23.35 s [alphal00p-docs-cargo] Compiling serde_spanned v1.1.1
  172. 23.37 s [alphal00p-docs-cargo] Compiling toml_datetime v1.1.1+spec-1.1.0
  173. 23.49 s [alphal00p-docs-cargo] Compiling unic-char-property v0.9.0
  174. 23.49 s [alphal00p-docs-cargo] Compiling const-random v0.1.18
  175. 23.66 s [alphal00p-docs-cargo] Compiling brotli-decompressor v5.0.0
  176. 23.77 s [alphal00p-docs-cargo] Compiling toml v1.1.2+spec-1.1.0
  177. 23.86 s [alphal00p-docs-cargo] Compiling mio v1.2.0
  178. 23.88 s [alphal00p-docs-cargo] Compiling rustpython-parser-vendored v0.4.0
  179. 24.00 s [alphal00p-docs-cargo] Compiling itertools v0.11.0
  180. 24.14 s [alphal00p-docs-cargo] Compiling minimal-lexical v0.2.1
  181. 24.14 s [alphal00p-docs-cargo] Compiling rustix v0.38.44
  182. 24.26 s [alphal00p-docs-cargo] Compiling fastrand v2.4.1
  183. 24.33 s [alphal00p-docs-cargo] Compiling unicase v2.9.0
  184. 24.53 s [alphal00p-docs-cargo] Compiling winnow v0.7.15
  185. 24.56 s [alphal00p-docs-cargo] Compiling indenter v0.3.4
  186. 24.59 s [alphal00p-docs-cargo] Compiling iana-time-zone v0.1.65
  187. 24.60 s [alphal00p-docs-cargo] Compiling nom v7.1.3
  188. 24.68 s [alphal00p-docs-cargo] Compiling signal-hook-mio v0.2.5
  189. 24.76 s [alphal00p-docs-cargo] Compiling synstructure v0.13.2
  190. 25.02 s [alphal00p-docs-cargo] Compiling indexmap v2.14.0
  191. 25.08 s [alphal00p-docs-cargo] Compiling block-buffer v0.10.4
  192. 25.18 s [alphal00p-docs-cargo] Compiling brotli v8.0.2
  193. 25.35 s [alphal00p-docs-cargo] Compiling crypto-common v0.1.7
  194. 25.40 s [alphal00p-docs-cargo] Compiling numpy v0.28.0
  195. 25.42 s [alphal00p-docs-cargo] Compiling bytemuck v1.25.0
  196. 25.44 s [alphal00p-docs-cargo] Compiling directories v6.0.0
  197. 25.54 s [alphal00p-docs-cargo] Compiling phf v0.11.3
  198. 25.56 s [alphal00p-docs-cargo] Compiling libloading v0.9.0
  199. 25.65 s [alphal00p-docs-cargo] Compiling safe_arch v0.7.4
  200. 25.69 s [alphal00p-docs-cargo] Compiling safe_arch v1.2.0
  201. 25.75 s [alphal00p-docs-cargo] Compiling append-only-vec v0.1.8
  202. 25.82 s [alphal00p-docs-cargo] Compiling rustc-hash v2.1.2
  203. 25.85 s [alphal00p-docs-cargo] Compiling unicode-segmentation v1.13.2
  204. 25.86 s [alphal00p-docs-cargo] Compiling self_cell v1.2.2
  205. 25.89 s [alphal00p-docs-cargo] Compiling tinyjson v2.5.1
  206. 25.92 s [alphal00p-docs-cargo] Compiling data-encoding v2.11.1
  207. 25.96 s [alphal00p-docs-cargo] Compiling ed25519-compact v2.4.2
  208. 26.14 s [alphal00p-docs-cargo] Compiling wide v1.7.0
  209. 26.18 s [alphal00p-docs-cargo] Compiling bytes v1.11.1
  210. 26.25 s [alphal00p-docs-cargo] Compiling byteorder v1.5.0
  211. 26.37 s [alphal00p-docs-cargo] Compiling linux-raw-sys v0.4.15
  212. 26.53 s [alphal00p-docs-cargo] Compiling digest v0.10.7
  213. 26.54 s [alphal00p-docs-cargo] Compiling wide v0.7.33
  214. 26.62 s [alphal00p-docs-cargo] Compiling serde_derive v1.0.228
  215. 26.64 s [alphal00p-docs-cargo] Compiling zerocopy-derive v0.8.48
  216. 26.66 s [alphal00p-docs-cargo] Compiling tracing-attributes v0.1.31
  217. 26.69 s [alphal00p-docs-cargo] Compiling thiserror-impl v2.0.18
  218. 26.78 s [alphal00p-docs-cargo] Compiling is-macro v0.3.7
  219. 27.15 s [alphal00p-docs-cargo] Compiling terminal_size v0.4.4
  220. 27.17 s [alphal00p-docs-cargo] Compiling strum_macros v0.27.2
  221. 27.22 s [alphal00p-docs-cargo] Compiling zerofrom-derive v0.1.7
  222. 27.27 s [alphal00p-docs-cargo] Compiling clap_builder v4.6.0
  223. 27.29 s [alphal00p-docs-cargo] Compiling clap_derive v4.6.1
  224. 27.84 s [alphal00p-docs-cargo] Compiling ansitok v0.3.0
  225. 27.88 s [alphal00p-docs-cargo] Compiling rustpython-parser-core v0.4.0
  226. 28.18 s [alphal00p-docs-cargo] Compiling rustpython-ast v0.4.0
  227. 28.23 s [alphal00p-docs-cargo] Compiling thiserror v2.0.18
  228. 28.30 s [alphal00p-docs-cargo] Compiling yoke-derive v0.8.2
  229. 28.44 s [alphal00p-docs-cargo] Compiling tracing v0.1.44
  230. 28.84 s [alphal00p-docs-cargo] Compiling unic-ucd-ident v0.9.0
  231. 28.97 s [alphal00p-docs-cargo] Compiling simba v0.9.1
  232. 28.98 s [alphal00p-docs-cargo] Compiling unic-emoji-char v0.9.0
  233. 28.99 s [alphal00p-docs-cargo] Compiling pyo3 v0.28.3
  234. 29.19 s [alphal00p-docs-cargo] Compiling bstr v1.12.1
  235. 29.33 s [alphal00p-docs-cargo] Compiling zerofrom v0.1.8
  236. 29.35 s [alphal00p-docs-cargo] Compiling phf_shared v0.13.1
  237. 29.38 s [alphal00p-docs-cargo] Compiling stable_deref_trait v1.2.1
  238. 29.44 s [alphal00p-docs-cargo] Compiling getrandom v0.4.2
  239. 29.45 s [alphal00p-docs-cargo] Compiling plotters-backend v0.3.7
  240. 29.56 s [alphal00p-docs-cargo] Compiling rustc-hash v1.1.0
  241. 29.64 s [alphal00p-docs-cargo] Compiling typeid v1.0.3
  242. 29.75 s [alphal00p-docs-cargo] Compiling cpufeatures v0.2.17
  243. 29.81 s [alphal00p-docs-cargo] Compiling ciborium-io v0.2.2
  244. 29.86 s [alphal00p-docs-cargo] Compiling lalrpop-util v0.20.2
  245. 29.88 s [alphal00p-docs-cargo] Compiling sha2 v0.10.9
  246. 30.04 s [alphal00p-docs-cargo] Compiling plotters-svg v0.3.7
  247. 30.21 s [alphal00p-docs-cargo] Compiling eyre v0.6.12
  248. 30.23 s [alphal00p-docs-cargo] Compiling num-rational v0.4.2
  249. 30.26 s [alphal00p-docs-cargo] Compiling toml_datetime v0.7.5+spec-1.1.0
  250. 30.41 s [alphal00p-docs-cargo] Compiling globset v0.4.18
  251. 30.43 s [alphal00p-docs-cargo] Compiling zerovec-derive v0.11.6
  252. 30.48 s [alphal00p-docs-cargo] Compiling console v0.16.3
  253. 30.62 s [alphal00p-docs-cargo] Compiling yoke v0.8.3
  254. 30.66 s [alphal00p-docs-cargo] Compiling itertools v0.10.5
  255. 30.76 s [alphal00p-docs-cargo] Compiling ucd-trie v0.1.7
  256. 30.85 s [alphal00p-docs-cargo] Compiling clap v4.6.1
  257. 30.91 s [alphal00p-docs-cargo] Compiling cast v0.3.0
  258. 30.91 s [alphal00p-docs-cargo] Compiling rustversion v1.0.22
  259. 30.92 s [alphal00p-docs-cargo] Compiling strum v0.27.2
  260. 30.94 s [alphal00p-docs-cargo] Compiling adler2 v2.0.1
  261. 31.00 s [alphal00p-docs-cargo] Compiling simd-adler32 v0.3.10
  262. 31.02 s [alphal00p-docs-cargo] Compiling symbolica v2.2.0 (https://github.com/symbolica-dev/symbolica?rev=ba3737137c2a2ccd7bb39f0441837d38ec867e78#ba373713)
  263. 31.04 s [alphal00p-docs-cargo] Compiling toml_write v0.1.2
  264. 31.07 s [alphal00p-docs-cargo] Compiling pest v2.8.6
  265. 31.09 s [alphal00p-docs-cargo] Compiling rust-embed-utils v8.11.0
  266. 31.20 s [alphal00p-docs-cargo] Compiling miniz_oxide v0.8.9
  267. 31.21 s [alphal00p-docs-cargo] Compiling toml v0.9.12+spec-1.1.0
  268. 31.42 s [alphal00p-docs-cargo] Compiling plotters v0.3.7
  269. 31.42 s [alphal00p-docs-cargo] Compiling ansi-str v0.9.0
  270. 31.45 s [alphal00p-docs-cargo] Compiling displaydoc v0.2.7
  271. 31.52 s [alphal00p-docs-cargo] Compiling ndarray v0.17.2
  272. 31.93 s [alphal00p-docs-cargo] Compiling is-terminal v0.4.17
  273. 32.02 s [alphal00p-docs-cargo] Compiling slotmap v1.1.1
  274. 32.04 s [alphal00p-docs-cargo] Compiling anes v0.1.6
  275. 32.13 s [alphal00p-docs-cargo] Compiling maplit v1.0.2
  276. 32.14 s [alphal00p-docs-cargo] Compiling pyo3-macros v0.28.3
  277. 32.18 s [alphal00p-docs-cargo] Compiling bytecount v0.6.9
  278. 32.24 s [alphal00p-docs-cargo] Compiling oorandom v11.1.5
  279. 32.32 s [alphal00p-docs-cargo] Compiling criterion-plot v0.5.0
  280. 32.34 s [alphal00p-docs-cargo] Compiling papergrid v0.18.0
  281. 32.43 s [alphal00p-docs-cargo] Compiling tempfile v3.27.0
  282. 32.63 s [alphal00p-docs-cargo] Compiling testing_table v0.3.0
  283. 32.68 s [alphal00p-docs-cargo] Compiling tabled_derive v0.12.0
  284. 32.74 s [alphal00p-docs-cargo] Compiling toml_edit v0.25.11+spec-1.1.0
  285. 32.79 s [alphal00p-docs-cargo] Compiling similar v2.7.0
  286. 32.86 s [alphal00p-docs-cargo] Compiling proc-macro2-diagnostics v0.10.1
  287. 33.00 s [alphal00p-docs-cargo] Compiling pest_meta v2.8.6
  288. 33.10 s [alphal00p-docs-cargo] Compiling proc-macro-error-attr v1.0.4
  289. 33.12 s [alphal00p-docs-cargo] Compiling uncased v0.9.10
  290. 33.27 s [alphal00p-docs-cargo] Compiling smallvec v1.15.1
  291. 33.48 s [alphal00p-docs-cargo] Compiling bincode v2.0.1
  292. 33.58 s [alphal00p-docs-cargo] Compiling tracing-serde v0.2.0
  293. 33.74 s [alphal00p-docs-cargo] Compiling tracing-subscriber v0.3.23
  294. 34.13 s [alphal00p-docs-cargo] Compiling chrono v0.4.44
  295. 34.17 s [alphal00p-docs-cargo] Compiling serde_spanned v0.6.9
  296. 34.27 s [alphal00p-docs-cargo] Compiling parking_lot v0.12.5
  297. 34.29 s [alphal00p-docs-cargo] Compiling toml_datetime v0.6.11
  298. 34.48 s [alphal00p-docs-cargo] Compiling toml_edit v0.22.27
  299. 34.71 s [alphal00p-docs-cargo] Compiling xprec v0.2.2
  300. 34.83 s [alphal00p-docs-cargo] Compiling crossterm v0.28.1
  301. 34.89 s [alphal00p-docs-cargo] Compiling zerovec v0.11.8
  302. 34.94 s [alphal00p-docs-cargo] Compiling bincode-trait-derive v0.1.1
  303. 35.12 s [alphal00p-docs-cargo] Compiling tinytemplate v1.2.1
  304. 35.16 s [alphal00p-docs-cargo] Compiling ron v0.12.1
  305. 35.51 s [alphal00p-docs-cargo] Compiling tabled v0.22.0
  306. 36.36 s [alphal00p-docs-cargo] Compiling pest_generator v2.8.6
  307. 36.74 s [alphal00p-docs-cargo] Compiling slab v0.4.12
  308. 36.87 s [alphal00p-docs-cargo] Compiling tinystr v0.8.4
  309. 36.97 s [alphal00p-docs-cargo] Compiling strsim v0.10.0
  310. 37.14 s [alphal00p-docs-cargo] Compiling unic-langid-impl v0.9.6
  311. 37.19 s [alphal00p-docs-cargo] Compiling insta v1.47.2
  312. 37.28 s [alphal00p-docs-cargo] Compiling radium v0.7.0
  313. 37.45 s [alphal00p-docs-cargo] Compiling darling_core v0.14.4
  314. 37.65 s [alphal00p-docs-cargo] Compiling darling_core v0.23.0
  315. 37.66 s [alphal00p-docs-cargo] Compiling figment v0.10.19
  316. 37.74 s [alphal00p-docs-cargo] Compiling proc-macro-error v1.0.4
  317. 37.82 s [alphal00p-docs-cargo] Compiling ryu v1.0.23
  318. 38.01 s [alphal00p-docs-cargo] Compiling tap v1.0.1
  319. 38.14 s [alphal00p-docs-cargo] Compiling pest_derive v2.8.6
  320. 38.15 s [alphal00p-docs-cargo] Compiling wyz v0.5.1
  321. 38.25 s [alphal00p-docs-cargo] Compiling ppv-lite86 v0.2.21
  322. 38.48 s [alphal00p-docs-cargo] Compiling half v2.7.1
  323. 38.75 s [alphal00p-docs-cargo] Compiling ciborium-ll v0.2.2
  324. 38.89 s [alphal00p-docs-cargo] Compiling castaway v0.2.4
  325. 38.99 s [alphal00p-docs-cargo] Compiling rand_chacha v0.3.1
  326. 39.06 s [alphal00p-docs-cargo] Compiling rand_chacha v0.9.0
  327. 39.18 s [alphal00p-docs-cargo] Compiling ciborium v0.2.2
  328. 39.40 s [alphal00p-docs-cargo] Compiling rand v0.8.6
  329. 39.51 s [alphal00p-docs-cargo] Compiling rand v0.9.4
  330. 39.80 s [alphal00p-docs-cargo] Compiling toml v0.8.23
  331. 39.85 s [alphal00p-docs-cargo] Compiling instability v0.3.12
  332. 40.11 s [alphal00p-docs-cargo] Compiling criterion v0.5.1
  333. 40.18 s [alphal00p-docs-cargo] Compiling find-msvc-tools v0.1.9
  334. 40.36 s [alphal00p-docs-cargo] Compiling shlex v1.3.0
  335. 40.48 s [alphal00p-docs-cargo] Compiling symjit v2.25.6
  336. 40.54 s [alphal00p-docs-cargo] Compiling phf_generator v0.11.3
  337. 40.59 s [alphal00p-docs-cargo] Compiling indoc v2.0.7
  338. 40.65 s [alphal00p-docs-cargo] Compiling funty v2.0.0
  339. 40.68 s [alphal00p-docs-cargo] Compiling phf_codegen v0.11.3
  340. 40.74 s [alphal00p-docs-cargo] Compiling heck v0.4.1
  341. 40.79 s [alphal00p-docs-cargo] Compiling unicode_names2_generator v1.3.0
  342. 40.93 s [alphal00p-docs-cargo] Compiling rustpython-parser v0.4.0
  343. 41.06 s [alphal00p-docs-cargo] Compiling cc v1.2.61
  344. 41.33 s [alphal00p-docs-cargo] Compiling darling_macro v0.14.4
  345. 41.48 s [alphal00p-docs-cargo] Compiling bitvec v1.0.1
  346. 41.49 s [alphal00p-docs-cargo] Compiling compact_str v0.9.0
  347. 41.54 s [alphal00p-docs-cargo] Compiling duplicate v2.0.1
  348. 41.56 s [alphal00p-docs-cargo] Compiling dot-parser v0.5.1
  349. 42.36 s [alphal00p-docs-cargo] Compiling unicode_names2 v1.3.0
  350. 42.50 s [alphal00p-docs-cargo] Compiling darling v0.14.4
  351. 42.58 s [alphal00p-docs-cargo] Compiling darling_macro v0.23.0
  352. 42.59 s [alphal00p-docs-cargo] Compiling kasuari v0.4.12
  353. 42.68 s [alphal00p-docs-cargo] Compiling serde_repr v0.1.20
  354. 43.07 s [alphal00p-docs-cargo] Compiling unicode-truncate v2.0.1
  355. 43.11 s [alphal00p-docs-cargo] Compiling convert_case v0.10.0
  356. 43.30 s [alphal00p-docs-cargo] Compiling env_filter v1.0.1
  357. 43.38 s [alphal00p-docs-cargo] Compiling num-iter v0.1.45
  358. 43.52 s [alphal00p-docs-cargo] Compiling lru v0.16.4
  359. 43.61 s [alphal00p-docs-cargo] Compiling jiff v0.2.24
  360. 43.72 s [alphal00p-docs-cargo] Compiling convert_case v0.4.0
  361. 43.76 s [alphal00p-docs-cargo] Compiling ref-ops v0.2.5
  362. 43.77 s [alphal00p-docs-cargo] Compiling blake3 v1.8.5
  363. 43.84 s [alphal00p-docs-cargo] Compiling darling v0.23.0
  364. 43.95 s [alphal00p-docs-cargo] Compiling ratatui-core v0.1.0
  365. 44.08 s [alphal00p-docs-cargo] Compiling num v0.4.3
  366. 44.10 s [alphal00p-docs-cargo] Compiling derive_more-impl v2.1.1
  367. 44.13 s [alphal00p-docs-cargo] Compiling derive_more v0.99.20
  368. 44.19 s [alphal00p-docs-cargo] Compiling derive_builder_core v0.11.2
  369. 44.22 s [alphal00p-docs-cargo] Compiling duplicate v1.0.0
  370. 44.43 s [alphal00p-docs-cargo] Compiling enum-try-as-inner v0.1.1
  371. 44.80 s [alphal00p-docs-cargo] Compiling delegate v0.12.0
  372. 45.11 s [alphal00p-docs-cargo] Compiling rand_xoshiro v0.6.0
  373. 45.21 s [alphal00p-docs-cargo] Compiling features v0.10.0
  374. 45.28 s [alphal00p-docs-cargo] Compiling colored v2.2.0
  375. 45.51 s [alphal00p-docs-cargo] Compiling litrs v1.0.0
  376. 45.52 s [alphal00p-docs-cargo] Compiling portable-atomic v1.13.1
  377. 45.76 s [alphal00p-docs-cargo] Compiling owo-colors v4.3.0
  378. 45.78 s [alphal00p-docs-cargo] Compiling cfg_aliases v0.2.1
  379. 45.81 s [alphal00p-docs-cargo] Compiling thiserror v1.0.69
  380. 45.84 s [alphal00p-docs-cargo] Compiling constcat v0.5.1
  381. 45.85 s [alphal00p-docs-cargo] Compiling object v0.37.3
  382. 45.90 s [alphal00p-docs-cargo] Compiling gat-lending-iterator v0.1.8
  383. 46.09 s [alphal00p-docs-cargo] Compiling nix v0.31.2
  384. 46.27 s [alphal00p-docs-cargo] Compiling derive_more v2.1.1
  385. 46.35 s [alphal00p-docs-cargo] Compiling rand_distr v0.4.3
  386. 46.36 s [alphal00p-docs-cargo] Compiling derive_builder_macro v0.11.2
  387. 46.36 s [alphal00p-docs-cargo] Compiling simba v0.6.0
  388. 46.38 s [alphal00p-docs-cargo] Compiling document-features v0.2.12
  389. 46.38 s [alphal00p-docs-cargo] Compiling phf_generator v0.13.1
  390. 46.43 s [alphal00p-docs-cargo] Compiling nalgebra-macros v0.1.0
  391. 46.48 s [alphal00p-docs-cargo] Compiling thiserror-impl v1.0.69
  392. 46.58 s [alphal00p-docs-cargo] Compiling line-clipping v0.3.7
  393. 46.69 s [alphal00p-docs-cargo] Compiling dirs v6.0.0
  394. 46.91 s [alphal00p-docs-cargo] Compiling vte v0.15.0
  395. 47.00 s [alphal00p-docs-cargo] Compiling joinery v2.1.0
  396. 47.07 s [alphal00p-docs-cargo] Compiling clarabel v0.11.1
  397. 47.21 s [alphal00p-docs-cargo] Compiling ref-cast v1.0.25
  398. 47.25 s [alphal00p-docs-cargo] Compiling gimli v0.32.3
  399. 47.31 s [alphal00p-docs-cargo] Compiling cpufeatures v0.3.0
  400. 47.33 s [alphal00p-docs-cargo] Compiling arrayref v0.3.9
  401. 47.47 s [alphal00p-docs-cargo] Compiling constant_time_eq v0.4.2
  402. 47.48 s [alphal00p-docs-cargo] Compiling color-spantrace v0.3.0
  403. 47.56 s [alphal00p-docs-cargo] Compiling crossterm v0.29.0
  404. 47.65 s [alphal00p-docs-cargo] Compiling derive_builder v0.11.2
  405. 47.73 s [alphal00p-docs-cargo] Compiling titlecase v2.2.1
  406. 47.77 s [alphal00p-docs-cargo] Compiling vt100 v0.16.2
  407. 47.79 s [alphal00p-docs-cargo] Compiling ratatui-widgets v0.3.0
  408. 48.09 s [alphal00p-docs-cargo] Compiling phf_macros v0.13.1
  409. 48.86 s [alphal00p-docs-cargo] Compiling tracing-error v0.2.1
  410. 49.13 s [alphal00p-docs-cargo] Compiling serde-big-array v0.5.1
  411. 49.23 s [alphal00p-docs-cargo] Compiling enum_dispatch v0.3.13
  412. 49.30 s [alphal00p-docs-cargo] Compiling ref-cast-impl v1.0.25
  413. 49.54 s [alphal00p-docs-cargo] Compiling env_logger v0.11.10
  414. 49.62 s [alphal00p-docs-cargo] Compiling delegate v0.13.5
  415. 49.76 s [alphal00p-docs-cargo] Compiling serde_derive_internals v0.29.1
  416. 49.82 s [alphal00p-docs-cargo] Compiling amd v0.2.2
  417. 49.89 s [alphal00p-docs-cargo] Compiling subprocess v0.2.15
  418. 49.97 s [alphal00p-docs-cargo] Compiling rust_lisp v0.18.0
  419. 50.12 s [alphal00p-docs-cargo] Compiling rustc-demangle v0.1.27
  420. 50.17 s [alphal00p-docs-cargo] Compiling base64 v0.22.1
  421. 50.30 s [alphal00p-docs-cargo] Compiling semver v1.0.28
  422. 50.51 s [alphal00p-docs-cargo] Compiling vakint v0.1.2 (/build/source/crates/vakint)
  423. 50.58 s [alphal00p-docs-cargo] Compiling unit-prefix v0.5.2
  424. 50.60 s [alphal00p-docs-cargo] Compiling deprecate-until v1.0.0
  425. 50.72 s [alphal00p-docs-cargo] Compiling string-template-plus v0.4.3
  426. 50.76 s [alphal00p-docs-cargo] Compiling indicatif v0.18.4
  427. 50.84 s [alphal00p-docs-cargo] Compiling ratatui-macros v0.7.0
  428. 50.92 s [alphal00p-docs-cargo] Compiling phf v0.13.1
  429. 50.98 s [alphal00p-docs-cargo] Compiling ratatui-crossterm v0.1.0
  430. 51.06 s [alphal00p-docs-cargo] Compiling shellexpand v3.1.2
  431. 51.12 s [alphal00p-docs-cargo] Compiling xpct v0.5.1
  432. 51.14 s [alphal00p-docs-cargo] Compiling brotli-decompressor v4.0.3
  433. 51.16 s [alphal00p-docs-cargo] Compiling integer-sqrt v0.1.5
  434. 51.18 s [alphal00p-docs-cargo] Compiling crossbeam-channel v0.5.15
  435. 51.20 s [alphal00p-docs-cargo] Compiling schemars_derive v1.2.1
  436. 51.22 s [alphal00p-docs-cargo] Compiling itertools v0.12.1
  437. 51.23 s [alphal00p-docs-cargo] Compiling include_dir_macros v0.7.4
  438. 51.31 s [alphal00p-docs-cargo] Compiling gammaloop-tracing-filter-macros v0.1.0 (/build/source/crates/gammaloop-tracing-filter-macros)
  439. 51.68 s [alphal00p-docs-cargo] Compiling version-compare v0.2.1
  440. 51.76 s [alphal00p-docs-cargo] Compiling addr2line v0.25.1
  441. 51.88 s [alphal00p-docs-cargo] Compiling gammalooprs v0.3.4 (/build/source/crates/gammalooprs)
  442. 51.99 s [alphal00p-docs-cargo] Compiling symlink v0.1.0
  443. 52.04 s [alphal00p-docs-cargo] Compiling unsafe-libyaml v0.2.11
  444. 52.07 s [alphal00p-docs-cargo] Compiling tracing-appender v0.2.5
  445. 52.08 s [alphal00p-docs-cargo] Compiling tracing-indicatif v0.3.14
  446. 52.13 s [alphal00p-docs-cargo] Compiling include_dir v0.7.4
  447. 52.27 s [alphal00p-docs-cargo] Compiling pathfinding v4.15.0
  448. 52.31 s [alphal00p-docs-cargo] Compiling brotli v7.0.0
  449. 52.49 s [alphal00p-docs-cargo] Compiling rust-embed-impl v8.11.0
  450. 52.59 s [alphal00p-docs-cargo] Compiling ctrlc v3.5.2
  451. 52.62 s [alphal00p-docs-cargo] Compiling ratatui v0.30.0
  452. 52.71 s [alphal00p-docs-cargo] Compiling json5 v0.4.1
  453. 52.77 s [alphal00p-docs-cargo] Compiling typed-index-collections v3.5.0
  454. 52.81 s [alphal00p-docs-cargo] Compiling strum_macros v0.26.4
  455. 52.96 s [alphal00p-docs-cargo] Compiling vectorize v0.2.0
  456. 53.04 s [alphal00p-docs-cargo] Compiling clap_complete v4.6.3
  457. 53.08 s [alphal00p-docs-cargo] Compiling fd-lock v4.0.4
  458. 53.19 s [alphal00p-docs-cargo] Compiling nalgebra v0.29.0
  459. 53.26 s [alphal00p-docs-cargo] Compiling serde_yaml v0.9.34+deprecated
  460. 53.28 s [alphal00p-docs-cargo] Compiling strip-ansi-escapes v0.2.1
  461. 53.34 s [alphal00p-docs-cargo] Compiling gammaloop-api v0.1.0 (/build/source/crates/gammaloop-api)
  462. 53.35 s [alphal00p-docs-cargo] Compiling itertools v0.13.0
  463. 53.51 s [alphal00p-docs-cargo] Compiling strum v0.26.3
  464. 53.56 s [alphal00p-docs-cargo] Compiling backtrace v0.3.76
  465. 53.62 s [alphal00p-docs-cargo] Compiling base62 v2.2.4
  466. 53.71 s [alphal00p-docs-cargo] Compiling ringbuffer v0.16.0
  467. 53.77 s [alphal00p-docs-cargo] Compiling clap_complete_nushell v4.6.0
  468. 53.83 s [alphal00p-docs-cargo] Compiling sysinfo v0.33.1
  469. 54.43 s [alphal00p-docs-cargo] Compiling schemars v1.2.1
  470. 54.44 s [alphal00p-docs-cargo] Compiling rust-embed v8.11.0
  471. 54.58 s [alphal00p-docs-cargo] Compiling color-eyre v0.6.5
  472. 55.34 s [alphal00p-docs-cargo] Compiling pyo3-stub-gen-derive v0.17.2
  473. 55.85 s [alphal00p-docs-cargo] Compiling reedline v0.42.0
  474. 57.17 s [alphal00p-docs-cargo] Compiling pyo3-stub-gen v0.17.2
  475. 59.52 s [alphal00p-docs-cargo] Compiling statrs v0.16.1
  476. 60.17 s [alphal00p-docs-cargo] Compiling momtrop v0.3.0
  477. 162.46 s [alphal00p-docs-cargo] Compiling numerica v3.0.0 (https://github.com/symbolica-dev/symbolica?rev=ba3737137c2a2ccd7bb39f0441837d38ec867e78#ba373713)
  478. 167.50 s [alphal00p-docs-cargo] Compiling graphica v3.0.0 (https://github.com/symbolica-dev/symbolica?rev=ba3737137c2a2ccd7bb39f0441837d38ec867e78#ba373713)
  479. 219.82 s [alphal00p-docs-cargo] Compiling symbolica-utils v0.1.0 (/build/source/crates/symbolica-utils)
  480. 257.64 s [alphal00p-docs-cargo] Compiling gammaloop-workspace-hack v0.1.0 (/build/source/crates/gammaloop-workspace-hack)
  481. 257.64 s [alphal00p-docs-cargo] Compiling spenso-macros v0.3.2 (/build/source/crates/spenso-macros)
  482. 258.20 s [alphal00p-docs-cargo] Compiling linnet v0.17.0 (/build/source/crates/linnet)
  483. 264.65 s [alphal00p-docs-cargo] Compiling spenso v0.6.0 (/build/source/crates/spenso)
  484. 274.20 s [alphal00p-docs-cargo] Compiling idenso v0.3.0 (/build/source/crates/idenso)
  485. 274.20 s [alphal00p-docs-cargo] Compiling gammaloop-tracing-filter v0.1.0 (/build/source/crates/gammaloop-tracing-filter)
  486. 279.10 s [alphal00p-docs-cargo] Compiling spenso-hep-lib v0.1.7 (/build/source/crates/spenso-hep-lib)
  487. 395.60 s [alphal00p-docs-cargo] Compiling alphal00p-docs-python-exporter v0.1.0 (/build/source/crates/alphal00p-docs-python-exporter)
  488. 415.93 s [alphal00p-docs-cargo] Finished `docs` profile [unoptimized] target(s) in 6m 39s
  489. 416.05 s [alphal00p-docs-cargo] +++ command cargo build --profile docs --locked -p alphal00p-docs-python-exporter --features linnet
  490. 416.67 s [alphal00p-docs-cargo] Compiling libc v0.2.186
  491. 416.67 s [alphal00p-docs-cargo] Compiling serde_core v1.0.228
  492. 416.67 s [alphal00p-docs-cargo] Compiling zerocopy v0.8.48
  493. 416.68 s [alphal00p-docs-cargo] Compiling log v0.4.29
  494. 416.69 s [alphal00p-docs-cargo] Compiling num-traits v0.2.19
  495. 416.70 s [alphal00p-docs-cargo] Compiling syn v1.0.109
  496. 416.71 s [alphal00p-docs-cargo] Compiling syn v2.0.117
  497. 416.71 s [alphal00p-docs-cargo] Compiling ahash v0.7.8
  498. 416.74 s [alphal00p-docs-cargo] Compiling bytecheck v0.6.12
  499. 416.75 s [alphal00p-docs-cargo] Compiling regex-syntax v0.8.10
  500. 416.76 s [alphal00p-docs-cargo] Compiling simdutf8 v0.1.5
  501. 416.77 s [alphal00p-docs-cargo] Compiling rend v0.4.2
  502. 416.77 s [alphal00p-docs-cargo] Compiling indexmap v2.14.0
  503. 416.78 s [alphal00p-docs-cargo] Compiling figment v0.10.19
  504. 416.78 s [alphal00p-docs-cargo] Compiling ahash v0.8.12
  505. 416.78 s [alphal00p-docs-cargo] Compiling cgmath v0.18.0
  506. 416.97 s [alphal00p-docs-cargo] Compiling either v1.15.0
  507. 417.18 s [alphal00p-docs-cargo] Compiling rkyv v0.7.46
  508. 417.21 s [alphal00p-docs-cargo] Compiling itertools v0.11.0
  509. 417.23 s [alphal00p-docs-cargo] Compiling bincode v2.0.1
  510. 417.29 s [alphal00p-docs-cargo] Compiling pyo3 v0.28.3
  511. 417.31 s [alphal00p-docs-cargo] Compiling venial v0.5.0
  512. 417.33 s [alphal00p-docs-cargo] Compiling winnow v1.0.2
  513. 417.37 s [alphal00p-docs-cargo] Compiling arrayvec v0.7.6
  514. 417.37 s [alphal00p-docs-cargo] Compiling rustix v1.1.4
  515. 417.61 s [alphal00p-docs-cargo] Compiling seahash v4.1.0
  516. 417.63 s [alphal00p-docs-cargo] Compiling polycool v0.4.0
  517. 417.80 s [alphal00p-docs-cargo] Compiling bitflags v2.11.1
  518. 417.85 s [alphal00p-docs-cargo] Compiling toml_writer v1.1.1+spec-1.1.0
  519. 417.89 s [alphal00p-docs-cargo] Compiling winnow v0.7.15
  520. 418.04 s [alphal00p-docs-cargo] Compiling toml_parser v1.1.2+spec-1.1.0
  521. 418.09 s [alphal00p-docs-cargo] Compiling smallvec v1.15.1
  522. 418.12 s [alphal00p-docs-cargo] Compiling linnet-py v0.1.0 (/build/source/crates/linnet-py)
  523. 418.29 s [alphal00p-docs-cargo] Compiling wasm-minimal-protocol v0.2.0
  524. 418.33 s [alphal00p-docs-cargo] Compiling num-integer v0.1.46
  525. 418.42 s [alphal00p-docs-cargo] Compiling approx v0.4.0
  526. 418.43 s [alphal00p-docs-cargo] Compiling kurbo v0.13.1
  527. 418.49 s [alphal00p-docs-cargo] Compiling num-complex v0.4.6
  528. 418.58 s [alphal00p-docs-cargo] Compiling regex-automata v0.4.14
  529. 418.61 s [alphal00p-docs-cargo] Compiling chrono v0.4.44
  530. 418.91 s [alphal00p-docs-cargo] Compiling num-bigint v0.4.6
  531. 419.03 s [alphal00p-docs-cargo] Compiling getrandom v0.2.17
  532. 419.07 s [alphal00p-docs-cargo] Compiling dirs-sys v0.5.0
  533. 419.25 s [alphal00p-docs-cargo] Compiling pyo3-ffi v0.28.3
  534. 419.32 s [alphal00p-docs-cargo] Compiling rand_core v0.6.4
  535. 419.36 s [alphal00p-docs-cargo] Compiling const-random-macro v0.1.16
  536. 419.60 s [alphal00p-docs-cargo] Compiling dirs v6.0.0
  537. 419.72 s [alphal00p-docs-cargo] Compiling hashbrown v0.12.3
  538. 419.74 s [alphal00p-docs-cargo] Compiling shellexpand v3.1.2
  539. 419.76 s [alphal00p-docs-cargo] Compiling getrandom v0.4.2
  540. 419.99 s [alphal00p-docs-cargo] Compiling const-random v0.1.18
  541. 420.53 s [alphal00p-docs-cargo] Compiling tempfile v3.27.0
  542. 420.58 s [alphal00p-docs-cargo] Compiling toml_datetime v0.7.5+spec-1.1.0
  543. 420.58 s [alphal00p-docs-cargo] Compiling serde_spanned v1.1.1
  544. 420.58 s [alphal00p-docs-cargo] Compiling serde_json v1.0.149
  545. 420.84 s [alphal00p-docs-cargo] Compiling toml v0.9.12+spec-1.1.0
  546. 421.23 s [alphal00p-docs-cargo] Compiling globset v0.4.18
  547. 421.46 s [alphal00p-docs-cargo] Compiling ptr_meta_derive v0.1.4
  548. 421.46 s [alphal00p-docs-cargo] Compiling bytecheck_derive v0.6.12
  549. 421.47 s [alphal00p-docs-cargo] Compiling rkyv_derive v0.7.46
  550. 421.70 s [alphal00p-docs-cargo] Compiling rust-embed-utils v8.11.0
  551. 421.72 s [alphal00p-docs-cargo] Compiling pest_generator v2.8.6
  552. 421.72 s [alphal00p-docs-cargo] Compiling proc-macro2-diagnostics v0.10.1
  553. 421.72 s [alphal00p-docs-cargo] Compiling pyo3-macros-backend v0.28.3
  554. 422.19 s [alphal00p-docs-cargo] Compiling ptr_meta v0.1.4
  555. 422.46 s [alphal00p-docs-cargo] Compiling zerocopy-derive v0.8.48
  556. 422.46 s [alphal00p-docs-cargo] Compiling serde_derive v1.0.228
  557. 422.48 s [alphal00p-docs-cargo] Compiling is-macro v0.3.7
  558. 422.48 s [alphal00p-docs-cargo] Compiling thiserror-impl v2.0.18
  559. 422.48 s [alphal00p-docs-cargo] Compiling serde_repr v0.1.20
  560. 422.48 s [alphal00p-docs-cargo] Compiling bincode-trait-derive v0.1.1
  561. 422.49 s [alphal00p-docs-cargo] Compiling duplicate v2.0.1
  562. 422.49 s [alphal00p-docs-cargo] Compiling rust-embed-impl v8.11.0
  563. 422.63 s [alphal00p-docs-cargo] Compiling pest_derive v2.8.6
  564. 423.29 s [alphal00p-docs-cargo] Compiling ppv-lite86 v0.2.21
  565. 423.55 s [alphal00p-docs-cargo] Compiling dot-parser v0.5.1
  566. 423.55 s [alphal00p-docs-cargo] Compiling rustpython-parser-core v0.4.0
  567. 423.76 s [alphal00p-docs-cargo] Compiling rustpython-ast v0.4.0
  568. 423.78 s [alphal00p-docs-cargo] Compiling rand_chacha v0.3.1
  569. 423.99 s [alphal00p-docs-cargo] Compiling rand v0.8.6
  570. 424.27 s [alphal00p-docs-cargo] Compiling rust-embed v8.11.0
  571. 424.36 s [alphal00p-docs-cargo] Compiling thiserror v2.0.18
  572. 424.74 s [alphal00p-docs-cargo] Compiling phf_generator v0.11.3
  573. 424.86 s [alphal00p-docs-cargo] Compiling phf_codegen v0.11.3
  574. 424.95 s [alphal00p-docs-cargo] Compiling unicode_names2_generator v1.3.0
  575. 424.96 s [alphal00p-docs-cargo] Compiling rustpython-parser v0.4.0
  576. 425.42 s [alphal00p-docs-cargo] Compiling unicode_names2 v1.3.0
  577. 426.15 s [alphal00p-docs-cargo] Compiling pyo3-macros v0.28.3
  578. 426.35 s [alphal00p-docs-cargo] Compiling serde v1.0.228
  579. 426.88 s [alphal00p-docs-cargo] Compiling bitvec v1.0.1
  580. 428.39 s [alphal00p-docs-cargo] Compiling half v2.7.1
  581. 428.64 s [alphal00p-docs-cargo] Compiling ciborium-ll v0.2.2
  582. 428.76 s [alphal00p-docs-cargo] Compiling ciborium v0.2.2
  583. 429.25 s [alphal00p-docs-cargo] Compiling kurvst v0.1.0 (/build/source/crates/kurvst)
  584. 430.83 s [alphal00p-docs-cargo] Compiling linnet v0.17.0 (/build/source/crates/linnet)
  585. 432.11 s [alphal00p-docs-cargo] Compiling pyo3-stub-gen-derive v0.17.2
  586. 433.92 s [alphal00p-docs-cargo] Compiling pyo3-stub-gen v0.17.2
  587. 435.81 s [alphal00p-docs-cargo] Compiling linnest v0.1.0 (/build/source/crates/linnest)
  588. 454.11 s [alphal00p-docs-cargo] Compiling alphal00p-docs-python-exporter v0.1.0 (/build/source/crates/alphal00p-docs-python-exporter)
  589. 455.78 s [alphal00p-docs-cargo] Finished `docs` profile [unoptimized] target(s) in 39.72s
  590. 455.88 s [alphal00p-docs-cargo] +++ command cargo build --profile docs --locked -p alphal00p-docs-python-exporter --features spenso
  591. 456.73 s [alphal00p-docs-cargo] Compiling pyo3-build-config v0.28.3
  592. 456.75 s [alphal00p-docs-cargo] Compiling symbolica v2.2.0 (https://github.com/symbolica-dev/symbolica?rev=ba3737137c2a2ccd7bb39f0441837d38ec867e78#ba373713)
  593. 456.76 s [alphal00p-docs-cargo] Compiling syn v1.0.109
  594. 456.77 s [alphal00p-docs-cargo] Compiling figment v0.10.19
  595. 457.53 s [alphal00p-docs-cargo] Compiling proc-macro-error v1.0.4
  596. 457.79 s [alphal00p-docs-cargo] Compiling duplicate v1.0.0
  597. 458.11 s [alphal00p-docs-cargo] Compiling pyo3-macros-backend v0.28.3
  598. 458.11 s [alphal00p-docs-cargo] Compiling numpy v0.28.0
  599. 458.11 s [alphal00p-docs-cargo] Compiling pyo3-ffi v0.28.3
  600. 458.11 s [alphal00p-docs-cargo] Compiling pyo3 v0.28.3
  601. 461.25 s [alphal00p-docs-cargo] Compiling pyo3-macros v0.28.3
  602. 466.33 s [alphal00p-docs-cargo] Compiling pyo3-stub-gen v0.17.2
  603. 467.11 s [alphal00p-docs-cargo] Compiling numerica v3.0.0 (https://github.com/symbolica-dev/symbolica?rev=ba3737137c2a2ccd7bb39f0441837d38ec867e78#ba373713)
  604. 467.62 s [alphal00p-docs-cargo] Compiling gammaloop-workspace-hack v0.1.0 (/build/source/crates/gammaloop-workspace-hack)
  605. 471.34 s [alphal00p-docs-cargo] Compiling graphica v3.0.0 (https://github.com/symbolica-dev/symbolica?rev=ba3737137c2a2ccd7bb39f0441837d38ec867e78#ba373713)
  606. 515.65 s [alphal00p-docs-cargo] Compiling symbolica-utils v0.1.0 (/build/source/crates/symbolica-utils)
  607. 515.65 s [alphal00p-docs-cargo] Compiling tymbolica-atom-payload v0.1.0 (https://github.com/lcnbr/tymbolica?rev=e85233dd3d99e5fb458913d0d49f99d83466025b#e85233dd)
  608. 516.05 s [alphal00p-docs-cargo] Compiling linnet v0.17.0 (/build/source/crates/linnet)
  609. 520.73 s [alphal00p-docs-cargo] Compiling spenso v0.6.0 (/build/source/crates/spenso)
  610. 529.56 s [alphal00p-docs-cargo] Compiling idenso v0.3.0 (/build/source/crates/idenso)
  611. 535.09 s [alphal00p-docs-cargo] Compiling spenso-hep-lib v0.1.7 (/build/source/crates/spenso-hep-lib)
  612. 535.68 s [alphal00p-docs-cargo] Compiling spynso3 v0.1.2 (/build/source/crates/spynso3)
  613. 543.55 s [alphal00p-docs-cargo] Compiling alphal00p-docs-python-exporter v0.1.0 (/build/source/crates/alphal00p-docs-python-exporter)
  614. 556.75 s [alphal00p-docs-cargo] Finished `docs` profile [unoptimized] target(s) in 1m 40s
  615. 556.93 s [alphal00p-docs-cargo] +++ command cargo build --profile docs --locked -p alphal00p-docs-python-exporter --features idenso
  616. 558.72 s [alphal00p-docs-cargo] Compiling pyo3 v0.28.3
  617. 562.94 s [alphal00p-docs-cargo] Compiling numpy v0.28.0
  618. 564.14 s [alphal00p-docs-cargo] Compiling pyo3-stub-gen v0.17.2
  619. 565.22 s [alphal00p-docs-cargo] Compiling numerica v3.0.0 (https://github.com/symbolica-dev/symbolica?rev=ba3737137c2a2ccd7bb39f0441837d38ec867e78#ba373713)
  620. 572.58 s [alphal00p-docs-cargo] Compiling graphica v3.0.0 (https://github.com/symbolica-dev/symbolica?rev=ba3737137c2a2ccd7bb39f0441837d38ec867e78#ba373713)
  621. 573.39 s [alphal00p-docs-cargo] Compiling symbolica v2.2.0 (https://github.com/symbolica-dev/symbolica?rev=ba3737137c2a2ccd7bb39f0441837d38ec867e78#ba373713)
  622. 616.08 s [alphal00p-docs-cargo] Compiling gammaloop-workspace-hack v0.1.0 (/build/source/crates/gammaloop-workspace-hack)
  623. 616.08 s [alphal00p-docs-cargo] Compiling symbolica-utils v0.1.0 (/build/source/crates/symbolica-utils)
  624. 616.44 s [alphal00p-docs-cargo] Compiling linnet v0.17.0 (/build/source/crates/linnet)
  625. 620.26 s [alphal00p-docs-cargo] Compiling spenso v0.6.0 (/build/source/crates/spenso)
  626. 629.24 s [alphal00p-docs-cargo] Compiling idenso v0.3.0 (/build/source/crates/idenso)
  627. 637.86 s [alphal00p-docs-cargo] Compiling alphal00p-docs-python-exporter v0.1.0 (/build/source/crates/alphal00p-docs-python-exporter)
  628. 646.57 s [alphal00p-docs-cargo] Finished `docs` profile [unoptimized] target(s) in 1m 29s
  629. 646.63 s [alphal00p-docs-cargo] +++ command cargo build --profile docs --locked -p alphal00p-docs-python-exporter --features vakint
  630. 647.90 s [alphal00p-docs-cargo] Compiling libc v0.2.186
  631. 647.90 s [alphal00p-docs-cargo] Compiling tiny-keccak v2.0.2
  632. 647.91 s [alphal00p-docs-cargo] Compiling bytemuck v1.25.0
  633. 647.91 s [alphal00p-docs-cargo] Compiling matrixmultiply v0.3.10
  634. 647.91 s [alphal00p-docs-cargo] Compiling getrandom v0.3.4
  635. 647.92 s [alphal00p-docs-cargo] Compiling num-integer v0.1.46
  636. 647.92 s [alphal00p-docs-cargo] Compiling pyo3 v0.28.3
  637. 647.93 s [alphal00p-docs-cargo] Compiling regex-automata v0.4.14
  638. 647.95 s [alphal00p-docs-cargo] Compiling pyo3-macros-backend v0.28.3
  639. 647.95 s [alphal00p-docs-cargo] Compiling pyo3-ffi v0.28.3
  640. 647.96 s [alphal00p-docs-cargo] Compiling approx v0.5.1
  641. 647.96 s [alphal00p-docs-cargo] Compiling ahash v0.8.12
  642. 647.96 s [alphal00p-docs-cargo] Compiling serde v1.0.228
  643. 647.99 s [alphal00p-docs-cargo] Compiling itertools v0.14.0
  644. 647.99 s [alphal00p-docs-cargo] Compiling gmp-mpfr-sys v1.7.1
  645. 647.99 s [alphal00p-docs-cargo] Compiling smallvec v1.15.1
  646. 648.10 s [alphal00p-docs-cargo] Compiling safe_arch v0.7.4
  647. 648.25 s [alphal00p-docs-cargo] Compiling rand_core v0.9.5
  648. 648.26 s [alphal00p-docs-cargo] Compiling safe_arch v1.2.0
  649. 648.32 s [alphal00p-docs-cargo] Compiling rayon v1.12.0
  650. 648.40 s [alphal00p-docs-cargo] Compiling tracing-attributes v0.1.31
  651. 648.52 s [alphal00p-docs-cargo] Compiling wide v0.7.33
  652. 648.54 s [alphal00p-docs-cargo] Compiling smartstring v1.0.1
  653. 648.60 s [alphal00p-docs-cargo] Compiling phf_shared v0.13.1
  654. 648.64 s [alphal00p-docs-cargo] Compiling rand_chacha v0.9.0
  655. 648.69 s [alphal00p-docs-cargo] Compiling wide v1.7.0
  656. 648.71 s [alphal00p-docs-cargo] Compiling fastrand v2.4.1
  657. 648.80 s [alphal00p-docs-cargo] Compiling symbolica v2.2.0 (https://github.com/symbolica-dev/symbolica?rev=ba3737137c2a2ccd7bb39f0441837d38ec867e78#ba373713)
  658. 648.84 s [alphal00p-docs-cargo] Compiling phf_generator v0.13.1
  659. 648.95 s [alphal00p-docs-cargo] Compiling rug v1.30.0
  660. 649.04 s [alphal00p-docs-cargo] Compiling phf_macros v0.13.1
  661. 649.08 s [alphal00p-docs-cargo] Compiling directories v6.0.0
  662. 649.29 s [alphal00p-docs-cargo] Compiling ndarray v0.17.2
  663. 649.38 s [alphal00p-docs-cargo] Compiling rand v0.9.4
  664. 649.44 s [alphal00p-docs-cargo] Compiling subprocess v0.2.15
  665. 649.47 s [alphal00p-docs-cargo] Compiling vakint v0.1.2 (/build/source/crates/vakint)
  666. 650.15 s [alphal00p-docs-cargo] Compiling getrandom v0.2.17
  667. 650.40 s [alphal00p-docs-cargo] Compiling rand_core v0.6.4
  668. 650.44 s [alphal00p-docs-cargo] Compiling phf v0.13.1
  669. 650.57 s [alphal00p-docs-cargo] Compiling rand_chacha v0.3.1
  670. 650.68 s [alphal00p-docs-cargo] Compiling simba v0.9.1
  671. 650.84 s [alphal00p-docs-cargo] Compiling rand v0.8.6
  672. 650.85 s [alphal00p-docs-cargo] Compiling tracing v0.1.44
  673. 651.35 s [alphal00p-docs-cargo] Compiling phf_generator v0.11.3
  674. 651.45 s [alphal00p-docs-cargo] Compiling phf_codegen v0.11.3
  675. 651.53 s [alphal00p-docs-cargo] Compiling unicode_names2_generator v1.3.0
  676. 651.55 s [alphal00p-docs-cargo] Compiling rustpython-parser v0.4.0
  677. 651.95 s [alphal00p-docs-cargo] Compiling unicode_names2 v1.3.0
  678. 652.00 s [alphal00p-docs-cargo] Compiling regex v1.12.3
  679. 652.00 s [alphal00p-docs-cargo] Compiling matchers v0.2.0
  680. 652.37 s [alphal00p-docs-cargo] Compiling tracing-subscriber v0.3.23
  681. 652.49 s [alphal00p-docs-cargo] Compiling titlecase v2.2.1
  682. 652.62 s [alphal00p-docs-cargo] Compiling string-template-plus v0.4.3
  683. 652.72 s [alphal00p-docs-cargo] Compiling pyo3-macros v0.28.3
  684. 654.33 s [alphal00p-docs-cargo] Compiling xprec v0.2.2
  685. 656.49 s [alphal00p-docs-cargo] Compiling numpy v0.28.0
  686. 658.06 s [alphal00p-docs-cargo] Compiling pyo3-stub-gen-derive v0.17.2
  687. 659.37 s [alphal00p-docs-cargo] Compiling pyo3-stub-gen v0.17.2
  688. 660.05 s [alphal00p-docs-cargo] Compiling numerica v3.0.0 (https://github.com/symbolica-dev/symbolica?rev=ba3737137c2a2ccd7bb39f0441837d38ec867e78#ba373713)
  689. 660.17 s [alphal00p-docs-cargo] error: select an integer backend: `integer-gmp` or `integer-malachite`
  690. 660.17 s [alphal00p-docs-cargo] --> /nix/store/5dfb7akvi1k3080zqfndr6jw2ay3di2p-vendor-cargo-deps/f8c6b2c844a6fa8c330abb750e4cf5bbdb36a70140a58e87f6b79fb3024532aa/numerica-3.0.0/src/lib.rs:40:1
  691. 660.17 s [alphal00p-docs-cargo] |
  692. 660.17 s [alphal00p-docs-cargo] 40 | compile_error!("select an integer backend: `integer-gmp` or `integer-malachite`");
  693. 660.17 s [alphal00p-docs-cargo] | ^^^^^^^^^^^^^^^^^^^^^^^^^^^^^^^^^^^^^^^^^^^^^^^^^^^^^^^^^^^^^^^^^^^^^^^^^^^^^^^^^
  694. 660.17 s [alphal00p-docs-cargo]
  695. 660.17 s [alphal00p-docs-cargo] error: select a float backend: `float-mpfr` or `float-astro`
  696. 660.17 s [alphal00p-docs-cargo] --> /nix/store/5dfb7akvi1k3080zqfndr6jw2ay3di2p-vendor-cargo-deps/f8c6b2c844a6fa8c330abb750e4cf5bbdb36a70140a58e87f6b79fb3024532aa/numerica-3.0.0/src/lib.rs:44:1
  697. 660.17 s [alphal00p-docs-cargo] |
  698. 660.17 s [alphal00p-docs-cargo] 44 | compile_error!("select a float backend: `float-mpfr` or `float-astro`");
  699. 660.17 s [alphal00p-docs-cargo] | ^^^^^^^^^^^^^^^^^^^^^^^^^^^^^^^^^^^^^^^^^^^^^^^^^^^^^^^^^^^^^^^^^^^^^^^
  700. 660.17 s [alphal00p-docs-cargo]
  701. 660.42 s [alphal00p-docs-cargo] error[E0432]: unresolved import `implementation::BackendRandState`
  702. 660.42 s [alphal00p-docs-cargo] --> /nix/store/5dfb7akvi1k3080zqfndr6jw2ay3di2p-vendor-cargo-deps/f8c6b2c844a6fa8c330abb750e4cf5bbdb36a70140a58e87f6b79fb3024532aa/numerica-3.0.0/src/domains/backend/integer.rs:1614:33
  703. 660.42 s [alphal00p-docs-cargo] |
  704. 660.42 s [alphal00p-docs-cargo] 1614 | pub(crate) use implementation::{BackendRandState, Complete, RemRounding};
  705. 660.42 s [alphal00p-docs-cargo] | ^^^^^^^^^^^^^^^^ no `BackendRandState` in `domains::backend::integer::implementation`
  706. 660.42 s [alphal00p-docs-cargo] |
  707. 660.42 s [alphal00p-docs-cargo] note: found an item that was configured out
  708. 660.42 s [alphal00p-docs-cargo] --> /nix/store/5dfb7akvi1k3080zqfndr6jw2ay3di2p-vendor-cargo-deps/f8c6b2c844a6fa8c330abb750e4cf5bbdb36a70140a58e87f6b79fb3024532aa/numerica-3.0.0/src/domains/backend/integer.rs:1378:23
  709. 660.42 s [alphal00p-docs-cargo] |
  710. 660.42 s [alphal00p-docs-cargo] 1377 | #[cfg(feature = "integer-malachite")]
  711. 660.42 s [alphal00p-docs-cargo] | ----------------------------- the item is gated behind the `integer-malachite` feature
  712. 660.42 s [alphal00p-docs-cargo] 1378 | pub(crate) struct BackendRandState {
  713. 660.42 s [alphal00p-docs-cargo] | ^^^^^^^^^^^^^^^^
  714. 660.42 s [alphal00p-docs-cargo] note: found an item that was configured out
  715. 660.42 s [alphal00p-docs-cargo] --> /nix/store/5dfb7akvi1k3080zqfndr6jw2ay3di2p-vendor-cargo-deps/f8c6b2c844a6fa8c330abb750e4cf5bbdb36a70140a58e87f6b79fb3024532aa/numerica-3.0.0/src/domains/backend/integer.rs:1413:23
  716. 660.42 s [alphal00p-docs-cargo] |
  717. 660.42 s [alphal00p-docs-cargo] 1412 | #[cfg(feature = "integer-gmp")]
  718. 660.42 s [alphal00p-docs-cargo] | ----------------------- the item is gated behind the `integer-gmp` feature
  719. 660.42 s [alphal00p-docs-cargo] 1413 | pub(crate) struct BackendRandState(rug::rand::RandState<'static>);
  720. 660.42 s [alphal00p-docs-cargo] | ^^^^^^^^^^^^^^^^
  721. 660.42 s [alphal00p-docs-cargo]
  722. 660.42 s [alphal00p-docs-cargo] error[E0432]: unresolved import `implementation::RawMultiPrecisionInteger`
  723. 660.42 s [alphal00p-docs-cargo] --> /nix/store/5dfb7akvi1k3080zqfndr6jw2ay3di2p-vendor-cargo-deps/f8c6b2c844a6fa8c330abb750e4cf5bbdb36a70140a58e87f6b79fb3024532aa/numerica-3.0.0/src/domains/backend/integer.rs:1616:61
  724. 660.42 s [alphal00p-docs-cargo] |
  725. 660.42 s [alphal00p-docs-cargo] 1616 | MultiPrecisionInteger, ParseMultiPrecisionIntegerError, RawMultiPrecisionInteger,
  726. 660.42 s [alphal00p-docs-cargo] | ^^^^^^^^^^^^^^^^^^^^^^^^ no `RawMultiPrecisionInteger` in `domains::backend::integer::implementation`
  727. 660.42 s [alphal00p-docs-cargo] |
  728. 660.42 s [alphal00p-docs-cargo] note: found an item that was configured out
  729. 660.42 s [alphal00p-docs-cargo] --> /nix/store/5dfb7akvi1k3080zqfndr6jw2ay3di2p-vendor-cargo-deps/f8c6b2c844a6fa8c330abb750e4cf5bbdb36a70140a58e87f6b79fb3024532aa/numerica-3.0.0/src/domains/backend/integer.rs:26:14
  730. 660.42 s [alphal00p-docs-cargo] |
  731. 660.42 s [alphal00p-docs-cargo] 25 | #[cfg(feature = "integer-malachite")]
  732. 660.42 s [alphal00p-docs-cargo] | ----------------------------- the item is gated behind the `integer-malachite` feature
  733. 660.42 s [alphal00p-docs-cargo] 26 | pub type RawMultiPrecisionInteger = malachite_nz::integer::Integer;
  734. 660.42 s [alphal00p-docs-cargo] | ^^^^^^^^^^^^^^^^^^^^^^^^
  735. 660.42 s [alphal00p-docs-cargo] note: found an item that was configured out
  736. 660.42 s [alphal00p-docs-cargo] --> /nix/store/5dfb7akvi1k3080zqfndr6jw2ay3di2p-vendor-cargo-deps/f8c6b2c844a6fa8c330abb750e4cf5bbdb36a70140a58e87f6b79fb3024532aa/numerica-3.0.0/src/domains/backend/integer.rs:29:14
  737. 660.42 s [alphal00p-docs-cargo] |
  738. 660.42 s [alphal00p-docs-cargo] 28 | #[cfg(feature = "integer-gmp")]
  739. 660.42 s [alphal00p-docs-cargo] | ----------------------- the item is gated behind the `integer-gmp` feature
  740. 660.42 s [alphal00p-docs-cargo] 29 | pub type RawMultiPrecisionInteger = rug::Integer;
  741. 660.42 s [alphal00p-docs-cargo] | ^^^^^^^^^^^^^^^^^^^^^^^^
  742. 660.42 s [alphal00p-docs-cargo] help: a similar name exists in the module
  743. 660.42 s [alphal00p-docs-cargo] |
  744. 660.42 s [alphal00p-docs-cargo] 1616 - MultiPrecisionInteger, ParseMultiPrecisionIntegerError, RawMultiPrecisionInteger,
  745. 660.42 s [alphal00p-docs-cargo] 1616 + MultiPrecisionInteger, ParseMultiPrecisionIntegerError, MultiPrecisionInteger,
  746. 660.42 s [alphal00p-docs-cargo] |
  747. 660.42 s [alphal00p-docs-cargo]
  748. 660.42 s [alphal00p-docs-cargo] error[E0432]: unresolved imports `implementation::from_be_bytes`, `implementation::to_be_bytes`
  749. 660.42 s [alphal00p-docs-cargo] --> /nix/store/5dfb7akvi1k3080zqfndr6jw2ay3di2p-vendor-cargo-deps/f8c6b2c844a6fa8c330abb750e4cf5bbdb36a70140a58e87f6b79fb3024532aa/numerica-3.0.0/src/domains/backend/integer.rs:1709:33
  750. 660.42 s [alphal00p-docs-cargo] |
  751. 660.42 s [alphal00p-docs-cargo] 1709 | pub(crate) use implementation::{from_be_bytes, to_be_bytes};
  752. 660.42 s [alphal00p-docs-cargo] | ^^^^^^^^^^^^^ ^^^^^^^^^^^ no `to_be_bytes` in `domains::backend::integer::implementation`
  753. 660.42 s [alphal00p-docs-cargo] | |
  754. 660.42 s [alphal00p-docs-cargo] | no `from_be_bytes` in `domains::backend::integer::implementation`
  755. 660.42 s [alphal00p-docs-cargo] |
  756. 660.42 s [alphal00p-docs-cargo] note: found an item that was configured out
  757. 660.42 s [alphal00p-docs-cargo] --> /nix/store/5dfb7akvi1k3080zqfndr6jw2ay3di2p-vendor-cargo-deps/f8c6b2c844a6fa8c330abb750e4cf5bbdb36a70140a58e87f6b79fb3024532aa/numerica-3.0.0/src/domains/backend/integer.rs:1370:19
  758. 660.42 s [alphal00p-docs-cargo] |
  759. 660.42 s [alphal00p-docs-cargo] 1369 | #[cfg(all(feature = "integer-malachite", feature = "bincode"))]
  760. 660.42 s [alphal00p-docs-cargo] | ----------------------------- the item is gated behind the `integer-malachite` feature
  761. 660.42 s [alphal00p-docs-cargo] 1370 | pub(crate) fn from_be_bytes(bytes: &[u8]) -> Result<MultiPrecisionInteger, &'static str> {
  762. 660.42 s [alphal00p-docs-cargo] | ^^^^^^^^^^^^^
  763. 660.42 s [alphal00p-docs-cargo] note: found an item that was configured out
  764. 660.42 s [alphal00p-docs-cargo] --> /nix/store/5dfb7akvi1k3080zqfndr6jw2ay3di2p-vendor-cargo-deps/f8c6b2c844a6fa8c330abb750e4cf5bbdb36a70140a58e87f6b79fb3024532aa/numerica-3.0.0/src/domains/backend/integer.rs:1405:19
  765. 660.42 s [alphal00p-docs-cargo] |
  766. 660.42 s [alphal00p-docs-cargo] 1404 | #[cfg(all(feature = "integer-gmp", feature = "bincode"))]
  767. 660.42 s [alphal00p-docs-cargo] | ----------------------- the item is gated behind the `integer-gmp` feature
  768. 660.42 s [alphal00p-docs-cargo] 1405 | pub(crate) fn from_be_bytes(bytes: &[u8]) -> Result<MultiPrecisionInteger, &'static str> {
  769. 660.42 s [alphal00p-docs-cargo] | ^^^^^^^^^^^^^
  770. 660.42 s [alphal00p-docs-cargo] note: found an item that was configured out
  771. 660.42 s [alphal00p-docs-cargo] --> /nix/store/5dfb7akvi1k3080zqfndr6jw2ay3di2p-vendor-cargo-deps/f8c6b2c844a6fa8c330abb750e4cf5bbdb36a70140a58e87f6b79fb3024532aa/numerica-3.0.0/src/domains/backend/integer.rs:1365:19
  772. 660.42 s [alphal00p-docs-cargo] |
  773. 660.42 s [alphal00p-docs-cargo] 1364 | #[cfg(all(feature = "integer-malachite", feature = "bincode"))]
  774. 660.42 s [alphal00p-docs-cargo] | ----------------------------- the item is gated behind the `integer-malachite` feature
  775. 660.42 s [alphal00p-docs-cargo] 1365 | pub(crate) fn to_be_bytes(value: &MultiPrecisionInteger) -> Vec<u8> {
  776. 660.42 s [alphal00p-docs-cargo] | ^^^^^^^^^^^
  777. 660.42 s [alphal00p-docs-cargo] note: found an item that was configured out
  778. 660.42 s [alphal00p-docs-cargo] --> /nix/store/5dfb7akvi1k3080zqfndr6jw2ay3di2p-vendor-cargo-deps/f8c6b2c844a6fa8c330abb750e4cf5bbdb36a70140a58e87f6b79fb3024532aa/numerica-3.0.0/src/domains/backend/integer.rs:1400:19
  779. 660.42 s [alphal00p-docs-cargo] |
  780. 660.42 s [alphal00p-docs-cargo] 1399 | #[cfg(all(feature = "integer-gmp", feature = "bincode"))]
  781. 660.42 s [alphal00p-docs-cargo] | ----------------------- the item is gated behind the `integer-gmp` feature
  782. 660.42 s [alphal00p-docs-cargo] 1400 | pub(crate) fn to_be_bytes(value: &MultiPrecisionInteger) -> Vec<u8> {
  783. 660.42 s [alphal00p-docs-cargo] | ^^^^^^^^^^^
  784. 660.42 s [alphal00p-docs-cargo]
  785. 660.43 s [alphal00p-docs-cargo] error[E0432]: unresolved imports `crate::domains::backend::float::Assign`, `crate::domains::backend::float::CompleteRound`, `crate::domains::backend::float::Constant`, `crate::domains::backend::float::MultiPrecisionFloat`, `crate::domains::backend::float::Pow`
  786. 660.43 s [alphal00p-docs-cargo] --> /nix/store/5dfb7akvi1k3080zqfndr6jw2ay3di2p-vendor-cargo-deps/f8c6b2c844a6fa8c330abb750e4cf5bbdb36a70140a58e87f6b79fb3024532aa/numerica-3.0.0/src/domains/float/multiprecision.rs:15:9
  787. 660.43 s [alphal00p-docs-cargo] |
  788. 660.43 s [alphal00p-docs-cargo] 15 | Assign, CompleteRound, Constant, MultiPrecisionFloat, MultiPrecisionFloatInteger,
  789. 660.43 s [alphal00p-docs-cargo] | ^^^^^^ ^^^^^^^^^^^^^ ^^^^^^^^ ^^^^^^^^^^^^^^^^^^^ no `MultiPrecisionFloat` in `domains::backend::float`
  790. 660.43 s [alphal00p-docs-cargo] | | | |
  791. 660.43 s [alphal00p-docs-cargo] | | | no `Constant` in `domains::backend::float`
  792. 660.43 s [alphal00p-docs-cargo] | | no `CompleteRound` in `domains::backend::float`
  793. 660.43 s [alphal00p-docs-cargo] | no `Assign` in `domains::backend::float`
  794. 660.43 s [alphal00p-docs-cargo] 16 | MultiPrecisionFloatRational, MultiPrecisionFloatRounding, Pow, RoundingDirection,
  795. 660.43 s [alphal00p-docs-cargo] | ^^^ no `Pow` in `domains::backend::float`
  796. 660.43 s [alphal00p-docs-cargo] |
  797. 660.43 s [alphal00p-docs-cargo] note: found an item that was configured out
  798. 660.43 s [alphal00p-docs-cargo] --> /nix/store/5dfb7akvi1k3080zqfndr6jw2ay3di2p-vendor-cargo-deps/f8c6b2c844a6fa8c330abb750e4cf5bbdb36a70140a58e87f6b79fb3024532aa/numerica-3.0.0/src/domains/backend/float.rs:17:5
  799. 660.43 s [alphal00p-docs-cargo] |
  800. 660.43 s [alphal00p-docs-cargo] 15 | #[cfg(feature = "float-mpfr")]
  801. 660.43 s [alphal00p-docs-cargo] | ---------------------- the item is gated behind the `float-mpfr` feature
  802. 660.43 s [alphal00p-docs-cargo] 16 | pub use rug::{
  803. 660.43 s [alphal00p-docs-cargo] 17 | Assign, Float as MultiPrecisionFloat, Rational as BackendRational,
  804. 660.43 s [alphal00p-docs-cargo] | ^^^^^^
  805. 660.43 s [alphal00p-docs-cargo] note: found an item that was configured out
  806. 660.43 s [alphal00p-docs-cargo] --> /nix/store/5dfb7akvi1k3080zqfndr6jw2ay3di2p-vendor-cargo-deps/f8c6b2c844a6fa8c330abb750e4cf5bbdb36a70140a58e87f6b79fb3024532aa/numerica-3.0.0/src/domains/backend/float.rs:1561:5
  807. 660.43 s [alphal00p-docs-cargo] |
  808. 660.43 s [alphal00p-docs-cargo] 1559 | #[cfg(feature = "float-astro")]
  809. 660.43 s [alphal00p-docs-cargo] | ----------------------- the item is gated behind the `float-astro` feature
  810. 660.43 s [alphal00p-docs-cargo] 1560 | pub use astro::{
  811. 660.43 s [alphal00p-docs-cargo] 1561 | Assign, BackendRational, CompleteRound, Constant, IntoMultiPrecisionFloat, MultiPrecisionFloat,
  812. 660.43 s [alphal00p-docs-cargo] | ^^^^^^
  813. 660.43 s [alphal00p-docs-cargo] note: found an item that was configured out
  814. 660.43 s [alphal00p-docs-cargo] --> /nix/store/5dfb7akvi1k3080zqfndr6jw2ay3di2p-vendor-cargo-deps/f8c6b2c844a6fa8c330abb750e4cf5bbdb36a70140a58e87f6b79fb3024532aa/numerica-3.0.0/src/domains/backend/float.rs:19:11
  815. 660.43 s [alphal00p-docs-cargo] |
  816. 660.43 s [alphal00p-docs-cargo] 15 | #[cfg(feature = "float-mpfr")]
  817. 660.43 s [alphal00p-docs-cargo] | ---------------------- the item is gated behind the `float-mpfr` feature
  818. 660.43 s [alphal00p-docs-cargo] ...
  819. 660.43 s [alphal00p-docs-cargo] 19 | ops::{CompleteRound, Pow},
  820. 660.43 s [alphal00p-docs-cargo] | ^^^^^^^^^^^^^
  821. 660.43 s [alphal00p-docs-cargo] note: found an item that was configured out
  822. 660.43 s [alphal00p-docs-cargo] --> /nix/store/5dfb7akvi1k3080zqfndr6jw2ay3di2p-vendor-cargo-deps/f8c6b2c844a6fa8c330abb750e4cf5bbdb36a70140a58e87f6b79fb3024532aa/numerica-3.0.0/src/domains/backend/float.rs:1561:30
  823. 660.43 s [alphal00p-docs-cargo] |
  824. 660.43 s [alphal00p-docs-cargo] 1559 | #[cfg(feature = "float-astro")]
  825. 660.43 s [alphal00p-docs-cargo] | ----------------------- the item is gated behind the `float-astro` feature
  826. 660.43 s [alphal00p-docs-cargo] 1560 | pub use astro::{
  827. 660.43 s [alphal00p-docs-cargo] 1561 | Assign, BackendRational, CompleteRound, Constant, IntoMultiPrecisionFloat, MultiPrecisionFloat,
  828. 660.43 s [alphal00p-docs-cargo] | ^^^^^^^^^^^^^
  829. 660.43 s [alphal00p-docs-cargo] note: found an item that was configured out
  830. 660.43 s [alphal00p-docs-cargo] --> /nix/store/5dfb7akvi1k3080zqfndr6jw2ay3di2p-vendor-cargo-deps/f8c6b2c844a6fa8c330abb750e4cf5bbdb36a70140a58e87f6b79fb3024532aa/numerica-3.0.0/src/domains/backend/float.rs:18:12
  831. 660.43 s [alphal00p-docs-cargo] |
  832. 660.43 s [alphal00p-docs-cargo] 15 | #[cfg(feature = "float-mpfr")]
  833. 660.43 s [alphal00p-docs-cargo] | ---------------------- the item is gated behind the `float-mpfr` feature
  834. 660.43 s [alphal00p-docs-cargo] ...
  835. 660.43 s [alphal00p-docs-cargo] 18 | float::Constant,
  836. 660.43 s [alphal00p-docs-cargo] | ^^^^^^^^
  837. 660.43 s [alphal00p-docs-cargo] note: found an item that was configured out
  838. 660.43 s [alphal00p-docs-cargo] --> /nix/store/5dfb7akvi1k3080zqfndr6jw2ay3di2p-vendor-cargo-deps/f8c6b2c844a6fa8c330abb750e4cf5bbdb36a70140a58e87f6b79fb3024532aa/numerica-3.0.0/src/domains/backend/float.rs:1561:45
  839. 660.43 s [alphal00p-docs-cargo] |
  840. 660.43 s [alphal00p-docs-cargo] 1559 | #[cfg(feature = "float-astro")]
  841. 660.43 s [alphal00p-docs-cargo] | ----------------------- the item is gated behind the `float-astro` feature
  842. 660.43 s [alphal00p-docs-cargo] 1560 | pub use astro::{
  843. 660.43 s [alphal00p-docs-cargo] 1561 | Assign, BackendRational, CompleteRound, Constant, IntoMultiPrecisionFloat, MultiPrecisionFloat,
  844. 660.43 s [alphal00p-docs-cargo] | ^^^^^^^^
  845. 660.43 s [alphal00p-docs-cargo] note: found an item that was configured out
  846. 660.43 s [alphal00p-docs-cargo] --> /nix/store/5dfb7akvi1k3080zqfndr6jw2ay3di2p-vendor-cargo-deps/f8c6b2c844a6fa8c330abb750e4cf5bbdb36a70140a58e87f6b79fb3024532aa/numerica-3.0.0/src/domains/backend/float.rs:17:22
  847. 660.43 s [alphal00p-docs-cargo] |
  848. 660.43 s [alphal00p-docs-cargo] 15 | #[cfg(feature = "float-mpfr")]
  849. 660.43 s [alphal00p-docs-cargo] | ---------------------- the item is gated behind the `float-mpfr` feature
  850. 660.43 s [alphal00p-docs-cargo] 16 | pub use rug::{
  851. 660.43 s [alphal00p-docs-cargo] 17 | Assign, Float as MultiPrecisionFloat, Rational as BackendRational,
  852. 660.43 s [alphal00p-docs-cargo] | ^^^^^^^^^^^^^^^^^^^
  853. 660.43 s [alphal00p-docs-cargo] note: found an item that was configured out
  854. 660.43 s [alphal00p-docs-cargo] --> /nix/store/5dfb7akvi1k3080zqfndr6jw2ay3di2p-vendor-cargo-deps/f8c6b2c844a6fa8c330abb750e4cf5bbdb36a70140a58e87f6b79fb3024532aa/numerica-3.0.0/src/domains/backend/float.rs:1561:80
  855. 660.43 s [alphal00p-docs-cargo] |
  856. 660.43 s [alphal00p-docs-cargo] 1559 | #[cfg(feature = "float-astro")]
  857. 660.43 s [alphal00p-docs-cargo] | ----------------------- the item is gated behind the `float-astro` feature
  858. 660.43 s [alphal00p-docs-cargo] 1560 | pub use astro::{
  859. 660.43 s [alphal00p-docs-cargo] 1561 | Assign, BackendRational, CompleteRound, Constant, IntoMultiPrecisionFloat, MultiPrecisionFloat,
  860. 660.43 s [alphal00p-docs-cargo] | ^^^^^^^^^^^^^^^^^^^
  861. 660.43 s [alphal00p-docs-cargo] note: found an item that was configured out
  862. 660.43 s [alphal00p-docs-cargo] --> /nix/store/5dfb7akvi1k3080zqfndr6jw2ay3di2p-vendor-cargo-deps/f8c6b2c844a6fa8c330abb750e4cf5bbdb36a70140a58e87f6b79fb3024532aa/numerica-3.0.0/src/domains/backend/float.rs:19:26
  863. 660.43 s [alphal00p-docs-cargo] |
  864. 660.43 s [alphal00p-docs-cargo] 15 | #[cfg(feature = "float-mpfr")]
  865. 660.43 s [alphal00p-docs-cargo] | ---------------------- the item is gated behind the `float-mpfr` feature
  866. 660.43 s [alphal00p-docs-cargo] ...
  867. 660.43 s [alphal00p-docs-cargo] 19 | ops::{CompleteRound, Pow},
  868. 660.43 s [alphal00p-docs-cargo] | ^^^
  869. 660.43 s [alphal00p-docs-cargo] note: found an item that was configured out
  870. 660.43 s [alphal00p-docs-cargo] --> /nix/store/5dfb7akvi1k3080zqfndr6jw2ay3di2p-vendor-cargo-deps/f8c6b2c844a6fa8c330abb750e4cf5bbdb36a70140a58e87f6b79fb3024532aa/numerica-3.0.0/src/domains/backend/float.rs:1562:5
  871. 660.43 s [alphal00p-docs-cargo] |
  872. 660.43 s [alphal00p-docs-cargo] 1559 | #[cfg(feature = "float-astro")]
  873. 660.43 s [alphal00p-docs-cargo] | ----------------------- the item is gated behind the `float-astro` feature
  874. 660.43 s [alphal00p-docs-cargo] ...
  875. 660.43 s [alphal00p-docs-cargo] 1562 | Pow,
  876. 660.43 s [alphal00p-docs-cargo] | ^^^
  877. 660.43 s [alphal00p-docs-cargo]
  878. 660.76 s [alphal00p-docs-cargo] error[E0425]: cannot find type `RawMultiPrecisionInteger` in this scope
  879. 660.76 s [alphal00p-docs-cargo] --> /nix/store/5dfb7akvi1k3080zqfndr6jw2ay3di2p-vendor-cargo-deps/f8c6b2c844a6fa8c330abb750e4cf5bbdb36a70140a58e87f6b79fb3024532aa/numerica-3.0.0/src/domains/backend/integer.rs:52:38
  880. 660.76 s [alphal00p-docs-cargo] |
  881. 660.76 s [alphal00p-docs-cargo] 52 | pub struct MultiPrecisionInteger(RawMultiPrecisionInteger);
  882. 660.76 s [alphal00p-docs-cargo] | ^^^^^^^^^^^^^^^^^^^^^^^^ not found in this scope
  883. 660.76 s [alphal00p-docs-cargo]
  884. 660.77 s [alphal00p-docs-cargo] error[E0425]: cannot find type `RawMultiPrecisionInteger` in this scope
  885. 660.77 s [alphal00p-docs-cargo] --> /nix/store/5dfb7akvi1k3080zqfndr6jw2ay3di2p-vendor-cargo-deps/f8c6b2c844a6fa8c330abb750e4cf5bbdb36a70140a58e87f6b79fb3024532aa/numerica-3.0.0/src/domains/backend/integer.rs:52:38
  886. 660.77 s [alphal00p-docs-cargo] |
  887. 660.77 s [alphal00p-docs-cargo] 52 | pub struct MultiPrecisionInteger(RawMultiPrecisionInteger);
  888. 660.77 s [alphal00p-docs-cargo] | ^^^^^^^^^^^^^^^^^^^^^^^^ not found in this scope
  889. 660.77 s [alphal00p-docs-cargo] |
  890. 660.77 s [alphal00p-docs-cargo] help: you might be missing a type parameter
  891. 660.77 s [alphal00p-docs-cargo] |
  892. 660.77 s [alphal00p-docs-cargo] 52 | pub struct MultiPrecisionInteger<RawMultiPrecisionInteger>(RawMultiPrecisionInteger);
  893. 660.77 s [alphal00p-docs-cargo] | ++++++++++++++++++++++++++
  894. 660.77 s [alphal00p-docs-cargo]
  895. 660.77 s [alphal00p-docs-cargo] error[E0425]: cannot find type `RawMultiPrecisionInteger` in this scope
  896. 660.77 s [alphal00p-docs-cargo] --> /nix/store/5dfb7akvi1k3080zqfndr6jw2ay3di2p-vendor-cargo-deps/f8c6b2c844a6fa8c330abb750e4cf5bbdb36a70140a58e87f6b79fb3024532aa/numerica-3.0.0/src/domains/backend/integer.rs:149:32
  897. 660.77 s [alphal00p-docs-cargo] |
  898. 660.77 s [alphal00p-docs-cargo] 52 | pub struct MultiPrecisionInteger(RawMultiPrecisionInteger);
  899. 660.77 s [alphal00p-docs-cargo] | ----------------------------------------------------------- similarly named struct `MultiPrecisionInteger` defined here
  900. 660.77 s [alphal00p-docs-cargo] ...
  901. 660.77 s [alphal00p-docs-cargo] 149 | pub fn from_raw(value: RawMultiPrecisionInteger) -> Self {
  902. 660.77 s [alphal00p-docs-cargo] | ^^^^^^^^^^^^^^^^^^^^^^^^
  903. 660.77 s [alphal00p-docs-cargo] |
  904. 660.77 s [alphal00p-docs-cargo] help: a struct with a similar name exists
  905. 660.77 s [alphal00p-docs-cargo] |
  906. 660.77 s [alphal00p-docs-cargo] 149 - pub fn from_raw(value: RawMultiPrecisionInteger) -> Self {
  907. 660.77 s [alphal00p-docs-cargo] 149 + pub fn from_raw(value: MultiPrecisionInteger) -> Self {
  908. 660.77 s [alphal00p-docs-cargo] |
  909. 660.77 s [alphal00p-docs-cargo]
  910. 660.77 s [alphal00p-docs-cargo] error[E0425]: cannot find type `RawMultiPrecisionInteger` in this scope
  911. 660.77 s [alphal00p-docs-cargo] --> /nix/store/5dfb7akvi1k3080zqfndr6jw2ay3di2p-vendor-cargo-deps/f8c6b2c844a6fa8c330abb750e4cf5bbdb36a70140a58e87f6b79fb3024532aa/numerica-3.0.0/src/domains/backend/integer.rs:187:34
  912. 660.77 s [alphal00p-docs-cargo] |
  913. 660.77 s [alphal00p-docs-cargo] 52 | pub struct MultiPrecisionInteger(RawMultiPrecisionInteger);
  914. 660.77 s [alphal00p-docs-cargo] | ----------------------------------------------------------- similarly named struct `MultiPrecisionInteger` defined here
  915. 660.77 s [alphal00p-docs-cargo] ...
  916. 660.77 s [alphal00p-docs-cargo] 187 | pub fn as_raw(&self) -> &RawMultiPrecisionInteger {
  917. 660.77 s [alphal00p-docs-cargo] | ^^^^^^^^^^^^^^^^^^^^^^^^
  918. 660.77 s [alphal00p-docs-cargo] |
  919. 660.77 s [alphal00p-docs-cargo] help: a struct with a similar name exists
  920. 660.77 s [alphal00p-docs-cargo] |
  921. 660.77 s [alphal00p-docs-cargo] 187 - pub fn as_raw(&self) -> &RawMultiPrecisionInteger {
  922. 660.77 s [alphal00p-docs-cargo] 187 + pub fn as_raw(&self) -> &MultiPrecisionInteger {
  923. 660.77 s [alphal00p-docs-cargo] |
  924. 660.77 s [alphal00p-docs-cargo]
  925. 660.78 s [alphal00p-docs-cargo] error[E0425]: cannot find type `RawMultiPrecisionInteger` in this scope
  926. 660.78 s [alphal00p-docs-cargo] --> /nix/store/5dfb7akvi1k3080zqfndr6jw2ay3di2p-vendor-cargo-deps/f8c6b2c844a6fa8c330abb750e4cf5bbdb36a70140a58e87f6b79fb3024532aa/numerica-3.0.0/src/domains/backend/integer.rs:193:33
  927. 660.78 s [alphal00p-docs-cargo] |
  928. 660.78 s [alphal00p-docs-cargo] 52 | pub struct MultiPrecisionInteger(RawMultiPrecisionInteger);
  929. 660.78 s [alphal00p-docs-cargo] | ----------------------------------------------------------- similarly named struct `MultiPrecisionInteger` defined here
  930. 660.78 s [alphal00p-docs-cargo] ...
  931. 660.78 s [alphal00p-docs-cargo] 193 | pub fn to_raw(&self) -> RawMultiPrecisionInteger {
  932. 660.78 s [alphal00p-docs-cargo] | ^^^^^^^^^^^^^^^^^^^^^^^^
  933. 660.78 s [alphal00p-docs-cargo] |
  934. 660.78 s [alphal00p-docs-cargo] help: a struct with a similar name exists
  935. 660.78 s [alphal00p-docs-cargo] |
  936. 660.78 s [alphal00p-docs-cargo] 193 - pub fn to_raw(&self) -> RawMultiPrecisionInteger {
  937. 660.78 s [alphal00p-docs-cargo] 193 + pub fn to_raw(&self) -> MultiPrecisionInteger {
  938. 660.78 s [alphal00p-docs-cargo] |
  939. 660.78 s [alphal00p-docs-cargo]
  940. 660.78 s [alphal00p-docs-cargo] error[E0425]: cannot find type `RawMultiPrecisionInteger` in this scope
  941. 660.78 s [alphal00p-docs-cargo] --> /nix/store/5dfb7akvi1k3080zqfndr6jw2ay3di2p-vendor-cargo-deps/f8c6b2c844a6fa8c330abb750e4cf5bbdb36a70140a58e87f6b79fb3024532aa/numerica-3.0.0/src/domains/backend/integer.rs:199:34
  942. 660.78 s [alphal00p-docs-cargo] |
  943. 660.78 s [alphal00p-docs-cargo] 52 | pub struct MultiPrecisionInteger(RawMultiPrecisionInteger);
  944. 660.78 s [alphal00p-docs-cargo] | ----------------------------------------------------------- similarly named struct `MultiPrecisionInteger` defined here
  945. 660.78 s [alphal00p-docs-cargo] ...
  946. 660.78 s [alphal00p-docs-cargo] 199 | pub fn into_raw(self) -> RawMultiPrecisionInteger {
  947. 660.78 s [alphal00p-docs-cargo] | ^^^^^^^^^^^^^^^^^^^^^^^^
  948. 660.78 s [alphal00p-docs-cargo] |
  949. 660.78 s [alphal00p-docs-cargo] help: a struct with a similar name exists
  950. 660.78 s [alphal00p-docs-cargo] |
  951. 660.78 s [alphal00p-docs-cargo] 199 - pub fn into_raw(self) -> RawMultiPrecisionInteger {
  952. 660.78 s [alphal00p-docs-cargo] 199 + pub fn into_raw(self) -> MultiPrecisionInteger {
  953. 660.78 s [alphal00p-docs-cargo] |
  954. 660.78 s [alphal00p-docs-cargo]
  955. 660.78 s [alphal00p-docs-cargo] error[E0425]: cannot find type `RawMultiPrecisionInteger` in this scope
  956. 660.78 s [alphal00p-docs-cargo] --> /nix/store/5dfb7akvi1k3080zqfndr6jw2ay3di2p-vendor-cargo-deps/f8c6b2c844a6fa8c330abb750e4cf5bbdb36a70140a58e87f6b79fb3024532aa/numerica-3.0.0/src/domains/backend/integer.rs:567:27
  957. 660.78 s [alphal00p-docs-cargo] |
  958. 660.78 s [alphal00p-docs-cargo] 52 | pub struct MultiPrecisionInteger(RawMultiPrecisionInteger);
  959. 660.78 s [alphal00p-docs-cargo] | ----------------------------------------------------------- similarly named struct `MultiPrecisionInteger` defined here
  960. 660.78 s [alphal00p-docs-cargo] ...
  961. 660.78 s [alphal00p-docs-cargo] 567 | fn rem_trunc(lhs: RawMultiPrecisionInteger, rhs: RawMultiPrecisionInteger) -> Self {
  962. 660.78 s [alphal00p-docs-cargo] | ^^^^^^^^^^^^^^^^^^^^^^^^
  963. 660.78 s [alphal00p-docs-cargo] |
  964. 660.78 s [alphal00p-docs-cargo] help: a struct with a similar name exists
  965. 660.78 s [alphal00p-docs-cargo] |
  966. 660.78 s [alphal00p-docs-cargo] 567 - fn rem_trunc(lhs: RawMultiPrecisionInteger, rhs: RawMultiPrecisionInteger) -> Self {
  967. 660.78 s [alphal00p-docs-cargo] 567 + fn rem_trunc(lhs: MultiPrecisionInteger, rhs: RawMultiPrecisionInteger) -> Self {
  968. 660.78 s [alphal00p-docs-cargo] |
  969. 660.78 s [alphal00p-docs-cargo]
  970. 660.78 s [alphal00p-docs-cargo] error[E0425]: cannot find type `RawMultiPrecisionInteger` in this scope
  971. 660.78 s [alphal00p-docs-cargo] --> /nix/store/5dfb7akvi1k3080zqfndr6jw2ay3di2p-vendor-cargo-deps/f8c6b2c844a6fa8c330abb750e4cf5bbdb36a70140a58e87f6b79fb3024532aa/numerica-3.0.0/src/domains/backend/integer.rs:567:58
  972. 660.78 s [alphal00p-docs-cargo] |
  973. 660.78 s [alphal00p-docs-cargo] 52 | pub struct MultiPrecisionInteger(RawMultiPrecisionInteger);
  974. 660.78 s [alphal00p-docs-cargo] | ----------------------------------------------------------- similarly named struct `MultiPrecisionInteger` defined here
  975. 660.78 s [alphal00p-docs-cargo] ...
  976. 660.78 s [alphal00p-docs-cargo] 567 | fn rem_trunc(lhs: RawMultiPrecisionInteger, rhs: RawMultiPrecisionInteger) -> Self {
  977. 660.78 s [alphal00p-docs-cargo] | ^^^^^^^^^^^^^^^^^^^^^^^^
  978. 660.78 s [alphal00p-docs-cargo] |
  979. 660.78 s [alphal00p-docs-cargo] help: a struct with a similar name exists
  980. 660.78 s [alphal00p-docs-cargo] |
  981. 660.78 s [alphal00p-docs-cargo] 567 - fn rem_trunc(lhs: RawMultiPrecisionInteger, rhs: RawMultiPrecisionInteger) -> Self {
  982. 660.78 s [alphal00p-docs-cargo] 567 + fn rem_trunc(lhs: RawMultiPrecisionInteger, rhs: MultiPrecisionInteger) -> Self {
  983. 660.78 s [alphal00p-docs-cargo] |
  984. 660.78 s [alphal00p-docs-cargo]
  985. 660.79 s [alphal00p-docs-cargo] error[E0425]: cannot find type `RawMultiPrecisionInteger` in this scope
  986. 660.79 s [alphal00p-docs-cargo] --> /nix/store/5dfb7akvi1k3080zqfndr6jw2ay3di2p-vendor-cargo-deps/f8c6b2c844a6fa8c330abb750e4cf5bbdb36a70140a58e87f6b79fb3024532aa/numerica-3.0.0/src/domains/backend/integer.rs:582:27
  987. 660.79 s [alphal00p-docs-cargo] |
  988. 660.79 s [alphal00p-docs-cargo] 52 | pub struct MultiPrecisionInteger(RawMultiPrecisionInteger);
  989. 660.79 s [alphal00p-docs-cargo] | ----------------------------------------------------------- similarly named struct `MultiPrecisionInteger` defined here
  990. 660.79 s [alphal00p-docs-cargo] ...
  991. 660.79 s [alphal00p-docs-cargo] 582 | fn shl_raw(value: RawMultiPrecisionInteger, rhs: u64) -> RawMultiPrecisionInteger {
  992. 660.79 s [alphal00p-docs-cargo] | ^^^^^^^^^^^^^^^^^^^^^^^^
  993. 660.79 s [alphal00p-docs-cargo] |
  994. 660.79 s [alphal00p-docs-cargo] help: a struct with a similar name exists
  995. 660.79 s [alphal00p-docs-cargo] |
  996. 660.79 s [alphal00p-docs-cargo] 582 - fn shl_raw(value: RawMultiPrecisionInteger, rhs: u64) -> RawMultiPrecisionInteger {
  997. 660.79 s [alphal00p-docs-cargo] 582 + fn shl_raw(value: MultiPrecisionInteger, rhs: u64) -> RawMultiPrecisionInteger {
  998. 660.79 s [alphal00p-docs-cargo] |
  999. 660.79 s [alphal00p-docs-cargo]
  1000. 660.79 s [alphal00p-docs-cargo] error[E0425]: cannot find type `RawMultiPrecisionInteger` in this scope
  1001. 660.79 s [alphal00p-docs-cargo] --> /nix/store/5dfb7akvi1k3080zqfndr6jw2ay3di2p-vendor-cargo-deps/f8c6b2c844a6fa8c330abb750e4cf5bbdb36a70140a58e87f6b79fb3024532aa/numerica-3.0.0/src/domains/backend/integer.rs:582:66
  1002. 660.79 s [alphal00p-docs-cargo] |
  1003. 660.79 s [alphal00p-docs-cargo] 52 | pub struct MultiPrecisionInteger(RawMultiPrecisionInteger);
  1004. 660.79 s [alphal00p-docs-cargo] | ----------------------------------------------------------- similarly named struct `MultiPrecisionInteger` defined here
  1005. 660.79 s [alphal00p-docs-cargo] ...
  1006. 660.79 s [alphal00p-docs-cargo] 582 | fn shl_raw(value: RawMultiPrecisionInteger, rhs: u64) -> RawMultiPrecisionInteger {
  1007. 660.79 s [alphal00p-docs-cargo] | ^^^^^^^^^^^^^^^^^^^^^^^^
  1008. 660.79 s [alphal00p-docs-cargo] |
  1009. 660.79 s [alphal00p-docs-cargo] help: a struct with a similar name exists
  1010. 660.79 s [alphal00p-docs-cargo] |
  1011. 660.79 s [alphal00p-docs-cargo] 582 - fn shl_raw(value: RawMultiPrecisionInteger, rhs: u64) -> RawMultiPrecisionInteger {
  1012. 660.79 s [alphal00p-docs-cargo] 582 + fn shl_raw(value: RawMultiPrecisionInteger, rhs: u64) -> MultiPrecisionInteger {
  1013. 660.79 s [alphal00p-docs-cargo] |
  1014. 660.79 s [alphal00p-docs-cargo]
  1015. 660.79 s [alphal00p-docs-cargo] error[E0425]: cannot find type `RawMultiPrecisionInteger` in this scope
  1016. 660.79 s [alphal00p-docs-cargo] --> /nix/store/5dfb7akvi1k3080zqfndr6jw2ay3di2p-vendor-cargo-deps/f8c6b2c844a6fa8c330abb750e4cf5bbdb36a70140a58e87f6b79fb3024532aa/numerica-3.0.0/src/domains/backend/integer.rs:590:27
  1017. 660.79 s [alphal00p-docs-cargo] |
  1018. 660.79 s [alphal00p-docs-cargo] 52 | pub struct MultiPrecisionInteger(RawMultiPrecisionInteger);
  1019. 660.79 s [alphal00p-docs-cargo] | ----------------------------------------------------------- similarly named struct `MultiPrecisionInteger` defined here
  1020. 660.79 s [alphal00p-docs-cargo] ...
  1021. 660.79 s [alphal00p-docs-cargo] 590 | fn shr_raw(value: RawMultiPrecisionInteger, rhs: u64) -> RawMultiPrecisionInteger {
  1022. 660.79 s [alphal00p-docs-cargo] | ^^^^^^^^^^^^^^^^^^^^^^^^
  1023. 660.79 s [alphal00p-docs-cargo] |
  1024. 660.79 s [alphal00p-docs-cargo] help: a struct with a similar name exists
  1025. 660.79 s [alphal00p-docs-cargo] |
  1026. 660.79 s [alphal00p-docs-cargo] 590 - fn shr_raw(value: RawMultiPrecisionInteger, rhs: u64) -> RawMultiPrecisionInteger {
  1027. 660.79 s [alphal00p-docs-cargo] 590 + fn shr_raw(value: MultiPrecisionInteger, rhs: u64) -> RawMultiPrecisionInteger {
  1028. 660.79 s [alphal00p-docs-cargo] |
  1029. 660.79 s [alphal00p-docs-cargo]
  1030. 660.79 s [alphal00p-docs-cargo] error[E0425]: cannot find type `RawMultiPrecisionInteger` in this scope
  1031. 660.79 s [alphal00p-docs-cargo] --> /nix/store/5dfb7akvi1k3080zqfndr6jw2ay3di2p-vendor-cargo-deps/f8c6b2c844a6fa8c330abb750e4cf5bbdb36a70140a58e87f6b79fb3024532aa/numerica-3.0.0/src/domains/backend/integer.rs:590:66
  1032. 660.79 s [alphal00p-docs-cargo] |
  1033. 660.79 s [alphal00p-docs-cargo] 52 | pub struct MultiPrecisionInteger(RawMultiPrecisionInteger);
  1034. 660.79 s [alphal00p-docs-cargo] | ----------------------------------------------------------- similarly named struct `MultiPrecisionInteger` defined here
  1035. 660.79 s [alphal00p-docs-cargo] ...
  1036. 660.79 s [alphal00p-docs-cargo] 590 | fn shr_raw(value: RawMultiPrecisionInteger, rhs: u64) -> RawMultiPrecisionInteger {
  1037. 660.79 s [alphal00p-docs-cargo] | ^^^^^^^^^^^^^^^^^^^^^^^^
  1038. 660.79 s [alphal00p-docs-cargo] |
  1039. 660.79 s [alphal00p-docs-cargo] help: a struct with a similar name exists
  1040. 660.79 s [alphal00p-docs-cargo] |
  1041. 660.79 s [alphal00p-docs-cargo] 590 - fn shr_raw(value: RawMultiPrecisionInteger, rhs: u64) -> RawMultiPrecisionInteger {
  1042. 660.79 s [alphal00p-docs-cargo] 590 + fn shr_raw(value: RawMultiPrecisionInteger, rhs: u64) -> MultiPrecisionInteger {
  1043. 660.79 s [alphal00p-docs-cargo] |
  1044. 660.79 s [alphal00p-docs-cargo]
  1045. 660.80 s [alphal00p-docs-cargo] error[E0425]: cannot find type `RawMultiPrecisionInteger` in this scope
  1046. 660.80 s [alphal00p-docs-cargo] --> /nix/store/5dfb7akvi1k3080zqfndr6jw2ay3di2p-vendor-cargo-deps/f8c6b2c844a6fa8c330abb750e4cf5bbdb36a70140a58e87f6b79fb3024532aa/numerica-3.0.0/src/domains/backend/integer.rs:654:15
  1047. 660.80 s [alphal00p-docs-cargo] |
  1048. 660.80 s [alphal00p-docs-cargo] 52 | pub struct MultiPrecisionInteger(RawMultiPrecisionInteger);
  1049. 660.80 s [alphal00p-docs-cargo] | ----------------------------------------------------------- similarly named struct `MultiPrecisionInteger` defined here
  1050. 660.80 s [alphal00p-docs-cargo] ...
  1051. 660.80 s [alphal00p-docs-cargo] 654 | impl From<RawMultiPrecisionInteger> for MultiPrecisionInteger {
  1052. 660.80 s [alphal00p-docs-cargo] | ^^^^^^^^^^^^^^^^^^^^^^^^
  1053. 660.80 s [alphal00p-docs-cargo] |
  1054. 660.80 s [alphal00p-docs-cargo] help: a struct with a similar name exists
  1055. 660.80 s [alphal00p-docs-cargo] |
  1056. 660.80 s [alphal00p-docs-cargo] 654 - impl From<RawMultiPrecisionInteger> for MultiPrecisionInteger {
  1057. 660.80 s [alphal00p-docs-cargo] 654 + impl From<MultiPrecisionInteger> for MultiPrecisionInteger {
  1058. 660.80 s [alphal00p-docs-cargo] |
  1059. 660.80 s [alphal00p-docs-cargo] help: you might be missing a type parameter
  1060. 660.80 s [alphal00p-docs-cargo] |
  1061. 660.80 s [alphal00p-docs-cargo] 654 | impl<RawMultiPrecisionInteger> From<RawMultiPrecisionInteger> for MultiPrecisionInteger {
  1062. 660.80 s [alphal00p-docs-cargo] | ++++++++++++++++++++++++++
  1063. 660.80 s [alphal00p-docs-cargo]
  1064. 660.80 s [alphal00p-docs-cargo] error[E0425]: cannot find type `RawMultiPrecisionInteger` in this scope
  1065. 660.80 s [alphal00p-docs-cargo] --> /nix/store/5dfb7akvi1k3080zqfndr6jw2ay3di2p-vendor-cargo-deps/f8c6b2c844a6fa8c330abb750e4cf5bbdb36a70140a58e87f6b79fb3024532aa/numerica-3.0.0/src/domains/backend/integer.rs:656:24
  1066. 660.80 s [alphal00p-docs-cargo] |
  1067. 660.80 s [alphal00p-docs-cargo] 52 | pub struct MultiPrecisionInteger(RawMultiPrecisionInteger);
  1068. 660.80 s [alphal00p-docs-cargo] | ----------------------------------------------------------- similarly named struct `MultiPrecisionInteger` defined here
  1069. 660.80 s [alphal00p-docs-cargo] ...
  1070. 660.80 s [alphal00p-docs-cargo] 656 | fn from(value: RawMultiPrecisionInteger) -> Self {
  1071. 660.80 s [alphal00p-docs-cargo] | ^^^^^^^^^^^^^^^^^^^^^^^^
  1072. 660.80 s [alphal00p-docs-cargo] |
  1073. 660.80 s [alphal00p-docs-cargo] help: a struct with a similar name exists
  1074. 660.80 s [alphal00p-docs-cargo] |
  1075. 660.80 s [alphal00p-docs-cargo] 656 - fn from(value: RawMultiPrecisionInteger) -> Self {
  1076. 660.80 s [alphal00p-docs-cargo] 656 + fn from(value: MultiPrecisionInteger) -> Self {
  1077. 660.80 s [alphal00p-docs-cargo] |
  1078. 660.80 s [alphal00p-docs-cargo]
  1079. 660.80 s [alphal00p-docs-cargo] error[E0425]: cannot find type `RawMultiPrecisionInteger` in this scope
  1080. 660.80 s [alphal00p-docs-cargo] --> /nix/store/5dfb7akvi1k3080zqfndr6jw2ay3di2p-vendor-cargo-deps/f8c6b2c844a6fa8c330abb750e4cf5bbdb36a70140a58e87f6b79fb3024532aa/numerica-3.0.0/src/domains/backend/integer.rs:661:42
  1081. 660.80 s [alphal00p-docs-cargo] |
  1082. 660.80 s [alphal00p-docs-cargo] 52 | pub struct MultiPrecisionInteger(RawMultiPrecisionInteger);
  1083. 660.80 s [alphal00p-docs-cargo] | ----------------------------------------------------------- similarly named struct `MultiPrecisionInteger` defined here
  1084. 660.80 s [alphal00p-docs-cargo] ...
  1085. 660.80 s [alphal00p-docs-cargo] 661 | impl From<MultiPrecisionInteger> for RawMultiPrecisionInteger {
  1086. 660.80 s [alphal00p-docs-cargo] | ^^^^^^^^^^^^^^^^^^^^^^^^
  1087. 660.80 s [alphal00p-docs-cargo] |
  1088. 660.80 s [alphal00p-docs-cargo] help: a struct with a similar name exists
  1089. 660.80 s [alphal00p-docs-cargo] |
  1090. 660.80 s [alphal00p-docs-cargo] 661 - impl From<MultiPrecisionInteger> for RawMultiPrecisionInteger {
  1091. 660.80 s [alphal00p-docs-cargo] 661 + impl From<MultiPrecisionInteger> for MultiPrecisionInteger {
  1092. 660.80 s [alphal00p-docs-cargo] |
  1093. 660.80 s [alphal00p-docs-cargo]
  1094. 661.17 s [alphal00p-docs-cargo] error[E0433]: cannot find type `RawMultiPrecisionInteger` in this scope
  1095. 661.17 s [alphal00p-docs-cargo] --> /nix/store/5dfb7akvi1k3080zqfndr6jw2ay3di2p-vendor-cargo-deps/f8c6b2c844a6fa8c330abb750e4cf5bbdb36a70140a58e87f6b79fb3024532aa/numerica-3.0.0/src/domains/backend/integer.rs:620:13
  1096. 661.17 s [alphal00p-docs-cargo] |
  1097. 661.17 s [alphal00p-docs-cargo] 620 | RawMultiPrecisionInteger::from_str(s)
  1098. 661.17 s [alphal00p-docs-cargo] | ^^^^^^^^^^^^^^^^^^^^^^^^ use of undeclared type `RawMultiPrecisionInteger`
  1099. 661.17 s [alphal00p-docs-cargo] |
  1100. 661.17 s [alphal00p-docs-cargo] help: a struct with a similar name exists
  1101. 661.17 s [alphal00p-docs-cargo] |
  1102. 661.17 s [alphal00p-docs-cargo] 620 - RawMultiPrecisionInteger::from_str(s)
  1103. 661.17 s [alphal00p-docs-cargo] 620 + MultiPrecisionInteger::from_str(s)
  1104. 661.17 s [alphal00p-docs-cargo] |
  1105. 661.17 s [alphal00p-docs-cargo]
  1106. 661.17 s [alphal00p-docs-cargo] error[E0433]: cannot find type `RawMultiPrecisionInteger` in this scope
  1107. 661.17 s [alphal00p-docs-cargo] --> /nix/store/5dfb7akvi1k3080zqfndr6jw2ay3di2p-vendor-cargo-deps/f8c6b2c844a6fa8c330abb750e4cf5bbdb36a70140a58e87f6b79fb3024532aa/numerica-3.0.0/src/domains/backend/integer.rs:674:35
  1108. 661.17 s [alphal00p-docs-cargo] |
  1109. 661.17 s [alphal00p-docs-cargo] 674 | self.0 == RawMultiPrecisionInteger::from(*other)
  1110. 661.17 s [alphal00p-docs-cargo] | ^^^^^^^^^^^^^^^^^^^^^^^^ use of undeclared type `RawMultiPrecisionInteger`
  1111. 661.17 s [alphal00p-docs-cargo] ...
  1112. 661.17 s [alphal00p-docs-cargo] 702 | impl_cmp_primitive!(i32, i64, i128, u32, u64, u128);
  1113. 661.17 s [alphal00p-docs-cargo] | --------------------------------------------------- in this macro invocation
  1114. 661.17 s [alphal00p-docs-cargo] |
  1115. 661.17 s [alphal00p-docs-cargo] = note: this error originates in the macro `impl_cmp_primitive` (in Nightly builds, run with -Z macro-backtrace for more info)
  1116. 661.17 s [alphal00p-docs-cargo] help: a struct with a similar name exists
  1117. 661.17 s [alphal00p-docs-cargo] |
  1118. 661.17 s [alphal00p-docs-cargo] 674 - self.0 == RawMultiPrecisionInteger::from(*other)
  1119. 661.17 s [alphal00p-docs-cargo] 674 + self.0 == MultiPrecisionInteger::from(*other)
  1120. 661.17 s [alphal00p-docs-cargo] |
  1121. 661.17 s [alphal00p-docs-cargo]
  1122. 661.17 s [alphal00p-docs-cargo] error[E0433]: cannot find type `RawMultiPrecisionInteger` in this scope
  1123. 661.17 s [alphal00p-docs-cargo] --> /nix/store/5dfb7akvi1k3080zqfndr6jw2ay3di2p-vendor-cargo-deps/f8c6b2c844a6fa8c330abb750e4cf5bbdb36a70140a58e87f6b79fb3024532aa/numerica-3.0.0/src/domains/backend/integer.rs:681:25
  1124. 661.17 s [alphal00p-docs-cargo] |
  1125. 661.17 s [alphal00p-docs-cargo] 681 | RawMultiPrecisionInteger::from(*self) == other.0
  1126. 661.17 s [alphal00p-docs-cargo] | ^^^^^^^^^^^^^^^^^^^^^^^^ use of undeclared type `RawMultiPrecisionInteger`
  1127. 661.17 s [alphal00p-docs-cargo] ...
  1128. 661.17 s [alphal00p-docs-cargo] 702 | impl_cmp_primitive!(i32, i64, i128, u32, u64, u128);
  1129. 661.17 s [alphal00p-docs-cargo] | --------------------------------------------------- in this macro invocation
  1130. 661.17 s [alphal00p-docs-cargo] |
  1131. 661.17 s [alphal00p-docs-cargo] = note: this error originates in the macro `impl_cmp_primitive` (in Nightly builds, run with -Z macro-backtrace for more info)
  1132. 661.17 s [alphal00p-docs-cargo] help: a struct with a similar name exists
  1133. 661.17 s [alphal00p-docs-cargo] |
  1134. 661.17 s [alphal00p-docs-cargo] 681 - RawMultiPrecisionInteger::from(*self) == other.0
  1135. 661.17 s [alphal00p-docs-cargo] 681 + MultiPrecisionInteger::from(*self) == other.0
  1136. 661.17 s [alphal00p-docs-cargo] |
  1137. 661.17 s [alphal00p-docs-cargo]
  1138. 661.17 s [alphal00p-docs-cargo] error[E0433]: cannot find type `RawMultiPrecisionInteger` in this scope
  1139. 661.17 s [alphal00p-docs-cargo] --> /nix/store/5dfb7akvi1k3080zqfndr6jw2ay3di2p-vendor-cargo-deps/f8c6b2c844a6fa8c330abb750e4cf5bbdb36a70140a58e87f6b79fb3024532aa/numerica-3.0.0/src/domains/backend/integer.rs:688:45
  1140. 661.17 s [alphal00p-docs-cargo] |
  1141. 661.17 s [alphal00p-docs-cargo] 688 | self.0.partial_cmp(&RawMultiPrecisionInteger::from(*other))
  1142. 661.17 s [alphal00p-docs-cargo] | ^^^^^^^^^^^^^^^^^^^^^^^^ use of undeclared type `RawMultiPrecisionInteger`
  1143. 661.17 s [alphal00p-docs-cargo] ...
  1144. 661.17 s [alphal00p-docs-cargo] 702 | impl_cmp_primitive!(i32, i64, i128, u32, u64, u128);
  1145. 661.17 s [alphal00p-docs-cargo] | --------------------------------------------------- in this macro invocation
  1146. 661.17 s [alphal00p-docs-cargo] |
  1147. 661.17 s [alphal00p-docs-cargo] = note: this error originates in the macro `impl_cmp_primitive` (in Nightly builds, run with -Z macro-backtrace for more info)
  1148. 661.17 s [alphal00p-docs-cargo] help: a struct with a similar name exists
  1149. 661.17 s [alphal00p-docs-cargo] |
  1150. 661.17 s [alphal00p-docs-cargo] 688 - self.0.partial_cmp(&RawMultiPrecisionInteger::from(*other))
  1151. 661.17 s [alphal00p-docs-cargo] 688 + self.0.partial_cmp(&MultiPrecisionInteger::from(*other))
  1152. 661.17 s [alphal00p-docs-cargo] |
  1153. 661.17 s [alphal00p-docs-cargo]
  1154. 661.17 s [alphal00p-docs-cargo] error[E0433]: cannot find type `RawMultiPrecisionInteger` in this scope
  1155. 661.17 s [alphal00p-docs-cargo] --> /nix/store/5dfb7akvi1k3080zqfndr6jw2ay3di2p-vendor-cargo-deps/f8c6b2c844a6fa8c330abb750e4cf5bbdb36a70140a58e87f6b79fb3024532aa/numerica-3.0.0/src/domains/backend/integer.rs:695:25
  1156. 661.17 s [alphal00p-docs-cargo] |
  1157. 661.17 s [alphal00p-docs-cargo] 695 | RawMultiPrecisionInteger::from(*self).partial_cmp(&other.0)
  1158. 661.17 s [alphal00p-docs-cargo] | ^^^^^^^^^^^^^^^^^^^^^^^^ use of undeclared type `RawMultiPrecisionInteger`
  1159. 661.17 s [alphal00p-docs-cargo] ...
  1160. 661.17 s [alphal00p-docs-cargo] 702 | impl_cmp_primitive!(i32, i64, i128, u32, u64, u128);
  1161. 661.17 s [alphal00p-docs-cargo] | --------------------------------------------------- in this macro invocation
  1162. 661.17 s [alphal00p-docs-cargo] |
  1163. 661.17 s [alphal00p-docs-cargo] = note: this error originates in the macro `impl_cmp_primitive` (in Nightly builds, run with -Z macro-backtrace for more info)
  1164. 661.17 s [alphal00p-docs-cargo] help: a struct with a similar name exists
  1165. 661.17 s [alphal00p-docs-cargo] |
  1166. 661.17 s [alphal00p-docs-cargo] 695 - RawMultiPrecisionInteger::from(*self).partial_cmp(&other.0)
  1167. 661.17 s [alphal00p-docs-cargo] 695 + MultiPrecisionInteger::from(*self).partial_cmp(&other.0)
  1168. 661.17 s [alphal00p-docs-cargo] |
  1169. 661.17 s [alphal00p-docs-cargo]
  1170. 661.17 s [alphal00p-docs-cargo] error[E0433]: cannot find type `RawMultiPrecisionInteger` in this scope
  1171. 661.17 s [alphal00p-docs-cargo] --> /nix/store/5dfb7akvi1k3080zqfndr6jw2ay3di2p-vendor-cargo-deps/f8c6b2c844a6fa8c330abb750e4cf5bbdb36a70140a58e87f6b79fb3024532aa/numerica-3.0.0/src/domains/backend/integer.rs:1180:35
  1172. 661.17 s [alphal00p-docs-cargo] |
  1173. 661.17 s [alphal00p-docs-cargo] 1180 | MultiPrecisionInteger(RawMultiPrecisionInteger::from((&self.0) & &rhs.0))
  1174. 661.17 s [alphal00p-docs-cargo] | ^^^^^^^^^^^^^^^^^^^^^^^^ use of undeclared type `RawMultiPrecisionInteger`
  1175. 661.17 s [alphal00p-docs-cargo] |
  1176. 661.17 s [alphal00p-docs-cargo] help: a struct with a similar name exists
  1177. 661.17 s [alphal00p-docs-cargo] |
  1178. 661.17 s [alphal00p-docs-cargo] 1180 - MultiPrecisionInteger(RawMultiPrecisionInteger::from((&self.0) & &rhs.0))
  1179. 661.17 s [alphal00p-docs-cargo] 1180 + MultiPrecisionInteger(MultiPrecisionInteger::from((&self.0) & &rhs.0))
  1180. 661.17 s [alphal00p-docs-cargo] |
  1181. 661.17 s [alphal00p-docs-cargo]
  1182. 661.17 s [alphal00p-docs-cargo] error[E0433]: cannot find type `RawMultiPrecisionInteger` in this scope
  1183. 661.17 s [alphal00p-docs-cargo] --> /nix/store/5dfb7akvi1k3080zqfndr6jw2ay3di2p-vendor-cargo-deps/f8c6b2c844a6fa8c330abb750e4cf5bbdb36a70140a58e87f6b79fb3024532aa/numerica-3.0.0/src/domains/backend/integer.rs:1212:35
  1184. 661.17 s [alphal00p-docs-cargo] |
  1185. 661.17 s [alphal00p-docs-cargo] 1212 | MultiPrecisionInteger(RawMultiPrecisionInteger::from(-&self.0))
  1186. 661.17 s [alphal00p-docs-cargo] | ^^^^^^^^^^^^^^^^^^^^^^^^ use of undeclared type `RawMultiPrecisionInteger`
  1187. 661.17 s [alphal00p-docs-cargo] |
  1188. 661.17 s [alphal00p-docs-cargo] help: a struct with a similar name exists
  1189. 661.17 s [alphal00p-docs-cargo] |
  1190. 661.17 s [alphal00p-docs-cargo] 1212 - MultiPrecisionInteger(RawMultiPrecisionInteger::from(-&self.0))
  1191. 661.17 s [alphal00p-docs-cargo] 1212 + MultiPrecisionInteger(MultiPrecisionInteger::from(-&self.0))
  1192. 661.17 s [alphal00p-docs-cargo] |
  1193. 661.17 s [alphal00p-docs-cargo]
  1194. 661.17 s [alphal00p-docs-cargo] error[E0425]: cannot find function `write_lsf_bytes` in this scope
  1195. 661.17 s [alphal00p-docs-cargo] --> /nix/store/5dfb7akvi1k3080zqfndr6jw2ay3di2p-vendor-cargo-deps/f8c6b2c844a6fa8c330abb750e4cf5bbdb36a70140a58e87f6b79fb3024532aa/numerica-3.0.0/src/domains/backend/integer.rs:1682:5
  1196. 661.17 s [alphal00p-docs-cargo] |
  1197. 661.17 s [alphal00p-docs-cargo] 1682 | write_lsf_bytes(value, &mut bytes);
  1198. 661.17 s [alphal00p-docs-cargo] | ^^^^^^^^^^^^^^^ not found in this scope
  1199. 661.17 s [alphal00p-docs-cargo]
  1200. 661.17 s [alphal00p-docs-cargo] Some errors have detailed explanations: E0425, E0432, E0433.
  1201. 661.17 s [alphal00p-docs-cargo] For more information about an error, try `rustc --explain E0425`.
  1202. 661.18 s [alphal00p-docs-cargo] error: could not compile `numerica` (lib) due to 29 previous errors
  1203. 661.18 s [alphal00p-docs-cargo] warning: build failed, waiting for other jobs to finish...
  1204. 834.71 s Progress: 0 of 1 built (1 failed)
  1205. 834.71 s Failed to build alphal00p-docs-cargo after 13m51s
  1206. 834.75 s Cannot build '/nix/store/623idw7bxrdblwflbqi3k630cvnna0if-alphal00p-docs-cargo-0.1.0.drv'.
  1207. 834.75 s Reason: builder failed with exit code 101.
  1208. 834.75 s Output paths:
  1209. 834.75 s /nix/store/rh9khp691qr9mzy0lnbbniym9gpm688f-alphal00p-docs-cargo-0.1.0
  1210. 834.75 s Last 1200 log lines:
  1211. 834.75 s > cargoArtifacts not set, will not reuse any cargo artifacts
  1212. 834.75 s > Running phase: unpackPhase
  1213. 834.75 s > unpacking source archive /nix/store/zw5i19nvfc6y8mffi47icfczb0q4x6ip-source
  1214. 834.75 s > source root is source
  1215. 834.75 s > Running phase: patchPhase
  1216. 834.75 s > Executing configureCargoCommonVars
  1217. 834.75 s > Running phase: updateAutotoolsGnuConfigScriptsPhase
  1218. 834.75 s > Running phase: configurePhase
  1219. 834.75 s > will append /build/source/.cargo-home/config.toml with contents of /nix/store/5dfb7akvi1k3080zqfndr6jw2ay3di2p-vendor-cargo-deps/config.toml
  1220. 834.75 s > default configurePhase, nothing to do
  1221. 834.75 s > Running phase: buildPhase
  1222. 834.75 s > +++ command cargo --version
  1223. 834.75 s > cargo 1.98.1 (797e8a9bc 2026-08-05)
  1224. 834.75 s > +++ command cargo build --profile docs --locked -p alphal00p-docs-catalogs --bin alphal00p-docs-catalogs
  1225. 834.75 s > Compiling proc-macro2 v1.0.106
  1226. 834.75 s > Compiling quote v1.0.45
  1227. 834.75 s > Compiling unicode-ident v1.0.24
  1228. 834.75 s > Compiling serde_core v1.0.228
  1229. 834.75 s > Compiling memchr v2.8.0
  1230. 834.75 s > Compiling zmij v1.0.21
  1231. 834.75 s > Compiling utf8parse v0.2.2
  1232. 834.75 s > Compiling serde_json v1.0.149
  1233. 834.75 s > Compiling serde v1.0.228
  1234. 834.75 s > Compiling thiserror v2.0.18
  1235. 834.75 s > Compiling anstyle-query v1.1.5
  1236. 834.75 s > Compiling anstyle v1.0.14
  1237. 834.75 s > Compiling colorchoice v1.0.5
  1238. 834.75 s > Compiling is_terminal_polyfill v1.70.2
  1239. 834.75 s > Compiling hashbrown v0.17.1
  1240. 834.75 s > Compiling heck v0.5.0
  1241. 834.75 s > Compiling anstyle-parse v1.0.0
  1242. 834.75 s > Compiling itoa v1.0.18
  1243. 834.75 s > Compiling clap_lex v1.1.0
  1244. 834.75 s > Compiling strsim v0.11.1
  1245. 834.75 s > Compiling eyre v0.6.12
  1246. 834.75 s > Compiling regex-syntax v0.8.10
  1247. 834.75 s > Compiling equivalent v1.0.2
  1248. 834.75 s > Compiling indenter v0.3.4
  1249. 834.75 s > Compiling once_cell v1.21.4
  1250. 834.75 s > Compiling anstream v1.0.0
  1251. 834.75 s > Compiling aho-corasick v1.1.4
  1252. 834.75 s > Compiling clap_builder v4.6.0
  1253. 834.75 s > Compiling syn v2.0.117
  1254. 834.75 s > Compiling regex-automata v0.4.14
  1255. 834.75 s > Compiling indexmap v2.14.0
  1256. 834.75 s > Compiling thiserror-impl v2.0.18
  1257. 834.75 s > Compiling serde_derive v1.0.228
  1258. 834.75 s > Compiling clap_derive v4.6.1
  1259. 834.75 s > Compiling alphal00p-docs-macros v0.1.0 (/build/source/crates/alphal00p-docs-macros)
  1260. 834.75 s > Compiling regex v1.12.3
  1261. 834.75 s > Compiling clap v4.6.1
  1262. 834.75 s > Compiling alphal00p-docs-schema v0.1.0 (/build/source/crates/alphal00p-docs-schema)
  1263. 834.75 s > Compiling alphal00p-docs-catalogs v0.1.0 (/build/source/crates/alphal00p-docs-catalogs)
  1264. 834.75 s > Finished `docs` profile [unoptimized] target(s) in 11.72s
  1265. 834.75 s > +++ command cargo build --profile docs --locked -p alphal00p-docs-python-exporter --features gammaloop
  1266. 834.75 s > Compiling serde_core v1.0.228
  1267. 834.75 s > Compiling libc v0.2.186
  1268. 834.75 s > Compiling cfg-if v1.0.4
  1269. 834.75 s > Compiling serde v1.0.228
  1270. 834.75 s > Compiling memchr v2.8.0
  1271. 834.75 s > Compiling autocfg v1.5.0
  1272. 834.75 s > Compiling libm v0.2.16
  1273. 834.75 s > Compiling version_check v0.9.5
  1274. 834.75 s > Compiling either v1.15.0
  1275. 834.75 s > Compiling zerocopy v0.8.48
  1276. 834.75 s > Compiling crossbeam-utils v0.8.21
  1277. 834.75 s > Compiling log v0.4.29
  1278. 834.75 s > Compiling unicode-width v0.2.2
  1279. 834.75 s > Compiling rayon-core v1.13.0
  1280. 834.75 s > Compiling foldhash v0.2.0
  1281. 834.75 s > Compiling syn v2.0.117
  1282. 834.75 s > Compiling syn v3.0.4
  1283. 834.75 s > Compiling target-lexicon v0.13.5
  1284. 834.75 s > Compiling serde_json v1.0.149
  1285. 834.75 s > Compiling lazy_static v1.5.0
  1286. 834.75 s > Compiling siphasher v1.0.2
  1287. 834.75 s > Compiling crunchy v0.2.4
  1288. 834.75 s > Compiling getrandom v0.3.4
  1289. 834.75 s > Compiling num-traits v0.2.19
  1290. 834.75 s > Compiling paste v1.0.15
  1291. 834.75 s > Compiling anyhow v1.0.102
  1292. 834.75 s > Compiling tiny-keccak v2.0.2
  1293. 834.75 s > Compiling itertools v0.14.0
  1294. 834.75 s > Compiling static_assertions v1.1.0
  1295. 834.75 s > Compiling aho-corasick v1.1.4
  1296. 834.75 s > Compiling time-core v0.1.8
  1297. 834.75 s > Compiling num-conv v0.2.1
  1298. 834.75 s > Compiling powerfmt v0.2.0
  1299. 834.75 s > Compiling rustix v1.1.4
  1300. 834.75 s > Compiling time-macros v0.2.27
  1301. 834.75 s > Compiling num_threads v0.1.7
  1302. 834.75 s > Compiling deranged v0.5.8
  1303. 834.75 s > Compiling linux-raw-sys v0.12.1
  1304. 834.75 s > Compiling allocator-api2 v0.2.21
  1305. 834.75 s > Compiling crossbeam-epoch v0.9.18
  1306. 834.75 s > Compiling tracing-core v0.1.36
  1307. 834.75 s > Compiling arrayvec v0.7.6
  1308. 834.75 s > Compiling crossbeam-deque v0.8.6
  1309. 834.75 s > Compiling hashbrown v0.16.1
  1310. 834.75 s > Compiling virtue v0.0.18
  1311. 834.75 s > Compiling pyo3-build-config v0.28.3
  1312. 834.75 s > Compiling winnow v1.0.2
  1313. 834.75 s > Compiling phf_shared v0.11.3
  1314. 834.75 s > Compiling gmp-mpfr-sys v1.7.1
  1315. 834.75 s > Compiling toml_writer v1.1.1+spec-1.1.0
  1316. 834.75 s > Compiling unty v0.0.4
  1317. 834.75 s > Compiling pin-project-lite v0.2.17
  1318. 834.75 s > Compiling nu-ansi-term v0.50.3
  1319. 834.75 s > Compiling tracing-log v0.2.0
  1320. 834.75 s > Compiling regex-automata v0.4.14
  1321. 834.75 s > Compiling matrixmultiply v0.3.10
  1322. 834.75 s > Compiling sharded-slab v0.1.7
  1323. 834.75 s > Compiling getrandom v0.2.17
  1324. 834.75 s > Compiling rayon v1.12.0
  1325. 834.75 s > Compiling rand_core v0.6.4
  1326. 834.75 s > Compiling time v0.3.47
  1327. 834.75 s > Compiling bincode_derive v2.0.1
  1328. 834.75 s > Compiling rand_core v0.9.5
  1329. 834.75 s > Compiling hashbrown v0.17.1
  1330. 834.75 s > Compiling thread_local v1.1.9
  1331. 834.75 s > Compiling syn v1.0.109
  1332. 834.75 s > Compiling typenum v1.20.0
  1333. 834.75 s > Compiling rug v1.30.0
  1334. 834.75 s > Compiling option-ext v0.2.0
  1335. 834.75 s > Compiling toml_parser v1.1.2+spec-1.1.0
  1336. 834.75 s > Compiling dirs-sys v0.5.0
  1337. 834.75 s > Compiling alloc-no-stdlib v2.0.4
  1338. 834.75 s > Compiling az v1.3.0
  1339. 834.75 s > Compiling dyn-clone v1.0.20
  1340. 834.75 s > Compiling fnv v1.0.7
  1341. 834.75 s > Compiling num-integer v0.1.46
  1342. 834.75 s > Compiling approx v0.5.1
  1343. 834.75 s > Compiling num-complex v0.4.6
  1344. 834.75 s > Compiling rawpointer v0.2.1
  1345. 834.75 s > Compiling alloc-stdlib v0.2.2
  1346. 834.75 s > Compiling generic-array v0.14.7
  1347. 834.75 s > Compiling colored v3.1.1
  1348. 834.75 s > Compiling pyo3-ffi v0.28.3
  1349. 834.75 s > Compiling pyo3-macros-backend v0.28.3
  1350. 834.75 s > Compiling num-bigint v0.4.6
  1351. 834.75 s > Compiling bitflags v1.3.2
  1352. 834.75 s > Compiling errno v0.3.14
  1353. 834.75 s > Compiling getopts v0.2.24
  1354. 834.75 s > Compiling ident_case v1.0.1
  1355. 834.75 s > Compiling signal-hook v0.3.18
  1356. 834.75 s > Compiling parking_lot_core v0.9.12
  1357. 834.75 s > Compiling same-file v1.0.6
  1358. 834.75 s > Compiling walkdir v2.5.0
  1359. 834.75 s > Compiling signal-hook-registry v1.4.8
  1360. 834.75 s > Compiling region v3.0.2
  1361. 834.75 s > Compiling const-random-macro v0.1.16
  1362. 834.75 s > Compiling hugepage-rs v0.1.1
  1363. 834.75 s > Compiling wasmtime-jit-icache-coherence v34.0.2
  1364. 834.75 s > Compiling vte v0.14.1
  1365. 834.75 s > Compiling smartstring v1.0.1
  1366. 834.75 s > Compiling ahash v0.8.12
  1367. 834.75 s > Compiling spec_math v0.1.6
  1368. 834.75 s > Compiling unic-char-range v0.9.0
  1369. 834.75 s > Compiling bytemuck_derive v1.12.0
  1370. 834.75 s > Compiling inventory v0.3.24
  1371. 834.75 s > Compiling scopeguard v1.2.0
  1372. 834.75 s > Compiling unic-common v0.9.0
  1373. 834.75 s > Compiling lock_api v0.4.14
  1374. 834.75 s > Compiling matchers v0.2.0
  1375. 834.75 s > Compiling regex v1.12.3
  1376. 834.75 s > Compiling unic-ucd-version v0.9.0
  1377. 834.75 s > Compiling bitflags v2.11.1
  1378. 834.75 s > Compiling serde_spanned v1.1.1
  1379. 834.75 s > Compiling toml_datetime v1.1.1+spec-1.1.0
  1380. 834.75 s > Compiling unic-char-property v0.9.0
  1381. 834.75 s > Compiling const-random v0.1.18
  1382. 834.75 s > Compiling brotli-decompressor v5.0.0
  1383. 834.75 s > Compiling toml v1.1.2+spec-1.1.0
  1384. 834.75 s > Compiling mio v1.2.0
  1385. 834.75 s > Compiling rustpython-parser-vendored v0.4.0
  1386. 834.75 s > Compiling itertools v0.11.0
  1387. 834.75 s > Compiling minimal-lexical v0.2.1
  1388. 834.75 s > Compiling rustix v0.38.44
  1389. 834.75 s > Compiling fastrand v2.4.1
  1390. 834.75 s > Compiling unicase v2.9.0
  1391. 834.75 s > Compiling winnow v0.7.15
  1392. 834.75 s > Compiling indenter v0.3.4
  1393. 834.75 s > Compiling iana-time-zone v0.1.65
  1394. 834.75 s > Compiling nom v7.1.3
  1395. 834.75 s > Compiling signal-hook-mio v0.2.5
  1396. 834.75 s > Compiling synstructure v0.13.2
  1397. 834.75 s > Compiling indexmap v2.14.0
  1398. 834.75 s > Compiling block-buffer v0.10.4
  1399. 834.75 s > Compiling brotli v8.0.2
  1400. 834.75 s > Compiling crypto-common v0.1.7
  1401. 834.75 s > Compiling numpy v0.28.0
  1402. 834.75 s > Compiling bytemuck v1.25.0
  1403. 834.75 s > Compiling directories v6.0.0
  1404. 834.75 s > Compiling phf v0.11.3
  1405. 834.75 s > Compiling libloading v0.9.0
  1406. 834.75 s > Compiling safe_arch v0.7.4
  1407. 834.75 s > Compiling safe_arch v1.2.0
  1408. 834.75 s > Compiling append-only-vec v0.1.8
  1409. 834.75 s > Compiling rustc-hash v2.1.2
  1410. 834.75 s > Compiling unicode-segmentation v1.13.2
  1411. 834.75 s > Compiling self_cell v1.2.2
  1412. 834.75 s > Compiling tinyjson v2.5.1
  1413. 834.75 s > Compiling data-encoding v2.11.1
  1414. 834.75 s > Compiling ed25519-compact v2.4.2
  1415. 834.75 s > Compiling wide v1.7.0
  1416. 834.75 s > Compiling bytes v1.11.1
  1417. 834.75 s > Compiling byteorder v1.5.0
  1418. 834.75 s > Compiling linux-raw-sys v0.4.15
  1419. 834.75 s > Compiling digest v0.10.7
  1420. 834.75 s > Compiling wide v0.7.33
  1421. 834.75 s > Compiling serde_derive v1.0.228
  1422. 834.75 s > Compiling zerocopy-derive v0.8.48
  1423. 834.75 s > Compiling tracing-attributes v0.1.31
  1424. 834.75 s > Compiling thiserror-impl v2.0.18
  1425. 834.75 s > Compiling is-macro v0.3.7
  1426. 834.75 s > Compiling terminal_size v0.4.4
  1427. 834.75 s > Compiling strum_macros v0.27.2
  1428. 834.75 s > Compiling zerofrom-derive v0.1.7
  1429. 834.75 s > Compiling clap_builder v4.6.0
  1430. 834.75 s > Compiling clap_derive v4.6.1
  1431. 834.75 s > Compiling ansitok v0.3.0
  1432. 834.75 s > Compiling rustpython-parser-core v0.4.0
  1433. 834.75 s > Compiling rustpython-ast v0.4.0
  1434. 834.75 s > Compiling thiserror v2.0.18
  1435. 834.75 s > Compiling yoke-derive v0.8.2
  1436. 834.75 s > Compiling tracing v0.1.44
  1437. 834.75 s > Compiling unic-ucd-ident v0.9.0
  1438. 834.75 s > Compiling simba v0.9.1
  1439. 834.75 s > Compiling unic-emoji-char v0.9.0
  1440. 834.75 s > Compiling pyo3 v0.28.3
  1441. 834.75 s > Compiling bstr v1.12.1
  1442. 834.75 s > Compiling zerofrom v0.1.8
  1443. 834.75 s > Compiling phf_shared v0.13.1
  1444. 834.75 s > Compiling stable_deref_trait v1.2.1
  1445. 834.75 s > Compiling getrandom v0.4.2
  1446. 834.75 s > Compiling plotters-backend v0.3.7
  1447. 834.75 s > Compiling rustc-hash v1.1.0
  1448. 834.75 s > Compiling typeid v1.0.3
  1449. 834.75 s > Compiling cpufeatures v0.2.17
  1450. 834.75 s > Compiling ciborium-io v0.2.2
  1451. 834.75 s > Compiling lalrpop-util v0.20.2
  1452. 834.75 s > Compiling sha2 v0.10.9
  1453. 834.75 s > Compiling plotters-svg v0.3.7
  1454. 834.75 s > Compiling eyre v0.6.12
  1455. 834.75 s > Compiling num-rational v0.4.2
  1456. 834.75 s > Compiling toml_datetime v0.7.5+spec-1.1.0
  1457. 834.75 s > Compiling globset v0.4.18
  1458. 834.75 s > Compiling zerovec-derive v0.11.6
  1459. 834.75 s > Compiling console v0.16.3
  1460. 834.75 s > Compiling yoke v0.8.3
  1461. 834.75 s > Compiling itertools v0.10.5
  1462. 834.75 s > Compiling ucd-trie v0.1.7
  1463. 834.75 s > Compiling clap v4.6.1
  1464. 834.75 s > Compiling cast v0.3.0
  1465. 834.75 s > Compiling rustversion v1.0.22
  1466. 834.75 s > Compiling strum v0.27.2
  1467. 834.75 s > Compiling adler2 v2.0.1
  1468. 834.75 s > Compiling simd-adler32 v0.3.10
  1469. 834.75 s > Compiling symbolica v2.2.0 (https://github.com/symbolica-dev/symbolica?rev=ba3737137c2a2ccd7bb39f0441837d38ec867e78#ba373713)
  1470. 834.75 s > Compiling toml_write v0.1.2
  1471. 834.75 s > Compiling pest v2.8.6
  1472. 834.75 s > Compiling rust-embed-utils v8.11.0
  1473. 834.75 s > Compiling miniz_oxide v0.8.9
  1474. 834.75 s > Compiling toml v0.9.12+spec-1.1.0
  1475. 834.75 s > Compiling plotters v0.3.7
  1476. 834.75 s > Compiling ansi-str v0.9.0
  1477. 834.75 s > Compiling displaydoc v0.2.7
  1478. 834.75 s > Compiling ndarray v0.17.2
  1479. 834.75 s > Compiling is-terminal v0.4.17
  1480. 834.75 s > Compiling slotmap v1.1.1
  1481. 834.75 s > Compiling anes v0.1.6
  1482. 834.75 s > Compiling maplit v1.0.2
  1483. 834.75 s > Compiling pyo3-macros v0.28.3
  1484. 834.75 s > Compiling bytecount v0.6.9
  1485. 834.75 s > Compiling oorandom v11.1.5
  1486. 834.75 s > Compiling criterion-plot v0.5.0
  1487. 834.75 s > Compiling papergrid v0.18.0
  1488. 834.75 s > Compiling tempfile v3.27.0
  1489. 834.75 s > Compiling testing_table v0.3.0
  1490. 834.75 s > Compiling tabled_derive v0.12.0
  1491. 834.75 s > Compiling toml_edit v0.25.11+spec-1.1.0
  1492. 834.75 s > Compiling similar v2.7.0
  1493. 834.75 s > Compiling proc-macro2-diagnostics v0.10.1
  1494. 834.75 s > Compiling pest_meta v2.8.6
  1495. 834.75 s > Compiling proc-macro-error-attr v1.0.4
  1496. 834.75 s > Compiling uncased v0.9.10
  1497. 834.75 s > Compiling smallvec v1.15.1
  1498. 834.75 s > Compiling bincode v2.0.1
  1499. 834.75 s > Compiling tracing-serde v0.2.0
  1500. 834.75 s > Compiling tracing-subscriber v0.3.23
  1501. 834.75 s > Compiling chrono v0.4.44
  1502. 834.75 s > Compiling serde_spanned v0.6.9
  1503. 834.75 s > Compiling parking_lot v0.12.5
  1504. 834.75 s > Compiling toml_datetime v0.6.11
  1505. 834.75 s > Compiling toml_edit v0.22.27
  1506. 834.75 s > Compiling xprec v0.2.2
  1507. 834.75 s > Compiling crossterm v0.28.1
  1508. 834.75 s > Compiling zerovec v0.11.8
  1509. 834.75 s > Compiling bincode-trait-derive v0.1.1
  1510. 834.75 s > Compiling tinytemplate v1.2.1
  1511. 834.75 s > Compiling ron v0.12.1
  1512. 834.75 s > Compiling tabled v0.22.0
  1513. 834.75 s > Compiling pest_generator v2.8.6
  1514. 834.75 s > Compiling slab v0.4.12
  1515. 834.75 s > Compiling tinystr v0.8.4
  1516. 834.75 s > Compiling strsim v0.10.0
  1517. 834.75 s > Compiling unic-langid-impl v0.9.6
  1518. 834.75 s > Compiling insta v1.47.2
  1519. 834.75 s > Compiling radium v0.7.0
  1520. 834.75 s > Compiling darling_core v0.14.4
  1521. 834.75 s > Compiling darling_core v0.23.0
  1522. 834.75 s > Compiling figment v0.10.19
  1523. 834.75 s > Compiling proc-macro-error v1.0.4
  1524. 834.75 s > Compiling ryu v1.0.23
  1525. 834.75 s > Compiling tap v1.0.1
  1526. 834.75 s > Compiling pest_derive v2.8.6
  1527. 834.75 s > Compiling wyz v0.5.1
  1528. 834.75 s > Compiling ppv-lite86 v0.2.21
  1529. 834.75 s > Compiling half v2.7.1
  1530. 834.75 s > Compiling ciborium-ll v0.2.2
  1531. 834.75 s > Compiling castaway v0.2.4
  1532. 834.75 s > Compiling rand_chacha v0.3.1
  1533. 834.75 s > Compiling rand_chacha v0.9.0
  1534. 834.75 s > Compiling ciborium v0.2.2
  1535. 834.75 s > Compiling rand v0.8.6
  1536. 834.75 s > Compiling rand v0.9.4
  1537. 834.75 s > Compiling toml v0.8.23
  1538. 834.75 s > Compiling instability v0.3.12
  1539. 834.75 s > Compiling criterion v0.5.1
  1540. 834.75 s > Compiling find-msvc-tools v0.1.9
  1541. 834.75 s > Compiling shlex v1.3.0
  1542. 834.75 s > Compiling symjit v2.25.6
  1543. 834.75 s > Compiling phf_generator v0.11.3
  1544. 834.75 s > Compiling indoc v2.0.7
  1545. 834.75 s > Compiling funty v2.0.0
  1546. 834.75 s > Compiling phf_codegen v0.11.3
  1547. 834.75 s > Compiling heck v0.4.1
  1548. 834.75 s > Compiling unicode_names2_generator v1.3.0
  1549. 834.75 s > Compiling rustpython-parser v0.4.0
  1550. 834.75 s > Compiling cc v1.2.61
  1551. 834.75 s > Compiling darling_macro v0.14.4
  1552. 834.75 s > Compiling bitvec v1.0.1
  1553. 834.75 s > Compiling compact_str v0.9.0
  1554. 834.75 s > Compiling duplicate v2.0.1
  1555. 834.75 s > Compiling dot-parser v0.5.1
  1556. 834.75 s > Compiling unicode_names2 v1.3.0
  1557. 834.75 s > Compiling darling v0.14.4
  1558. 834.75 s > Compiling darling_macro v0.23.0
  1559. 834.75 s > Compiling kasuari v0.4.12
  1560. 834.75 s > Compiling serde_repr v0.1.20
  1561. 834.75 s > Compiling unicode-truncate v2.0.1
  1562. 834.75 s > Compiling convert_case v0.10.0
  1563. 834.75 s > Compiling env_filter v1.0.1
  1564. 834.75 s > Compiling num-iter v0.1.45
  1565. 834.75 s > Compiling lru v0.16.4
  1566. 834.75 s > Compiling jiff v0.2.24
  1567. 834.75 s > Compiling convert_case v0.4.0
  1568. 834.75 s > Compiling ref-ops v0.2.5
  1569. 834.75 s > Compiling blake3 v1.8.5
  1570. 834.75 s > Compiling darling v0.23.0
  1571. 834.75 s > Compiling ratatui-core v0.1.0
  1572. 834.75 s > Compiling num v0.4.3
  1573. 834.75 s > Compiling derive_more-impl v2.1.1
  1574. 834.75 s > Compiling derive_more v0.99.20
  1575. 834.75 s > Compiling derive_builder_core v0.11.2
  1576. 834.75 s > Compiling duplicate v1.0.0
  1577. 834.75 s > Compiling enum-try-as-inner v0.1.1
  1578. 834.75 s > Compiling delegate v0.12.0
  1579. 834.75 s > Compiling rand_xoshiro v0.6.0
  1580. 834.75 s > Compiling features v0.10.0
  1581. 834.75 s > Compiling colored v2.2.0
  1582. 834.75 s > Compiling litrs v1.0.0
  1583. 834.75 s > Compiling portable-atomic v1.13.1
  1584. 834.75 s > Compiling owo-colors v4.3.0
  1585. 834.75 s > Compiling cfg_aliases v0.2.1
  1586. 834.75 s > Compiling thiserror v1.0.69
  1587. 834.75 s > Compiling constcat v0.5.1
  1588. 834.75 s > Compiling object v0.37.3
  1589. 834.75 s > Compiling gat-lending-iterator v0.1.8
  1590. 834.75 s > Compiling nix v0.31.2
  1591. 834.75 s > Compiling derive_more v2.1.1
  1592. 834.75 s > Compiling rand_distr v0.4.3
  1593. 834.75 s > Compiling derive_builder_macro v0.11.2
  1594. 834.75 s > Compiling simba v0.6.0
  1595. 834.75 s > Compiling document-features v0.2.12
  1596. 834.75 s > Compiling phf_generator v0.13.1
  1597. 834.75 s > Compiling nalgebra-macros v0.1.0
  1598. 834.75 s > Compiling thiserror-impl v1.0.69
  1599. 834.75 s > Compiling line-clipping v0.3.7
  1600. 834.75 s > Compiling dirs v6.0.0
  1601. 834.75 s > Compiling vte v0.15.0
  1602. 834.75 s > Compiling joinery v2.1.0
  1603. 834.75 s > Compiling clarabel v0.11.1
  1604. 834.75 s > Compiling ref-cast v1.0.25
  1605. 834.75 s > Compiling gimli v0.32.3
  1606. 834.75 s > Compiling cpufeatures v0.3.0
  1607. 834.75 s > Compiling arrayref v0.3.9
  1608. 834.75 s > Compiling constant_time_eq v0.4.2
  1609. 834.75 s > Compiling color-spantrace v0.3.0
  1610. 834.75 s > Compiling crossterm v0.29.0
  1611. 834.75 s > Compiling derive_builder v0.11.2
  1612. 834.75 s > Compiling titlecase v2.2.1
  1613. 834.75 s > Compiling vt100 v0.16.2
  1614. 834.75 s > Compiling ratatui-widgets v0.3.0
  1615. 834.75 s > Compiling phf_macros v0.13.1
  1616. 834.75 s > Compiling tracing-error v0.2.1
  1617. 834.75 s > Compiling serde-big-array v0.5.1
  1618. 834.75 s > Compiling enum_dispatch v0.3.13
  1619. 834.75 s > Compiling ref-cast-impl v1.0.25
  1620. 834.75 s > Compiling env_logger v0.11.10
  1621. 834.75 s > Compiling delegate v0.13.5
  1622. 834.75 s > Compiling serde_derive_internals v0.29.1
  1623. 834.75 s > Compiling amd v0.2.2
  1624. 834.75 s > Compiling subprocess v0.2.15
  1625. 834.75 s > Compiling rust_lisp v0.18.0
  1626. 834.75 s > Compiling rustc-demangle v0.1.27
  1627. 834.75 s > Compiling base64 v0.22.1
  1628. 834.75 s > Compiling semver v1.0.28
  1629. 834.75 s > Compiling vakint v0.1.2 (/build/source/crates/vakint)
  1630. 834.75 s > Compiling unit-prefix v0.5.2
  1631. 834.75 s > Compiling deprecate-until v1.0.0
  1632. 834.75 s > Compiling string-template-plus v0.4.3
  1633. 834.75 s > Compiling indicatif v0.18.4
  1634. 834.75 s > Compiling ratatui-macros v0.7.0
  1635. 834.75 s > Compiling phf v0.13.1
  1636. 834.75 s > Compiling ratatui-crossterm v0.1.0
  1637. 834.75 s > Compiling shellexpand v3.1.2
  1638. 834.75 s > Compiling xpct v0.5.1
  1639. 834.75 s > Compiling brotli-decompressor v4.0.3
  1640. 834.75 s > Compiling integer-sqrt v0.1.5
  1641. 834.75 s > Compiling crossbeam-channel v0.5.15
  1642. 834.75 s > Compiling schemars_derive v1.2.1
  1643. 834.75 s > Compiling itertools v0.12.1
  1644. 834.75 s > Compiling include_dir_macros v0.7.4
  1645. 834.75 s > Compiling gammaloop-tracing-filter-macros v0.1.0 (/build/source/crates/gammaloop-tracing-filter-macros)
  1646. 834.75 s > Compiling version-compare v0.2.1
  1647. 834.75 s > Compiling addr2line v0.25.1
  1648. 834.75 s > Compiling gammalooprs v0.3.4 (/build/source/crates/gammalooprs)
  1649. 834.75 s > Compiling symlink v0.1.0
  1650. 834.75 s > Compiling unsafe-libyaml v0.2.11
  1651. 834.75 s > Compiling tracing-appender v0.2.5
  1652. 834.75 s > Compiling tracing-indicatif v0.3.14
  1653. 834.75 s > Compiling include_dir v0.7.4
  1654. 834.75 s > Compiling pathfinding v4.15.0
  1655. 834.75 s > Compiling brotli v7.0.0
  1656. 834.75 s > Compiling rust-embed-impl v8.11.0
  1657. 834.75 s > Compiling ctrlc v3.5.2
  1658. 834.75 s > Compiling ratatui v0.30.0
  1659. 834.75 s > Compiling json5 v0.4.1
  1660. 834.75 s > Compiling typed-index-collections v3.5.0
  1661. 834.75 s > Compiling strum_macros v0.26.4
  1662. 834.75 s > Compiling vectorize v0.2.0
  1663. 834.75 s > Compiling clap_complete v4.6.3
  1664. 834.75 s > Compiling fd-lock v4.0.4
  1665. 834.75 s > Compiling nalgebra v0.29.0
  1666. 834.75 s > Compiling serde_yaml v0.9.34+deprecated
  1667. 834.75 s > Compiling strip-ansi-escapes v0.2.1
  1668. 834.75 s > Compiling gammaloop-api v0.1.0 (/build/source/crates/gammaloop-api)
  1669. 834.75 s > Compiling itertools v0.13.0
  1670. 834.75 s > Compiling strum v0.26.3
  1671. 834.75 s > Compiling backtrace v0.3.76
  1672. 834.75 s > Compiling base62 v2.2.4
  1673. 834.75 s > Compiling ringbuffer v0.16.0
  1674. 834.75 s > Compiling clap_complete_nushell v4.6.0
  1675. 834.75 s > Compiling sysinfo v0.33.1
  1676. 834.75 s > Compiling schemars v1.2.1
  1677. 834.75 s > Compiling rust-embed v8.11.0
  1678. 834.75 s > Compiling color-eyre v0.6.5
  1679. 834.75 s > Compiling pyo3-stub-gen-derive v0.17.2
  1680. 834.75 s > Compiling reedline v0.42.0
  1681. 834.75 s > Compiling pyo3-stub-gen v0.17.2
  1682. 834.75 s > Compiling statrs v0.16.1
  1683. 834.75 s > Compiling momtrop v0.3.0
  1684. 834.75 s > Compiling numerica v3.0.0 (https://github.com/symbolica-dev/symbolica?rev=ba3737137c2a2ccd7bb39f0441837d38ec867e78#ba373713)
  1685. 834.75 s > Compiling graphica v3.0.0 (https://github.com/symbolica-dev/symbolica?rev=ba3737137c2a2ccd7bb39f0441837d38ec867e78#ba373713)
  1686. 834.75 s > Compiling symbolica-utils v0.1.0 (/build/source/crates/symbolica-utils)
  1687. 834.75 s > Compiling gammaloop-workspace-hack v0.1.0 (/build/source/crates/gammaloop-workspace-hack)
  1688. 834.75 s > Compiling spenso-macros v0.3.2 (/build/source/crates/spenso-macros)
  1689. 834.75 s > Compiling linnet v0.17.0 (/build/source/crates/linnet)
  1690. 834.75 s > Compiling spenso v0.6.0 (/build/source/crates/spenso)
  1691. 834.75 s > Compiling idenso v0.3.0 (/build/source/crates/idenso)
  1692. 834.75 s > Compiling gammaloop-tracing-filter v0.1.0 (/build/source/crates/gammaloop-tracing-filter)
  1693. 834.75 s > Compiling spenso-hep-lib v0.1.7 (/build/source/crates/spenso-hep-lib)
  1694. 834.75 s > Compiling alphal00p-docs-python-exporter v0.1.0 (/build/source/crates/alphal00p-docs-python-exporter)
  1695. 834.75 s > Finished `docs` profile [unoptimized] target(s) in 6m 39s
  1696. 834.75 s > +++ command cargo build --profile docs --locked -p alphal00p-docs-python-exporter --features linnet
  1697. 834.75 s > Compiling libc v0.2.186
  1698. 834.75 s > Compiling serde_core v1.0.228
  1699. 834.75 s > Compiling zerocopy v0.8.48
  1700. 834.75 s > Compiling log v0.4.29
  1701. 834.75 s > Compiling num-traits v0.2.19
  1702. 834.75 s > Compiling syn v1.0.109
  1703. 834.75 s > Compiling syn v2.0.117
  1704. 834.75 s > Compiling ahash v0.7.8
  1705. 834.75 s > Compiling bytecheck v0.6.12
  1706. 834.75 s > Compiling regex-syntax v0.8.10
  1707. 834.75 s > Compiling simdutf8 v0.1.5
  1708. 834.75 s > Compiling rend v0.4.2
  1709. 834.75 s > Compiling indexmap v2.14.0
  1710. 834.75 s > Compiling figment v0.10.19
  1711. 834.75 s > Compiling ahash v0.8.12
  1712. 834.75 s > Compiling cgmath v0.18.0
  1713. 834.75 s > Compiling either v1.15.0
  1714. 834.75 s > Compiling rkyv v0.7.46
  1715. 834.75 s > Compiling itertools v0.11.0
  1716. 834.75 s > Compiling bincode v2.0.1
  1717. 834.75 s > Compiling pyo3 v0.28.3
  1718. 834.75 s > Compiling venial v0.5.0
  1719. 834.75 s > Compiling winnow v1.0.2
  1720. 834.75 s > Compiling arrayvec v0.7.6
  1721. 834.75 s > Compiling rustix v1.1.4
  1722. 834.75 s > Compiling seahash v4.1.0
  1723. 834.75 s > Compiling polycool v0.4.0
  1724. 834.75 s > Compiling bitflags v2.11.1
  1725. 834.75 s > Compiling toml_writer v1.1.1+spec-1.1.0
  1726. 834.75 s > Compiling winnow v0.7.15
  1727. 834.75 s > Compiling toml_parser v1.1.2+spec-1.1.0
  1728. 834.75 s > Compiling smallvec v1.15.1
  1729. 834.75 s > Compiling linnet-py v0.1.0 (/build/source/crates/linnet-py)
  1730. 834.75 s > Compiling wasm-minimal-protocol v0.2.0
  1731. 834.75 s > Compiling num-integer v0.1.46
  1732. 834.75 s > Compiling approx v0.4.0
  1733. 834.75 s > Compiling kurbo v0.13.1
  1734. 834.75 s > Compiling num-complex v0.4.6
  1735. 834.75 s > Compiling regex-automata v0.4.14
  1736. 834.75 s > Compiling chrono v0.4.44
  1737. 834.75 s > Compiling num-bigint v0.4.6
  1738. 834.75 s > Compiling getrandom v0.2.17
  1739. 834.75 s > Compiling dirs-sys v0.5.0
  1740. 834.75 s > Compiling pyo3-ffi v0.28.3
  1741. 834.75 s > Compiling rand_core v0.6.4
  1742. 834.75 s > Compiling const-random-macro v0.1.16
  1743. 834.75 s > Compiling dirs v6.0.0
  1744. 834.75 s > Compiling hashbrown v0.12.3
  1745. 834.75 s > Compiling shellexpand v3.1.2
  1746. 834.75 s > Compiling getrandom v0.4.2
  1747. 834.75 s > Compiling const-random v0.1.18
  1748. 834.75 s > Compiling tempfile v3.27.0
  1749. 834.75 s > Compiling toml_datetime v0.7.5+spec-1.1.0
  1750. 834.75 s > Compiling serde_spanned v1.1.1
  1751. 834.75 s > Compiling serde_json v1.0.149
  1752. 834.75 s > Compiling toml v0.9.12+spec-1.1.0
  1753. 834.75 s > Compiling globset v0.4.18
  1754. 834.75 s > Compiling ptr_meta_derive v0.1.4
  1755. 834.75 s > Compiling bytecheck_derive v0.6.12
  1756. 834.75 s > Compiling rkyv_derive v0.7.46
  1757. 834.75 s > Compiling rust-embed-utils v8.11.0
  1758. 834.75 s > Compiling pest_generator v2.8.6
  1759. 834.75 s > Compiling proc-macro2-diagnostics v0.10.1
  1760. 834.75 s > Compiling pyo3-macros-backend v0.28.3
  1761. 834.75 s > Compiling ptr_meta v0.1.4
  1762. 834.75 s > Compiling zerocopy-derive v0.8.48
  1763. 834.75 s > Compiling serde_derive v1.0.228
  1764. 834.75 s > Compiling is-macro v0.3.7
  1765. 834.75 s > Compiling thiserror-impl v2.0.18
  1766. 834.75 s > Compiling serde_repr v0.1.20
  1767. 834.75 s > Compiling bincode-trait-derive v0.1.1
  1768. 834.75 s > Compiling duplicate v2.0.1
  1769. 834.75 s > Compiling rust-embed-impl v8.11.0
  1770. 834.75 s > Compiling pest_derive v2.8.6
  1771. 834.75 s > Compiling ppv-lite86 v0.2.21
  1772. 834.75 s > Compiling dot-parser v0.5.1
  1773. 834.75 s > Compiling rustpython-parser-core v0.4.0
  1774. 834.75 s > Compiling rustpython-ast v0.4.0
  1775. 834.75 s > Compiling rand_chacha v0.3.1
  1776. 834.75 s > Compiling rand v0.8.6
  1777. 834.75 s > Compiling rust-embed v8.11.0
  1778. 834.75 s > Compiling thiserror v2.0.18
  1779. 834.75 s > Compiling phf_generator v0.11.3
  1780. 834.75 s > Compiling phf_codegen v0.11.3
  1781. 834.75 s > Compiling unicode_names2_generator v1.3.0
  1782. 834.75 s > Compiling rustpython-parser v0.4.0
  1783. 834.75 s > Compiling unicode_names2 v1.3.0
  1784. 834.75 s > Compiling pyo3-macros v0.28.3
  1785. 834.75 s > Compiling serde v1.0.228
  1786. 834.75 s > Compiling bitvec v1.0.1
  1787. 834.75 s > Compiling half v2.7.1
  1788. 834.75 s > Compiling ciborium-ll v0.2.2
  1789. 834.75 s > Compiling ciborium v0.2.2
  1790. 834.75 s > Compiling kurvst v0.1.0 (/build/source/crates/kurvst)
  1791. 834.75 s > Compiling linnet v0.17.0 (/build/source/crates/linnet)
  1792. 834.75 s > Compiling pyo3-stub-gen-derive v0.17.2
  1793. 834.75 s > Compiling pyo3-stub-gen v0.17.2
  1794. 834.75 s > Compiling linnest v0.1.0 (/build/source/crates/linnest)
  1795. 834.75 s > Compiling alphal00p-docs-python-exporter v0.1.0 (/build/source/crates/alphal00p-docs-python-exporter)
  1796. 834.75 s > Finished `docs` profile [unoptimized] target(s) in 39.72s
  1797. 834.75 s > +++ command cargo build --profile docs --locked -p alphal00p-docs-python-exporter --features spenso
  1798. 834.75 s > Compiling pyo3-build-config v0.28.3
  1799. 834.75 s > Compiling symbolica v2.2.0 (https://github.com/symbolica-dev/symbolica?rev=ba3737137c2a2ccd7bb39f0441837d38ec867e78#ba373713)
  1800. 834.75 s > Compiling syn v1.0.109
  1801. 834.75 s > Compiling figment v0.10.19
  1802. 834.75 s > Compiling proc-macro-error v1.0.4
  1803. 834.75 s > Compiling duplicate v1.0.0
  1804. 834.75 s > Compiling pyo3-macros-backend v0.28.3
  1805. 834.75 s > Compiling numpy v0.28.0
  1806. 834.75 s > Compiling pyo3-ffi v0.28.3
  1807. 834.75 s > Compiling pyo3 v0.28.3
  1808. 834.75 s > Compiling pyo3-macros v0.28.3
  1809. 834.75 s > Compiling pyo3-stub-gen v0.17.2
  1810. 834.75 s > Compiling numerica v3.0.0 (https://github.com/symbolica-dev/symbolica?rev=ba3737137c2a2ccd7bb39f0441837d38ec867e78#ba373713)
  1811. 834.75 s > Compiling gammaloop-workspace-hack v0.1.0 (/build/source/crates/gammaloop-workspace-hack)
  1812. 834.75 s > Compiling graphica v3.0.0 (https://github.com/symbolica-dev/symbolica?rev=ba3737137c2a2ccd7bb39f0441837d38ec867e78#ba373713)
  1813. 834.75 s > Compiling symbolica-utils v0.1.0 (/build/source/crates/symbolica-utils)
  1814. 834.75 s > Compiling tymbolica-atom-payload v0.1.0 (https://github.com/lcnbr/tymbolica?rev=e85233dd3d99e5fb458913d0d49f99d83466025b#e85233dd)
  1815. 834.75 s > Compiling linnet v0.17.0 (/build/source/crates/linnet)
  1816. 834.75 s > Compiling spenso v0.6.0 (/build/source/crates/spenso)
  1817. 834.75 s > Compiling idenso v0.3.0 (/build/source/crates/idenso)
  1818. 834.75 s > Compiling spenso-hep-lib v0.1.7 (/build/source/crates/spenso-hep-lib)
  1819. 834.75 s > Compiling spynso3 v0.1.2 (/build/source/crates/spynso3)
  1820. 834.75 s > Compiling alphal00p-docs-python-exporter v0.1.0 (/build/source/crates/alphal00p-docs-python-exporter)
  1821. 834.75 s > Finished `docs` profile [unoptimized] target(s) in 1m 40s
  1822. 834.75 s > +++ command cargo build --profile docs --locked -p alphal00p-docs-python-exporter --features idenso
  1823. 834.75 s > Compiling pyo3 v0.28.3
  1824. 834.75 s > Compiling numpy v0.28.0
  1825. 834.75 s > Compiling pyo3-stub-gen v0.17.2
  1826. 834.75 s > Compiling numerica v3.0.0 (https://github.com/symbolica-dev/symbolica?rev=ba3737137c2a2ccd7bb39f0441837d38ec867e78#ba373713)
  1827. 834.75 s > Compiling graphica v3.0.0 (https://github.com/symbolica-dev/symbolica?rev=ba3737137c2a2ccd7bb39f0441837d38ec867e78#ba373713)
  1828. 834.75 s > Compiling symbolica v2.2.0 (https://github.com/symbolica-dev/symbolica?rev=ba3737137c2a2ccd7bb39f0441837d38ec867e78#ba373713)
  1829. 834.75 s > Compiling gammaloop-workspace-hack v0.1.0 (/build/source/crates/gammaloop-workspace-hack)
  1830. 834.75 s > Compiling symbolica-utils v0.1.0 (/build/source/crates/symbolica-utils)
  1831. 834.75 s > Compiling linnet v0.17.0 (/build/source/crates/linnet)
  1832. 834.75 s > Compiling spenso v0.6.0 (/build/source/crates/spenso)
  1833. 834.75 s > Compiling idenso v0.3.0 (/build/source/crates/idenso)
  1834. 834.75 s > Compiling alphal00p-docs-python-exporter v0.1.0 (/build/source/crates/alphal00p-docs-python-exporter)
  1835. 834.75 s > Finished `docs` profile [unoptimized] target(s) in 1m 29s
  1836. 834.75 s > +++ command cargo build --profile docs --locked -p alphal00p-docs-python-exporter --features vakint
  1837. 834.75 s > Compiling libc v0.2.186
  1838. 834.75 s > Compiling tiny-keccak v2.0.2
  1839. 834.75 s > Compiling bytemuck v1.25.0
  1840. 834.75 s > Compiling matrixmultiply v0.3.10
  1841. 834.75 s > Compiling getrandom v0.3.4
  1842. 834.75 s > Compiling num-integer v0.1.46
  1843. 834.75 s > Compiling pyo3 v0.28.3
  1844. 834.75 s > Compiling regex-automata v0.4.14
  1845. 834.75 s > Compiling pyo3-macros-backend v0.28.3
  1846. 834.75 s > Compiling pyo3-ffi v0.28.3
  1847. 834.75 s > Compiling approx v0.5.1
  1848. 834.75 s > Compiling ahash v0.8.12
  1849. 834.75 s > Compiling serde v1.0.228
  1850. 834.75 s > Compiling itertools v0.14.0
  1851. 834.75 s > Compiling gmp-mpfr-sys v1.7.1
  1852. 834.75 s > Compiling smallvec v1.15.1
  1853. 834.75 s > Compiling safe_arch v0.7.4
  1854. 834.75 s > Compiling rand_core v0.9.5
  1855. 834.75 s > Compiling safe_arch v1.2.0
  1856. 834.75 s > Compiling rayon v1.12.0
  1857. 834.75 s > Compiling tracing-attributes v0.1.31
  1858. 834.75 s > Compiling wide v0.7.33
  1859. 834.75 s > Compiling smartstring v1.0.1
  1860. 834.75 s > Compiling phf_shared v0.13.1
  1861. 834.75 s > Compiling rand_chacha v0.9.0
  1862. 834.75 s > Compiling wide v1.7.0
  1863. 834.75 s > Compiling fastrand v2.4.1
  1864. 834.75 s > Compiling symbolica v2.2.0 (https://github.com/symbolica-dev/symbolica?rev=ba3737137c2a2ccd7bb39f0441837d38ec867e78#ba373713)
  1865. 834.75 s > Compiling phf_generator v0.13.1
  1866. 834.75 s > Compiling rug v1.30.0
  1867. 834.75 s > Compiling phf_macros v0.13.1
  1868. 834.75 s > Compiling directories v6.0.0
  1869. 834.75 s > Compiling ndarray v0.17.2
  1870. 834.75 s > Compiling rand v0.9.4
  1871. 834.75 s > Compiling subprocess v0.2.15
  1872. 834.75 s > Compiling vakint v0.1.2 (/build/source/crates/vakint)
  1873. 834.75 s > Compiling getrandom v0.2.17
  1874. 834.75 s > Compiling rand_core v0.6.4
  1875. 834.75 s > Compiling phf v0.13.1
  1876. 834.75 s > Compiling rand_chacha v0.3.1
  1877. 834.75 s > Compiling simba v0.9.1
  1878. 834.75 s > Compiling rand v0.8.6
  1879. 834.75 s > Compiling tracing v0.1.44
  1880. 834.75 s > Compiling phf_generator v0.11.3
  1881. 834.75 s > Compiling phf_codegen v0.11.3
  1882. 834.75 s > Compiling unicode_names2_generator v1.3.0
  1883. 834.75 s > Compiling rustpython-parser v0.4.0
  1884. 834.75 s > Compiling unicode_names2 v1.3.0
  1885. 834.75 s > Compiling regex v1.12.3
  1886. 834.75 s > Compiling matchers v0.2.0
  1887. 834.75 s > Compiling tracing-subscriber v0.3.23
  1888. 834.75 s > Compiling titlecase v2.2.1
  1889. 834.75 s > Compiling string-template-plus v0.4.3
  1890. 834.75 s > Compiling pyo3-macros v0.28.3
  1891. 834.75 s > Compiling xprec v0.2.2
  1892. 834.75 s > Compiling numpy v0.28.0
  1893. 834.75 s > Compiling pyo3-stub-gen-derive v0.17.2
  1894. 834.75 s > Compiling pyo3-stub-gen v0.17.2
  1895. 834.75 s > Compiling numerica v3.0.0 (https://github.com/symbolica-dev/symbolica?rev=ba3737137c2a2ccd7bb39f0441837d38ec867e78#ba373713)
  1896. 834.75 s > error: select an integer backend: `integer-gmp` or `integer-malachite`
  1897. 834.75 s > --> /nix/store/5dfb7akvi1k3080zqfndr6jw2ay3di2p-vendor-cargo-deps/f8c6b2c844a6fa8c330abb750e4cf5bbdb36a70140a58e87f6b79fb3024532aa/numerica-3.0.0/src/lib.rs:40:1
  1898. 834.75 s > |
  1899. 834.75 s > 40 | compile_error!("select an integer backend: `integer-gmp` or `integer-malachite`");
  1900. 834.75 s > | ^^^^^^^^^^^^^^^^^^^^^^^^^^^^^^^^^^^^^^^^^^^^^^^^^^^^^^^^^^^^^^^^^^^^^^^^^^^^^^^^^
  1901. 834.75 s >
  1902. 834.75 s > error: select a float backend: `float-mpfr` or `float-astro`
  1903. 834.75 s > --> /nix/store/5dfb7akvi1k3080zqfndr6jw2ay3di2p-vendor-cargo-deps/f8c6b2c844a6fa8c330abb750e4cf5bbdb36a70140a58e87f6b79fb3024532aa/numerica-3.0.0/src/lib.rs:44:1
  1904. 834.75 s > |
  1905. 834.75 s > 44 | compile_error!("select a float backend: `float-mpfr` or `float-astro`");
  1906. 834.75 s > | ^^^^^^^^^^^^^^^^^^^^^^^^^^^^^^^^^^^^^^^^^^^^^^^^^^^^^^^^^^^^^^^^^^^^^^^
  1907. 834.75 s >
  1908. 834.75 s > error[E0432]: unresolved import `implementation::BackendRandState`
  1909. 834.75 s > --> /nix/store/5dfb7akvi1k3080zqfndr6jw2ay3di2p-vendor-cargo-deps/f8c6b2c844a6fa8c330abb750e4cf5bbdb36a70140a58e87f6b79fb3024532aa/numerica-3.0.0/src/domains/backend/integer.rs:1614:33
  1910. 834.75 s > |
  1911. 834.75 s > 1614 | pub(crate) use implementation::{BackendRandState, Complete, RemRounding};
  1912. 834.75 s > | ^^^^^^^^^^^^^^^^ no `BackendRandState` in `domains::backend::integer::implementation`
  1913. 834.75 s > |
  1914. 834.75 s > note: found an item that was configured out
  1915. 834.75 s > --> /nix/store/5dfb7akvi1k3080zqfndr6jw2ay3di2p-vendor-cargo-deps/f8c6b2c844a6fa8c330abb750e4cf5bbdb36a70140a58e87f6b79fb3024532aa/numerica-3.0.0/src/domains/backend/integer.rs:1378:23
  1916. 834.75 s > |
  1917. 834.75 s > 1377 | #[cfg(feature = "integer-malachite")]
  1918. 834.75 s > | ----------------------------- the item is gated behind the `integer-malachite` feature
  1919. 834.75 s > 1378 | pub(crate) struct BackendRandState {
  1920. 834.75 s > | ^^^^^^^^^^^^^^^^
  1921. 834.75 s > note: found an item that was configured out
  1922. 834.75 s > --> /nix/store/5dfb7akvi1k3080zqfndr6jw2ay3di2p-vendor-cargo-deps/f8c6b2c844a6fa8c330abb750e4cf5bbdb36a70140a58e87f6b79fb3024532aa/numerica-3.0.0/src/domains/backend/integer.rs:1413:23
  1923. 834.75 s > |
  1924. 834.75 s > 1412 | #[cfg(feature = "integer-gmp")]
  1925. 834.75 s > | ----------------------- the item is gated behind the `integer-gmp` feature
  1926. 834.75 s > 1413 | pub(crate) struct BackendRandState(rug::rand::RandState<'static>);
  1927. 834.75 s > | ^^^^^^^^^^^^^^^^
  1928. 834.75 s >
  1929. 834.75 s > error[E0432]: unresolved import `implementation::RawMultiPrecisionInteger`
  1930. 834.75 s > --> /nix/store/5dfb7akvi1k3080zqfndr6jw2ay3di2p-vendor-cargo-deps/f8c6b2c844a6fa8c330abb750e4cf5bbdb36a70140a58e87f6b79fb3024532aa/numerica-3.0.0/src/domains/backend/integer.rs:1616:61
  1931. 834.75 s > |
  1932. 834.75 s > 1616 | MultiPrecisionInteger, ParseMultiPrecisionIntegerError, RawMultiPrecisionInteger,
  1933. 834.75 s > | ^^^^^^^^^^^^^^^^^^^^^^^^ no `RawMultiPrecisionInteger` in `domains::backend::integer::implementation`
  1934. 834.75 s > |
  1935. 834.75 s > note: found an item that was configured out
  1936. 834.75 s > --> /nix/store/5dfb7akvi1k3080zqfndr6jw2ay3di2p-vendor-cargo-deps/f8c6b2c844a6fa8c330abb750e4cf5bbdb36a70140a58e87f6b79fb3024532aa/numerica-3.0.0/src/domains/backend/integer.rs:26:14
  1937. 834.75 s > |
  1938. 834.75 s > 25 | #[cfg(feature = "integer-malachite")]
  1939. 834.75 s > | ----------------------------- the item is gated behind the `integer-malachite` feature
  1940. 834.75 s > 26 | pub type RawMultiPrecisionInteger = malachite_nz::integer::Integer;
  1941. 834.75 s > | ^^^^^^^^^^^^^^^^^^^^^^^^
  1942. 834.75 s > note: found an item that was configured out
  1943. 834.75 s > --> /nix/store/5dfb7akvi1k3080zqfndr6jw2ay3di2p-vendor-cargo-deps/f8c6b2c844a6fa8c330abb750e4cf5bbdb36a70140a58e87f6b79fb3024532aa/numerica-3.0.0/src/domains/backend/integer.rs:29:14
  1944. 834.75 s > |
  1945. 834.75 s > 28 | #[cfg(feature = "integer-gmp")]
  1946. 834.75 s > | ----------------------- the item is gated behind the `integer-gmp` feature
  1947. 834.75 s > 29 | pub type RawMultiPrecisionInteger = rug::Integer;
  1948. 834.75 s > | ^^^^^^^^^^^^^^^^^^^^^^^^
  1949. 834.75 s > help: a similar name exists in the module
  1950. 834.75 s > |
  1951. 834.75 s > 1616 - MultiPrecisionInteger, ParseMultiPrecisionIntegerError, RawMultiPrecisionInteger,
  1952. 834.75 s > 1616 + MultiPrecisionInteger, ParseMultiPrecisionIntegerError, MultiPrecisionInteger,
  1953. 834.75 s > |
  1954. 834.75 s >
  1955. 834.75 s > error[E0432]: unresolved imports `implementation::from_be_bytes`, `implementation::to_be_bytes`
  1956. 834.75 s > --> /nix/store/5dfb7akvi1k3080zqfndr6jw2ay3di2p-vendor-cargo-deps/f8c6b2c844a6fa8c330abb750e4cf5bbdb36a70140a58e87f6b79fb3024532aa/numerica-3.0.0/src/domains/backend/integer.rs:1709:33
  1957. 834.75 s > |
  1958. 834.75 s > 1709 | pub(crate) use implementation::{from_be_bytes, to_be_bytes};
  1959. 834.75 s > | ^^^^^^^^^^^^^ ^^^^^^^^^^^ no `to_be_bytes` in `domains::backend::integer::implementation`
  1960. 834.75 s > | |
  1961. 834.75 s > | no `from_be_bytes` in `domains::backend::integer::implementation`
  1962. 834.75 s > |
  1963. 834.75 s > note: found an item that was configured out
  1964. 834.75 s > --> /nix/store/5dfb7akvi1k3080zqfndr6jw2ay3di2p-vendor-cargo-deps/f8c6b2c844a6fa8c330abb750e4cf5bbdb36a70140a58e87f6b79fb3024532aa/numerica-3.0.0/src/domains/backend/integer.rs:1370:19
  1965. 834.75 s > |
  1966. 834.75 s > 1369 | #[cfg(all(feature = "integer-malachite", feature = "bincode"))]
  1967. 834.75 s > | ----------------------------- the item is gated behind the `integer-malachite` feature
  1968. 834.75 s > 1370 | pub(crate) fn from_be_bytes(bytes: &[u8]) -> Result<MultiPrecisionInteger, &'static str> {
  1969. 834.75 s > | ^^^^^^^^^^^^^
  1970. 834.75 s > note: found an item that was configured out
  1971. 834.75 s > --> /nix/store/5dfb7akvi1k3080zqfndr6jw2ay3di2p-vendor-cargo-deps/f8c6b2c844a6fa8c330abb750e4cf5bbdb36a70140a58e87f6b79fb3024532aa/numerica-3.0.0/src/domains/backend/integer.rs:1405:19
  1972. 834.75 s > |
  1973. 834.75 s > 1404 | #[cfg(all(feature = "integer-gmp", feature = "bincode"))]
  1974. 834.75 s > | ----------------------- the item is gated behind the `integer-gmp` feature
  1975. 834.75 s > 1405 | pub(crate) fn from_be_bytes(bytes: &[u8]) -> Result<MultiPrecisionInteger, &'static str> {
  1976. 834.75 s > | ^^^^^^^^^^^^^
  1977. 834.75 s > note: found an item that was configured out
  1978. 834.75 s > --> /nix/store/5dfb7akvi1k3080zqfndr6jw2ay3di2p-vendor-cargo-deps/f8c6b2c844a6fa8c330abb750e4cf5bbdb36a70140a58e87f6b79fb3024532aa/numerica-3.0.0/src/domains/backend/integer.rs:1365:19
  1979. 834.75 s > |
  1980. 834.75 s > 1364 | #[cfg(all(feature = "integer-malachite", feature = "bincode"))]
  1981. 834.75 s > | ----------------------------- the item is gated behind the `integer-malachite` feature
  1982. 834.75 s > 1365 | pub(crate) fn to_be_bytes(value: &MultiPrecisionInteger) -> Vec<u8> {
  1983. 834.75 s > | ^^^^^^^^^^^
  1984. 834.75 s > note: found an item that was configured out
  1985. 834.75 s > --> /nix/store/5dfb7akvi1k3080zqfndr6jw2ay3di2p-vendor-cargo-deps/f8c6b2c844a6fa8c330abb750e4cf5bbdb36a70140a58e87f6b79fb3024532aa/numerica-3.0.0/src/domains/backend/integer.rs:1400:19
  1986. 834.75 s > |
  1987. 834.75 s > 1399 | #[cfg(all(feature = "integer-gmp", feature = "bincode"))]
  1988. 834.75 s > | ----------------------- the item is gated behind the `integer-gmp` feature
  1989. 834.75 s > 1400 | pub(crate) fn to_be_bytes(value: &MultiPrecisionInteger) -> Vec<u8> {
  1990. 834.75 s > | ^^^^^^^^^^^
  1991. 834.75 s >
  1992. 834.75 s > error[E0432]: unresolved imports `crate::domains::backend::float::Assign`, `crate::domains::backend::float::CompleteRound`, `crate::domains::backend::float::Constant`, `crate::domains::backend::float::MultiPrecisionFloat`, `crate::domains::backend::float::Pow`
  1993. 834.75 s > --> /nix/store/5dfb7akvi1k3080zqfndr6jw2ay3di2p-vendor-cargo-deps/f8c6b2c844a6fa8c330abb750e4cf5bbdb36a70140a58e87f6b79fb3024532aa/numerica-3.0.0/src/domains/float/multiprecision.rs:15:9
  1994. 834.75 s > |
  1995. 834.75 s > 15 | Assign, CompleteRound, Constant, MultiPrecisionFloat, MultiPrecisionFloatInteger,
  1996. 834.75 s > | ^^^^^^ ^^^^^^^^^^^^^ ^^^^^^^^ ^^^^^^^^^^^^^^^^^^^ no `MultiPrecisionFloat` in `domains::backend::float`
  1997. 834.75 s > | | | |
  1998. 834.75 s > | | | no `Constant` in `domains::backend::float`
  1999. 834.75 s > | | no `CompleteRound` in `domains::backend::float`
  2000. 834.75 s > | no `Assign` in `domains::backend::float`
  2001. 834.75 s > 16 | MultiPrecisionFloatRational, MultiPrecisionFloatRounding, Pow, RoundingDirection,
  2002. 834.75 s > | ^^^ no `Pow` in `domains::backend::float`
  2003. 834.75 s > |
  2004. 834.75 s > note: found an item that was configured out
  2005. 834.75 s > --> /nix/store/5dfb7akvi1k3080zqfndr6jw2ay3di2p-vendor-cargo-deps/f8c6b2c844a6fa8c330abb750e4cf5bbdb36a70140a58e87f6b79fb3024532aa/numerica-3.0.0/src/domains/backend/float.rs:17:5
  2006. 834.75 s > |
  2007. 834.75 s > 15 | #[cfg(feature = "float-mpfr")]
  2008. 834.75 s > | ---------------------- the item is gated behind the `float-mpfr` feature
  2009. 834.75 s > 16 | pub use rug::{
  2010. 834.75 s > 17 | Assign, Float as MultiPrecisionFloat, Rational as BackendRational,
  2011. 834.75 s > | ^^^^^^
  2012. 834.75 s > note: found an item that was configured out
  2013. 834.75 s > --> /nix/store/5dfb7akvi1k3080zqfndr6jw2ay3di2p-vendor-cargo-deps/f8c6b2c844a6fa8c330abb750e4cf5bbdb36a70140a58e87f6b79fb3024532aa/numerica-3.0.0/src/domains/backend/float.rs:1561:5
  2014. 834.75 s > |
  2015. 834.75 s > 1559 | #[cfg(feature = "float-astro")]
  2016. 834.75 s > | ----------------------- the item is gated behind the `float-astro` feature
  2017. 834.75 s > 1560 | pub use astro::{
  2018. 834.75 s > 1561 | Assign, BackendRational, CompleteRound, Constant, IntoMultiPrecisionFloat, MultiPrecisionFloat,
  2019. 834.75 s > | ^^^^^^
  2020. 834.75 s > note: found an item that was configured out
  2021. 834.75 s > --> /nix/store/5dfb7akvi1k3080zqfndr6jw2ay3di2p-vendor-cargo-deps/f8c6b2c844a6fa8c330abb750e4cf5bbdb36a70140a58e87f6b79fb3024532aa/numerica-3.0.0/src/domains/backend/float.rs:19:11
  2022. 834.75 s > |
  2023. 834.75 s > 15 | #[cfg(feature = "float-mpfr")]
  2024. 834.75 s > | ---------------------- the item is gated behind the `float-mpfr` feature
  2025. 834.75 s > ...
  2026. 834.75 s > 19 | ops::{CompleteRound, Pow},
  2027. 834.75 s > | ^^^^^^^^^^^^^
  2028. 834.75 s > note: found an item that was configured out
  2029. 834.75 s > --> /nix/store/5dfb7akvi1k3080zqfndr6jw2ay3di2p-vendor-cargo-deps/f8c6b2c844a6fa8c330abb750e4cf5bbdb36a70140a58e87f6b79fb3024532aa/numerica-3.0.0/src/domains/backend/float.rs:1561:30
  2030. 834.75 s > |
  2031. 834.75 s > 1559 | #[cfg(feature = "float-astro")]
  2032. 834.75 s > | ----------------------- the item is gated behind the `float-astro` feature
  2033. 834.75 s > 1560 | pub use astro::{
  2034. 834.75 s > 1561 | Assign, BackendRational, CompleteRound, Constant, IntoMultiPrecisionFloat, MultiPrecisionFloat,
  2035. 834.75 s > | ^^^^^^^^^^^^^
  2036. 834.75 s > note: found an item that was configured out
  2037. 834.75 s > --> /nix/store/5dfb7akvi1k3080zqfndr6jw2ay3di2p-vendor-cargo-deps/f8c6b2c844a6fa8c330abb750e4cf5bbdb36a70140a58e87f6b79fb3024532aa/numerica-3.0.0/src/domains/backend/float.rs:18:12
  2038. 834.75 s > |
  2039. 834.75 s > 15 | #[cfg(feature = "float-mpfr")]
  2040. 834.75 s > | ---------------------- the item is gated behind the `float-mpfr` feature
  2041. 834.75 s > ...
  2042. 834.75 s > 18 | float::Constant,
  2043. 834.75 s > | ^^^^^^^^
  2044. 834.75 s > note: found an item that was configured out
  2045. 834.75 s > --> /nix/store/5dfb7akvi1k3080zqfndr6jw2ay3di2p-vendor-cargo-deps/f8c6b2c844a6fa8c330abb750e4cf5bbdb36a70140a58e87f6b79fb3024532aa/numerica-3.0.0/src/domains/backend/float.rs:1561:45
  2046. 834.75 s > |
  2047. 834.75 s > 1559 | #[cfg(feature = "float-astro")]
  2048. 834.75 s > | ----------------------- the item is gated behind the `float-astro` feature
  2049. 834.75 s > 1560 | pub use astro::{
  2050. 834.75 s > 1561 | Assign, BackendRational, CompleteRound, Constant, IntoMultiPrecisionFloat, MultiPrecisionFloat,
  2051. 834.75 s > | ^^^^^^^^
  2052. 834.75 s > note: found an item that was configured out
  2053. 834.75 s > --> /nix/store/5dfb7akvi1k3080zqfndr6jw2ay3di2p-vendor-cargo-deps/f8c6b2c844a6fa8c330abb750e4cf5bbdb36a70140a58e87f6b79fb3024532aa/numerica-3.0.0/src/domains/backend/float.rs:17:22
  2054. 834.75 s > |
  2055. 834.75 s > 15 | #[cfg(feature = "float-mpfr")]
  2056. 834.75 s > | ---------------------- the item is gated behind the `float-mpfr` feature
  2057. 834.75 s > 16 | pub use rug::{
  2058. 834.75 s > 17 | Assign, Float as MultiPrecisionFloat, Rational as BackendRational,
  2059. 834.75 s > | ^^^^^^^^^^^^^^^^^^^
  2060. 834.75 s > note: found an item that was configured out
  2061. 834.75 s > --> /nix/store/5dfb7akvi1k3080zqfndr6jw2ay3di2p-vendor-cargo-deps/f8c6b2c844a6fa8c330abb750e4cf5bbdb36a70140a58e87f6b79fb3024532aa/numerica-3.0.0/src/domains/backend/float.rs:1561:80
  2062. 834.75 s > |
  2063. 834.75 s > 1559 | #[cfg(feature = "float-astro")]
  2064. 834.75 s > | ----------------------- the item is gated behind the `float-astro` feature
  2065. 834.75 s > 1560 | pub use astro::{
  2066. 834.75 s > 1561 | Assign, BackendRational, CompleteRound, Constant, IntoMultiPrecisionFloat, MultiPrecisionFloat,
  2067. 834.75 s > | ^^^^^^^^^^^^^^^^^^^
  2068. 834.75 s > note: found an item that was configured out
  2069. 834.75 s > --> /nix/store/5dfb7akvi1k3080zqfndr6jw2ay3di2p-vendor-cargo-deps/f8c6b2c844a6fa8c330abb750e4cf5bbdb36a70140a58e87f6b79fb3024532aa/numerica-3.0.0/src/domains/backend/float.rs:19:26
  2070. 834.75 s > |
  2071. 834.75 s > 15 | #[cfg(feature = "float-mpfr")]
  2072. 834.75 s > | ---------------------- the item is gated behind the `float-mpfr` feature
  2073. 834.75 s > ...
  2074. 834.75 s > 19 | ops::{CompleteRound, Pow},
  2075. 834.75 s > | ^^^
  2076. 834.75 s > note: found an item that was configured out
  2077. 834.75 s > --> /nix/store/5dfb7akvi1k3080zqfndr6jw2ay3di2p-vendor-cargo-deps/f8c6b2c844a6fa8c330abb750e4cf5bbdb36a70140a58e87f6b79fb3024532aa/numerica-3.0.0/src/domains/backend/float.rs:1562:5
  2078. 834.75 s > |
  2079. 834.75 s > 1559 | #[cfg(feature = "float-astro")]
  2080. 834.75 s > | ----------------------- the item is gated behind the `float-astro` feature
  2081. 834.75 s > ...
  2082. 834.75 s > 1562 | Pow,
  2083. 834.75 s > | ^^^
  2084. 834.75 s >
  2085. 834.75 s > error[E0425]: cannot find type `RawMultiPrecisionInteger` in this scope
  2086. 834.75 s > --> /nix/store/5dfb7akvi1k3080zqfndr6jw2ay3di2p-vendor-cargo-deps/f8c6b2c844a6fa8c330abb750e4cf5bbdb36a70140a58e87f6b79fb3024532aa/numerica-3.0.0/src/domains/backend/integer.rs:52:38
  2087. 834.75 s > |
  2088. 834.75 s > 52 | pub struct MultiPrecisionInteger(RawMultiPrecisionInteger);
  2089. 834.75 s > | ^^^^^^^^^^^^^^^^^^^^^^^^ not found in this scope
  2090. 834.75 s >
  2091. 834.75 s > error[E0425]: cannot find type `RawMultiPrecisionInteger` in this scope
  2092. 834.75 s > --> /nix/store/5dfb7akvi1k3080zqfndr6jw2ay3di2p-vendor-cargo-deps/f8c6b2c844a6fa8c330abb750e4cf5bbdb36a70140a58e87f6b79fb3024532aa/numerica-3.0.0/src/domains/backend/integer.rs:52:38
  2093. 834.75 s > |
  2094. 834.75 s > 52 | pub struct MultiPrecisionInteger(RawMultiPrecisionInteger);
  2095. 834.75 s > | ^^^^^^^^^^^^^^^^^^^^^^^^ not found in this scope
  2096. 834.75 s > |
  2097. 834.75 s > help: you might be missing a type parameter
  2098. 834.75 s > |
  2099. 834.75 s > 52 | pub struct MultiPrecisionInteger<RawMultiPrecisionInteger>(RawMultiPrecisionInteger);
  2100. 834.75 s > | ++++++++++++++++++++++++++
  2101. 834.75 s >
  2102. 834.75 s > error[E0425]: cannot find type `RawMultiPrecisionInteger` in this scope
  2103. 834.75 s > --> /nix/store/5dfb7akvi1k3080zqfndr6jw2ay3di2p-vendor-cargo-deps/f8c6b2c844a6fa8c330abb750e4cf5bbdb36a70140a58e87f6b79fb3024532aa/numerica-3.0.0/src/domains/backend/integer.rs:149:32
  2104. 834.75 s > |
  2105. 834.75 s > 52 | pub struct MultiPrecisionInteger(RawMultiPrecisionInteger);
  2106. 834.75 s > | ----------------------------------------------------------- similarly named struct `MultiPrecisionInteger` defined here
  2107. 834.75 s > ...
  2108. 834.75 s > 149 | pub fn from_raw(value: RawMultiPrecisionInteger) -> Self {
  2109. 834.75 s > | ^^^^^^^^^^^^^^^^^^^^^^^^
  2110. 834.75 s > |
  2111. 834.75 s > help: a struct with a similar name exists
  2112. 834.75 s > |
  2113. 834.75 s > 149 - pub fn from_raw(value: RawMultiPrecisionInteger) -> Self {
  2114. 834.75 s > 149 + pub fn from_raw(value: MultiPrecisionInteger) -> Self {
  2115. 834.75 s > |
  2116. 834.75 s >
  2117. 834.75 s > error[E0425]: cannot find type `RawMultiPrecisionInteger` in this scope
  2118. 834.75 s > --> /nix/store/5dfb7akvi1k3080zqfndr6jw2ay3di2p-vendor-cargo-deps/f8c6b2c844a6fa8c330abb750e4cf5bbdb36a70140a58e87f6b79fb3024532aa/numerica-3.0.0/src/domains/backend/integer.rs:187:34
  2119. 834.75 s > |
  2120. 834.75 s > 52 | pub struct MultiPrecisionInteger(RawMultiPrecisionInteger);
  2121. 834.75 s > | ----------------------------------------------------------- similarly named struct `MultiPrecisionInteger` defined here
  2122. 834.75 s > ...
  2123. 834.75 s > 187 | pub fn as_raw(&self) -> &RawMultiPrecisionInteger {
  2124. 834.75 s > | ^^^^^^^^^^^^^^^^^^^^^^^^
  2125. 834.75 s > |
  2126. 834.75 s > help: a struct with a similar name exists
  2127. 834.75 s > |
  2128. 834.75 s > 187 - pub fn as_raw(&self) -> &RawMultiPrecisionInteger {
  2129. 834.75 s > 187 + pub fn as_raw(&self) -> &MultiPrecisionInteger {
  2130. 834.75 s > |
  2131. 834.75 s >
  2132. 834.75 s > error[E0425]: cannot find type `RawMultiPrecisionInteger` in this scope
  2133. 834.75 s > --> /nix/store/5dfb7akvi1k3080zqfndr6jw2ay3di2p-vendor-cargo-deps/f8c6b2c844a6fa8c330abb750e4cf5bbdb36a70140a58e87f6b79fb3024532aa/numerica-3.0.0/src/domains/backend/integer.rs:193:33
  2134. 834.75 s > |
  2135. 834.75 s > 52 | pub struct MultiPrecisionInteger(RawMultiPrecisionInteger);
  2136. 834.75 s > | ----------------------------------------------------------- similarly named struct `MultiPrecisionInteger` defined here
  2137. 834.75 s > ...
  2138. 834.75 s > 193 | pub fn to_raw(&self) -> RawMultiPrecisionInteger {
  2139. 834.75 s > | ^^^^^^^^^^^^^^^^^^^^^^^^
  2140. 834.75 s > |
  2141. 834.75 s > help: a struct with a similar name exists
  2142. 834.75 s > |
  2143. 834.75 s > 193 - pub fn to_raw(&self) -> RawMultiPrecisionInteger {
  2144. 834.75 s > 193 + pub fn to_raw(&self) -> MultiPrecisionInteger {
  2145. 834.75 s > |
  2146. 834.75 s >
  2147. 834.75 s > error[E0425]: cannot find type `RawMultiPrecisionInteger` in this scope
  2148. 834.75 s > --> /nix/store/5dfb7akvi1k3080zqfndr6jw2ay3di2p-vendor-cargo-deps/f8c6b2c844a6fa8c330abb750e4cf5bbdb36a70140a58e87f6b79fb3024532aa/numerica-3.0.0/src/domains/backend/integer.rs:199:34
  2149. 834.75 s > |
  2150. 834.75 s > 52 | pub struct MultiPrecisionInteger(RawMultiPrecisionInteger);
  2151. 834.75 s > | ----------------------------------------------------------- similarly named struct `MultiPrecisionInteger` defined here
  2152. 834.75 s > ...
  2153. 834.75 s > 199 | pub fn into_raw(self) -> RawMultiPrecisionInteger {
  2154. 834.75 s > | ^^^^^^^^^^^^^^^^^^^^^^^^
  2155. 834.75 s > |
  2156. 834.75 s > help: a struct with a similar name exists
  2157. 834.75 s > |
  2158. 834.75 s > 199 - pub fn into_raw(self) -> RawMultiPrecisionInteger {
  2159. 834.75 s > 199 + pub fn into_raw(self) -> MultiPrecisionInteger {
  2160. 834.75 s > |
  2161. 834.75 s >
  2162. 834.75 s > error[E0425]: cannot find type `RawMultiPrecisionInteger` in this scope
  2163. 834.75 s > --> /nix/store/5dfb7akvi1k3080zqfndr6jw2ay3di2p-vendor-cargo-deps/f8c6b2c844a6fa8c330abb750e4cf5bbdb36a70140a58e87f6b79fb3024532aa/numerica-3.0.0/src/domains/backend/integer.rs:567:27
  2164. 834.75 s > |
  2165. 834.75 s > 52 | pub struct MultiPrecisionInteger(RawMultiPrecisionInteger);
  2166. 834.75 s > | ----------------------------------------------------------- similarly named struct `MultiPrecisionInteger` defined here
  2167. 834.75 s > ...
  2168. 834.75 s > 567 | fn rem_trunc(lhs: RawMultiPrecisionInteger, rhs: RawMultiPrecisionInteger) -> Self {
  2169. 834.75 s > | ^^^^^^^^^^^^^^^^^^^^^^^^
  2170. 834.75 s > |
  2171. 834.75 s > help: a struct with a similar name exists
  2172. 834.75 s > |
  2173. 834.75 s > 567 - fn rem_trunc(lhs: RawMultiPrecisionInteger, rhs: RawMultiPrecisionInteger) -> Self {
  2174. 834.75 s > 567 + fn rem_trunc(lhs: MultiPrecisionInteger, rhs: RawMultiPrecisionInteger) -> Self {
  2175. 834.75 s > |
  2176. 834.75 s >
  2177. 834.75 s > error[E0425]: cannot find type `RawMultiPrecisionInteger` in this scope
  2178. 834.75 s > --> /nix/store/5dfb7akvi1k3080zqfndr6jw2ay3di2p-vendor-cargo-deps/f8c6b2c844a6fa8c330abb750e4cf5bbdb36a70140a58e87f6b79fb3024532aa/numerica-3.0.0/src/domains/backend/integer.rs:567:58
  2179. 834.75 s > |
  2180. 834.75 s > 52 | pub struct MultiPrecisionInteger(RawMultiPrecisionInteger);
  2181. 834.75 s > | ----------------------------------------------------------- similarly named struct `MultiPrecisionInteger` defined here
  2182. 834.75 s > ...
  2183. 834.75 s > 567 | fn rem_trunc(lhs: RawMultiPrecisionInteger, rhs: RawMultiPrecisionInteger) -> Self {
  2184. 834.75 s > | ^^^^^^^^^^^^^^^^^^^^^^^^
  2185. 834.75 s > |
  2186. 834.75 s > help: a struct with a similar name exists
  2187. 834.75 s > |
  2188. 834.75 s > 567 - fn rem_trunc(lhs: RawMultiPrecisionInteger, rhs: RawMultiPrecisionInteger) -> Self {
  2189. 834.75 s > 567 + fn rem_trunc(lhs: RawMultiPrecisionInteger, rhs: MultiPrecisionInteger) -> Self {
  2190. 834.75 s > |
  2191. 834.75 s >
  2192. 834.75 s > error[E0425]: cannot find type `RawMultiPrecisionInteger` in this scope
  2193. 834.75 s > --> /nix/store/5dfb7akvi1k3080zqfndr6jw2ay3di2p-vendor-cargo-deps/f8c6b2c844a6fa8c330abb750e4cf5bbdb36a70140a58e87f6b79fb3024532aa/numerica-3.0.0/src/domains/backend/integer.rs:582:27
  2194. 834.75 s > |
  2195. 834.75 s > 52 | pub struct MultiPrecisionInteger(RawMultiPrecisionInteger);
  2196. 834.75 s > | ----------------------------------------------------------- similarly named struct `MultiPrecisionInteger` defined here
  2197. 834.75 s > ...
  2198. 834.75 s > 582 | fn shl_raw(value: RawMultiPrecisionInteger, rhs: u64) -> RawMultiPrecisionInteger {
  2199. 834.75 s > | ^^^^^^^^^^^^^^^^^^^^^^^^
  2200. 834.75 s > |
  2201. 834.75 s > help: a struct with a similar name exists
  2202. 834.75 s > |
  2203. 834.75 s > 582 - fn shl_raw(value: RawMultiPrecisionInteger, rhs: u64) -> RawMultiPrecisionInteger {
  2204. 834.75 s > 582 + fn shl_raw(value: MultiPrecisionInteger, rhs: u64) -> RawMultiPrecisionInteger {
  2205. 834.75 s > |
  2206. 834.75 s >
  2207. 834.75 s > error[E0425]: cannot find type `RawMultiPrecisionInteger` in this scope
  2208. 834.75 s > --> /nix/store/5dfb7akvi1k3080zqfndr6jw2ay3di2p-vendor-cargo-deps/f8c6b2c844a6fa8c330abb750e4cf5bbdb36a70140a58e87f6b79fb3024532aa/numerica-3.0.0/src/domains/backend/integer.rs:582:66
  2209. 834.75 s > |
  2210. 834.75 s > 52 | pub struct MultiPrecisionInteger(RawMultiPrecisionInteger);
  2211. 834.75 s > | ----------------------------------------------------------- similarly named struct `MultiPrecisionInteger` defined here
  2212. 834.75 s > ...
  2213. 834.75 s > 582 | fn shl_raw(value: RawMultiPrecisionInteger, rhs: u64) -> RawMultiPrecisionInteger {
  2214. 834.75 s > | ^^^^^^^^^^^^^^^^^^^^^^^^
  2215. 834.75 s > |
  2216. 834.75 s > help: a struct with a similar name exists
  2217. 834.75 s > |
  2218. 834.75 s > 582 - fn shl_raw(value: RawMultiPrecisionInteger, rhs: u64) -> RawMultiPrecisionInteger {
  2219. 834.75 s > 582 + fn shl_raw(value: RawMultiPrecisionInteger, rhs: u64) -> MultiPrecisionInteger {
  2220. 834.75 s > |
  2221. 834.75 s >
  2222. 834.75 s > error[E0425]: cannot find type `RawMultiPrecisionInteger` in this scope
  2223. 834.75 s > --> /nix/store/5dfb7akvi1k3080zqfndr6jw2ay3di2p-vendor-cargo-deps/f8c6b2c844a6fa8c330abb750e4cf5bbdb36a70140a58e87f6b79fb3024532aa/numerica-3.0.0/src/domains/backend/integer.rs:590:27
  2224. 834.75 s > |
  2225. 834.75 s > 52 | pub struct MultiPrecisionInteger(RawMultiPrecisionInteger);
  2226. 834.75 s > | ----------------------------------------------------------- similarly named struct `MultiPrecisionInteger` defined here
  2227. 834.75 s > ...
  2228. 834.75 s > 590 | fn shr_raw(value: RawMultiPrecisionInteger, rhs: u64) -> RawMultiPrecisionInteger {
  2229. 834.75 s > | ^^^^^^^^^^^^^^^^^^^^^^^^
  2230. 834.75 s > |
  2231. 834.75 s > help: a struct with a similar name exists
  2232. 834.75 s > |
  2233. 834.75 s > 590 - fn shr_raw(value: RawMultiPrecisionInteger, rhs: u64) -> RawMultiPrecisionInteger {
  2234. 834.75 s > 590 + fn shr_raw(value: MultiPrecisionInteger, rhs: u64) -> RawMultiPrecisionInteger {
  2235. 834.75 s > |
  2236. 834.75 s >
  2237. 834.75 s > error[E0425]: cannot find type `RawMultiPrecisionInteger` in this scope
  2238. 834.75 s > --> /nix/store/5dfb7akvi1k3080zqfndr6jw2ay3di2p-vendor-cargo-deps/f8c6b2c844a6fa8c330abb750e4cf5bbdb36a70140a58e87f6b79fb3024532aa/numerica-3.0.0/src/domains/backend/integer.rs:590:66
  2239. 834.75 s > |
  2240. 834.75 s > 52 | pub struct MultiPrecisionInteger(RawMultiPrecisionInteger);
  2241. 834.75 s > | ----------------------------------------------------------- similarly named struct `MultiPrecisionInteger` defined here
  2242. 834.75 s > ...
  2243. 834.75 s > 590 | fn shr_raw(value: RawMultiPrecisionInteger, rhs: u64) -> RawMultiPrecisionInteger {
  2244. 834.75 s > | ^^^^^^^^^^^^^^^^^^^^^^^^
  2245. 834.75 s > |
  2246. 834.75 s > help: a struct with a similar name exists
  2247. 834.75 s > |
  2248. 834.75 s > 590 - fn shr_raw(value: RawMultiPrecisionInteger, rhs: u64) -> RawMultiPrecisionInteger {
  2249. 834.75 s > 590 + fn shr_raw(value: RawMultiPrecisionInteger, rhs: u64) -> MultiPrecisionInteger {
  2250. 834.75 s > |
  2251. 834.75 s >
  2252. 834.75 s > error[E0425]: cannot find type `RawMultiPrecisionInteger` in this scope
  2253. 834.75 s > --> /nix/store/5dfb7akvi1k3080zqfndr6jw2ay3di2p-vendor-cargo-deps/f8c6b2c844a6fa8c330abb750e4cf5bbdb36a70140a58e87f6b79fb3024532aa/numerica-3.0.0/src/domains/backend/integer.rs:654:15
  2254. 834.75 s > |
  2255. 834.75 s > 52 | pub struct MultiPrecisionInteger(RawMultiPrecisionInteger);
  2256. 834.75 s > | ----------------------------------------------------------- similarly named struct `MultiPrecisionInteger` defined here
  2257. 834.75 s > ...
  2258. 834.75 s > 654 | impl From<RawMultiPrecisionInteger> for MultiPrecisionInteger {
  2259. 834.75 s > | ^^^^^^^^^^^^^^^^^^^^^^^^
  2260. 834.75 s > |
  2261. 834.75 s > help: a struct with a similar name exists
  2262. 834.75 s > |
  2263. 834.75 s > 654 - impl From<RawMultiPrecisionInteger> for MultiPrecisionInteger {
  2264. 834.75 s > 654 + impl From<MultiPrecisionInteger> for MultiPrecisionInteger {
  2265. 834.75 s > |
  2266. 834.75 s > help: you might be missing a type parameter
  2267. 834.75 s > |
  2268. 834.75 s > 654 | impl<RawMultiPrecisionInteger> From<RawMultiPrecisionInteger> for MultiPrecisionInteger {
  2269. 834.75 s > | ++++++++++++++++++++++++++
  2270. 834.75 s >
  2271. 834.75 s > error[E0425]: cannot find type `RawMultiPrecisionInteger` in this scope
  2272. 834.75 s > --> /nix/store/5dfb7akvi1k3080zqfndr6jw2ay3di2p-vendor-cargo-deps/f8c6b2c844a6fa8c330abb750e4cf5bbdb36a70140a58e87f6b79fb3024532aa/numerica-3.0.0/src/domains/backend/integer.rs:656:24
  2273. 834.75 s > |
  2274. 834.75 s > 52 | pub struct MultiPrecisionInteger(RawMultiPrecisionInteger);
  2275. 834.75 s > | ----------------------------------------------------------- similarly named struct `MultiPrecisionInteger` defined here
  2276. 834.75 s > ...
  2277. 834.75 s > 656 | fn from(value: RawMultiPrecisionInteger) -> Self {
  2278. 834.75 s > | ^^^^^^^^^^^^^^^^^^^^^^^^
  2279. 834.75 s > |
  2280. 834.75 s > help: a struct with a similar name exists
  2281. 834.75 s > |
  2282. 834.75 s > 656 - fn from(value: RawMultiPrecisionInteger) -> Self {
  2283. 834.75 s > 656 + fn from(value: MultiPrecisionInteger) -> Self {
  2284. 834.75 s > |
  2285. 834.75 s >
  2286. 834.75 s > error[E0425]: cannot find type `RawMultiPrecisionInteger` in this scope
  2287. 834.75 s > --> /nix/store/5dfb7akvi1k3080zqfndr6jw2ay3di2p-vendor-cargo-deps/f8c6b2c844a6fa8c330abb750e4cf5bbdb36a70140a58e87f6b79fb3024532aa/numerica-3.0.0/src/domains/backend/integer.rs:661:42
  2288. 834.75 s > |
  2289. 834.75 s > 52 | pub struct MultiPrecisionInteger(RawMultiPrecisionInteger);
  2290. 834.75 s > | ----------------------------------------------------------- similarly named struct `MultiPrecisionInteger` defined here
  2291. 834.75 s > ...
  2292. 834.75 s > 661 | impl From<MultiPrecisionInteger> for RawMultiPrecisionInteger {
  2293. 834.75 s > | ^^^^^^^^^^^^^^^^^^^^^^^^
  2294. 834.75 s > |
  2295. 834.75 s > help: a struct with a similar name exists
  2296. 834.75 s > |
  2297. 834.75 s > 661 - impl From<MultiPrecisionInteger> for RawMultiPrecisionInteger {
  2298. 834.75 s > 661 + impl From<MultiPrecisionInteger> for MultiPrecisionInteger {
  2299. 834.75 s > |
  2300. 834.75 s >
  2301. 834.75 s > error[E0433]: cannot find type `RawMultiPrecisionInteger` in this scope
  2302. 834.75 s > --> /nix/store/5dfb7akvi1k3080zqfndr6jw2ay3di2p-vendor-cargo-deps/f8c6b2c844a6fa8c330abb750e4cf5bbdb36a70140a58e87f6b79fb3024532aa/numerica-3.0.0/src/domains/backend/integer.rs:620:13
  2303. 834.75 s > |
  2304. 834.75 s > 620 | RawMultiPrecisionInteger::from_str(s)
  2305. 834.75 s > | ^^^^^^^^^^^^^^^^^^^^^^^^ use of undeclared type `RawMultiPrecisionInteger`
  2306. 834.75 s > |
  2307. 834.75 s > help: a struct with a similar name exists
  2308. 834.75 s > |
  2309. 834.75 s > 620 - RawMultiPrecisionInteger::from_str(s)
  2310. 834.75 s > 620 + MultiPrecisionInteger::from_str(s)
  2311. 834.75 s > |
  2312. 834.75 s >
  2313. 834.75 s > error[E0433]: cannot find type `RawMultiPrecisionInteger` in this scope
  2314. 834.75 s > --> /nix/store/5dfb7akvi1k3080zqfndr6jw2ay3di2p-vendor-cargo-deps/f8c6b2c844a6fa8c330abb750e4cf5bbdb36a70140a58e87f6b79fb3024532aa/numerica-3.0.0/src/domains/backend/integer.rs:674:35
  2315. 834.75 s > |
  2316. 834.75 s > 674 | self.0 == RawMultiPrecisionInteger::from(*other)
  2317. 834.75 s > | ^^^^^^^^^^^^^^^^^^^^^^^^ use of undeclared type `RawMultiPrecisionInteger`
  2318. 834.75 s > ...
  2319. 834.75 s > 702 | impl_cmp_primitive!(i32, i64, i128, u32, u64, u128);
  2320. 834.75 s > | --------------------------------------------------- in this macro invocation
  2321. 834.75 s > |
  2322. 834.75 s > = note: this error originates in the macro `impl_cmp_primitive` (in Nightly builds, run with -Z macro-backtrace for more info)
  2323. 834.75 s > help: a struct with a similar name exists
  2324. 834.75 s > |
  2325. 834.75 s > 674 - self.0 == RawMultiPrecisionInteger::from(*other)
  2326. 834.75 s > 674 + self.0 == MultiPrecisionInteger::from(*other)
  2327. 834.75 s > |
  2328. 834.75 s >
  2329. 834.75 s > error[E0433]: cannot find type `RawMultiPrecisionInteger` in this scope
  2330. 834.75 s > --> /nix/store/5dfb7akvi1k3080zqfndr6jw2ay3di2p-vendor-cargo-deps/f8c6b2c844a6fa8c330abb750e4cf5bbdb36a70140a58e87f6b79fb3024532aa/numerica-3.0.0/src/domains/backend/integer.rs:681:25
  2331. 834.75 s > |
  2332. 834.75 s > 681 | RawMultiPrecisionInteger::from(*self) == other.0
  2333. 834.75 s > | ^^^^^^^^^^^^^^^^^^^^^^^^ use of undeclared type `RawMultiPrecisionInteger`
  2334. 834.75 s > ...
  2335. 834.75 s > 702 | impl_cmp_primitive!(i32, i64, i128, u32, u64, u128);
  2336. 834.75 s > | --------------------------------------------------- in this macro invocation
  2337. 834.75 s > |
  2338. 834.75 s > = note: this error originates in the macro `impl_cmp_primitive` (in Nightly builds, run with -Z macro-backtrace for more info)
  2339. 834.75 s > help: a struct with a similar name exists
  2340. 834.75 s > |
  2341. 834.75 s > 681 - RawMultiPrecisionInteger::from(*self) == other.0
  2342. 834.75 s > 681 + MultiPrecisionInteger::from(*self) == other.0
  2343. 834.75 s > |
  2344. 834.75 s >
  2345. 834.75 s > error[E0433]: cannot find type `RawMultiPrecisionInteger` in this scope
  2346. 834.75 s > --> /nix/store/5dfb7akvi1k3080zqfndr6jw2ay3di2p-vendor-cargo-deps/f8c6b2c844a6fa8c330abb750e4cf5bbdb36a70140a58e87f6b79fb3024532aa/numerica-3.0.0/src/domains/backend/integer.rs:688:45
  2347. 834.75 s > |
  2348. 834.75 s > 688 | self.0.partial_cmp(&RawMultiPrecisionInteger::from(*other))
  2349. 834.75 s > | ^^^^^^^^^^^^^^^^^^^^^^^^ use of undeclared type `RawMultiPrecisionInteger`
  2350. 834.75 s > ...
  2351. 834.75 s > 702 | impl_cmp_primitive!(i32, i64, i128, u32, u64, u128);
  2352. 834.75 s > | --------------------------------------------------- in this macro invocation
  2353. 834.75 s > |
  2354. 834.75 s > = note: this error originates in the macro `impl_cmp_primitive` (in Nightly builds, run with -Z macro-backtrace for more info)
  2355. 834.75 s > help: a struct with a similar name exists
  2356. 834.75 s > |
  2357. 834.75 s > 688 - self.0.partial_cmp(&RawMultiPrecisionInteger::from(*other))
  2358. 834.75 s > 688 + self.0.partial_cmp(&MultiPrecisionInteger::from(*other))
  2359. 834.75 s > |
  2360. 834.75 s >
  2361. 834.75 s > error[E0433]: cannot find type `RawMultiPrecisionInteger` in this scope
  2362. 834.75 s > --> /nix/store/5dfb7akvi1k3080zqfndr6jw2ay3di2p-vendor-cargo-deps/f8c6b2c844a6fa8c330abb750e4cf5bbdb36a70140a58e87f6b79fb3024532aa/numerica-3.0.0/src/domains/backend/integer.rs:695:25
  2363. 834.75 s > |
  2364. 834.75 s > 695 | RawMultiPrecisionInteger::from(*self).partial_cmp(&other.0)
  2365. 834.75 s > | ^^^^^^^^^^^^^^^^^^^^^^^^ use of undeclared type `RawMultiPrecisionInteger`
  2366. 834.75 s > ...
  2367. 834.75 s > 702 | impl_cmp_primitive!(i32, i64, i128, u32, u64, u128);
  2368. 834.75 s > | --------------------------------------------------- in this macro invocation
  2369. 834.75 s > |
  2370. 834.75 s > = note: this error originates in the macro `impl_cmp_primitive` (in Nightly builds, run with -Z macro-backtrace for more info)
  2371. 834.75 s > help: a struct with a similar name exists
  2372. 834.75 s > |
  2373. 834.75 s > 695 - RawMultiPrecisionInteger::from(*self).partial_cmp(&other.0)
  2374. 834.75 s > 695 + MultiPrecisionInteger::from(*self).partial_cmp(&other.0)
  2375. 834.75 s > |
  2376. 834.75 s >
  2377. 834.75 s > error[E0433]: cannot find type `RawMultiPrecisionInteger` in this scope
  2378. 834.75 s > --> /nix/store/5dfb7akvi1k3080zqfndr6jw2ay3di2p-vendor-cargo-deps/f8c6b2c844a6fa8c330abb750e4cf5bbdb36a70140a58e87f6b79fb3024532aa/numerica-3.0.0/src/domains/backend/integer.rs:1180:35
  2379. 834.75 s > |
  2380. 834.75 s > 1180 | MultiPrecisionInteger(RawMultiPrecisionInteger::from((&self.0) & &rhs.0))
  2381. 834.75 s > | ^^^^^^^^^^^^^^^^^^^^^^^^ use of undeclared type `RawMultiPrecisionInteger`
  2382. 834.75 s > |
  2383. 834.75 s > help: a struct with a similar name exists
  2384. 834.75 s > |
  2385. 834.75 s > 1180 - MultiPrecisionInteger(RawMultiPrecisionInteger::from((&self.0) & &rhs.0))
  2386. 834.75 s > 1180 + MultiPrecisionInteger(MultiPrecisionInteger::from((&self.0) & &rhs.0))
  2387. 834.75 s > |
  2388. 834.75 s >
  2389. 834.75 s > error[E0433]: cannot find type `RawMultiPrecisionInteger` in this scope
  2390. 834.75 s > --> /nix/store/5dfb7akvi1k3080zqfndr6jw2ay3di2p-vendor-cargo-deps/f8c6b2c844a6fa8c330abb750e4cf5bbdb36a70140a58e87f6b79fb3024532aa/numerica-3.0.0/src/domains/backend/integer.rs:1212:35
  2391. 834.75 s > |
  2392. 834.75 s > 1212 | MultiPrecisionInteger(RawMultiPrecisionInteger::from(-&self.0))
  2393. 834.75 s > | ^^^^^^^^^^^^^^^^^^^^^^^^ use of undeclared type `RawMultiPrecisionInteger`
  2394. 834.75 s > |
  2395. 834.75 s > help: a struct with a similar name exists
  2396. 834.75 s > |
  2397. 834.75 s > 1212 - MultiPrecisionInteger(RawMultiPrecisionInteger::from(-&self.0))
  2398. 834.75 s > 1212 + MultiPrecisionInteger(MultiPrecisionInteger::from(-&self.0))
  2399. 834.75 s > |
  2400. 834.75 s >
  2401. 834.75 s > error[E0425]: cannot find function `write_lsf_bytes` in this scope
  2402. 834.75 s > --> /nix/store/5dfb7akvi1k3080zqfndr6jw2ay3di2p-vendor-cargo-deps/f8c6b2c844a6fa8c330abb750e4cf5bbdb36a70140a58e87f6b79fb3024532aa/numerica-3.0.0/src/domains/backend/integer.rs:1682:5
  2403. 834.75 s > |
  2404. 834.75 s > 1682 | write_lsf_bytes(value, &mut bytes);
  2405. 834.75 s > | ^^^^^^^^^^^^^^^ not found in this scope
  2406. 834.75 s >
  2407. 834.75 s > Some errors have detailed explanations: E0425, E0432, E0433.
  2408. 834.75 s > For more information about an error, try `rustc --explain E0425`.
  2409. 834.75 s > error: could not compile `numerica` (lib) due to 29 previous errors
  2410. 834.75 s > warning: build failed, waiting for other jobs to finish...
  2411. 834.75 s For full logs, run:
  2412. 834.75 s nix log /nix/store/623idw7bxrdblwflbqi3k630cvnna0if-alphal00p-docs-cargo-0.1.0.drv
  2413. 834.79 s Build failed.