build packages.x86_64-linux.alphal00p-docs-cargo-artifacts
0.00 s
$ /nix/store/9ypz3flqsrl5xl495mm8h645gadjsxi1-coreutils-9.11/bin/timeout --kill-after=15s 7200s /nix/store/23zk8sgzamrbmj1fday15szf7f2279s8-nix-2.34.7/bin/nix --extra-experimental-features nix-command --extra-experimental-features flakes --log-format internal-json build --no-link --print-out-paths git+https://github.com/alphal00p/gammaloop?ref=simplify-spenso-api&rev=ab00e4917295883add11f9855734aaee1d56926f&shallow=1#packages.x86_64-linux.alphal00p-docs-cargo-artifacts --print-build-logs
1.96 s
3.14 s
Building /nix/store/623idw7bxrdblwflbqi3k630cvnna0if-alphal00p-docs-cargo-0.1.0.drv
3.20 s
[alphal00p-docs-cargo] cargoArtifacts not set, will not reuse any cargo artifacts
3.25 s
[alphal00p-docs-cargo] Phase: unpackPhase
3.27 s
[alphal00p-docs-cargo] unpacking source archive /nix/store/zw5i19nvfc6y8mffi47icfczb0q4x6ip-source
4.93 s
[alphal00p-docs-cargo] source root is source
4.97 s
[alphal00p-docs-cargo] Phase: patchPhase
4.98 s
[alphal00p-docs-cargo] Executing configureCargoCommonVars
4.99 s
[alphal00p-docs-cargo] Phase: updateAutotoolsGnuConfigScriptsPhase
5.01 s
[alphal00p-docs-cargo] Phase: configurePhase
5.01 s
[alphal00p-docs-cargo] will append /build/source/.cargo-home/config.toml with contents of /nix/store/5dfb7akvi1k3080zqfndr6jw2ay3di2p-vendor-cargo-deps/config.toml
5.02 s
[alphal00p-docs-cargo] default configurePhase, nothing to do
5.02 s
[alphal00p-docs-cargo] Phase: buildPhase
5.03 s
[alphal00p-docs-cargo] +++ command cargo --version
5.04 s
[alphal00p-docs-cargo] cargo 1.98.1 (797e8a9bc 2026-08-05)
5.04 s
[alphal00p-docs-cargo] +++ command cargo build --profile docs --locked -p alphal00p-docs-catalogs --bin alphal00p-docs-catalogs
5.42 s
[alphal00p-docs-cargo] Compiling proc-macro2 v1.0.106
5.42 s
[alphal00p-docs-cargo] Compiling quote v1.0.45
5.42 s
[alphal00p-docs-cargo] Compiling unicode-ident v1.0.24
5.42 s
[alphal00p-docs-cargo] Compiling serde_core v1.0.228
5.42 s
[alphal00p-docs-cargo] Compiling memchr v2.8.0
5.42 s
[alphal00p-docs-cargo] Compiling zmij v1.0.21
5.42 s
[alphal00p-docs-cargo] Compiling utf8parse v0.2.2
5.43 s
[alphal00p-docs-cargo] Compiling serde_json v1.0.149
5.43 s
[alphal00p-docs-cargo] Compiling serde v1.0.228
5.43 s
[alphal00p-docs-cargo] Compiling thiserror v2.0.18
5.43 s
[alphal00p-docs-cargo] Compiling anstyle-query v1.1.5
5.43 s
[alphal00p-docs-cargo] Compiling anstyle v1.0.14
5.43 s
[alphal00p-docs-cargo] Compiling colorchoice v1.0.5
5.43 s
[alphal00p-docs-cargo] Compiling is_terminal_polyfill v1.70.2
5.43 s
[alphal00p-docs-cargo] Compiling hashbrown v0.17.1
5.43 s
[alphal00p-docs-cargo] Compiling heck v0.5.0
5.54 s
[alphal00p-docs-cargo] Compiling anstyle-parse v1.0.0
5.54 s
[alphal00p-docs-cargo] Compiling itoa v1.0.18
5.56 s
[alphal00p-docs-cargo] Compiling clap_lex v1.1.0
5.57 s
[alphal00p-docs-cargo] Compiling strsim v0.11.1
5.66 s
[alphal00p-docs-cargo] Compiling eyre v0.6.12
5.70 s
[alphal00p-docs-cargo] Compiling regex-syntax v0.8.10
5.74 s
[alphal00p-docs-cargo] Compiling equivalent v1.0.2
5.75 s
[alphal00p-docs-cargo] Compiling indenter v0.3.4
5.76 s
[alphal00p-docs-cargo] Compiling once_cell v1.21.4
5.80 s
[alphal00p-docs-cargo] Compiling anstream v1.0.0
5.96 s
[alphal00p-docs-cargo] Compiling aho-corasick v1.1.4
6.01 s
[alphal00p-docs-cargo] Compiling clap_builder v4.6.0
6.47 s
[alphal00p-docs-cargo] Compiling syn v2.0.117
7.27 s
[alphal00p-docs-cargo] Compiling regex-automata v0.4.14
7.69 s
[alphal00p-docs-cargo] Compiling indexmap v2.14.0
8.39 s
[alphal00p-docs-cargo] Compiling thiserror-impl v2.0.18
8.39 s
[alphal00p-docs-cargo] Compiling serde_derive v1.0.228
8.39 s
[alphal00p-docs-cargo] Compiling clap_derive v4.6.1
8.39 s
[alphal00p-docs-cargo] Compiling alphal00p-docs-macros v0.1.0 (/build/source/crates/alphal00p-docs-macros)
9.04 s
[alphal00p-docs-cargo] Compiling regex v1.12.3
9.92 s
[alphal00p-docs-cargo] Compiling clap v4.6.1
10.81 s
[alphal00p-docs-cargo] Compiling alphal00p-docs-schema v0.1.0 (/build/source/crates/alphal00p-docs-schema)
11.42 s
[alphal00p-docs-cargo] Compiling alphal00p-docs-catalogs v0.1.0 (/build/source/crates/alphal00p-docs-catalogs)
16.76 s
[alphal00p-docs-cargo] Finished `docs` profile [unoptimized] target(s) in 11.72s
16.84 s
[alphal00p-docs-cargo] +++ command cargo build --profile docs --locked -p alphal00p-docs-python-exporter --features gammaloop
17.30 s
[alphal00p-docs-cargo] Compiling serde_core v1.0.228
17.30 s
[alphal00p-docs-cargo] Compiling libc v0.2.186
17.30 s
[alphal00p-docs-cargo] Compiling cfg-if v1.0.4
17.30 s
[alphal00p-docs-cargo] Compiling serde v1.0.228
17.30 s
[alphal00p-docs-cargo] Compiling memchr v2.8.0
17.30 s
[alphal00p-docs-cargo] Compiling autocfg v1.5.0
17.30 s
[alphal00p-docs-cargo] Compiling libm v0.2.16
17.30 s
[alphal00p-docs-cargo] Compiling version_check v0.9.5
17.30 s
[alphal00p-docs-cargo] Compiling either v1.15.0
17.30 s
[alphal00p-docs-cargo] Compiling zerocopy v0.8.48
17.30 s
[alphal00p-docs-cargo] Compiling crossbeam-utils v0.8.21
17.30 s
[alphal00p-docs-cargo] Compiling log v0.4.29
17.30 s
[alphal00p-docs-cargo] Compiling unicode-width v0.2.2
17.30 s
[alphal00p-docs-cargo] Compiling rayon-core v1.13.0
17.30 s
[alphal00p-docs-cargo] Compiling foldhash v0.2.0
17.30 s
[alphal00p-docs-cargo] Compiling syn v2.0.117
17.40 s
[alphal00p-docs-cargo] Compiling syn v3.0.4
17.54 s
[alphal00p-docs-cargo] Compiling target-lexicon v0.13.5
17.56 s
[alphal00p-docs-cargo] Compiling serde_json v1.0.149
17.57 s
[alphal00p-docs-cargo] Compiling lazy_static v1.5.0
17.57 s
[alphal00p-docs-cargo] Compiling siphasher v1.0.2
17.63 s
[alphal00p-docs-cargo] Compiling crunchy v0.2.4
17.71 s
[alphal00p-docs-cargo] Compiling getrandom v0.3.4
17.74 s
[alphal00p-docs-cargo] Compiling num-traits v0.2.19
17.75 s
[alphal00p-docs-cargo] Compiling paste v1.0.15
17.77 s
[alphal00p-docs-cargo] Compiling anyhow v1.0.102
17.91 s
[alphal00p-docs-cargo] Compiling tiny-keccak v2.0.2
17.93 s
[alphal00p-docs-cargo] Compiling itertools v0.14.0
17.95 s
[alphal00p-docs-cargo] Compiling static_assertions v1.1.0
18.03 s
[alphal00p-docs-cargo] Compiling aho-corasick v1.1.4
18.16 s
[alphal00p-docs-cargo] Compiling time-core v0.1.8
18.22 s
[alphal00p-docs-cargo] Compiling num-conv v0.2.1
18.27 s
[alphal00p-docs-cargo] Compiling powerfmt v0.2.0
18.27 s
[alphal00p-docs-cargo] Compiling rustix v1.1.4
18.35 s
[alphal00p-docs-cargo] Compiling time-macros v0.2.27
18.37 s
[alphal00p-docs-cargo] Compiling num_threads v0.1.7
18.46 s
[alphal00p-docs-cargo] Compiling deranged v0.5.8
18.47 s
[alphal00p-docs-cargo] Compiling linux-raw-sys v0.12.1
18.71 s
[alphal00p-docs-cargo] Compiling allocator-api2 v0.2.21
18.77 s
[alphal00p-docs-cargo] Compiling crossbeam-epoch v0.9.18
18.85 s
[alphal00p-docs-cargo] Compiling tracing-core v0.1.36
18.90 s
[alphal00p-docs-cargo] Compiling arrayvec v0.7.6
19.05 s
[alphal00p-docs-cargo] Compiling crossbeam-deque v0.8.6
19.08 s
[alphal00p-docs-cargo] Compiling hashbrown v0.16.1
19.09 s
[alphal00p-docs-cargo] Compiling virtue v0.0.18
19.12 s
[alphal00p-docs-cargo] Compiling pyo3-build-config v0.28.3
19.14 s
[alphal00p-docs-cargo] Compiling winnow v1.0.2
19.15 s
[alphal00p-docs-cargo] Compiling phf_shared v0.11.3
19.28 s
[alphal00p-docs-cargo] Compiling gmp-mpfr-sys v1.7.1
19.31 s
[alphal00p-docs-cargo] Compiling toml_writer v1.1.1+spec-1.1.0
19.48 s
[alphal00p-docs-cargo] Compiling unty v0.0.4
19.56 s
[alphal00p-docs-cargo] Compiling pin-project-lite v0.2.17
19.58 s
[alphal00p-docs-cargo] Compiling nu-ansi-term v0.50.3
19.63 s
[alphal00p-docs-cargo] Compiling tracing-log v0.2.0
19.77 s
[alphal00p-docs-cargo] Compiling regex-automata v0.4.14
19.81 s
[alphal00p-docs-cargo] Compiling matrixmultiply v0.3.10
19.94 s
[alphal00p-docs-cargo] Compiling sharded-slab v0.1.7
20.19 s
[alphal00p-docs-cargo] Compiling getrandom v0.2.17
20.25 s
[alphal00p-docs-cargo] Compiling rayon v1.12.0
20.39 s
[alphal00p-docs-cargo] Compiling rand_core v0.6.4
20.40 s
[alphal00p-docs-cargo] Compiling time v0.3.47
20.43 s
[alphal00p-docs-cargo] Compiling bincode_derive v2.0.1
20.49 s
[alphal00p-docs-cargo] Compiling rand_core v0.9.5
20.52 s
[alphal00p-docs-cargo] Compiling hashbrown v0.17.1
20.61 s
[alphal00p-docs-cargo] Compiling thread_local v1.1.9
20.66 s
[alphal00p-docs-cargo] Compiling syn v1.0.109
20.69 s
[alphal00p-docs-cargo] Compiling typenum v1.20.0
20.74 s
[alphal00p-docs-cargo] Compiling rug v1.30.0
21.05 s
[alphal00p-docs-cargo] Compiling option-ext v0.2.0
21.08 s
[alphal00p-docs-cargo] Compiling toml_parser v1.1.2+spec-1.1.0
21.13 s
[alphal00p-docs-cargo] Compiling dirs-sys v0.5.0
21.15 s
[alphal00p-docs-cargo] Compiling alloc-no-stdlib v2.0.4
21.21 s
[alphal00p-docs-cargo] Compiling az v1.3.0
21.27 s
[alphal00p-docs-cargo] Compiling dyn-clone v1.0.20
21.30 s
[alphal00p-docs-cargo] Compiling fnv v1.0.7
21.38 s
[alphal00p-docs-cargo] Compiling num-integer v0.1.46
21.39 s
[alphal00p-docs-cargo] Compiling approx v0.5.1
21.43 s
[alphal00p-docs-cargo] Compiling num-complex v0.4.6
21.45 s
[alphal00p-docs-cargo] Compiling rawpointer v0.2.1
21.51 s
[alphal00p-docs-cargo] Compiling alloc-stdlib v0.2.2
21.60 s
[alphal00p-docs-cargo] Compiling generic-array v0.14.7
21.64 s
[alphal00p-docs-cargo] Compiling colored v3.1.1
21.77 s
[alphal00p-docs-cargo] Compiling pyo3-ffi v0.28.3
21.82 s
[alphal00p-docs-cargo] Compiling pyo3-macros-backend v0.28.3
21.97 s
[alphal00p-docs-cargo] Compiling num-bigint v0.4.6
21.99 s
[alphal00p-docs-cargo] Compiling bitflags v1.3.2
22.07 s
[alphal00p-docs-cargo] Compiling errno v0.3.14
22.09 s
[alphal00p-docs-cargo] Compiling getopts v0.2.24
22.12 s
[alphal00p-docs-cargo] Compiling ident_case v1.0.1
22.21 s
[alphal00p-docs-cargo] Compiling signal-hook v0.3.18
22.24 s
[alphal00p-docs-cargo] Compiling parking_lot_core v0.9.12
22.27 s
[alphal00p-docs-cargo] Compiling same-file v1.0.6
22.40 s
[alphal00p-docs-cargo] Compiling walkdir v2.5.0
22.42 s
[alphal00p-docs-cargo] Compiling signal-hook-registry v1.4.8
22.58 s
[alphal00p-docs-cargo] Compiling region v3.0.2
22.60 s
[alphal00p-docs-cargo] Compiling const-random-macro v0.1.16
22.68 s
[alphal00p-docs-cargo] Compiling hugepage-rs v0.1.1
22.71 s
[alphal00p-docs-cargo] Compiling wasmtime-jit-icache-coherence v34.0.2
22.78 s
[alphal00p-docs-cargo] Compiling vte v0.14.1
22.79 s
[alphal00p-docs-cargo] Compiling smartstring v1.0.1
22.84 s
[alphal00p-docs-cargo] Compiling ahash v0.8.12
22.88 s
[alphal00p-docs-cargo] Compiling spec_math v0.1.6
23.01 s
[alphal00p-docs-cargo] Compiling unic-char-range v0.9.0
23.06 s
[alphal00p-docs-cargo] Compiling bytemuck_derive v1.12.0
23.08 s
[alphal00p-docs-cargo] Compiling inventory v0.3.24
23.08 s
[alphal00p-docs-cargo] Compiling scopeguard v1.2.0
23.12 s
[alphal00p-docs-cargo] Compiling unic-common v0.9.0
23.14 s
[alphal00p-docs-cargo] Compiling lock_api v0.4.14
23.17 s
[alphal00p-docs-cargo] Compiling matchers v0.2.0
23.24 s
[alphal00p-docs-cargo] Compiling regex v1.12.3
23.27 s
[alphal00p-docs-cargo] Compiling unic-ucd-version v0.9.0
23.34 s
[alphal00p-docs-cargo] Compiling bitflags v2.11.1
23.35 s
[alphal00p-docs-cargo] Compiling serde_spanned v1.1.1
23.37 s
[alphal00p-docs-cargo] Compiling toml_datetime v1.1.1+spec-1.1.0
23.49 s
[alphal00p-docs-cargo] Compiling unic-char-property v0.9.0
23.49 s
[alphal00p-docs-cargo] Compiling const-random v0.1.18
23.66 s
[alphal00p-docs-cargo] Compiling brotli-decompressor v5.0.0
23.77 s
[alphal00p-docs-cargo] Compiling toml v1.1.2+spec-1.1.0
23.86 s
[alphal00p-docs-cargo] Compiling mio v1.2.0
23.88 s
[alphal00p-docs-cargo] Compiling rustpython-parser-vendored v0.4.0
24.00 s
[alphal00p-docs-cargo] Compiling itertools v0.11.0
24.14 s
[alphal00p-docs-cargo] Compiling minimal-lexical v0.2.1
24.14 s
[alphal00p-docs-cargo] Compiling rustix v0.38.44
24.26 s
[alphal00p-docs-cargo] Compiling fastrand v2.4.1
24.33 s
[alphal00p-docs-cargo] Compiling unicase v2.9.0
24.53 s
[alphal00p-docs-cargo] Compiling winnow v0.7.15
24.56 s
[alphal00p-docs-cargo] Compiling indenter v0.3.4
24.59 s
[alphal00p-docs-cargo] Compiling iana-time-zone v0.1.65
24.60 s
[alphal00p-docs-cargo] Compiling nom v7.1.3
24.68 s
[alphal00p-docs-cargo] Compiling signal-hook-mio v0.2.5
24.76 s
[alphal00p-docs-cargo] Compiling synstructure v0.13.2
25.02 s
[alphal00p-docs-cargo] Compiling indexmap v2.14.0
25.08 s
[alphal00p-docs-cargo] Compiling block-buffer v0.10.4
25.18 s
[alphal00p-docs-cargo] Compiling brotli v8.0.2
25.35 s
[alphal00p-docs-cargo] Compiling crypto-common v0.1.7
25.40 s
[alphal00p-docs-cargo] Compiling numpy v0.28.0
25.42 s
[alphal00p-docs-cargo] Compiling bytemuck v1.25.0
25.44 s
[alphal00p-docs-cargo] Compiling directories v6.0.0
25.54 s
[alphal00p-docs-cargo] Compiling phf v0.11.3
25.56 s
[alphal00p-docs-cargo] Compiling libloading v0.9.0
25.65 s
[alphal00p-docs-cargo] Compiling safe_arch v0.7.4
25.69 s
[alphal00p-docs-cargo] Compiling safe_arch v1.2.0
25.75 s
[alphal00p-docs-cargo] Compiling append-only-vec v0.1.8
25.82 s
[alphal00p-docs-cargo] Compiling rustc-hash v2.1.2
25.85 s
[alphal00p-docs-cargo] Compiling unicode-segmentation v1.13.2
25.86 s
[alphal00p-docs-cargo] Compiling self_cell v1.2.2
25.89 s
[alphal00p-docs-cargo] Compiling tinyjson v2.5.1
25.92 s
[alphal00p-docs-cargo] Compiling data-encoding v2.11.1
25.96 s
[alphal00p-docs-cargo] Compiling ed25519-compact v2.4.2
26.14 s
[alphal00p-docs-cargo] Compiling wide v1.7.0
26.18 s
[alphal00p-docs-cargo] Compiling bytes v1.11.1
26.25 s
[alphal00p-docs-cargo] Compiling byteorder v1.5.0
26.37 s
[alphal00p-docs-cargo] Compiling linux-raw-sys v0.4.15
26.53 s
[alphal00p-docs-cargo] Compiling digest v0.10.7
26.54 s
[alphal00p-docs-cargo] Compiling wide v0.7.33
26.62 s
[alphal00p-docs-cargo] Compiling serde_derive v1.0.228
26.64 s
[alphal00p-docs-cargo] Compiling zerocopy-derive v0.8.48
26.66 s
[alphal00p-docs-cargo] Compiling tracing-attributes v0.1.31
26.69 s
[alphal00p-docs-cargo] Compiling thiserror-impl v2.0.18
26.78 s
[alphal00p-docs-cargo] Compiling is-macro v0.3.7
27.15 s
[alphal00p-docs-cargo] Compiling terminal_size v0.4.4
27.17 s
[alphal00p-docs-cargo] Compiling strum_macros v0.27.2
27.22 s
[alphal00p-docs-cargo] Compiling zerofrom-derive v0.1.7
27.27 s
[alphal00p-docs-cargo] Compiling clap_builder v4.6.0
27.29 s
[alphal00p-docs-cargo] Compiling clap_derive v4.6.1
27.84 s
[alphal00p-docs-cargo] Compiling ansitok v0.3.0
27.88 s
[alphal00p-docs-cargo] Compiling rustpython-parser-core v0.4.0
28.18 s
[alphal00p-docs-cargo] Compiling rustpython-ast v0.4.0
28.23 s
[alphal00p-docs-cargo] Compiling thiserror v2.0.18
28.30 s
[alphal00p-docs-cargo] Compiling yoke-derive v0.8.2
28.44 s
[alphal00p-docs-cargo] Compiling tracing v0.1.44
28.84 s
[alphal00p-docs-cargo] Compiling unic-ucd-ident v0.9.0
28.97 s
[alphal00p-docs-cargo] Compiling simba v0.9.1
28.98 s
[alphal00p-docs-cargo] Compiling unic-emoji-char v0.9.0
28.99 s
[alphal00p-docs-cargo] Compiling pyo3 v0.28.3
29.19 s
[alphal00p-docs-cargo] Compiling bstr v1.12.1
29.33 s
[alphal00p-docs-cargo] Compiling zerofrom v0.1.8
29.35 s
[alphal00p-docs-cargo] Compiling phf_shared v0.13.1
29.38 s
[alphal00p-docs-cargo] Compiling stable_deref_trait v1.2.1
29.44 s
[alphal00p-docs-cargo] Compiling getrandom v0.4.2
29.45 s
[alphal00p-docs-cargo] Compiling plotters-backend v0.3.7
29.56 s
[alphal00p-docs-cargo] Compiling rustc-hash v1.1.0
29.64 s
[alphal00p-docs-cargo] Compiling typeid v1.0.3
29.75 s
[alphal00p-docs-cargo] Compiling cpufeatures v0.2.17
29.81 s
[alphal00p-docs-cargo] Compiling ciborium-io v0.2.2
29.86 s
[alphal00p-docs-cargo] Compiling lalrpop-util v0.20.2
29.88 s
[alphal00p-docs-cargo] Compiling sha2 v0.10.9
30.04 s
[alphal00p-docs-cargo] Compiling plotters-svg v0.3.7
30.21 s
[alphal00p-docs-cargo] Compiling eyre v0.6.12
30.23 s
[alphal00p-docs-cargo] Compiling num-rational v0.4.2
30.26 s
[alphal00p-docs-cargo] Compiling toml_datetime v0.7.5+spec-1.1.0
30.41 s
[alphal00p-docs-cargo] Compiling globset v0.4.18
30.43 s
[alphal00p-docs-cargo] Compiling zerovec-derive v0.11.6
30.48 s
[alphal00p-docs-cargo] Compiling console v0.16.3
30.62 s
[alphal00p-docs-cargo] Compiling yoke v0.8.3
30.66 s
[alphal00p-docs-cargo] Compiling itertools v0.10.5
30.76 s
[alphal00p-docs-cargo] Compiling ucd-trie v0.1.7
30.85 s
[alphal00p-docs-cargo] Compiling clap v4.6.1
30.91 s
[alphal00p-docs-cargo] Compiling cast v0.3.0
30.91 s
[alphal00p-docs-cargo] Compiling rustversion v1.0.22
30.92 s
[alphal00p-docs-cargo] Compiling strum v0.27.2
30.94 s
[alphal00p-docs-cargo] Compiling adler2 v2.0.1
31.00 s
[alphal00p-docs-cargo] Compiling simd-adler32 v0.3.10
31.02 s
[alphal00p-docs-cargo] Compiling symbolica v2.2.0 (https://github.com/symbolica-dev/symbolica?rev=ba3737137c2a2ccd7bb39f0441837d38ec867e78#ba373713)
31.04 s
[alphal00p-docs-cargo] Compiling toml_write v0.1.2
31.07 s
[alphal00p-docs-cargo] Compiling pest v2.8.6
31.09 s
[alphal00p-docs-cargo] Compiling rust-embed-utils v8.11.0
31.20 s
[alphal00p-docs-cargo] Compiling miniz_oxide v0.8.9
31.21 s
[alphal00p-docs-cargo] Compiling toml v0.9.12+spec-1.1.0
31.42 s
[alphal00p-docs-cargo] Compiling plotters v0.3.7
31.42 s
[alphal00p-docs-cargo] Compiling ansi-str v0.9.0
31.45 s
[alphal00p-docs-cargo] Compiling displaydoc v0.2.7
31.52 s
[alphal00p-docs-cargo] Compiling ndarray v0.17.2
31.93 s
[alphal00p-docs-cargo] Compiling is-terminal v0.4.17
32.02 s
[alphal00p-docs-cargo] Compiling slotmap v1.1.1
32.04 s
[alphal00p-docs-cargo] Compiling anes v0.1.6
32.13 s
[alphal00p-docs-cargo] Compiling maplit v1.0.2
32.14 s
[alphal00p-docs-cargo] Compiling pyo3-macros v0.28.3
32.18 s
[alphal00p-docs-cargo] Compiling bytecount v0.6.9
32.24 s
[alphal00p-docs-cargo] Compiling oorandom v11.1.5
32.32 s
[alphal00p-docs-cargo] Compiling criterion-plot v0.5.0
32.34 s
[alphal00p-docs-cargo] Compiling papergrid v0.18.0
32.43 s
[alphal00p-docs-cargo] Compiling tempfile v3.27.0
32.63 s
[alphal00p-docs-cargo] Compiling testing_table v0.3.0
32.68 s
[alphal00p-docs-cargo] Compiling tabled_derive v0.12.0
32.74 s
[alphal00p-docs-cargo] Compiling toml_edit v0.25.11+spec-1.1.0
32.79 s
[alphal00p-docs-cargo] Compiling similar v2.7.0
32.86 s
[alphal00p-docs-cargo] Compiling proc-macro2-diagnostics v0.10.1
33.00 s
[alphal00p-docs-cargo] Compiling pest_meta v2.8.6
33.10 s
[alphal00p-docs-cargo] Compiling proc-macro-error-attr v1.0.4
33.12 s
[alphal00p-docs-cargo] Compiling uncased v0.9.10
33.27 s
[alphal00p-docs-cargo] Compiling smallvec v1.15.1
33.48 s
[alphal00p-docs-cargo] Compiling bincode v2.0.1
33.58 s
[alphal00p-docs-cargo] Compiling tracing-serde v0.2.0
33.74 s
[alphal00p-docs-cargo] Compiling tracing-subscriber v0.3.23
34.13 s
[alphal00p-docs-cargo] Compiling chrono v0.4.44
34.17 s
[alphal00p-docs-cargo] Compiling serde_spanned v0.6.9
34.27 s
[alphal00p-docs-cargo] Compiling parking_lot v0.12.5
34.29 s
[alphal00p-docs-cargo] Compiling toml_datetime v0.6.11
34.48 s
[alphal00p-docs-cargo] Compiling toml_edit v0.22.27
34.71 s
[alphal00p-docs-cargo] Compiling xprec v0.2.2
34.83 s
[alphal00p-docs-cargo] Compiling crossterm v0.28.1
34.89 s
[alphal00p-docs-cargo] Compiling zerovec v0.11.8
34.94 s
[alphal00p-docs-cargo] Compiling bincode-trait-derive v0.1.1
35.12 s
[alphal00p-docs-cargo] Compiling tinytemplate v1.2.1
35.16 s
[alphal00p-docs-cargo] Compiling ron v0.12.1
35.51 s
[alphal00p-docs-cargo] Compiling tabled v0.22.0
36.36 s
[alphal00p-docs-cargo] Compiling pest_generator v2.8.6
36.74 s
[alphal00p-docs-cargo] Compiling slab v0.4.12
36.87 s
[alphal00p-docs-cargo] Compiling tinystr v0.8.4
36.97 s
[alphal00p-docs-cargo] Compiling strsim v0.10.0
37.14 s
[alphal00p-docs-cargo] Compiling unic-langid-impl v0.9.6
37.19 s
[alphal00p-docs-cargo] Compiling insta v1.47.2
37.28 s
[alphal00p-docs-cargo] Compiling radium v0.7.0
37.45 s
[alphal00p-docs-cargo] Compiling darling_core v0.14.4
37.65 s
[alphal00p-docs-cargo] Compiling darling_core v0.23.0
37.66 s
[alphal00p-docs-cargo] Compiling figment v0.10.19
37.74 s
[alphal00p-docs-cargo] Compiling proc-macro-error v1.0.4
37.82 s
[alphal00p-docs-cargo] Compiling ryu v1.0.23
38.01 s
[alphal00p-docs-cargo] Compiling tap v1.0.1
38.14 s
[alphal00p-docs-cargo] Compiling pest_derive v2.8.6
38.15 s
[alphal00p-docs-cargo] Compiling wyz v0.5.1
38.25 s
[alphal00p-docs-cargo] Compiling ppv-lite86 v0.2.21
38.48 s
[alphal00p-docs-cargo] Compiling half v2.7.1
38.75 s
[alphal00p-docs-cargo] Compiling ciborium-ll v0.2.2
38.89 s
[alphal00p-docs-cargo] Compiling castaway v0.2.4
38.99 s
[alphal00p-docs-cargo] Compiling rand_chacha v0.3.1
39.06 s
[alphal00p-docs-cargo] Compiling rand_chacha v0.9.0
39.18 s
[alphal00p-docs-cargo] Compiling ciborium v0.2.2
39.40 s
[alphal00p-docs-cargo] Compiling rand v0.8.6
39.51 s
[alphal00p-docs-cargo] Compiling rand v0.9.4
39.80 s
[alphal00p-docs-cargo] Compiling toml v0.8.23
39.85 s
[alphal00p-docs-cargo] Compiling instability v0.3.12
40.11 s
[alphal00p-docs-cargo] Compiling criterion v0.5.1
40.18 s
[alphal00p-docs-cargo] Compiling find-msvc-tools v0.1.9
40.36 s
[alphal00p-docs-cargo] Compiling shlex v1.3.0
40.48 s
[alphal00p-docs-cargo] Compiling symjit v2.25.6
40.54 s
[alphal00p-docs-cargo] Compiling phf_generator v0.11.3
40.59 s
[alphal00p-docs-cargo] Compiling indoc v2.0.7
40.65 s
[alphal00p-docs-cargo] Compiling funty v2.0.0
40.68 s
[alphal00p-docs-cargo] Compiling phf_codegen v0.11.3
40.74 s
[alphal00p-docs-cargo] Compiling heck v0.4.1
40.79 s
[alphal00p-docs-cargo] Compiling unicode_names2_generator v1.3.0
40.93 s
[alphal00p-docs-cargo] Compiling rustpython-parser v0.4.0
41.06 s
[alphal00p-docs-cargo] Compiling cc v1.2.61
41.33 s
[alphal00p-docs-cargo] Compiling darling_macro v0.14.4
41.48 s
[alphal00p-docs-cargo] Compiling bitvec v1.0.1
41.49 s
[alphal00p-docs-cargo] Compiling compact_str v0.9.0
41.54 s
[alphal00p-docs-cargo] Compiling duplicate v2.0.1
41.56 s
[alphal00p-docs-cargo] Compiling dot-parser v0.5.1
42.36 s
[alphal00p-docs-cargo] Compiling unicode_names2 v1.3.0
42.50 s
[alphal00p-docs-cargo] Compiling darling v0.14.4
42.58 s
[alphal00p-docs-cargo] Compiling darling_macro v0.23.0
42.59 s
[alphal00p-docs-cargo] Compiling kasuari v0.4.12
42.68 s
[alphal00p-docs-cargo] Compiling serde_repr v0.1.20
43.07 s
[alphal00p-docs-cargo] Compiling unicode-truncate v2.0.1
43.11 s
[alphal00p-docs-cargo] Compiling convert_case v0.10.0
43.30 s
[alphal00p-docs-cargo] Compiling env_filter v1.0.1
43.38 s
[alphal00p-docs-cargo] Compiling num-iter v0.1.45
43.52 s
[alphal00p-docs-cargo] Compiling lru v0.16.4
43.61 s
[alphal00p-docs-cargo] Compiling jiff v0.2.24
43.72 s
[alphal00p-docs-cargo] Compiling convert_case v0.4.0
43.76 s
[alphal00p-docs-cargo] Compiling ref-ops v0.2.5
43.77 s
[alphal00p-docs-cargo] Compiling blake3 v1.8.5
43.84 s
[alphal00p-docs-cargo] Compiling darling v0.23.0
43.95 s
[alphal00p-docs-cargo] Compiling ratatui-core v0.1.0
44.08 s
[alphal00p-docs-cargo] Compiling num v0.4.3
44.10 s
[alphal00p-docs-cargo] Compiling derive_more-impl v2.1.1
44.13 s
[alphal00p-docs-cargo] Compiling derive_more v0.99.20
44.19 s
[alphal00p-docs-cargo] Compiling derive_builder_core v0.11.2
44.22 s
[alphal00p-docs-cargo] Compiling duplicate v1.0.0
44.43 s
[alphal00p-docs-cargo] Compiling enum-try-as-inner v0.1.1
44.80 s
[alphal00p-docs-cargo] Compiling delegate v0.12.0
45.11 s
[alphal00p-docs-cargo] Compiling rand_xoshiro v0.6.0
45.21 s
[alphal00p-docs-cargo] Compiling features v0.10.0
45.28 s
[alphal00p-docs-cargo] Compiling colored v2.2.0
45.51 s
[alphal00p-docs-cargo] Compiling litrs v1.0.0
45.52 s
[alphal00p-docs-cargo] Compiling portable-atomic v1.13.1
45.76 s
[alphal00p-docs-cargo] Compiling owo-colors v4.3.0
45.78 s
[alphal00p-docs-cargo] Compiling cfg_aliases v0.2.1
45.81 s
[alphal00p-docs-cargo] Compiling thiserror v1.0.69
45.84 s
[alphal00p-docs-cargo] Compiling constcat v0.5.1
45.85 s
[alphal00p-docs-cargo] Compiling object v0.37.3
45.90 s
[alphal00p-docs-cargo] Compiling gat-lending-iterator v0.1.8
46.09 s
[alphal00p-docs-cargo] Compiling nix v0.31.2
46.27 s
[alphal00p-docs-cargo] Compiling derive_more v2.1.1
46.35 s
[alphal00p-docs-cargo] Compiling rand_distr v0.4.3
46.36 s
[alphal00p-docs-cargo] Compiling derive_builder_macro v0.11.2
46.36 s
[alphal00p-docs-cargo] Compiling simba v0.6.0
46.38 s
[alphal00p-docs-cargo] Compiling document-features v0.2.12
46.38 s
[alphal00p-docs-cargo] Compiling phf_generator v0.13.1
46.43 s
[alphal00p-docs-cargo] Compiling nalgebra-macros v0.1.0
46.48 s
[alphal00p-docs-cargo] Compiling thiserror-impl v1.0.69
46.58 s
[alphal00p-docs-cargo] Compiling line-clipping v0.3.7
46.69 s
[alphal00p-docs-cargo] Compiling dirs v6.0.0
46.91 s
[alphal00p-docs-cargo] Compiling vte v0.15.0
47.00 s
[alphal00p-docs-cargo] Compiling joinery v2.1.0
47.07 s
[alphal00p-docs-cargo] Compiling clarabel v0.11.1
47.21 s
[alphal00p-docs-cargo] Compiling ref-cast v1.0.25
47.25 s
[alphal00p-docs-cargo] Compiling gimli v0.32.3
47.31 s
[alphal00p-docs-cargo] Compiling cpufeatures v0.3.0
47.33 s
[alphal00p-docs-cargo] Compiling arrayref v0.3.9
47.47 s
[alphal00p-docs-cargo] Compiling constant_time_eq v0.4.2
47.48 s
[alphal00p-docs-cargo] Compiling color-spantrace v0.3.0
47.56 s
[alphal00p-docs-cargo] Compiling crossterm v0.29.0
47.65 s
[alphal00p-docs-cargo] Compiling derive_builder v0.11.2
47.73 s
[alphal00p-docs-cargo] Compiling titlecase v2.2.1
47.77 s
[alphal00p-docs-cargo] Compiling vt100 v0.16.2
47.79 s
[alphal00p-docs-cargo] Compiling ratatui-widgets v0.3.0
48.09 s
[alphal00p-docs-cargo] Compiling phf_macros v0.13.1
48.86 s
[alphal00p-docs-cargo] Compiling tracing-error v0.2.1
49.13 s
[alphal00p-docs-cargo] Compiling serde-big-array v0.5.1
49.23 s
[alphal00p-docs-cargo] Compiling enum_dispatch v0.3.13
49.30 s
[alphal00p-docs-cargo] Compiling ref-cast-impl v1.0.25
49.54 s
[alphal00p-docs-cargo] Compiling env_logger v0.11.10
49.62 s
[alphal00p-docs-cargo] Compiling delegate v0.13.5
49.76 s
[alphal00p-docs-cargo] Compiling serde_derive_internals v0.29.1
49.82 s
[alphal00p-docs-cargo] Compiling amd v0.2.2
49.89 s
[alphal00p-docs-cargo] Compiling subprocess v0.2.15
49.97 s
[alphal00p-docs-cargo] Compiling rust_lisp v0.18.0
50.12 s
[alphal00p-docs-cargo] Compiling rustc-demangle v0.1.27
50.17 s
[alphal00p-docs-cargo] Compiling base64 v0.22.1
50.30 s
[alphal00p-docs-cargo] Compiling semver v1.0.28
50.51 s
[alphal00p-docs-cargo] Compiling vakint v0.1.2 (/build/source/crates/vakint)
50.58 s
[alphal00p-docs-cargo] Compiling unit-prefix v0.5.2
50.60 s
[alphal00p-docs-cargo] Compiling deprecate-until v1.0.0
50.72 s
[alphal00p-docs-cargo] Compiling string-template-plus v0.4.3
50.76 s
[alphal00p-docs-cargo] Compiling indicatif v0.18.4
50.84 s
[alphal00p-docs-cargo] Compiling ratatui-macros v0.7.0
50.92 s
[alphal00p-docs-cargo] Compiling phf v0.13.1
50.98 s
[alphal00p-docs-cargo] Compiling ratatui-crossterm v0.1.0
51.06 s
[alphal00p-docs-cargo] Compiling shellexpand v3.1.2
51.12 s
[alphal00p-docs-cargo] Compiling xpct v0.5.1
51.14 s
[alphal00p-docs-cargo] Compiling brotli-decompressor v4.0.3
51.16 s
[alphal00p-docs-cargo] Compiling integer-sqrt v0.1.5
51.18 s
[alphal00p-docs-cargo] Compiling crossbeam-channel v0.5.15
51.20 s
[alphal00p-docs-cargo] Compiling schemars_derive v1.2.1
51.22 s
[alphal00p-docs-cargo] Compiling itertools v0.12.1
51.23 s
[alphal00p-docs-cargo] Compiling include_dir_macros v0.7.4
51.31 s
[alphal00p-docs-cargo] Compiling gammaloop-tracing-filter-macros v0.1.0 (/build/source/crates/gammaloop-tracing-filter-macros)
51.68 s
[alphal00p-docs-cargo] Compiling version-compare v0.2.1
51.76 s
[alphal00p-docs-cargo] Compiling addr2line v0.25.1
51.88 s
[alphal00p-docs-cargo] Compiling gammalooprs v0.3.4 (/build/source/crates/gammalooprs)
51.99 s
[alphal00p-docs-cargo] Compiling symlink v0.1.0
52.04 s
[alphal00p-docs-cargo] Compiling unsafe-libyaml v0.2.11
52.07 s
[alphal00p-docs-cargo] Compiling tracing-appender v0.2.5
52.08 s
[alphal00p-docs-cargo] Compiling tracing-indicatif v0.3.14
52.13 s
[alphal00p-docs-cargo] Compiling include_dir v0.7.4
52.27 s
[alphal00p-docs-cargo] Compiling pathfinding v4.15.0
52.31 s
[alphal00p-docs-cargo] Compiling brotli v7.0.0
52.49 s
[alphal00p-docs-cargo] Compiling rust-embed-impl v8.11.0
52.59 s
[alphal00p-docs-cargo] Compiling ctrlc v3.5.2
52.62 s
[alphal00p-docs-cargo] Compiling ratatui v0.30.0
52.71 s
[alphal00p-docs-cargo] Compiling json5 v0.4.1
52.77 s
[alphal00p-docs-cargo] Compiling typed-index-collections v3.5.0
52.81 s
[alphal00p-docs-cargo] Compiling strum_macros v0.26.4
52.96 s
[alphal00p-docs-cargo] Compiling vectorize v0.2.0
53.04 s
[alphal00p-docs-cargo] Compiling clap_complete v4.6.3
53.08 s
[alphal00p-docs-cargo] Compiling fd-lock v4.0.4
53.19 s
[alphal00p-docs-cargo] Compiling nalgebra v0.29.0
53.26 s
[alphal00p-docs-cargo] Compiling serde_yaml v0.9.34+deprecated
53.28 s
[alphal00p-docs-cargo] Compiling strip-ansi-escapes v0.2.1
53.34 s
[alphal00p-docs-cargo] Compiling gammaloop-api v0.1.0 (/build/source/crates/gammaloop-api)
53.35 s
[alphal00p-docs-cargo] Compiling itertools v0.13.0
53.51 s
[alphal00p-docs-cargo] Compiling strum v0.26.3
53.56 s
[alphal00p-docs-cargo] Compiling backtrace v0.3.76
53.62 s
[alphal00p-docs-cargo] Compiling base62 v2.2.4
53.71 s
[alphal00p-docs-cargo] Compiling ringbuffer v0.16.0
53.77 s
[alphal00p-docs-cargo] Compiling clap_complete_nushell v4.6.0
53.83 s
[alphal00p-docs-cargo] Compiling sysinfo v0.33.1
54.43 s
[alphal00p-docs-cargo] Compiling schemars v1.2.1
54.44 s
[alphal00p-docs-cargo] Compiling rust-embed v8.11.0
54.58 s
[alphal00p-docs-cargo] Compiling color-eyre v0.6.5
55.34 s
[alphal00p-docs-cargo] Compiling pyo3-stub-gen-derive v0.17.2
55.85 s
[alphal00p-docs-cargo] Compiling reedline v0.42.0
57.17 s
[alphal00p-docs-cargo] Compiling pyo3-stub-gen v0.17.2
59.52 s
[alphal00p-docs-cargo] Compiling statrs v0.16.1
60.17 s
[alphal00p-docs-cargo] Compiling momtrop v0.3.0
162.46 s
[alphal00p-docs-cargo] Compiling numerica v3.0.0 (https://github.com/symbolica-dev/symbolica?rev=ba3737137c2a2ccd7bb39f0441837d38ec867e78#ba373713)
167.50 s
[alphal00p-docs-cargo] Compiling graphica v3.0.0 (https://github.com/symbolica-dev/symbolica?rev=ba3737137c2a2ccd7bb39f0441837d38ec867e78#ba373713)
219.82 s
[alphal00p-docs-cargo] Compiling symbolica-utils v0.1.0 (/build/source/crates/symbolica-utils)
257.64 s
[alphal00p-docs-cargo] Compiling gammaloop-workspace-hack v0.1.0 (/build/source/crates/gammaloop-workspace-hack)
257.64 s
[alphal00p-docs-cargo] Compiling spenso-macros v0.3.2 (/build/source/crates/spenso-macros)
258.20 s
[alphal00p-docs-cargo] Compiling linnet v0.17.0 (/build/source/crates/linnet)
264.65 s
[alphal00p-docs-cargo] Compiling spenso v0.6.0 (/build/source/crates/spenso)
274.20 s
[alphal00p-docs-cargo] Compiling idenso v0.3.0 (/build/source/crates/idenso)
274.20 s
[alphal00p-docs-cargo] Compiling gammaloop-tracing-filter v0.1.0 (/build/source/crates/gammaloop-tracing-filter)
279.10 s
[alphal00p-docs-cargo] Compiling spenso-hep-lib v0.1.7 (/build/source/crates/spenso-hep-lib)
395.60 s
[alphal00p-docs-cargo] Compiling alphal00p-docs-python-exporter v0.1.0 (/build/source/crates/alphal00p-docs-python-exporter)
415.93 s
[alphal00p-docs-cargo] Finished `docs` profile [unoptimized] target(s) in 6m 39s
416.05 s
[alphal00p-docs-cargo] +++ command cargo build --profile docs --locked -p alphal00p-docs-python-exporter --features linnet
416.67 s
[alphal00p-docs-cargo] Compiling libc v0.2.186
416.67 s
[alphal00p-docs-cargo] Compiling serde_core v1.0.228
416.67 s
[alphal00p-docs-cargo] Compiling zerocopy v0.8.48
416.68 s
[alphal00p-docs-cargo] Compiling log v0.4.29
416.69 s
[alphal00p-docs-cargo] Compiling num-traits v0.2.19
416.70 s
[alphal00p-docs-cargo] Compiling syn v1.0.109
416.71 s
[alphal00p-docs-cargo] Compiling syn v2.0.117
416.71 s
[alphal00p-docs-cargo] Compiling ahash v0.7.8
416.74 s
[alphal00p-docs-cargo] Compiling bytecheck v0.6.12
416.75 s
[alphal00p-docs-cargo] Compiling regex-syntax v0.8.10
416.76 s
[alphal00p-docs-cargo] Compiling simdutf8 v0.1.5
416.77 s
[alphal00p-docs-cargo] Compiling rend v0.4.2
416.77 s
[alphal00p-docs-cargo] Compiling indexmap v2.14.0
416.78 s
[alphal00p-docs-cargo] Compiling figment v0.10.19
416.78 s
[alphal00p-docs-cargo] Compiling ahash v0.8.12
416.78 s
[alphal00p-docs-cargo] Compiling cgmath v0.18.0
416.97 s
[alphal00p-docs-cargo] Compiling either v1.15.0
417.18 s
[alphal00p-docs-cargo] Compiling rkyv v0.7.46
417.21 s
[alphal00p-docs-cargo] Compiling itertools v0.11.0
417.23 s
[alphal00p-docs-cargo] Compiling bincode v2.0.1
417.29 s
[alphal00p-docs-cargo] Compiling pyo3 v0.28.3
417.31 s
[alphal00p-docs-cargo] Compiling venial v0.5.0
417.33 s
[alphal00p-docs-cargo] Compiling winnow v1.0.2
417.37 s
[alphal00p-docs-cargo] Compiling arrayvec v0.7.6
417.37 s
[alphal00p-docs-cargo] Compiling rustix v1.1.4
417.61 s
[alphal00p-docs-cargo] Compiling seahash v4.1.0
417.63 s
[alphal00p-docs-cargo] Compiling polycool v0.4.0
417.80 s
[alphal00p-docs-cargo] Compiling bitflags v2.11.1
417.85 s
[alphal00p-docs-cargo] Compiling toml_writer v1.1.1+spec-1.1.0
417.89 s
[alphal00p-docs-cargo] Compiling winnow v0.7.15
418.04 s
[alphal00p-docs-cargo] Compiling toml_parser v1.1.2+spec-1.1.0
418.09 s
[alphal00p-docs-cargo] Compiling smallvec v1.15.1
418.12 s
[alphal00p-docs-cargo] Compiling linnet-py v0.1.0 (/build/source/crates/linnet-py)
418.29 s
[alphal00p-docs-cargo] Compiling wasm-minimal-protocol v0.2.0
418.33 s
[alphal00p-docs-cargo] Compiling num-integer v0.1.46
418.42 s
[alphal00p-docs-cargo] Compiling approx v0.4.0
418.43 s
[alphal00p-docs-cargo] Compiling kurbo v0.13.1
418.49 s
[alphal00p-docs-cargo] Compiling num-complex v0.4.6
418.58 s
[alphal00p-docs-cargo] Compiling regex-automata v0.4.14
418.61 s
[alphal00p-docs-cargo] Compiling chrono v0.4.44
418.91 s
[alphal00p-docs-cargo] Compiling num-bigint v0.4.6
419.03 s
[alphal00p-docs-cargo] Compiling getrandom v0.2.17
419.07 s
[alphal00p-docs-cargo] Compiling dirs-sys v0.5.0
419.25 s
[alphal00p-docs-cargo] Compiling pyo3-ffi v0.28.3
419.32 s
[alphal00p-docs-cargo] Compiling rand_core v0.6.4
419.36 s
[alphal00p-docs-cargo] Compiling const-random-macro v0.1.16
419.60 s
[alphal00p-docs-cargo] Compiling dirs v6.0.0
419.72 s
[alphal00p-docs-cargo] Compiling hashbrown v0.12.3
419.74 s
[alphal00p-docs-cargo] Compiling shellexpand v3.1.2
419.76 s
[alphal00p-docs-cargo] Compiling getrandom v0.4.2
419.99 s
[alphal00p-docs-cargo] Compiling const-random v0.1.18
420.53 s
[alphal00p-docs-cargo] Compiling tempfile v3.27.0
420.58 s
[alphal00p-docs-cargo] Compiling toml_datetime v0.7.5+spec-1.1.0
420.58 s
[alphal00p-docs-cargo] Compiling serde_spanned v1.1.1
420.58 s
[alphal00p-docs-cargo] Compiling serde_json v1.0.149
420.84 s
[alphal00p-docs-cargo] Compiling toml v0.9.12+spec-1.1.0
421.23 s
[alphal00p-docs-cargo] Compiling globset v0.4.18
421.46 s
[alphal00p-docs-cargo] Compiling ptr_meta_derive v0.1.4
421.46 s
[alphal00p-docs-cargo] Compiling bytecheck_derive v0.6.12
421.47 s
[alphal00p-docs-cargo] Compiling rkyv_derive v0.7.46
421.70 s
[alphal00p-docs-cargo] Compiling rust-embed-utils v8.11.0
421.72 s
[alphal00p-docs-cargo] Compiling pest_generator v2.8.6
421.72 s
[alphal00p-docs-cargo] Compiling proc-macro2-diagnostics v0.10.1
421.72 s
[alphal00p-docs-cargo] Compiling pyo3-macros-backend v0.28.3
422.19 s
[alphal00p-docs-cargo] Compiling ptr_meta v0.1.4
422.46 s
[alphal00p-docs-cargo] Compiling zerocopy-derive v0.8.48
422.46 s
[alphal00p-docs-cargo] Compiling serde_derive v1.0.228
422.48 s
[alphal00p-docs-cargo] Compiling is-macro v0.3.7
422.48 s
[alphal00p-docs-cargo] Compiling thiserror-impl v2.0.18
422.48 s
[alphal00p-docs-cargo] Compiling serde_repr v0.1.20
422.48 s
[alphal00p-docs-cargo] Compiling bincode-trait-derive v0.1.1
422.49 s
[alphal00p-docs-cargo] Compiling duplicate v2.0.1
422.49 s
[alphal00p-docs-cargo] Compiling rust-embed-impl v8.11.0
422.63 s
[alphal00p-docs-cargo] Compiling pest_derive v2.8.6
423.29 s
[alphal00p-docs-cargo] Compiling ppv-lite86 v0.2.21
423.55 s
[alphal00p-docs-cargo] Compiling dot-parser v0.5.1
423.55 s
[alphal00p-docs-cargo] Compiling rustpython-parser-core v0.4.0
423.76 s
[alphal00p-docs-cargo] Compiling rustpython-ast v0.4.0
423.78 s
[alphal00p-docs-cargo] Compiling rand_chacha v0.3.1
423.99 s
[alphal00p-docs-cargo] Compiling rand v0.8.6
424.27 s
[alphal00p-docs-cargo] Compiling rust-embed v8.11.0
424.36 s
[alphal00p-docs-cargo] Compiling thiserror v2.0.18
424.74 s
[alphal00p-docs-cargo] Compiling phf_generator v0.11.3
424.86 s
[alphal00p-docs-cargo] Compiling phf_codegen v0.11.3
424.95 s
[alphal00p-docs-cargo] Compiling unicode_names2_generator v1.3.0
424.96 s
[alphal00p-docs-cargo] Compiling rustpython-parser v0.4.0
425.42 s
[alphal00p-docs-cargo] Compiling unicode_names2 v1.3.0
426.15 s
[alphal00p-docs-cargo] Compiling pyo3-macros v0.28.3
426.35 s
[alphal00p-docs-cargo] Compiling serde v1.0.228
426.88 s
[alphal00p-docs-cargo] Compiling bitvec v1.0.1
428.39 s
[alphal00p-docs-cargo] Compiling half v2.7.1
428.64 s
[alphal00p-docs-cargo] Compiling ciborium-ll v0.2.2
428.76 s
[alphal00p-docs-cargo] Compiling ciborium v0.2.2
429.25 s
[alphal00p-docs-cargo] Compiling kurvst v0.1.0 (/build/source/crates/kurvst)
430.83 s
[alphal00p-docs-cargo] Compiling linnet v0.17.0 (/build/source/crates/linnet)
432.11 s
[alphal00p-docs-cargo] Compiling pyo3-stub-gen-derive v0.17.2
433.92 s
[alphal00p-docs-cargo] Compiling pyo3-stub-gen v0.17.2
435.81 s
[alphal00p-docs-cargo] Compiling linnest v0.1.0 (/build/source/crates/linnest)
454.11 s
[alphal00p-docs-cargo] Compiling alphal00p-docs-python-exporter v0.1.0 (/build/source/crates/alphal00p-docs-python-exporter)
455.78 s
[alphal00p-docs-cargo] Finished `docs` profile [unoptimized] target(s) in 39.72s
455.88 s
[alphal00p-docs-cargo] +++ command cargo build --profile docs --locked -p alphal00p-docs-python-exporter --features spenso
456.73 s
[alphal00p-docs-cargo] Compiling pyo3-build-config v0.28.3
456.75 s
[alphal00p-docs-cargo] Compiling symbolica v2.2.0 (https://github.com/symbolica-dev/symbolica?rev=ba3737137c2a2ccd7bb39f0441837d38ec867e78#ba373713)
456.76 s
[alphal00p-docs-cargo] Compiling syn v1.0.109
456.77 s
[alphal00p-docs-cargo] Compiling figment v0.10.19
457.53 s
[alphal00p-docs-cargo] Compiling proc-macro-error v1.0.4
457.79 s
[alphal00p-docs-cargo] Compiling duplicate v1.0.0
458.11 s
[alphal00p-docs-cargo] Compiling pyo3-macros-backend v0.28.3
458.11 s
[alphal00p-docs-cargo] Compiling numpy v0.28.0
458.11 s
[alphal00p-docs-cargo] Compiling pyo3-ffi v0.28.3
458.11 s
[alphal00p-docs-cargo] Compiling pyo3 v0.28.3
461.25 s
[alphal00p-docs-cargo] Compiling pyo3-macros v0.28.3
466.33 s
[alphal00p-docs-cargo] Compiling pyo3-stub-gen v0.17.2
467.11 s
[alphal00p-docs-cargo] Compiling numerica v3.0.0 (https://github.com/symbolica-dev/symbolica?rev=ba3737137c2a2ccd7bb39f0441837d38ec867e78#ba373713)
467.62 s
[alphal00p-docs-cargo] Compiling gammaloop-workspace-hack v0.1.0 (/build/source/crates/gammaloop-workspace-hack)
471.34 s
[alphal00p-docs-cargo] Compiling graphica v3.0.0 (https://github.com/symbolica-dev/symbolica?rev=ba3737137c2a2ccd7bb39f0441837d38ec867e78#ba373713)
515.65 s
[alphal00p-docs-cargo] Compiling symbolica-utils v0.1.0 (/build/source/crates/symbolica-utils)
515.65 s
[alphal00p-docs-cargo] Compiling tymbolica-atom-payload v0.1.0 (https://github.com/lcnbr/tymbolica?rev=e85233dd3d99e5fb458913d0d49f99d83466025b#e85233dd)
516.05 s
[alphal00p-docs-cargo] Compiling linnet v0.17.0 (/build/source/crates/linnet)
520.73 s
[alphal00p-docs-cargo] Compiling spenso v0.6.0 (/build/source/crates/spenso)
529.56 s
[alphal00p-docs-cargo] Compiling idenso v0.3.0 (/build/source/crates/idenso)
535.09 s
[alphal00p-docs-cargo] Compiling spenso-hep-lib v0.1.7 (/build/source/crates/spenso-hep-lib)
535.68 s
[alphal00p-docs-cargo] Compiling spynso3 v0.1.2 (/build/source/crates/spynso3)
543.55 s
[alphal00p-docs-cargo] Compiling alphal00p-docs-python-exporter v0.1.0 (/build/source/crates/alphal00p-docs-python-exporter)
556.75 s
[alphal00p-docs-cargo] Finished `docs` profile [unoptimized] target(s) in 1m 40s
556.93 s
[alphal00p-docs-cargo] +++ command cargo build --profile docs --locked -p alphal00p-docs-python-exporter --features idenso
558.72 s
[alphal00p-docs-cargo] Compiling pyo3 v0.28.3
562.94 s
[alphal00p-docs-cargo] Compiling numpy v0.28.0
564.14 s
[alphal00p-docs-cargo] Compiling pyo3-stub-gen v0.17.2
565.22 s
[alphal00p-docs-cargo] Compiling numerica v3.0.0 (https://github.com/symbolica-dev/symbolica?rev=ba3737137c2a2ccd7bb39f0441837d38ec867e78#ba373713)
572.58 s
[alphal00p-docs-cargo] Compiling graphica v3.0.0 (https://github.com/symbolica-dev/symbolica?rev=ba3737137c2a2ccd7bb39f0441837d38ec867e78#ba373713)
573.39 s
[alphal00p-docs-cargo] Compiling symbolica v2.2.0 (https://github.com/symbolica-dev/symbolica?rev=ba3737137c2a2ccd7bb39f0441837d38ec867e78#ba373713)
616.08 s
[alphal00p-docs-cargo] Compiling gammaloop-workspace-hack v0.1.0 (/build/source/crates/gammaloop-workspace-hack)
616.08 s
[alphal00p-docs-cargo] Compiling symbolica-utils v0.1.0 (/build/source/crates/symbolica-utils)
616.44 s
[alphal00p-docs-cargo] Compiling linnet v0.17.0 (/build/source/crates/linnet)
620.26 s
[alphal00p-docs-cargo] Compiling spenso v0.6.0 (/build/source/crates/spenso)
629.24 s
[alphal00p-docs-cargo] Compiling idenso v0.3.0 (/build/source/crates/idenso)
637.86 s
[alphal00p-docs-cargo] Compiling alphal00p-docs-python-exporter v0.1.0 (/build/source/crates/alphal00p-docs-python-exporter)
646.57 s
[alphal00p-docs-cargo] Finished `docs` profile [unoptimized] target(s) in 1m 29s
646.63 s
[alphal00p-docs-cargo] +++ command cargo build --profile docs --locked -p alphal00p-docs-python-exporter --features vakint
647.90 s
[alphal00p-docs-cargo] Compiling libc v0.2.186
647.90 s
[alphal00p-docs-cargo] Compiling tiny-keccak v2.0.2
647.91 s
[alphal00p-docs-cargo] Compiling bytemuck v1.25.0
647.91 s
[alphal00p-docs-cargo] Compiling matrixmultiply v0.3.10
647.91 s
[alphal00p-docs-cargo] Compiling getrandom v0.3.4
647.92 s
[alphal00p-docs-cargo] Compiling num-integer v0.1.46
647.92 s
[alphal00p-docs-cargo] Compiling pyo3 v0.28.3
647.93 s
[alphal00p-docs-cargo] Compiling regex-automata v0.4.14
647.95 s
[alphal00p-docs-cargo] Compiling pyo3-macros-backend v0.28.3
647.95 s
[alphal00p-docs-cargo] Compiling pyo3-ffi v0.28.3
647.96 s
[alphal00p-docs-cargo] Compiling approx v0.5.1
647.96 s
[alphal00p-docs-cargo] Compiling ahash v0.8.12
647.96 s
[alphal00p-docs-cargo] Compiling serde v1.0.228
647.99 s
[alphal00p-docs-cargo] Compiling itertools v0.14.0
647.99 s
[alphal00p-docs-cargo] Compiling gmp-mpfr-sys v1.7.1
647.99 s
[alphal00p-docs-cargo] Compiling smallvec v1.15.1
648.10 s
[alphal00p-docs-cargo] Compiling safe_arch v0.7.4
648.25 s
[alphal00p-docs-cargo] Compiling rand_core v0.9.5
648.26 s
[alphal00p-docs-cargo] Compiling safe_arch v1.2.0
648.32 s
[alphal00p-docs-cargo] Compiling rayon v1.12.0
648.40 s
[alphal00p-docs-cargo] Compiling tracing-attributes v0.1.31
648.52 s
[alphal00p-docs-cargo] Compiling wide v0.7.33
648.54 s
[alphal00p-docs-cargo] Compiling smartstring v1.0.1
648.60 s
[alphal00p-docs-cargo] Compiling phf_shared v0.13.1
648.64 s
[alphal00p-docs-cargo] Compiling rand_chacha v0.9.0
648.69 s
[alphal00p-docs-cargo] Compiling wide v1.7.0
648.71 s
[alphal00p-docs-cargo] Compiling fastrand v2.4.1
648.80 s
[alphal00p-docs-cargo] Compiling symbolica v2.2.0 (https://github.com/symbolica-dev/symbolica?rev=ba3737137c2a2ccd7bb39f0441837d38ec867e78#ba373713)
648.84 s
[alphal00p-docs-cargo] Compiling phf_generator v0.13.1
648.95 s
[alphal00p-docs-cargo] Compiling rug v1.30.0
649.04 s
[alphal00p-docs-cargo] Compiling phf_macros v0.13.1
649.08 s
[alphal00p-docs-cargo] Compiling directories v6.0.0
649.29 s
[alphal00p-docs-cargo] Compiling ndarray v0.17.2
649.38 s
[alphal00p-docs-cargo] Compiling rand v0.9.4
649.44 s
[alphal00p-docs-cargo] Compiling subprocess v0.2.15
649.47 s
[alphal00p-docs-cargo] Compiling vakint v0.1.2 (/build/source/crates/vakint)
650.15 s
[alphal00p-docs-cargo] Compiling getrandom v0.2.17
650.40 s
[alphal00p-docs-cargo] Compiling rand_core v0.6.4
650.44 s
[alphal00p-docs-cargo] Compiling phf v0.13.1
650.57 s
[alphal00p-docs-cargo] Compiling rand_chacha v0.3.1
650.68 s
[alphal00p-docs-cargo] Compiling simba v0.9.1
650.84 s
[alphal00p-docs-cargo] Compiling rand v0.8.6
650.85 s
[alphal00p-docs-cargo] Compiling tracing v0.1.44
651.35 s
[alphal00p-docs-cargo] Compiling phf_generator v0.11.3
651.45 s
[alphal00p-docs-cargo] Compiling phf_codegen v0.11.3
651.53 s
[alphal00p-docs-cargo] Compiling unicode_names2_generator v1.3.0
651.55 s
[alphal00p-docs-cargo] Compiling rustpython-parser v0.4.0
651.95 s
[alphal00p-docs-cargo] Compiling unicode_names2 v1.3.0
652.00 s
[alphal00p-docs-cargo] Compiling regex v1.12.3
652.00 s
[alphal00p-docs-cargo] Compiling matchers v0.2.0
652.37 s
[alphal00p-docs-cargo] Compiling tracing-subscriber v0.3.23
652.49 s
[alphal00p-docs-cargo] Compiling titlecase v2.2.1
652.62 s
[alphal00p-docs-cargo] Compiling string-template-plus v0.4.3
652.72 s
[alphal00p-docs-cargo] Compiling pyo3-macros v0.28.3
654.33 s
[alphal00p-docs-cargo] Compiling xprec v0.2.2
656.49 s
[alphal00p-docs-cargo] Compiling numpy v0.28.0
658.06 s
[alphal00p-docs-cargo] Compiling pyo3-stub-gen-derive v0.17.2
659.37 s
[alphal00p-docs-cargo] Compiling pyo3-stub-gen v0.17.2
660.05 s
[alphal00p-docs-cargo] Compiling numerica v3.0.0 (https://github.com/symbolica-dev/symbolica?rev=ba3737137c2a2ccd7bb39f0441837d38ec867e78#ba373713)
660.17 s
[alphal00p-docs-cargo] error : select an integer backend: `integer-gmp` or `integer-malachite`
660.17 s
[alphal00p-docs-cargo] --> /nix/store/5dfb7akvi1k3080zqfndr6jw2ay3di2p-vendor-cargo-deps/f8c6b2c844a6fa8c330abb750e4cf5bbdb36a70140a58e87f6b79fb3024532aa/numerica-3.0.0/src/lib.rs:40:1
660.17 s
[alphal00p-docs-cargo] |
660.17 s
[alphal00p-docs-cargo] 40 | compile_error!("select an integer backend: `integer-gmp` or `integer-malachite`");
660.17 s
[alphal00p-docs-cargo] | ^^^^^^^^^^^^^^^^^^^^^^^^^^^^^^^^^^^^^^^^^^^^^^^^^^^^^^^^^^^^^^^^^^^^^^^^^^^^^^^^^
660.17 s
[alphal00p-docs-cargo]
660.17 s
[alphal00p-docs-cargo] error : select a float backend: `float-mpfr` or `float-astro`
660.17 s
[alphal00p-docs-cargo] --> /nix/store/5dfb7akvi1k3080zqfndr6jw2ay3di2p-vendor-cargo-deps/f8c6b2c844a6fa8c330abb750e4cf5bbdb36a70140a58e87f6b79fb3024532aa/numerica-3.0.0/src/lib.rs:44:1
660.17 s
[alphal00p-docs-cargo] |
660.17 s
[alphal00p-docs-cargo] 44 | compile_error!("select a float backend: `float-mpfr` or `float-astro`");
660.17 s
[alphal00p-docs-cargo] | ^^^^^^^^^^^^^^^^^^^^^^^^^^^^^^^^^^^^^^^^^^^^^^^^^^^^^^^^^^^^^^^^^^^^^^^
660.17 s
[alphal00p-docs-cargo]
660.42 s
[alphal00p-docs-cargo] error[E0432] : unresolved import `implementation::BackendRandState`
660.42 s
[alphal00p-docs-cargo] --> /nix/store/5dfb7akvi1k3080zqfndr6jw2ay3di2p-vendor-cargo-deps/f8c6b2c844a6fa8c330abb750e4cf5bbdb36a70140a58e87f6b79fb3024532aa/numerica-3.0.0/src/domains/backend/integer.rs:1614:33
660.42 s
[alphal00p-docs-cargo] |
660.42 s
[alphal00p-docs-cargo] 1614 | pub(crate) use implementation::{BackendRandState, Complete, RemRounding};
660.42 s
[alphal00p-docs-cargo] | ^^^^^^^^^^^^^^^^ no `BackendRandState` in `domains::backend::integer::implementation`
660.42 s
[alphal00p-docs-cargo] |
660.42 s
[alphal00p-docs-cargo] note : found an item that was configured out
660.42 s
[alphal00p-docs-cargo] --> /nix/store/5dfb7akvi1k3080zqfndr6jw2ay3di2p-vendor-cargo-deps/f8c6b2c844a6fa8c330abb750e4cf5bbdb36a70140a58e87f6b79fb3024532aa/numerica-3.0.0/src/domains/backend/integer.rs:1378:23
660.42 s
[alphal00p-docs-cargo] |
660.42 s
[alphal00p-docs-cargo] 1377 | #[cfg(feature = "integer-malachite")]
660.42 s
[alphal00p-docs-cargo] | ----------------------------- the item is gated behind the `integer-malachite` feature
660.42 s
[alphal00p-docs-cargo] 1378 | pub(crate) struct BackendRandState {
660.42 s
[alphal00p-docs-cargo] | ^^^^^^^^^^^^^^^^
660.42 s
[alphal00p-docs-cargo] note : found an item that was configured out
660.42 s
[alphal00p-docs-cargo] --> /nix/store/5dfb7akvi1k3080zqfndr6jw2ay3di2p-vendor-cargo-deps/f8c6b2c844a6fa8c330abb750e4cf5bbdb36a70140a58e87f6b79fb3024532aa/numerica-3.0.0/src/domains/backend/integer.rs:1413:23
660.42 s
[alphal00p-docs-cargo] |
660.42 s
[alphal00p-docs-cargo] 1412 | #[cfg(feature = "integer-gmp")]
660.42 s
[alphal00p-docs-cargo] | ----------------------- the item is gated behind the `integer-gmp` feature
660.42 s
[alphal00p-docs-cargo] 1413 | pub(crate) struct BackendRandState(rug::rand::RandState<'static>);
660.42 s
[alphal00p-docs-cargo] | ^^^^^^^^^^^^^^^^
660.42 s
[alphal00p-docs-cargo]
660.42 s
[alphal00p-docs-cargo] error[E0432] : unresolved import `implementation::RawMultiPrecisionInteger`
660.42 s
[alphal00p-docs-cargo] --> /nix/store/5dfb7akvi1k3080zqfndr6jw2ay3di2p-vendor-cargo-deps/f8c6b2c844a6fa8c330abb750e4cf5bbdb36a70140a58e87f6b79fb3024532aa/numerica-3.0.0/src/domains/backend/integer.rs:1616:61
660.42 s
[alphal00p-docs-cargo] |
660.42 s
[alphal00p-docs-cargo] 1616 | MultiPrecisionInteger, ParseMultiPrecisionIntegerError, RawMultiPrecisionInteger,
660.42 s
[alphal00p-docs-cargo] | ^^^^^^^^^^^^^^^^^^^^^^^^ no `RawMultiPrecisionInteger` in `domains::backend::integer::implementation`
660.42 s
[alphal00p-docs-cargo] |
660.42 s
[alphal00p-docs-cargo] note : found an item that was configured out
660.42 s
[alphal00p-docs-cargo] --> /nix/store/5dfb7akvi1k3080zqfndr6jw2ay3di2p-vendor-cargo-deps/f8c6b2c844a6fa8c330abb750e4cf5bbdb36a70140a58e87f6b79fb3024532aa/numerica-3.0.0/src/domains/backend/integer.rs:26:14
660.42 s
[alphal00p-docs-cargo] |
660.42 s
[alphal00p-docs-cargo] 25 | #[cfg(feature = "integer-malachite")]
660.42 s
[alphal00p-docs-cargo] | ----------------------------- the item is gated behind the `integer-malachite` feature
660.42 s
[alphal00p-docs-cargo] 26 | pub type RawMultiPrecisionInteger = malachite_nz::integer::Integer;
660.42 s
[alphal00p-docs-cargo] | ^^^^^^^^^^^^^^^^^^^^^^^^
660.42 s
[alphal00p-docs-cargo] note : found an item that was configured out
660.42 s
[alphal00p-docs-cargo] --> /nix/store/5dfb7akvi1k3080zqfndr6jw2ay3di2p-vendor-cargo-deps/f8c6b2c844a6fa8c330abb750e4cf5bbdb36a70140a58e87f6b79fb3024532aa/numerica-3.0.0/src/domains/backend/integer.rs:29:14
660.42 s
[alphal00p-docs-cargo] |
660.42 s
[alphal00p-docs-cargo] 28 | #[cfg(feature = "integer-gmp")]
660.42 s
[alphal00p-docs-cargo] | ----------------------- the item is gated behind the `integer-gmp` feature
660.42 s
[alphal00p-docs-cargo] 29 | pub type RawMultiPrecisionInteger = rug::Integer;
660.42 s
[alphal00p-docs-cargo] | ^^^^^^^^^^^^^^^^^^^^^^^^
660.42 s
[alphal00p-docs-cargo] help : a similar name exists in the module
660.42 s
[alphal00p-docs-cargo] |
660.42 s
[alphal00p-docs-cargo] 1616 - MultiPrecisionInteger, ParseMultiPrecisionIntegerError, RawMultiPrecisionInteger ,
660.42 s
[alphal00p-docs-cargo] 1616 + MultiPrecisionInteger, ParseMultiPrecisionIntegerError, MultiPrecisionInteger ,
660.42 s
[alphal00p-docs-cargo] |
660.42 s
[alphal00p-docs-cargo]
660.42 s
[alphal00p-docs-cargo] error[E0432] : unresolved imports `implementation::from_be_bytes`, `implementation::to_be_bytes`
660.42 s
[alphal00p-docs-cargo] --> /nix/store/5dfb7akvi1k3080zqfndr6jw2ay3di2p-vendor-cargo-deps/f8c6b2c844a6fa8c330abb750e4cf5bbdb36a70140a58e87f6b79fb3024532aa/numerica-3.0.0/src/domains/backend/integer.rs:1709:33
660.42 s
[alphal00p-docs-cargo] |
660.42 s
[alphal00p-docs-cargo] 1709 | pub(crate) use implementation::{from_be_bytes, to_be_bytes};
660.42 s
[alphal00p-docs-cargo] | ^^^^^^^^^^^^^ ^^^^^^^^^^^ no `to_be_bytes` in `domains::backend::integer::implementation`
660.42 s
[alphal00p-docs-cargo] | |
660.42 s
[alphal00p-docs-cargo] | no `from_be_bytes` in `domains::backend::integer::implementation`
660.42 s
[alphal00p-docs-cargo] |
660.42 s
[alphal00p-docs-cargo] note : found an item that was configured out
660.42 s
[alphal00p-docs-cargo] --> /nix/store/5dfb7akvi1k3080zqfndr6jw2ay3di2p-vendor-cargo-deps/f8c6b2c844a6fa8c330abb750e4cf5bbdb36a70140a58e87f6b79fb3024532aa/numerica-3.0.0/src/domains/backend/integer.rs:1370:19
660.42 s
[alphal00p-docs-cargo] |
660.42 s
[alphal00p-docs-cargo] 1369 | #[cfg(all(feature = "integer-malachite", feature = "bincode"))]
660.42 s
[alphal00p-docs-cargo] | ----------------------------- the item is gated behind the `integer-malachite` feature
660.42 s
[alphal00p-docs-cargo] 1370 | pub(crate) fn from_be_bytes(bytes: &[u8]) -> Result<MultiPrecisionInteger, &'static str> {
660.42 s
[alphal00p-docs-cargo] | ^^^^^^^^^^^^^
660.42 s
[alphal00p-docs-cargo] note : found an item that was configured out
660.42 s
[alphal00p-docs-cargo] --> /nix/store/5dfb7akvi1k3080zqfndr6jw2ay3di2p-vendor-cargo-deps/f8c6b2c844a6fa8c330abb750e4cf5bbdb36a70140a58e87f6b79fb3024532aa/numerica-3.0.0/src/domains/backend/integer.rs:1405:19
660.42 s
[alphal00p-docs-cargo] |
660.42 s
[alphal00p-docs-cargo] 1404 | #[cfg(all(feature = "integer-gmp", feature = "bincode"))]
660.42 s
[alphal00p-docs-cargo] | ----------------------- the item is gated behind the `integer-gmp` feature
660.42 s
[alphal00p-docs-cargo] 1405 | pub(crate) fn from_be_bytes(bytes: &[u8]) -> Result<MultiPrecisionInteger, &'static str> {
660.42 s
[alphal00p-docs-cargo] | ^^^^^^^^^^^^^
660.42 s
[alphal00p-docs-cargo] note : found an item that was configured out
660.42 s
[alphal00p-docs-cargo] --> /nix/store/5dfb7akvi1k3080zqfndr6jw2ay3di2p-vendor-cargo-deps/f8c6b2c844a6fa8c330abb750e4cf5bbdb36a70140a58e87f6b79fb3024532aa/numerica-3.0.0/src/domains/backend/integer.rs:1365:19
660.42 s
[alphal00p-docs-cargo] |
660.42 s
[alphal00p-docs-cargo] 1364 | #[cfg(all(feature = "integer-malachite", feature = "bincode"))]
660.42 s
[alphal00p-docs-cargo] | ----------------------------- the item is gated behind the `integer-malachite` feature
660.42 s
[alphal00p-docs-cargo] 1365 | pub(crate) fn to_be_bytes(value: &MultiPrecisionInteger) -> Vec<u8> {
660.42 s
[alphal00p-docs-cargo] | ^^^^^^^^^^^
660.42 s
[alphal00p-docs-cargo] note : found an item that was configured out
660.42 s
[alphal00p-docs-cargo] --> /nix/store/5dfb7akvi1k3080zqfndr6jw2ay3di2p-vendor-cargo-deps/f8c6b2c844a6fa8c330abb750e4cf5bbdb36a70140a58e87f6b79fb3024532aa/numerica-3.0.0/src/domains/backend/integer.rs:1400:19
660.42 s
[alphal00p-docs-cargo] |
660.42 s
[alphal00p-docs-cargo] 1399 | #[cfg(all(feature = "integer-gmp", feature = "bincode"))]
660.42 s
[alphal00p-docs-cargo] | ----------------------- the item is gated behind the `integer-gmp` feature
660.42 s
[alphal00p-docs-cargo] 1400 | pub(crate) fn to_be_bytes(value: &MultiPrecisionInteger) -> Vec<u8> {
660.42 s
[alphal00p-docs-cargo] | ^^^^^^^^^^^
660.42 s
[alphal00p-docs-cargo]
660.43 s
[alphal00p-docs-cargo] error[E0432] : unresolved imports `crate::domains::backend::float::Assign`, `crate::domains::backend::float::CompleteRound`, `crate::domains::backend::float::Constant`, `crate::domains::backend::float::MultiPrecisionFloat`, `crate::domains::backend::float::Pow`
660.43 s
[alphal00p-docs-cargo] --> /nix/store/5dfb7akvi1k3080zqfndr6jw2ay3di2p-vendor-cargo-deps/f8c6b2c844a6fa8c330abb750e4cf5bbdb36a70140a58e87f6b79fb3024532aa/numerica-3.0.0/src/domains/float/multiprecision.rs:15:9
660.43 s
[alphal00p-docs-cargo] |
660.43 s
[alphal00p-docs-cargo] 15 | Assign, CompleteRound, Constant, MultiPrecisionFloat, MultiPrecisionFloatInteger,
660.43 s
[alphal00p-docs-cargo] | ^^^^^^ ^^^^^^^^^^^^^ ^^^^^^^^ ^^^^^^^^^^^^^^^^^^^ no `MultiPrecisionFloat` in `domains::backend::float`
660.43 s
[alphal00p-docs-cargo] | | | |
660.43 s
[alphal00p-docs-cargo] | | | no `Constant` in `domains::backend::float`
660.43 s
[alphal00p-docs-cargo] | | no `CompleteRound` in `domains::backend::float`
660.43 s
[alphal00p-docs-cargo] | no `Assign` in `domains::backend::float`
660.43 s
[alphal00p-docs-cargo] 16 | MultiPrecisionFloatRational, MultiPrecisionFloatRounding, Pow, RoundingDirection,
660.43 s
[alphal00p-docs-cargo] | ^^^ no `Pow` in `domains::backend::float`
660.43 s
[alphal00p-docs-cargo] |
660.43 s
[alphal00p-docs-cargo] note : found an item that was configured out
660.43 s
[alphal00p-docs-cargo] --> /nix/store/5dfb7akvi1k3080zqfndr6jw2ay3di2p-vendor-cargo-deps/f8c6b2c844a6fa8c330abb750e4cf5bbdb36a70140a58e87f6b79fb3024532aa/numerica-3.0.0/src/domains/backend/float.rs:17:5
660.43 s
[alphal00p-docs-cargo] |
660.43 s
[alphal00p-docs-cargo] 15 | #[cfg(feature = "float-mpfr")]
660.43 s
[alphal00p-docs-cargo] | ---------------------- the item is gated behind the `float-mpfr` feature
660.43 s
[alphal00p-docs-cargo] 16 | pub use rug::{
660.43 s
[alphal00p-docs-cargo] 17 | Assign, Float as MultiPrecisionFloat, Rational as BackendRational,
660.43 s
[alphal00p-docs-cargo] | ^^^^^^
660.43 s
[alphal00p-docs-cargo] note : found an item that was configured out
660.43 s
[alphal00p-docs-cargo] --> /nix/store/5dfb7akvi1k3080zqfndr6jw2ay3di2p-vendor-cargo-deps/f8c6b2c844a6fa8c330abb750e4cf5bbdb36a70140a58e87f6b79fb3024532aa/numerica-3.0.0/src/domains/backend/float.rs:1561:5
660.43 s
[alphal00p-docs-cargo] |
660.43 s
[alphal00p-docs-cargo] 1559 | #[cfg(feature = "float-astro")]
660.43 s
[alphal00p-docs-cargo] | ----------------------- the item is gated behind the `float-astro` feature
660.43 s
[alphal00p-docs-cargo] 1560 | pub use astro::{
660.43 s
[alphal00p-docs-cargo] 1561 | Assign, BackendRational, CompleteRound, Constant, IntoMultiPrecisionFloat, MultiPrecisionFloat,
660.43 s
[alphal00p-docs-cargo] | ^^^^^^
660.43 s
[alphal00p-docs-cargo] note : found an item that was configured out
660.43 s
[alphal00p-docs-cargo] --> /nix/store/5dfb7akvi1k3080zqfndr6jw2ay3di2p-vendor-cargo-deps/f8c6b2c844a6fa8c330abb750e4cf5bbdb36a70140a58e87f6b79fb3024532aa/numerica-3.0.0/src/domains/backend/float.rs:19:11
660.43 s
[alphal00p-docs-cargo] |
660.43 s
[alphal00p-docs-cargo] 15 | #[cfg(feature = "float-mpfr")]
660.43 s
[alphal00p-docs-cargo] | ---------------------- the item is gated behind the `float-mpfr` feature
660.43 s
[alphal00p-docs-cargo] ...
660.43 s
[alphal00p-docs-cargo] 19 | ops::{CompleteRound, Pow},
660.43 s
[alphal00p-docs-cargo] | ^^^^^^^^^^^^^
660.43 s
[alphal00p-docs-cargo] note : found an item that was configured out
660.43 s
[alphal00p-docs-cargo] --> /nix/store/5dfb7akvi1k3080zqfndr6jw2ay3di2p-vendor-cargo-deps/f8c6b2c844a6fa8c330abb750e4cf5bbdb36a70140a58e87f6b79fb3024532aa/numerica-3.0.0/src/domains/backend/float.rs:1561:30
660.43 s
[alphal00p-docs-cargo] |
660.43 s
[alphal00p-docs-cargo] 1559 | #[cfg(feature = "float-astro")]
660.43 s
[alphal00p-docs-cargo] | ----------------------- the item is gated behind the `float-astro` feature
660.43 s
[alphal00p-docs-cargo] 1560 | pub use astro::{
660.43 s
[alphal00p-docs-cargo] 1561 | Assign, BackendRational, CompleteRound, Constant, IntoMultiPrecisionFloat, MultiPrecisionFloat,
660.43 s
[alphal00p-docs-cargo] | ^^^^^^^^^^^^^
660.43 s
[alphal00p-docs-cargo] note : found an item that was configured out
660.43 s
[alphal00p-docs-cargo] --> /nix/store/5dfb7akvi1k3080zqfndr6jw2ay3di2p-vendor-cargo-deps/f8c6b2c844a6fa8c330abb750e4cf5bbdb36a70140a58e87f6b79fb3024532aa/numerica-3.0.0/src/domains/backend/float.rs:18:12
660.43 s
[alphal00p-docs-cargo] |
660.43 s
[alphal00p-docs-cargo] 15 | #[cfg(feature = "float-mpfr")]
660.43 s
[alphal00p-docs-cargo] | ---------------------- the item is gated behind the `float-mpfr` feature
660.43 s
[alphal00p-docs-cargo] ...
660.43 s
[alphal00p-docs-cargo] 18 | float::Constant,
660.43 s
[alphal00p-docs-cargo] | ^^^^^^^^
660.43 s
[alphal00p-docs-cargo] note : found an item that was configured out
660.43 s
[alphal00p-docs-cargo] --> /nix/store/5dfb7akvi1k3080zqfndr6jw2ay3di2p-vendor-cargo-deps/f8c6b2c844a6fa8c330abb750e4cf5bbdb36a70140a58e87f6b79fb3024532aa/numerica-3.0.0/src/domains/backend/float.rs:1561:45
660.43 s
[alphal00p-docs-cargo] |
660.43 s
[alphal00p-docs-cargo] 1559 | #[cfg(feature = "float-astro")]
660.43 s
[alphal00p-docs-cargo] | ----------------------- the item is gated behind the `float-astro` feature
660.43 s
[alphal00p-docs-cargo] 1560 | pub use astro::{
660.43 s
[alphal00p-docs-cargo] 1561 | Assign, BackendRational, CompleteRound, Constant, IntoMultiPrecisionFloat, MultiPrecisionFloat,
660.43 s
[alphal00p-docs-cargo] | ^^^^^^^^
660.43 s
[alphal00p-docs-cargo] note : found an item that was configured out
660.43 s
[alphal00p-docs-cargo] --> /nix/store/5dfb7akvi1k3080zqfndr6jw2ay3di2p-vendor-cargo-deps/f8c6b2c844a6fa8c330abb750e4cf5bbdb36a70140a58e87f6b79fb3024532aa/numerica-3.0.0/src/domains/backend/float.rs:17:22
660.43 s
[alphal00p-docs-cargo] |
660.43 s
[alphal00p-docs-cargo] 15 | #[cfg(feature = "float-mpfr")]
660.43 s
[alphal00p-docs-cargo] | ---------------------- the item is gated behind the `float-mpfr` feature
660.43 s
[alphal00p-docs-cargo] 16 | pub use rug::{
660.43 s
[alphal00p-docs-cargo] 17 | Assign, Float as MultiPrecisionFloat, Rational as BackendRational,
660.43 s
[alphal00p-docs-cargo] | ^^^^^^^^^^^^^^^^^^^
660.43 s
[alphal00p-docs-cargo] note : found an item that was configured out
660.43 s
[alphal00p-docs-cargo] --> /nix/store/5dfb7akvi1k3080zqfndr6jw2ay3di2p-vendor-cargo-deps/f8c6b2c844a6fa8c330abb750e4cf5bbdb36a70140a58e87f6b79fb3024532aa/numerica-3.0.0/src/domains/backend/float.rs:1561:80
660.43 s
[alphal00p-docs-cargo] |
660.43 s
[alphal00p-docs-cargo] 1559 | #[cfg(feature = "float-astro")]
660.43 s
[alphal00p-docs-cargo] | ----------------------- the item is gated behind the `float-astro` feature
660.43 s
[alphal00p-docs-cargo] 1560 | pub use astro::{
660.43 s
[alphal00p-docs-cargo] 1561 | Assign, BackendRational, CompleteRound, Constant, IntoMultiPrecisionFloat, MultiPrecisionFloat,
660.43 s
[alphal00p-docs-cargo] | ^^^^^^^^^^^^^^^^^^^
660.43 s
[alphal00p-docs-cargo] note : found an item that was configured out
660.43 s
[alphal00p-docs-cargo] --> /nix/store/5dfb7akvi1k3080zqfndr6jw2ay3di2p-vendor-cargo-deps/f8c6b2c844a6fa8c330abb750e4cf5bbdb36a70140a58e87f6b79fb3024532aa/numerica-3.0.0/src/domains/backend/float.rs:19:26
660.43 s
[alphal00p-docs-cargo] |
660.43 s
[alphal00p-docs-cargo] 15 | #[cfg(feature = "float-mpfr")]
660.43 s
[alphal00p-docs-cargo] | ---------------------- the item is gated behind the `float-mpfr` feature
660.43 s
[alphal00p-docs-cargo] ...
660.43 s
[alphal00p-docs-cargo] 19 | ops::{CompleteRound, Pow},
660.43 s
[alphal00p-docs-cargo] | ^^^
660.43 s
[alphal00p-docs-cargo] note : found an item that was configured out
660.43 s
[alphal00p-docs-cargo] --> /nix/store/5dfb7akvi1k3080zqfndr6jw2ay3di2p-vendor-cargo-deps/f8c6b2c844a6fa8c330abb750e4cf5bbdb36a70140a58e87f6b79fb3024532aa/numerica-3.0.0/src/domains/backend/float.rs:1562:5
660.43 s
[alphal00p-docs-cargo] |
660.43 s
[alphal00p-docs-cargo] 1559 | #[cfg(feature = "float-astro")]
660.43 s
[alphal00p-docs-cargo] | ----------------------- the item is gated behind the `float-astro` feature
660.43 s
[alphal00p-docs-cargo] ...
660.43 s
[alphal00p-docs-cargo] 1562 | Pow,
660.43 s
[alphal00p-docs-cargo] | ^^^
660.43 s
[alphal00p-docs-cargo]
660.76 s
[alphal00p-docs-cargo] error[E0425] : cannot find type `RawMultiPrecisionInteger` in this scope
660.76 s
[alphal00p-docs-cargo] --> /nix/store/5dfb7akvi1k3080zqfndr6jw2ay3di2p-vendor-cargo-deps/f8c6b2c844a6fa8c330abb750e4cf5bbdb36a70140a58e87f6b79fb3024532aa/numerica-3.0.0/src/domains/backend/integer.rs:52:38
660.76 s
[alphal00p-docs-cargo] |
660.76 s
[alphal00p-docs-cargo] 52 | pub struct MultiPrecisionInteger(RawMultiPrecisionInteger);
660.76 s
[alphal00p-docs-cargo] | ^^^^^^^^^^^^^^^^^^^^^^^^ not found in this scope
660.76 s
[alphal00p-docs-cargo]
660.77 s
[alphal00p-docs-cargo] error[E0425] : cannot find type `RawMultiPrecisionInteger` in this scope
660.77 s
[alphal00p-docs-cargo] --> /nix/store/5dfb7akvi1k3080zqfndr6jw2ay3di2p-vendor-cargo-deps/f8c6b2c844a6fa8c330abb750e4cf5bbdb36a70140a58e87f6b79fb3024532aa/numerica-3.0.0/src/domains/backend/integer.rs:52:38
660.77 s
[alphal00p-docs-cargo] |
660.77 s
[alphal00p-docs-cargo] 52 | pub struct MultiPrecisionInteger(RawMultiPrecisionInteger);
660.77 s
[alphal00p-docs-cargo] | ^^^^^^^^^^^^^^^^^^^^^^^^ not found in this scope
660.77 s
[alphal00p-docs-cargo] |
660.77 s
[alphal00p-docs-cargo] help : you might be missing a type parameter
660.77 s
[alphal00p-docs-cargo] |
660.77 s
[alphal00p-docs-cargo] 52 | pub struct MultiPrecisionInteger<RawMultiPrecisionInteger> (RawMultiPrecisionInteger);
660.77 s
[alphal00p-docs-cargo] | ++++++++++++++++++++++++++
660.77 s
[alphal00p-docs-cargo]
660.77 s
[alphal00p-docs-cargo] error[E0425] : cannot find type `RawMultiPrecisionInteger` in this scope
660.77 s
[alphal00p-docs-cargo] --> /nix/store/5dfb7akvi1k3080zqfndr6jw2ay3di2p-vendor-cargo-deps/f8c6b2c844a6fa8c330abb750e4cf5bbdb36a70140a58e87f6b79fb3024532aa/numerica-3.0.0/src/domains/backend/integer.rs:149:32
660.77 s
[alphal00p-docs-cargo] |
660.77 s
[alphal00p-docs-cargo] 52 | pub struct MultiPrecisionInteger(RawMultiPrecisionInteger);
660.77 s
[alphal00p-docs-cargo] | ----------------------------------------------------------- similarly named struct `MultiPrecisionInteger` defined here
660.77 s
[alphal00p-docs-cargo] ...
660.77 s
[alphal00p-docs-cargo] 149 | pub fn from_raw(value: RawMultiPrecisionInteger) -> Self {
660.77 s
[alphal00p-docs-cargo] | ^^^^^^^^^^^^^^^^^^^^^^^^
660.77 s
[alphal00p-docs-cargo] |
660.77 s
[alphal00p-docs-cargo] help : a struct with a similar name exists
660.77 s
[alphal00p-docs-cargo] |
660.77 s
[alphal00p-docs-cargo] 149 - pub fn from_raw(value: RawMultiPrecisionInteger ) -> Self {
660.77 s
[alphal00p-docs-cargo] 149 + pub fn from_raw(value: MultiPrecisionInteger ) -> Self {
660.77 s
[alphal00p-docs-cargo] |
660.77 s
[alphal00p-docs-cargo]
660.77 s
[alphal00p-docs-cargo] error[E0425] : cannot find type `RawMultiPrecisionInteger` in this scope
660.77 s
[alphal00p-docs-cargo] --> /nix/store/5dfb7akvi1k3080zqfndr6jw2ay3di2p-vendor-cargo-deps/f8c6b2c844a6fa8c330abb750e4cf5bbdb36a70140a58e87f6b79fb3024532aa/numerica-3.0.0/src/domains/backend/integer.rs:187:34
660.77 s
[alphal00p-docs-cargo] |
660.77 s
[alphal00p-docs-cargo] 52 | pub struct MultiPrecisionInteger(RawMultiPrecisionInteger);
660.77 s
[alphal00p-docs-cargo] | ----------------------------------------------------------- similarly named struct `MultiPrecisionInteger` defined here
660.77 s
[alphal00p-docs-cargo] ...
660.77 s
[alphal00p-docs-cargo] 187 | pub fn as_raw(&self) -> &RawMultiPrecisionInteger {
660.77 s
[alphal00p-docs-cargo] | ^^^^^^^^^^^^^^^^^^^^^^^^
660.77 s
[alphal00p-docs-cargo] |
660.77 s
[alphal00p-docs-cargo] help : a struct with a similar name exists
660.77 s
[alphal00p-docs-cargo] |
660.77 s
[alphal00p-docs-cargo] 187 - pub fn as_raw(&self) -> &RawMultiPrecisionInteger {
660.77 s
[alphal00p-docs-cargo] 187 + pub fn as_raw(&self) -> &MultiPrecisionInteger {
660.77 s
[alphal00p-docs-cargo] |
660.77 s
[alphal00p-docs-cargo]
660.78 s
[alphal00p-docs-cargo] error[E0425] : cannot find type `RawMultiPrecisionInteger` in this scope
660.78 s
[alphal00p-docs-cargo] --> /nix/store/5dfb7akvi1k3080zqfndr6jw2ay3di2p-vendor-cargo-deps/f8c6b2c844a6fa8c330abb750e4cf5bbdb36a70140a58e87f6b79fb3024532aa/numerica-3.0.0/src/domains/backend/integer.rs:193:33
660.78 s
[alphal00p-docs-cargo] |
660.78 s
[alphal00p-docs-cargo] 52 | pub struct MultiPrecisionInteger(RawMultiPrecisionInteger);
660.78 s
[alphal00p-docs-cargo] | ----------------------------------------------------------- similarly named struct `MultiPrecisionInteger` defined here
660.78 s
[alphal00p-docs-cargo] ...
660.78 s
[alphal00p-docs-cargo] 193 | pub fn to_raw(&self) -> RawMultiPrecisionInteger {
660.78 s
[alphal00p-docs-cargo] | ^^^^^^^^^^^^^^^^^^^^^^^^
660.78 s
[alphal00p-docs-cargo] |
660.78 s
[alphal00p-docs-cargo] help : a struct with a similar name exists
660.78 s
[alphal00p-docs-cargo] |
660.78 s
[alphal00p-docs-cargo] 193 - pub fn to_raw(&self) -> RawMultiPrecisionInteger {
660.78 s
[alphal00p-docs-cargo] 193 + pub fn to_raw(&self) -> MultiPrecisionInteger {
660.78 s
[alphal00p-docs-cargo] |
660.78 s
[alphal00p-docs-cargo]
660.78 s
[alphal00p-docs-cargo] error[E0425] : cannot find type `RawMultiPrecisionInteger` in this scope
660.78 s
[alphal00p-docs-cargo] --> /nix/store/5dfb7akvi1k3080zqfndr6jw2ay3di2p-vendor-cargo-deps/f8c6b2c844a6fa8c330abb750e4cf5bbdb36a70140a58e87f6b79fb3024532aa/numerica-3.0.0/src/domains/backend/integer.rs:199:34
660.78 s
[alphal00p-docs-cargo] |
660.78 s
[alphal00p-docs-cargo] 52 | pub struct MultiPrecisionInteger(RawMultiPrecisionInteger);
660.78 s
[alphal00p-docs-cargo] | ----------------------------------------------------------- similarly named struct `MultiPrecisionInteger` defined here
660.78 s
[alphal00p-docs-cargo] ...
660.78 s
[alphal00p-docs-cargo] 199 | pub fn into_raw(self) -> RawMultiPrecisionInteger {
660.78 s
[alphal00p-docs-cargo] | ^^^^^^^^^^^^^^^^^^^^^^^^
660.78 s
[alphal00p-docs-cargo] |
660.78 s
[alphal00p-docs-cargo] help : a struct with a similar name exists
660.78 s
[alphal00p-docs-cargo] |
660.78 s
[alphal00p-docs-cargo] 199 - pub fn into_raw(self) -> RawMultiPrecisionInteger {
660.78 s
[alphal00p-docs-cargo] 199 + pub fn into_raw(self) -> MultiPrecisionInteger {
660.78 s
[alphal00p-docs-cargo] |
660.78 s
[alphal00p-docs-cargo]
660.78 s
[alphal00p-docs-cargo] error[E0425] : cannot find type `RawMultiPrecisionInteger` in this scope
660.78 s
[alphal00p-docs-cargo] --> /nix/store/5dfb7akvi1k3080zqfndr6jw2ay3di2p-vendor-cargo-deps/f8c6b2c844a6fa8c330abb750e4cf5bbdb36a70140a58e87f6b79fb3024532aa/numerica-3.0.0/src/domains/backend/integer.rs:567:27
660.78 s
[alphal00p-docs-cargo] |
660.78 s
[alphal00p-docs-cargo] 52 | pub struct MultiPrecisionInteger(RawMultiPrecisionInteger);
660.78 s
[alphal00p-docs-cargo] | ----------------------------------------------------------- similarly named struct `MultiPrecisionInteger` defined here
660.78 s
[alphal00p-docs-cargo] ...
660.78 s
[alphal00p-docs-cargo] 567 | fn rem_trunc(lhs: RawMultiPrecisionInteger, rhs: RawMultiPrecisionInteger) -> Self {
660.78 s
[alphal00p-docs-cargo] | ^^^^^^^^^^^^^^^^^^^^^^^^
660.78 s
[alphal00p-docs-cargo] |
660.78 s
[alphal00p-docs-cargo] help : a struct with a similar name exists
660.78 s
[alphal00p-docs-cargo] |
660.78 s
[alphal00p-docs-cargo] 567 - fn rem_trunc(lhs: RawMultiPrecisionInteger , rhs: RawMultiPrecisionInteger) -> Self {
660.78 s
[alphal00p-docs-cargo] 567 + fn rem_trunc(lhs: MultiPrecisionInteger , rhs: RawMultiPrecisionInteger) -> Self {
660.78 s
[alphal00p-docs-cargo] |
660.78 s
[alphal00p-docs-cargo]
660.78 s
[alphal00p-docs-cargo] error[E0425] : cannot find type `RawMultiPrecisionInteger` in this scope
660.78 s
[alphal00p-docs-cargo] --> /nix/store/5dfb7akvi1k3080zqfndr6jw2ay3di2p-vendor-cargo-deps/f8c6b2c844a6fa8c330abb750e4cf5bbdb36a70140a58e87f6b79fb3024532aa/numerica-3.0.0/src/domains/backend/integer.rs:567:58
660.78 s
[alphal00p-docs-cargo] |
660.78 s
[alphal00p-docs-cargo] 52 | pub struct MultiPrecisionInteger(RawMultiPrecisionInteger);
660.78 s
[alphal00p-docs-cargo] | ----------------------------------------------------------- similarly named struct `MultiPrecisionInteger` defined here
660.78 s
[alphal00p-docs-cargo] ...
660.78 s
[alphal00p-docs-cargo] 567 | fn rem_trunc(lhs: RawMultiPrecisionInteger, rhs: RawMultiPrecisionInteger) -> Self {
660.78 s
[alphal00p-docs-cargo] | ^^^^^^^^^^^^^^^^^^^^^^^^
660.78 s
[alphal00p-docs-cargo] |
660.78 s
[alphal00p-docs-cargo] help : a struct with a similar name exists
660.78 s
[alphal00p-docs-cargo] |
660.78 s
[alphal00p-docs-cargo] 567 - fn rem_trunc(lhs: RawMultiPrecisionInteger, rhs: RawMultiPrecisionInteger ) -> Self {
660.78 s
[alphal00p-docs-cargo] 567 + fn rem_trunc(lhs: RawMultiPrecisionInteger, rhs: MultiPrecisionInteger ) -> Self {
660.78 s
[alphal00p-docs-cargo] |
660.78 s
[alphal00p-docs-cargo]
660.79 s
[alphal00p-docs-cargo] error[E0425] : cannot find type `RawMultiPrecisionInteger` in this scope
660.79 s
[alphal00p-docs-cargo] --> /nix/store/5dfb7akvi1k3080zqfndr6jw2ay3di2p-vendor-cargo-deps/f8c6b2c844a6fa8c330abb750e4cf5bbdb36a70140a58e87f6b79fb3024532aa/numerica-3.0.0/src/domains/backend/integer.rs:582:27
660.79 s
[alphal00p-docs-cargo] |
660.79 s
[alphal00p-docs-cargo] 52 | pub struct MultiPrecisionInteger(RawMultiPrecisionInteger);
660.79 s
[alphal00p-docs-cargo] | ----------------------------------------------------------- similarly named struct `MultiPrecisionInteger` defined here
660.79 s
[alphal00p-docs-cargo] ...
660.79 s
[alphal00p-docs-cargo] 582 | fn shl_raw(value: RawMultiPrecisionInteger, rhs: u64) -> RawMultiPrecisionInteger {
660.79 s
[alphal00p-docs-cargo] | ^^^^^^^^^^^^^^^^^^^^^^^^
660.79 s
[alphal00p-docs-cargo] |
660.79 s
[alphal00p-docs-cargo] help : a struct with a similar name exists
660.79 s
[alphal00p-docs-cargo] |
660.79 s
[alphal00p-docs-cargo] 582 - fn shl_raw(value: RawMultiPrecisionInteger , rhs: u64) -> RawMultiPrecisionInteger {
660.79 s
[alphal00p-docs-cargo] 582 + fn shl_raw(value: MultiPrecisionInteger , rhs: u64) -> RawMultiPrecisionInteger {
660.79 s
[alphal00p-docs-cargo] |
660.79 s
[alphal00p-docs-cargo]
660.79 s
[alphal00p-docs-cargo] error[E0425] : cannot find type `RawMultiPrecisionInteger` in this scope
660.79 s
[alphal00p-docs-cargo] --> /nix/store/5dfb7akvi1k3080zqfndr6jw2ay3di2p-vendor-cargo-deps/f8c6b2c844a6fa8c330abb750e4cf5bbdb36a70140a58e87f6b79fb3024532aa/numerica-3.0.0/src/domains/backend/integer.rs:582:66
660.79 s
[alphal00p-docs-cargo] |
660.79 s
[alphal00p-docs-cargo] 52 | pub struct MultiPrecisionInteger(RawMultiPrecisionInteger);
660.79 s
[alphal00p-docs-cargo] | ----------------------------------------------------------- similarly named struct `MultiPrecisionInteger` defined here
660.79 s
[alphal00p-docs-cargo] ...
660.79 s
[alphal00p-docs-cargo] 582 | fn shl_raw(value: RawMultiPrecisionInteger, rhs: u64) -> RawMultiPrecisionInteger {
660.79 s
[alphal00p-docs-cargo] | ^^^^^^^^^^^^^^^^^^^^^^^^
660.79 s
[alphal00p-docs-cargo] |
660.79 s
[alphal00p-docs-cargo] help : a struct with a similar name exists
660.79 s
[alphal00p-docs-cargo] |
660.79 s
[alphal00p-docs-cargo] 582 - fn shl_raw(value: RawMultiPrecisionInteger, rhs: u64) -> RawMultiPrecisionInteger {
660.79 s
[alphal00p-docs-cargo] 582 + fn shl_raw(value: RawMultiPrecisionInteger, rhs: u64) -> MultiPrecisionInteger {
660.79 s
[alphal00p-docs-cargo] |
660.79 s
[alphal00p-docs-cargo]
660.79 s
[alphal00p-docs-cargo] error[E0425] : cannot find type `RawMultiPrecisionInteger` in this scope
660.79 s
[alphal00p-docs-cargo] --> /nix/store/5dfb7akvi1k3080zqfndr6jw2ay3di2p-vendor-cargo-deps/f8c6b2c844a6fa8c330abb750e4cf5bbdb36a70140a58e87f6b79fb3024532aa/numerica-3.0.0/src/domains/backend/integer.rs:590:27
660.79 s
[alphal00p-docs-cargo] |
660.79 s
[alphal00p-docs-cargo] 52 | pub struct MultiPrecisionInteger(RawMultiPrecisionInteger);
660.79 s
[alphal00p-docs-cargo] | ----------------------------------------------------------- similarly named struct `MultiPrecisionInteger` defined here
660.79 s
[alphal00p-docs-cargo] ...
660.79 s
[alphal00p-docs-cargo] 590 | fn shr_raw(value: RawMultiPrecisionInteger, rhs: u64) -> RawMultiPrecisionInteger {
660.79 s
[alphal00p-docs-cargo] | ^^^^^^^^^^^^^^^^^^^^^^^^
660.79 s
[alphal00p-docs-cargo] |
660.79 s
[alphal00p-docs-cargo] help : a struct with a similar name exists
660.79 s
[alphal00p-docs-cargo] |
660.79 s
[alphal00p-docs-cargo] 590 - fn shr_raw(value: RawMultiPrecisionInteger , rhs: u64) -> RawMultiPrecisionInteger {
660.79 s
[alphal00p-docs-cargo] 590 + fn shr_raw(value: MultiPrecisionInteger , rhs: u64) -> RawMultiPrecisionInteger {
660.79 s
[alphal00p-docs-cargo] |
660.79 s
[alphal00p-docs-cargo]
660.79 s
[alphal00p-docs-cargo] error[E0425] : cannot find type `RawMultiPrecisionInteger` in this scope
660.79 s
[alphal00p-docs-cargo] --> /nix/store/5dfb7akvi1k3080zqfndr6jw2ay3di2p-vendor-cargo-deps/f8c6b2c844a6fa8c330abb750e4cf5bbdb36a70140a58e87f6b79fb3024532aa/numerica-3.0.0/src/domains/backend/integer.rs:590:66
660.79 s
[alphal00p-docs-cargo] |
660.79 s
[alphal00p-docs-cargo] 52 | pub struct MultiPrecisionInteger(RawMultiPrecisionInteger);
660.79 s
[alphal00p-docs-cargo] | ----------------------------------------------------------- similarly named struct `MultiPrecisionInteger` defined here
660.79 s
[alphal00p-docs-cargo] ...
660.79 s
[alphal00p-docs-cargo] 590 | fn shr_raw(value: RawMultiPrecisionInteger, rhs: u64) -> RawMultiPrecisionInteger {
660.79 s
[alphal00p-docs-cargo] | ^^^^^^^^^^^^^^^^^^^^^^^^
660.79 s
[alphal00p-docs-cargo] |
660.79 s
[alphal00p-docs-cargo] help : a struct with a similar name exists
660.79 s
[alphal00p-docs-cargo] |
660.79 s
[alphal00p-docs-cargo] 590 - fn shr_raw(value: RawMultiPrecisionInteger, rhs: u64) -> RawMultiPrecisionInteger {
660.79 s
[alphal00p-docs-cargo] 590 + fn shr_raw(value: RawMultiPrecisionInteger, rhs: u64) -> MultiPrecisionInteger {
660.79 s
[alphal00p-docs-cargo] |
660.79 s
[alphal00p-docs-cargo]
660.80 s
[alphal00p-docs-cargo] error[E0425] : cannot find type `RawMultiPrecisionInteger` in this scope
660.80 s
[alphal00p-docs-cargo] --> /nix/store/5dfb7akvi1k3080zqfndr6jw2ay3di2p-vendor-cargo-deps/f8c6b2c844a6fa8c330abb750e4cf5bbdb36a70140a58e87f6b79fb3024532aa/numerica-3.0.0/src/domains/backend/integer.rs:654:15
660.80 s
[alphal00p-docs-cargo] |
660.80 s
[alphal00p-docs-cargo] 52 | pub struct MultiPrecisionInteger(RawMultiPrecisionInteger);
660.80 s
[alphal00p-docs-cargo] | ----------------------------------------------------------- similarly named struct `MultiPrecisionInteger` defined here
660.80 s
[alphal00p-docs-cargo] ...
660.80 s
[alphal00p-docs-cargo] 654 | impl From<RawMultiPrecisionInteger> for MultiPrecisionInteger {
660.80 s
[alphal00p-docs-cargo] | ^^^^^^^^^^^^^^^^^^^^^^^^
660.80 s
[alphal00p-docs-cargo] |
660.80 s
[alphal00p-docs-cargo] help : a struct with a similar name exists
660.80 s
[alphal00p-docs-cargo] |
660.80 s
[alphal00p-docs-cargo] 654 - impl From<RawMultiPrecisionInteger > for MultiPrecisionInteger {
660.80 s
[alphal00p-docs-cargo] 654 + impl From<MultiPrecisionInteger > for MultiPrecisionInteger {
660.80 s
[alphal00p-docs-cargo] |
660.80 s
[alphal00p-docs-cargo] help : you might be missing a type parameter
660.80 s
[alphal00p-docs-cargo] |
660.80 s
[alphal00p-docs-cargo] 654 | impl<RawMultiPrecisionInteger> From<RawMultiPrecisionInteger> for MultiPrecisionInteger {
660.80 s
[alphal00p-docs-cargo] | ++++++++++++++++++++++++++
660.80 s
[alphal00p-docs-cargo]
660.80 s
[alphal00p-docs-cargo] error[E0425] : cannot find type `RawMultiPrecisionInteger` in this scope
660.80 s
[alphal00p-docs-cargo] --> /nix/store/5dfb7akvi1k3080zqfndr6jw2ay3di2p-vendor-cargo-deps/f8c6b2c844a6fa8c330abb750e4cf5bbdb36a70140a58e87f6b79fb3024532aa/numerica-3.0.0/src/domains/backend/integer.rs:656:24
660.80 s
[alphal00p-docs-cargo] |
660.80 s
[alphal00p-docs-cargo] 52 | pub struct MultiPrecisionInteger(RawMultiPrecisionInteger);
660.80 s
[alphal00p-docs-cargo] | ----------------------------------------------------------- similarly named struct `MultiPrecisionInteger` defined here
660.80 s
[alphal00p-docs-cargo] ...
660.80 s
[alphal00p-docs-cargo] 656 | fn from(value: RawMultiPrecisionInteger) -> Self {
660.80 s
[alphal00p-docs-cargo] | ^^^^^^^^^^^^^^^^^^^^^^^^
660.80 s
[alphal00p-docs-cargo] |
660.80 s
[alphal00p-docs-cargo] help : a struct with a similar name exists
660.80 s
[alphal00p-docs-cargo] |
660.80 s
[alphal00p-docs-cargo] 656 - fn from(value: RawMultiPrecisionInteger ) -> Self {
660.80 s
[alphal00p-docs-cargo] 656 + fn from(value: MultiPrecisionInteger ) -> Self {
660.80 s
[alphal00p-docs-cargo] |
660.80 s
[alphal00p-docs-cargo]
660.80 s
[alphal00p-docs-cargo] error[E0425] : cannot find type `RawMultiPrecisionInteger` in this scope
660.80 s
[alphal00p-docs-cargo] --> /nix/store/5dfb7akvi1k3080zqfndr6jw2ay3di2p-vendor-cargo-deps/f8c6b2c844a6fa8c330abb750e4cf5bbdb36a70140a58e87f6b79fb3024532aa/numerica-3.0.0/src/domains/backend/integer.rs:661:42
660.80 s
[alphal00p-docs-cargo] |
660.80 s
[alphal00p-docs-cargo] 52 | pub struct MultiPrecisionInteger(RawMultiPrecisionInteger);
660.80 s
[alphal00p-docs-cargo] | ----------------------------------------------------------- similarly named struct `MultiPrecisionInteger` defined here
660.80 s
[alphal00p-docs-cargo] ...
660.80 s
[alphal00p-docs-cargo] 661 | impl From<MultiPrecisionInteger> for RawMultiPrecisionInteger {
660.80 s
[alphal00p-docs-cargo] | ^^^^^^^^^^^^^^^^^^^^^^^^
660.80 s
[alphal00p-docs-cargo] |
660.80 s
[alphal00p-docs-cargo] help : a struct with a similar name exists
660.80 s
[alphal00p-docs-cargo] |
660.80 s
[alphal00p-docs-cargo] 661 - impl From<MultiPrecisionInteger> for RawMultiPrecisionInteger {
660.80 s
[alphal00p-docs-cargo] 661 + impl From<MultiPrecisionInteger> for MultiPrecisionInteger {
660.80 s
[alphal00p-docs-cargo] |
660.80 s
[alphal00p-docs-cargo]
661.17 s
[alphal00p-docs-cargo] error[E0433] : cannot find type `RawMultiPrecisionInteger` in this scope
661.17 s
[alphal00p-docs-cargo] --> /nix/store/5dfb7akvi1k3080zqfndr6jw2ay3di2p-vendor-cargo-deps/f8c6b2c844a6fa8c330abb750e4cf5bbdb36a70140a58e87f6b79fb3024532aa/numerica-3.0.0/src/domains/backend/integer.rs:620:13
661.17 s
[alphal00p-docs-cargo] |
661.17 s
[alphal00p-docs-cargo] 620 | RawMultiPrecisionInteger::from_str(s)
661.17 s
[alphal00p-docs-cargo] | ^^^^^^^^^^^^^^^^^^^^^^^^ use of undeclared type `RawMultiPrecisionInteger`
661.17 s
[alphal00p-docs-cargo] |
661.17 s
[alphal00p-docs-cargo] help : a struct with a similar name exists
661.17 s
[alphal00p-docs-cargo] |
661.17 s
[alphal00p-docs-cargo] 620 - RawMultiPrecisionInteger ::from_str(s)
661.17 s
[alphal00p-docs-cargo] 620 + MultiPrecisionInteger ::from_str(s)
661.17 s
[alphal00p-docs-cargo] |
661.17 s
[alphal00p-docs-cargo]
661.17 s
[alphal00p-docs-cargo] error[E0433] : cannot find type `RawMultiPrecisionInteger` in this scope
661.17 s
[alphal00p-docs-cargo] --> /nix/store/5dfb7akvi1k3080zqfndr6jw2ay3di2p-vendor-cargo-deps/f8c6b2c844a6fa8c330abb750e4cf5bbdb36a70140a58e87f6b79fb3024532aa/numerica-3.0.0/src/domains/backend/integer.rs:674:35
661.17 s
[alphal00p-docs-cargo] |
661.17 s
[alphal00p-docs-cargo] 674 | self.0 == RawMultiPrecisionInteger::from(*other)
661.17 s
[alphal00p-docs-cargo] | ^^^^^^^^^^^^^^^^^^^^^^^^ use of undeclared type `RawMultiPrecisionInteger`
661.17 s
[alphal00p-docs-cargo] ...
661.17 s
[alphal00p-docs-cargo] 702 | impl_cmp_primitive!(i32, i64, i128, u32, u64, u128);
661.17 s
[alphal00p-docs-cargo] | --------------------------------------------------- in this macro invocation
661.17 s
[alphal00p-docs-cargo] |
661.17 s
[alphal00p-docs-cargo] = note : this error originates in the macro `impl_cmp_primitive` (in Nightly builds, run with -Z macro-backtrace for more info)
661.17 s
[alphal00p-docs-cargo] help : a struct with a similar name exists
661.17 s
[alphal00p-docs-cargo] |
661.17 s
[alphal00p-docs-cargo] 674 - self.0 == RawMultiPrecisionInteger ::from(*other)
661.17 s
[alphal00p-docs-cargo] 674 + self.0 == MultiPrecisionInteger ::from(*other)
661.17 s
[alphal00p-docs-cargo] |
661.17 s
[alphal00p-docs-cargo]
661.17 s
[alphal00p-docs-cargo] error[E0433] : cannot find type `RawMultiPrecisionInteger` in this scope
661.17 s
[alphal00p-docs-cargo] --> /nix/store/5dfb7akvi1k3080zqfndr6jw2ay3di2p-vendor-cargo-deps/f8c6b2c844a6fa8c330abb750e4cf5bbdb36a70140a58e87f6b79fb3024532aa/numerica-3.0.0/src/domains/backend/integer.rs:681:25
661.17 s
[alphal00p-docs-cargo] |
661.17 s
[alphal00p-docs-cargo] 681 | RawMultiPrecisionInteger::from(*self) == other.0
661.17 s
[alphal00p-docs-cargo] | ^^^^^^^^^^^^^^^^^^^^^^^^ use of undeclared type `RawMultiPrecisionInteger`
661.17 s
[alphal00p-docs-cargo] ...
661.17 s
[alphal00p-docs-cargo] 702 | impl_cmp_primitive!(i32, i64, i128, u32, u64, u128);
661.17 s
[alphal00p-docs-cargo] | --------------------------------------------------- in this macro invocation
661.17 s
[alphal00p-docs-cargo] |
661.17 s
[alphal00p-docs-cargo] = note : this error originates in the macro `impl_cmp_primitive` (in Nightly builds, run with -Z macro-backtrace for more info)
661.17 s
[alphal00p-docs-cargo] help : a struct with a similar name exists
661.17 s
[alphal00p-docs-cargo] |
661.17 s
[alphal00p-docs-cargo] 681 - RawMultiPrecisionInteger ::from(*self) == other.0
661.17 s
[alphal00p-docs-cargo] 681 + MultiPrecisionInteger ::from(*self) == other.0
661.17 s
[alphal00p-docs-cargo] |
661.17 s
[alphal00p-docs-cargo]
661.17 s
[alphal00p-docs-cargo] error[E0433] : cannot find type `RawMultiPrecisionInteger` in this scope
661.17 s
[alphal00p-docs-cargo] --> /nix/store/5dfb7akvi1k3080zqfndr6jw2ay3di2p-vendor-cargo-deps/f8c6b2c844a6fa8c330abb750e4cf5bbdb36a70140a58e87f6b79fb3024532aa/numerica-3.0.0/src/domains/backend/integer.rs:688:45
661.17 s
[alphal00p-docs-cargo] |
661.17 s
[alphal00p-docs-cargo] 688 | self.0.partial_cmp(&RawMultiPrecisionInteger::from(*other))
661.17 s
[alphal00p-docs-cargo] | ^^^^^^^^^^^^^^^^^^^^^^^^ use of undeclared type `RawMultiPrecisionInteger`
661.17 s
[alphal00p-docs-cargo] ...
661.17 s
[alphal00p-docs-cargo] 702 | impl_cmp_primitive!(i32, i64, i128, u32, u64, u128);
661.17 s
[alphal00p-docs-cargo] | --------------------------------------------------- in this macro invocation
661.17 s
[alphal00p-docs-cargo] |
661.17 s
[alphal00p-docs-cargo] = note : this error originates in the macro `impl_cmp_primitive` (in Nightly builds, run with -Z macro-backtrace for more info)
661.17 s
[alphal00p-docs-cargo] help : a struct with a similar name exists
661.17 s
[alphal00p-docs-cargo] |
661.17 s
[alphal00p-docs-cargo] 688 - self.0.partial_cmp(&RawMultiPrecisionInteger ::from(*other))
661.17 s
[alphal00p-docs-cargo] 688 + self.0.partial_cmp(&MultiPrecisionInteger ::from(*other))
661.17 s
[alphal00p-docs-cargo] |
661.17 s
[alphal00p-docs-cargo]
661.17 s
[alphal00p-docs-cargo] error[E0433] : cannot find type `RawMultiPrecisionInteger` in this scope
661.17 s
[alphal00p-docs-cargo] --> /nix/store/5dfb7akvi1k3080zqfndr6jw2ay3di2p-vendor-cargo-deps/f8c6b2c844a6fa8c330abb750e4cf5bbdb36a70140a58e87f6b79fb3024532aa/numerica-3.0.0/src/domains/backend/integer.rs:695:25
661.17 s
[alphal00p-docs-cargo] |
661.17 s
[alphal00p-docs-cargo] 695 | RawMultiPrecisionInteger::from(*self).partial_cmp(&other.0)
661.17 s
[alphal00p-docs-cargo] | ^^^^^^^^^^^^^^^^^^^^^^^^ use of undeclared type `RawMultiPrecisionInteger`
661.17 s
[alphal00p-docs-cargo] ...
661.17 s
[alphal00p-docs-cargo] 702 | impl_cmp_primitive!(i32, i64, i128, u32, u64, u128);
661.17 s
[alphal00p-docs-cargo] | --------------------------------------------------- in this macro invocation
661.17 s
[alphal00p-docs-cargo] |
661.17 s
[alphal00p-docs-cargo] = note : this error originates in the macro `impl_cmp_primitive` (in Nightly builds, run with -Z macro-backtrace for more info)
661.17 s
[alphal00p-docs-cargo] help : a struct with a similar name exists
661.17 s
[alphal00p-docs-cargo] |
661.17 s
[alphal00p-docs-cargo] 695 - RawMultiPrecisionInteger ::from(*self).partial_cmp(&other.0)
661.17 s
[alphal00p-docs-cargo] 695 + MultiPrecisionInteger ::from(*self).partial_cmp(&other.0)
661.17 s
[alphal00p-docs-cargo] |
661.17 s
[alphal00p-docs-cargo]
661.17 s
[alphal00p-docs-cargo] error[E0433] : cannot find type `RawMultiPrecisionInteger` in this scope
661.17 s
[alphal00p-docs-cargo] --> /nix/store/5dfb7akvi1k3080zqfndr6jw2ay3di2p-vendor-cargo-deps/f8c6b2c844a6fa8c330abb750e4cf5bbdb36a70140a58e87f6b79fb3024532aa/numerica-3.0.0/src/domains/backend/integer.rs:1180:35
661.17 s
[alphal00p-docs-cargo] |
661.17 s
[alphal00p-docs-cargo] 1180 | MultiPrecisionInteger(RawMultiPrecisionInteger::from((&self.0) & &rhs.0))
661.17 s
[alphal00p-docs-cargo] | ^^^^^^^^^^^^^^^^^^^^^^^^ use of undeclared type `RawMultiPrecisionInteger`
661.17 s
[alphal00p-docs-cargo] |
661.17 s
[alphal00p-docs-cargo] help : a struct with a similar name exists
661.17 s
[alphal00p-docs-cargo] |
661.17 s
[alphal00p-docs-cargo] 1180 - MultiPrecisionInteger(RawMultiPrecisionInteger ::from((&self.0) & &rhs.0))
661.17 s
[alphal00p-docs-cargo] 1180 + MultiPrecisionInteger(MultiPrecisionInteger ::from((&self.0) & &rhs.0))
661.17 s
[alphal00p-docs-cargo] |
661.17 s
[alphal00p-docs-cargo]
661.17 s
[alphal00p-docs-cargo] error[E0433] : cannot find type `RawMultiPrecisionInteger` in this scope
661.17 s
[alphal00p-docs-cargo] --> /nix/store/5dfb7akvi1k3080zqfndr6jw2ay3di2p-vendor-cargo-deps/f8c6b2c844a6fa8c330abb750e4cf5bbdb36a70140a58e87f6b79fb3024532aa/numerica-3.0.0/src/domains/backend/integer.rs:1212:35
661.17 s
[alphal00p-docs-cargo] |
661.17 s
[alphal00p-docs-cargo] 1212 | MultiPrecisionInteger(RawMultiPrecisionInteger::from(-&self.0))
661.17 s
[alphal00p-docs-cargo] | ^^^^^^^^^^^^^^^^^^^^^^^^ use of undeclared type `RawMultiPrecisionInteger`
661.17 s
[alphal00p-docs-cargo] |
661.17 s
[alphal00p-docs-cargo] help : a struct with a similar name exists
661.17 s
[alphal00p-docs-cargo] |
661.17 s
[alphal00p-docs-cargo] 1212 - MultiPrecisionInteger(RawMultiPrecisionInteger ::from(-&self.0))
661.17 s
[alphal00p-docs-cargo] 1212 + MultiPrecisionInteger(MultiPrecisionInteger ::from(-&self.0))
661.17 s
[alphal00p-docs-cargo] |
661.17 s
[alphal00p-docs-cargo]
661.17 s
[alphal00p-docs-cargo] error[E0425] : cannot find function `write_lsf_bytes` in this scope
661.17 s
[alphal00p-docs-cargo] --> /nix/store/5dfb7akvi1k3080zqfndr6jw2ay3di2p-vendor-cargo-deps/f8c6b2c844a6fa8c330abb750e4cf5bbdb36a70140a58e87f6b79fb3024532aa/numerica-3.0.0/src/domains/backend/integer.rs:1682:5
661.17 s
[alphal00p-docs-cargo] |
661.17 s
[alphal00p-docs-cargo] 1682 | write_lsf_bytes(value, &mut bytes);
661.17 s
[alphal00p-docs-cargo] | ^^^^^^^^^^^^^^^ not found in this scope
661.17 s
[alphal00p-docs-cargo]
661.17 s
[alphal00p-docs-cargo] Some errors have detailed explanations: E0425, E0432, E0433.
661.17 s
[alphal00p-docs-cargo] For more information about an error, try `rustc --explain E0425`.
661.18 s
[alphal00p-docs-cargo] error : could not compile `numerica` (lib) due to 29 previous errors
661.18 s
[alphal00p-docs-cargo] warning : build failed, waiting for other jobs to finish...
834.71 s
Progress: 0 of 1 built (1 failed)
834.71 s
Failed to build alphal00p-docs-cargo after 13m51s
834.75 s
Cannot build ' /nix/store/623idw7bxrdblwflbqi3k630cvnna0if-alphal00p-docs-cargo-0.1.0.drv '.
834.75 s
Reason: builder failed with exit code 101 .
834.75 s
Output paths:
834.75 s
/nix/store/rh9khp691qr9mzy0lnbbniym9gpm688f-alphal00p-docs-cargo-0.1.0
834.75 s
Last 1200 log lines:
834.75 s
> cargoArtifacts not set, will not reuse any cargo artifacts
834.75 s
> Running phase: unpackPhase
834.75 s
> unpacking source archive /nix/store/zw5i19nvfc6y8mffi47icfczb0q4x6ip-source
834.75 s
> source root is source
834.75 s
> Running phase: patchPhase
834.75 s
> Executing configureCargoCommonVars
834.75 s
> Running phase: updateAutotoolsGnuConfigScriptsPhase
834.75 s
> Running phase: configurePhase
834.75 s
> will append /build/source/.cargo-home/config.toml with contents of /nix/store/5dfb7akvi1k3080zqfndr6jw2ay3di2p-vendor-cargo-deps/config.toml
834.75 s
> default configurePhase, nothing to do
834.75 s
> Running phase: buildPhase
834.75 s
> +++ command cargo --version
834.75 s
> cargo 1.98.1 (797e8a9bc 2026-08-05)
834.75 s
> +++ command cargo build --profile docs --locked -p alphal00p-docs-catalogs --bin alphal00p-docs-catalogs
834.75 s
> Compiling proc-macro2 v1.0.106
834.75 s
> Compiling quote v1.0.45
834.75 s
> Compiling unicode-ident v1.0.24
834.75 s
> Compiling serde_core v1.0.228
834.75 s
> Compiling memchr v2.8.0
834.75 s
> Compiling zmij v1.0.21
834.75 s
> Compiling utf8parse v0.2.2
834.75 s
> Compiling serde_json v1.0.149
834.75 s
> Compiling serde v1.0.228
834.75 s
> Compiling thiserror v2.0.18
834.75 s
> Compiling anstyle-query v1.1.5
834.75 s
> Compiling anstyle v1.0.14
834.75 s
> Compiling colorchoice v1.0.5
834.75 s
> Compiling is_terminal_polyfill v1.70.2
834.75 s
> Compiling hashbrown v0.17.1
834.75 s
> Compiling heck v0.5.0
834.75 s
> Compiling anstyle-parse v1.0.0
834.75 s
> Compiling itoa v1.0.18
834.75 s
> Compiling clap_lex v1.1.0
834.75 s
> Compiling strsim v0.11.1
834.75 s
> Compiling eyre v0.6.12
834.75 s
> Compiling regex-syntax v0.8.10
834.75 s
> Compiling equivalent v1.0.2
834.75 s
> Compiling indenter v0.3.4
834.75 s
> Compiling once_cell v1.21.4
834.75 s
> Compiling anstream v1.0.0
834.75 s
> Compiling aho-corasick v1.1.4
834.75 s
> Compiling clap_builder v4.6.0
834.75 s
> Compiling syn v2.0.117
834.75 s
> Compiling regex-automata v0.4.14
834.75 s
> Compiling indexmap v2.14.0
834.75 s
> Compiling thiserror-impl v2.0.18
834.75 s
> Compiling serde_derive v1.0.228
834.75 s
> Compiling clap_derive v4.6.1
834.75 s
> Compiling alphal00p-docs-macros v0.1.0 (/build/source/crates/alphal00p-docs-macros)
834.75 s
> Compiling regex v1.12.3
834.75 s
> Compiling clap v4.6.1
834.75 s
> Compiling alphal00p-docs-schema v0.1.0 (/build/source/crates/alphal00p-docs-schema)
834.75 s
> Compiling alphal00p-docs-catalogs v0.1.0 (/build/source/crates/alphal00p-docs-catalogs)
834.75 s
> Finished `docs` profile [unoptimized] target(s) in 11.72s
834.75 s
> +++ command cargo build --profile docs --locked -p alphal00p-docs-python-exporter --features gammaloop
834.75 s
> Compiling serde_core v1.0.228
834.75 s
> Compiling libc v0.2.186
834.75 s
> Compiling cfg-if v1.0.4
834.75 s
> Compiling serde v1.0.228
834.75 s
> Compiling memchr v2.8.0
834.75 s
> Compiling autocfg v1.5.0
834.75 s
> Compiling libm v0.2.16
834.75 s
> Compiling version_check v0.9.5
834.75 s
> Compiling either v1.15.0
834.75 s
> Compiling zerocopy v0.8.48
834.75 s
> Compiling crossbeam-utils v0.8.21
834.75 s
> Compiling log v0.4.29
834.75 s
> Compiling unicode-width v0.2.2
834.75 s
> Compiling rayon-core v1.13.0
834.75 s
> Compiling foldhash v0.2.0
834.75 s
> Compiling syn v2.0.117
834.75 s
> Compiling syn v3.0.4
834.75 s
> Compiling target-lexicon v0.13.5
834.75 s
> Compiling serde_json v1.0.149
834.75 s
> Compiling lazy_static v1.5.0
834.75 s
> Compiling siphasher v1.0.2
834.75 s
> Compiling crunchy v0.2.4
834.75 s
> Compiling getrandom v0.3.4
834.75 s
> Compiling num-traits v0.2.19
834.75 s
> Compiling paste v1.0.15
834.75 s
> Compiling anyhow v1.0.102
834.75 s
> Compiling tiny-keccak v2.0.2
834.75 s
> Compiling itertools v0.14.0
834.75 s
> Compiling static_assertions v1.1.0
834.75 s
> Compiling aho-corasick v1.1.4
834.75 s
> Compiling time-core v0.1.8
834.75 s
> Compiling num-conv v0.2.1
834.75 s
> Compiling powerfmt v0.2.0
834.75 s
> Compiling rustix v1.1.4
834.75 s
> Compiling time-macros v0.2.27
834.75 s
> Compiling num_threads v0.1.7
834.75 s
> Compiling deranged v0.5.8
834.75 s
> Compiling linux-raw-sys v0.12.1
834.75 s
> Compiling allocator-api2 v0.2.21
834.75 s
> Compiling crossbeam-epoch v0.9.18
834.75 s
> Compiling tracing-core v0.1.36
834.75 s
> Compiling arrayvec v0.7.6
834.75 s
> Compiling crossbeam-deque v0.8.6
834.75 s
> Compiling hashbrown v0.16.1
834.75 s
> Compiling virtue v0.0.18
834.75 s
> Compiling pyo3-build-config v0.28.3
834.75 s
> Compiling winnow v1.0.2
834.75 s
> Compiling phf_shared v0.11.3
834.75 s
> Compiling gmp-mpfr-sys v1.7.1
834.75 s
> Compiling toml_writer v1.1.1+spec-1.1.0
834.75 s
> Compiling unty v0.0.4
834.75 s
> Compiling pin-project-lite v0.2.17
834.75 s
> Compiling nu-ansi-term v0.50.3
834.75 s
> Compiling tracing-log v0.2.0
834.75 s
> Compiling regex-automata v0.4.14
834.75 s
> Compiling matrixmultiply v0.3.10
834.75 s
> Compiling sharded-slab v0.1.7
834.75 s
> Compiling getrandom v0.2.17
834.75 s
> Compiling rayon v1.12.0
834.75 s
> Compiling rand_core v0.6.4
834.75 s
> Compiling time v0.3.47
834.75 s
> Compiling bincode_derive v2.0.1
834.75 s
> Compiling rand_core v0.9.5
834.75 s
> Compiling hashbrown v0.17.1
834.75 s
> Compiling thread_local v1.1.9
834.75 s
> Compiling syn v1.0.109
834.75 s
> Compiling typenum v1.20.0
834.75 s
> Compiling rug v1.30.0
834.75 s
> Compiling option-ext v0.2.0
834.75 s
> Compiling toml_parser v1.1.2+spec-1.1.0
834.75 s
> Compiling dirs-sys v0.5.0
834.75 s
> Compiling alloc-no-stdlib v2.0.4
834.75 s
> Compiling az v1.3.0
834.75 s
> Compiling dyn-clone v1.0.20
834.75 s
> Compiling fnv v1.0.7
834.75 s
> Compiling num-integer v0.1.46
834.75 s
> Compiling approx v0.5.1
834.75 s
> Compiling num-complex v0.4.6
834.75 s
> Compiling rawpointer v0.2.1
834.75 s
> Compiling alloc-stdlib v0.2.2
834.75 s
> Compiling generic-array v0.14.7
834.75 s
> Compiling colored v3.1.1
834.75 s
> Compiling pyo3-ffi v0.28.3
834.75 s
> Compiling pyo3-macros-backend v0.28.3
834.75 s
> Compiling num-bigint v0.4.6
834.75 s
> Compiling bitflags v1.3.2
834.75 s
> Compiling errno v0.3.14
834.75 s
> Compiling getopts v0.2.24
834.75 s
> Compiling ident_case v1.0.1
834.75 s
> Compiling signal-hook v0.3.18
834.75 s
> Compiling parking_lot_core v0.9.12
834.75 s
> Compiling same-file v1.0.6
834.75 s
> Compiling walkdir v2.5.0
834.75 s
> Compiling signal-hook-registry v1.4.8
834.75 s
> Compiling region v3.0.2
834.75 s
> Compiling const-random-macro v0.1.16
834.75 s
> Compiling hugepage-rs v0.1.1
834.75 s
> Compiling wasmtime-jit-icache-coherence v34.0.2
834.75 s
> Compiling vte v0.14.1
834.75 s
> Compiling smartstring v1.0.1
834.75 s
> Compiling ahash v0.8.12
834.75 s
> Compiling spec_math v0.1.6
834.75 s
> Compiling unic-char-range v0.9.0
834.75 s
> Compiling bytemuck_derive v1.12.0
834.75 s
> Compiling inventory v0.3.24
834.75 s
> Compiling scopeguard v1.2.0
834.75 s
> Compiling unic-common v0.9.0
834.75 s
> Compiling lock_api v0.4.14
834.75 s
> Compiling matchers v0.2.0
834.75 s
> Compiling regex v1.12.3
834.75 s
> Compiling unic-ucd-version v0.9.0
834.75 s
> Compiling bitflags v2.11.1
834.75 s
> Compiling serde_spanned v1.1.1
834.75 s
> Compiling toml_datetime v1.1.1+spec-1.1.0
834.75 s
> Compiling unic-char-property v0.9.0
834.75 s
> Compiling const-random v0.1.18
834.75 s
> Compiling brotli-decompressor v5.0.0
834.75 s
> Compiling toml v1.1.2+spec-1.1.0
834.75 s
> Compiling mio v1.2.0
834.75 s
> Compiling rustpython-parser-vendored v0.4.0
834.75 s
> Compiling itertools v0.11.0
834.75 s
> Compiling minimal-lexical v0.2.1
834.75 s
> Compiling rustix v0.38.44
834.75 s
> Compiling fastrand v2.4.1
834.75 s
> Compiling unicase v2.9.0
834.75 s
> Compiling winnow v0.7.15
834.75 s
> Compiling indenter v0.3.4
834.75 s
> Compiling iana-time-zone v0.1.65
834.75 s
> Compiling nom v7.1.3
834.75 s
> Compiling signal-hook-mio v0.2.5
834.75 s
> Compiling synstructure v0.13.2
834.75 s
> Compiling indexmap v2.14.0
834.75 s
> Compiling block-buffer v0.10.4
834.75 s
> Compiling brotli v8.0.2
834.75 s
> Compiling crypto-common v0.1.7
834.75 s
> Compiling numpy v0.28.0
834.75 s
> Compiling bytemuck v1.25.0
834.75 s
> Compiling directories v6.0.0
834.75 s
> Compiling phf v0.11.3
834.75 s
> Compiling libloading v0.9.0
834.75 s
> Compiling safe_arch v0.7.4
834.75 s
> Compiling safe_arch v1.2.0
834.75 s
> Compiling append-only-vec v0.1.8
834.75 s
> Compiling rustc-hash v2.1.2
834.75 s
> Compiling unicode-segmentation v1.13.2
834.75 s
> Compiling self_cell v1.2.2
834.75 s
> Compiling tinyjson v2.5.1
834.75 s
> Compiling data-encoding v2.11.1
834.75 s
> Compiling ed25519-compact v2.4.2
834.75 s
> Compiling wide v1.7.0
834.75 s
> Compiling bytes v1.11.1
834.75 s
> Compiling byteorder v1.5.0
834.75 s
> Compiling linux-raw-sys v0.4.15
834.75 s
> Compiling digest v0.10.7
834.75 s
> Compiling wide v0.7.33
834.75 s
> Compiling serde_derive v1.0.228
834.75 s
> Compiling zerocopy-derive v0.8.48
834.75 s
> Compiling tracing-attributes v0.1.31
834.75 s
> Compiling thiserror-impl v2.0.18
834.75 s
> Compiling is-macro v0.3.7
834.75 s
> Compiling terminal_size v0.4.4
834.75 s
> Compiling strum_macros v0.27.2
834.75 s
> Compiling zerofrom-derive v0.1.7
834.75 s
> Compiling clap_builder v4.6.0
834.75 s
> Compiling clap_derive v4.6.1
834.75 s
> Compiling ansitok v0.3.0
834.75 s
> Compiling rustpython-parser-core v0.4.0
834.75 s
> Compiling rustpython-ast v0.4.0
834.75 s
> Compiling thiserror v2.0.18
834.75 s
> Compiling yoke-derive v0.8.2
834.75 s
> Compiling tracing v0.1.44
834.75 s
> Compiling unic-ucd-ident v0.9.0
834.75 s
> Compiling simba v0.9.1
834.75 s
> Compiling unic-emoji-char v0.9.0
834.75 s
> Compiling pyo3 v0.28.3
834.75 s
> Compiling bstr v1.12.1
834.75 s
> Compiling zerofrom v0.1.8
834.75 s
> Compiling phf_shared v0.13.1
834.75 s
> Compiling stable_deref_trait v1.2.1
834.75 s
> Compiling getrandom v0.4.2
834.75 s
> Compiling plotters-backend v0.3.7
834.75 s
> Compiling rustc-hash v1.1.0
834.75 s
> Compiling typeid v1.0.3
834.75 s
> Compiling cpufeatures v0.2.17
834.75 s
> Compiling ciborium-io v0.2.2
834.75 s
> Compiling lalrpop-util v0.20.2
834.75 s
> Compiling sha2 v0.10.9
834.75 s
> Compiling plotters-svg v0.3.7
834.75 s
> Compiling eyre v0.6.12
834.75 s
> Compiling num-rational v0.4.2
834.75 s
> Compiling toml_datetime v0.7.5+spec-1.1.0
834.75 s
> Compiling globset v0.4.18
834.75 s
> Compiling zerovec-derive v0.11.6
834.75 s
> Compiling console v0.16.3
834.75 s
> Compiling yoke v0.8.3
834.75 s
> Compiling itertools v0.10.5
834.75 s
> Compiling ucd-trie v0.1.7
834.75 s
> Compiling clap v4.6.1
834.75 s
> Compiling cast v0.3.0
834.75 s
> Compiling rustversion v1.0.22
834.75 s
> Compiling strum v0.27.2
834.75 s
> Compiling adler2 v2.0.1
834.75 s
> Compiling simd-adler32 v0.3.10
834.75 s
> Compiling symbolica v2.2.0 (https://github.com/symbolica-dev/symbolica?rev=ba3737137c2a2ccd7bb39f0441837d38ec867e78#ba373713)
834.75 s
> Compiling toml_write v0.1.2
834.75 s
> Compiling pest v2.8.6
834.75 s
> Compiling rust-embed-utils v8.11.0
834.75 s
> Compiling miniz_oxide v0.8.9
834.75 s
> Compiling toml v0.9.12+spec-1.1.0
834.75 s
> Compiling plotters v0.3.7
834.75 s
> Compiling ansi-str v0.9.0
834.75 s
> Compiling displaydoc v0.2.7
834.75 s
> Compiling ndarray v0.17.2
834.75 s
> Compiling is-terminal v0.4.17
834.75 s
> Compiling slotmap v1.1.1
834.75 s
> Compiling anes v0.1.6
834.75 s
> Compiling maplit v1.0.2
834.75 s
> Compiling pyo3-macros v0.28.3
834.75 s
> Compiling bytecount v0.6.9
834.75 s
> Compiling oorandom v11.1.5
834.75 s
> Compiling criterion-plot v0.5.0
834.75 s
> Compiling papergrid v0.18.0
834.75 s
> Compiling tempfile v3.27.0
834.75 s
> Compiling testing_table v0.3.0
834.75 s
> Compiling tabled_derive v0.12.0
834.75 s
> Compiling toml_edit v0.25.11+spec-1.1.0
834.75 s
> Compiling similar v2.7.0
834.75 s
> Compiling proc-macro2-diagnostics v0.10.1
834.75 s
> Compiling pest_meta v2.8.6
834.75 s
> Compiling proc-macro-error-attr v1.0.4
834.75 s
> Compiling uncased v0.9.10
834.75 s
> Compiling smallvec v1.15.1
834.75 s
> Compiling bincode v2.0.1
834.75 s
> Compiling tracing-serde v0.2.0
834.75 s
> Compiling tracing-subscriber v0.3.23
834.75 s
> Compiling chrono v0.4.44
834.75 s
> Compiling serde_spanned v0.6.9
834.75 s
> Compiling parking_lot v0.12.5
834.75 s
> Compiling toml_datetime v0.6.11
834.75 s
> Compiling toml_edit v0.22.27
834.75 s
> Compiling xprec v0.2.2
834.75 s
> Compiling crossterm v0.28.1
834.75 s
> Compiling zerovec v0.11.8
834.75 s
> Compiling bincode-trait-derive v0.1.1
834.75 s
> Compiling tinytemplate v1.2.1
834.75 s
> Compiling ron v0.12.1
834.75 s
> Compiling tabled v0.22.0
834.75 s
> Compiling pest_generator v2.8.6
834.75 s
> Compiling slab v0.4.12
834.75 s
> Compiling tinystr v0.8.4
834.75 s
> Compiling strsim v0.10.0
834.75 s
> Compiling unic-langid-impl v0.9.6
834.75 s
> Compiling insta v1.47.2
834.75 s
> Compiling radium v0.7.0
834.75 s
> Compiling darling_core v0.14.4
834.75 s
> Compiling darling_core v0.23.0
834.75 s
> Compiling figment v0.10.19
834.75 s
> Compiling proc-macro-error v1.0.4
834.75 s
> Compiling ryu v1.0.23
834.75 s
> Compiling tap v1.0.1
834.75 s
> Compiling pest_derive v2.8.6
834.75 s
> Compiling wyz v0.5.1
834.75 s
> Compiling ppv-lite86 v0.2.21
834.75 s
> Compiling half v2.7.1
834.75 s
> Compiling ciborium-ll v0.2.2
834.75 s
> Compiling castaway v0.2.4
834.75 s
> Compiling rand_chacha v0.3.1
834.75 s
> Compiling rand_chacha v0.9.0
834.75 s
> Compiling ciborium v0.2.2
834.75 s
> Compiling rand v0.8.6
834.75 s
> Compiling rand v0.9.4
834.75 s
> Compiling toml v0.8.23
834.75 s
> Compiling instability v0.3.12
834.75 s
> Compiling criterion v0.5.1
834.75 s
> Compiling find-msvc-tools v0.1.9
834.75 s
> Compiling shlex v1.3.0
834.75 s
> Compiling symjit v2.25.6
834.75 s
> Compiling phf_generator v0.11.3
834.75 s
> Compiling indoc v2.0.7
834.75 s
> Compiling funty v2.0.0
834.75 s
> Compiling phf_codegen v0.11.3
834.75 s
> Compiling heck v0.4.1
834.75 s
> Compiling unicode_names2_generator v1.3.0
834.75 s
> Compiling rustpython-parser v0.4.0
834.75 s
> Compiling cc v1.2.61
834.75 s
> Compiling darling_macro v0.14.4
834.75 s
> Compiling bitvec v1.0.1
834.75 s
> Compiling compact_str v0.9.0
834.75 s
> Compiling duplicate v2.0.1
834.75 s
> Compiling dot-parser v0.5.1
834.75 s
> Compiling unicode_names2 v1.3.0
834.75 s
> Compiling darling v0.14.4
834.75 s
> Compiling darling_macro v0.23.0
834.75 s
> Compiling kasuari v0.4.12
834.75 s
> Compiling serde_repr v0.1.20
834.75 s
> Compiling unicode-truncate v2.0.1
834.75 s
> Compiling convert_case v0.10.0
834.75 s
> Compiling env_filter v1.0.1
834.75 s
> Compiling num-iter v0.1.45
834.75 s
> Compiling lru v0.16.4
834.75 s
> Compiling jiff v0.2.24
834.75 s
> Compiling convert_case v0.4.0
834.75 s
> Compiling ref-ops v0.2.5
834.75 s
> Compiling blake3 v1.8.5
834.75 s
> Compiling darling v0.23.0
834.75 s
> Compiling ratatui-core v0.1.0
834.75 s
> Compiling num v0.4.3
834.75 s
> Compiling derive_more-impl v2.1.1
834.75 s
> Compiling derive_more v0.99.20
834.75 s
> Compiling derive_builder_core v0.11.2
834.75 s
> Compiling duplicate v1.0.0
834.75 s
> Compiling enum-try-as-inner v0.1.1
834.75 s
> Compiling delegate v0.12.0
834.75 s
> Compiling rand_xoshiro v0.6.0
834.75 s
> Compiling features v0.10.0
834.75 s
> Compiling colored v2.2.0
834.75 s
> Compiling litrs v1.0.0
834.75 s
> Compiling portable-atomic v1.13.1
834.75 s
> Compiling owo-colors v4.3.0
834.75 s
> Compiling cfg_aliases v0.2.1
834.75 s
> Compiling thiserror v1.0.69
834.75 s
> Compiling constcat v0.5.1
834.75 s
> Compiling object v0.37.3
834.75 s
> Compiling gat-lending-iterator v0.1.8
834.75 s
> Compiling nix v0.31.2
834.75 s
> Compiling derive_more v2.1.1
834.75 s
> Compiling rand_distr v0.4.3
834.75 s
> Compiling derive_builder_macro v0.11.2
834.75 s
> Compiling simba v0.6.0
834.75 s
> Compiling document-features v0.2.12
834.75 s
> Compiling phf_generator v0.13.1
834.75 s
> Compiling nalgebra-macros v0.1.0
834.75 s
> Compiling thiserror-impl v1.0.69
834.75 s
> Compiling line-clipping v0.3.7
834.75 s
> Compiling dirs v6.0.0
834.75 s
> Compiling vte v0.15.0
834.75 s
> Compiling joinery v2.1.0
834.75 s
> Compiling clarabel v0.11.1
834.75 s
> Compiling ref-cast v1.0.25
834.75 s
> Compiling gimli v0.32.3
834.75 s
> Compiling cpufeatures v0.3.0
834.75 s
> Compiling arrayref v0.3.9
834.75 s
> Compiling constant_time_eq v0.4.2
834.75 s
> Compiling color-spantrace v0.3.0
834.75 s
> Compiling crossterm v0.29.0
834.75 s
> Compiling derive_builder v0.11.2
834.75 s
> Compiling titlecase v2.2.1
834.75 s
> Compiling vt100 v0.16.2
834.75 s
> Compiling ratatui-widgets v0.3.0
834.75 s
> Compiling phf_macros v0.13.1
834.75 s
> Compiling tracing-error v0.2.1
834.75 s
> Compiling serde-big-array v0.5.1
834.75 s
> Compiling enum_dispatch v0.3.13
834.75 s
> Compiling ref-cast-impl v1.0.25
834.75 s
> Compiling env_logger v0.11.10
834.75 s
> Compiling delegate v0.13.5
834.75 s
> Compiling serde_derive_internals v0.29.1
834.75 s
> Compiling amd v0.2.2
834.75 s
> Compiling subprocess v0.2.15
834.75 s
> Compiling rust_lisp v0.18.0
834.75 s
> Compiling rustc-demangle v0.1.27
834.75 s
> Compiling base64 v0.22.1
834.75 s
> Compiling semver v1.0.28
834.75 s
> Compiling vakint v0.1.2 (/build/source/crates/vakint)
834.75 s
> Compiling unit-prefix v0.5.2
834.75 s
> Compiling deprecate-until v1.0.0
834.75 s
> Compiling string-template-plus v0.4.3
834.75 s
> Compiling indicatif v0.18.4
834.75 s
> Compiling ratatui-macros v0.7.0
834.75 s
> Compiling phf v0.13.1
834.75 s
> Compiling ratatui-crossterm v0.1.0
834.75 s
> Compiling shellexpand v3.1.2
834.75 s
> Compiling xpct v0.5.1
834.75 s
> Compiling brotli-decompressor v4.0.3
834.75 s
> Compiling integer-sqrt v0.1.5
834.75 s
> Compiling crossbeam-channel v0.5.15
834.75 s
> Compiling schemars_derive v1.2.1
834.75 s
> Compiling itertools v0.12.1
834.75 s
> Compiling include_dir_macros v0.7.4
834.75 s
> Compiling gammaloop-tracing-filter-macros v0.1.0 (/build/source/crates/gammaloop-tracing-filter-macros)
834.75 s
> Compiling version-compare v0.2.1
834.75 s
> Compiling addr2line v0.25.1
834.75 s
> Compiling gammalooprs v0.3.4 (/build/source/crates/gammalooprs)
834.75 s
> Compiling symlink v0.1.0
834.75 s
> Compiling unsafe-libyaml v0.2.11
834.75 s
> Compiling tracing-appender v0.2.5
834.75 s
> Compiling tracing-indicatif v0.3.14
834.75 s
> Compiling include_dir v0.7.4
834.75 s
> Compiling pathfinding v4.15.0
834.75 s
> Compiling brotli v7.0.0
834.75 s
> Compiling rust-embed-impl v8.11.0
834.75 s
> Compiling ctrlc v3.5.2
834.75 s
> Compiling ratatui v0.30.0
834.75 s
> Compiling json5 v0.4.1
834.75 s
> Compiling typed-index-collections v3.5.0
834.75 s
> Compiling strum_macros v0.26.4
834.75 s
> Compiling vectorize v0.2.0
834.75 s
> Compiling clap_complete v4.6.3
834.75 s
> Compiling fd-lock v4.0.4
834.75 s
> Compiling nalgebra v0.29.0
834.75 s
> Compiling serde_yaml v0.9.34+deprecated
834.75 s
> Compiling strip-ansi-escapes v0.2.1
834.75 s
> Compiling gammaloop-api v0.1.0 (/build/source/crates/gammaloop-api)
834.75 s
> Compiling itertools v0.13.0
834.75 s
> Compiling strum v0.26.3
834.75 s
> Compiling backtrace v0.3.76
834.75 s
> Compiling base62 v2.2.4
834.75 s
> Compiling ringbuffer v0.16.0
834.75 s
> Compiling clap_complete_nushell v4.6.0
834.75 s
> Compiling sysinfo v0.33.1
834.75 s
> Compiling schemars v1.2.1
834.75 s
> Compiling rust-embed v8.11.0
834.75 s
> Compiling color-eyre v0.6.5
834.75 s
> Compiling pyo3-stub-gen-derive v0.17.2
834.75 s
> Compiling reedline v0.42.0
834.75 s
> Compiling pyo3-stub-gen v0.17.2
834.75 s
> Compiling statrs v0.16.1
834.75 s
> Compiling momtrop v0.3.0
834.75 s
> Compiling numerica v3.0.0 (https://github.com/symbolica-dev/symbolica?rev=ba3737137c2a2ccd7bb39f0441837d38ec867e78#ba373713)
834.75 s
> Compiling graphica v3.0.0 (https://github.com/symbolica-dev/symbolica?rev=ba3737137c2a2ccd7bb39f0441837d38ec867e78#ba373713)
834.75 s
> Compiling symbolica-utils v0.1.0 (/build/source/crates/symbolica-utils)
834.75 s
> Compiling gammaloop-workspace-hack v0.1.0 (/build/source/crates/gammaloop-workspace-hack)
834.75 s
> Compiling spenso-macros v0.3.2 (/build/source/crates/spenso-macros)
834.75 s
> Compiling linnet v0.17.0 (/build/source/crates/linnet)
834.75 s
> Compiling spenso v0.6.0 (/build/source/crates/spenso)
834.75 s
> Compiling idenso v0.3.0 (/build/source/crates/idenso)
834.75 s
> Compiling gammaloop-tracing-filter v0.1.0 (/build/source/crates/gammaloop-tracing-filter)
834.75 s
> Compiling spenso-hep-lib v0.1.7 (/build/source/crates/spenso-hep-lib)
834.75 s
> Compiling alphal00p-docs-python-exporter v0.1.0 (/build/source/crates/alphal00p-docs-python-exporter)
834.75 s
> Finished `docs` profile [unoptimized] target(s) in 6m 39s
834.75 s
> +++ command cargo build --profile docs --locked -p alphal00p-docs-python-exporter --features linnet
834.75 s
> Compiling libc v0.2.186
834.75 s
> Compiling serde_core v1.0.228
834.75 s
> Compiling zerocopy v0.8.48
834.75 s
> Compiling log v0.4.29
834.75 s
> Compiling num-traits v0.2.19
834.75 s
> Compiling syn v1.0.109
834.75 s
> Compiling syn v2.0.117
834.75 s
> Compiling ahash v0.7.8
834.75 s
> Compiling bytecheck v0.6.12
834.75 s
> Compiling regex-syntax v0.8.10
834.75 s
> Compiling simdutf8 v0.1.5
834.75 s
> Compiling rend v0.4.2
834.75 s
> Compiling indexmap v2.14.0
834.75 s
> Compiling figment v0.10.19
834.75 s
> Compiling ahash v0.8.12
834.75 s
> Compiling cgmath v0.18.0
834.75 s
> Compiling either v1.15.0
834.75 s
> Compiling rkyv v0.7.46
834.75 s
> Compiling itertools v0.11.0
834.75 s
> Compiling bincode v2.0.1
834.75 s
> Compiling pyo3 v0.28.3
834.75 s
> Compiling venial v0.5.0
834.75 s
> Compiling winnow v1.0.2
834.75 s
> Compiling arrayvec v0.7.6
834.75 s
> Compiling rustix v1.1.4
834.75 s
> Compiling seahash v4.1.0
834.75 s
> Compiling polycool v0.4.0
834.75 s
> Compiling bitflags v2.11.1
834.75 s
> Compiling toml_writer v1.1.1+spec-1.1.0
834.75 s
> Compiling winnow v0.7.15
834.75 s
> Compiling toml_parser v1.1.2+spec-1.1.0
834.75 s
> Compiling smallvec v1.15.1
834.75 s
> Compiling linnet-py v0.1.0 (/build/source/crates/linnet-py)
834.75 s
> Compiling wasm-minimal-protocol v0.2.0
834.75 s
> Compiling num-integer v0.1.46
834.75 s
> Compiling approx v0.4.0
834.75 s
> Compiling kurbo v0.13.1
834.75 s
> Compiling num-complex v0.4.6
834.75 s
> Compiling regex-automata v0.4.14
834.75 s
> Compiling chrono v0.4.44
834.75 s
> Compiling num-bigint v0.4.6
834.75 s
> Compiling getrandom v0.2.17
834.75 s
> Compiling dirs-sys v0.5.0
834.75 s
> Compiling pyo3-ffi v0.28.3
834.75 s
> Compiling rand_core v0.6.4
834.75 s
> Compiling const-random-macro v0.1.16
834.75 s
> Compiling dirs v6.0.0
834.75 s
> Compiling hashbrown v0.12.3
834.75 s
> Compiling shellexpand v3.1.2
834.75 s
> Compiling getrandom v0.4.2
834.75 s
> Compiling const-random v0.1.18
834.75 s
> Compiling tempfile v3.27.0
834.75 s
> Compiling toml_datetime v0.7.5+spec-1.1.0
834.75 s
> Compiling serde_spanned v1.1.1
834.75 s
> Compiling serde_json v1.0.149
834.75 s
> Compiling toml v0.9.12+spec-1.1.0
834.75 s
> Compiling globset v0.4.18
834.75 s
> Compiling ptr_meta_derive v0.1.4
834.75 s
> Compiling bytecheck_derive v0.6.12
834.75 s
> Compiling rkyv_derive v0.7.46
834.75 s
> Compiling rust-embed-utils v8.11.0
834.75 s
> Compiling pest_generator v2.8.6
834.75 s
> Compiling proc-macro2-diagnostics v0.10.1
834.75 s
> Compiling pyo3-macros-backend v0.28.3
834.75 s
> Compiling ptr_meta v0.1.4
834.75 s
> Compiling zerocopy-derive v0.8.48
834.75 s
> Compiling serde_derive v1.0.228
834.75 s
> Compiling is-macro v0.3.7
834.75 s
> Compiling thiserror-impl v2.0.18
834.75 s
> Compiling serde_repr v0.1.20
834.75 s
> Compiling bincode-trait-derive v0.1.1
834.75 s
> Compiling duplicate v2.0.1
834.75 s
> Compiling rust-embed-impl v8.11.0
834.75 s
> Compiling pest_derive v2.8.6
834.75 s
> Compiling ppv-lite86 v0.2.21
834.75 s
> Compiling dot-parser v0.5.1
834.75 s
> Compiling rustpython-parser-core v0.4.0
834.75 s
> Compiling rustpython-ast v0.4.0
834.75 s
> Compiling rand_chacha v0.3.1
834.75 s
> Compiling rand v0.8.6
834.75 s
> Compiling rust-embed v8.11.0
834.75 s
> Compiling thiserror v2.0.18
834.75 s
> Compiling phf_generator v0.11.3
834.75 s
> Compiling phf_codegen v0.11.3
834.75 s
> Compiling unicode_names2_generator v1.3.0
834.75 s
> Compiling rustpython-parser v0.4.0
834.75 s
> Compiling unicode_names2 v1.3.0
834.75 s
> Compiling pyo3-macros v0.28.3
834.75 s
> Compiling serde v1.0.228
834.75 s
> Compiling bitvec v1.0.1
834.75 s
> Compiling half v2.7.1
834.75 s
> Compiling ciborium-ll v0.2.2
834.75 s
> Compiling ciborium v0.2.2
834.75 s
> Compiling kurvst v0.1.0 (/build/source/crates/kurvst)
834.75 s
> Compiling linnet v0.17.0 (/build/source/crates/linnet)
834.75 s
> Compiling pyo3-stub-gen-derive v0.17.2
834.75 s
> Compiling pyo3-stub-gen v0.17.2
834.75 s
> Compiling linnest v0.1.0 (/build/source/crates/linnest)
834.75 s
> Compiling alphal00p-docs-python-exporter v0.1.0 (/build/source/crates/alphal00p-docs-python-exporter)
834.75 s
> Finished `docs` profile [unoptimized] target(s) in 39.72s
834.75 s
> +++ command cargo build --profile docs --locked -p alphal00p-docs-python-exporter --features spenso
834.75 s
> Compiling pyo3-build-config v0.28.3
834.75 s
> Compiling symbolica v2.2.0 (https://github.com/symbolica-dev/symbolica?rev=ba3737137c2a2ccd7bb39f0441837d38ec867e78#ba373713)
834.75 s
> Compiling syn v1.0.109
834.75 s
> Compiling figment v0.10.19
834.75 s
> Compiling proc-macro-error v1.0.4
834.75 s
> Compiling duplicate v1.0.0
834.75 s
> Compiling pyo3-macros-backend v0.28.3
834.75 s
> Compiling numpy v0.28.0
834.75 s
> Compiling pyo3-ffi v0.28.3
834.75 s
> Compiling pyo3 v0.28.3
834.75 s
> Compiling pyo3-macros v0.28.3
834.75 s
> Compiling pyo3-stub-gen v0.17.2
834.75 s
> Compiling numerica v3.0.0 (https://github.com/symbolica-dev/symbolica?rev=ba3737137c2a2ccd7bb39f0441837d38ec867e78#ba373713)
834.75 s
> Compiling gammaloop-workspace-hack v0.1.0 (/build/source/crates/gammaloop-workspace-hack)
834.75 s
> Compiling graphica v3.0.0 (https://github.com/symbolica-dev/symbolica?rev=ba3737137c2a2ccd7bb39f0441837d38ec867e78#ba373713)
834.75 s
> Compiling symbolica-utils v0.1.0 (/build/source/crates/symbolica-utils)
834.75 s
> Compiling tymbolica-atom-payload v0.1.0 (https://github.com/lcnbr/tymbolica?rev=e85233dd3d99e5fb458913d0d49f99d83466025b#e85233dd)
834.75 s
> Compiling linnet v0.17.0 (/build/source/crates/linnet)
834.75 s
> Compiling spenso v0.6.0 (/build/source/crates/spenso)
834.75 s
> Compiling idenso v0.3.0 (/build/source/crates/idenso)
834.75 s
> Compiling spenso-hep-lib v0.1.7 (/build/source/crates/spenso-hep-lib)
834.75 s
> Compiling spynso3 v0.1.2 (/build/source/crates/spynso3)
834.75 s
> Compiling alphal00p-docs-python-exporter v0.1.0 (/build/source/crates/alphal00p-docs-python-exporter)
834.75 s
> Finished `docs` profile [unoptimized] target(s) in 1m 40s
834.75 s
> +++ command cargo build --profile docs --locked -p alphal00p-docs-python-exporter --features idenso
834.75 s
> Compiling pyo3 v0.28.3
834.75 s
> Compiling numpy v0.28.0
834.75 s
> Compiling pyo3-stub-gen v0.17.2
834.75 s
> Compiling numerica v3.0.0 (https://github.com/symbolica-dev/symbolica?rev=ba3737137c2a2ccd7bb39f0441837d38ec867e78#ba373713)
834.75 s
> Compiling graphica v3.0.0 (https://github.com/symbolica-dev/symbolica?rev=ba3737137c2a2ccd7bb39f0441837d38ec867e78#ba373713)
834.75 s
> Compiling symbolica v2.2.0 (https://github.com/symbolica-dev/symbolica?rev=ba3737137c2a2ccd7bb39f0441837d38ec867e78#ba373713)
834.75 s
> Compiling gammaloop-workspace-hack v0.1.0 (/build/source/crates/gammaloop-workspace-hack)
834.75 s
> Compiling symbolica-utils v0.1.0 (/build/source/crates/symbolica-utils)
834.75 s
> Compiling linnet v0.17.0 (/build/source/crates/linnet)
834.75 s
> Compiling spenso v0.6.0 (/build/source/crates/spenso)
834.75 s
> Compiling idenso v0.3.0 (/build/source/crates/idenso)
834.75 s
> Compiling alphal00p-docs-python-exporter v0.1.0 (/build/source/crates/alphal00p-docs-python-exporter)
834.75 s
> Finished `docs` profile [unoptimized] target(s) in 1m 29s
834.75 s
> +++ command cargo build --profile docs --locked -p alphal00p-docs-python-exporter --features vakint
834.75 s
> Compiling libc v0.2.186
834.75 s
> Compiling tiny-keccak v2.0.2
834.75 s
> Compiling bytemuck v1.25.0
834.75 s
> Compiling matrixmultiply v0.3.10
834.75 s
> Compiling getrandom v0.3.4
834.75 s
> Compiling num-integer v0.1.46
834.75 s
> Compiling pyo3 v0.28.3
834.75 s
> Compiling regex-automata v0.4.14
834.75 s
> Compiling pyo3-macros-backend v0.28.3
834.75 s
> Compiling pyo3-ffi v0.28.3
834.75 s
> Compiling approx v0.5.1
834.75 s
> Compiling ahash v0.8.12
834.75 s
> Compiling serde v1.0.228
834.75 s
> Compiling itertools v0.14.0
834.75 s
> Compiling gmp-mpfr-sys v1.7.1
834.75 s
> Compiling smallvec v1.15.1
834.75 s
> Compiling safe_arch v0.7.4
834.75 s
> Compiling rand_core v0.9.5
834.75 s
> Compiling safe_arch v1.2.0
834.75 s
> Compiling rayon v1.12.0
834.75 s
> Compiling tracing-attributes v0.1.31
834.75 s
> Compiling wide v0.7.33
834.75 s
> Compiling smartstring v1.0.1
834.75 s
> Compiling phf_shared v0.13.1
834.75 s
> Compiling rand_chacha v0.9.0
834.75 s
> Compiling wide v1.7.0
834.75 s
> Compiling fastrand v2.4.1
834.75 s
> Compiling symbolica v2.2.0 (https://github.com/symbolica-dev/symbolica?rev=ba3737137c2a2ccd7bb39f0441837d38ec867e78#ba373713)
834.75 s
> Compiling phf_generator v0.13.1
834.75 s
> Compiling rug v1.30.0
834.75 s
> Compiling phf_macros v0.13.1
834.75 s
> Compiling directories v6.0.0
834.75 s
> Compiling ndarray v0.17.2
834.75 s
> Compiling rand v0.9.4
834.75 s
> Compiling subprocess v0.2.15
834.75 s
> Compiling vakint v0.1.2 (/build/source/crates/vakint)
834.75 s
> Compiling getrandom v0.2.17
834.75 s
> Compiling rand_core v0.6.4
834.75 s
> Compiling phf v0.13.1
834.75 s
> Compiling rand_chacha v0.3.1
834.75 s
> Compiling simba v0.9.1
834.75 s
> Compiling rand v0.8.6
834.75 s
> Compiling tracing v0.1.44
834.75 s
> Compiling phf_generator v0.11.3
834.75 s
> Compiling phf_codegen v0.11.3
834.75 s
> Compiling unicode_names2_generator v1.3.0
834.75 s
> Compiling rustpython-parser v0.4.0
834.75 s
> Compiling unicode_names2 v1.3.0
834.75 s
> Compiling regex v1.12.3
834.75 s
> Compiling matchers v0.2.0
834.75 s
> Compiling tracing-subscriber v0.3.23
834.75 s
> Compiling titlecase v2.2.1
834.75 s
> Compiling string-template-plus v0.4.3
834.75 s
> Compiling pyo3-macros v0.28.3
834.75 s
> Compiling xprec v0.2.2
834.75 s
> Compiling numpy v0.28.0
834.75 s
> Compiling pyo3-stub-gen-derive v0.17.2
834.75 s
> Compiling pyo3-stub-gen v0.17.2
834.75 s
> Compiling numerica v3.0.0 (https://github.com/symbolica-dev/symbolica?rev=ba3737137c2a2ccd7bb39f0441837d38ec867e78#ba373713)
834.75 s
> error : select an integer backend: `integer-gmp` or `integer-malachite`
834.75 s
> --> /nix/store/5dfb7akvi1k3080zqfndr6jw2ay3di2p-vendor-cargo-deps/f8c6b2c844a6fa8c330abb750e4cf5bbdb36a70140a58e87f6b79fb3024532aa/numerica-3.0.0/src/lib.rs:40:1
834.75 s
> |
834.75 s
> 40 | compile_error!("select an integer backend: `integer-gmp` or `integer-malachite`");
834.75 s
> | ^^^^^^^^^^^^^^^^^^^^^^^^^^^^^^^^^^^^^^^^^^^^^^^^^^^^^^^^^^^^^^^^^^^^^^^^^^^^^^^^^
834.75 s
>
834.75 s
> error : select a float backend: `float-mpfr` or `float-astro`
834.75 s
> --> /nix/store/5dfb7akvi1k3080zqfndr6jw2ay3di2p-vendor-cargo-deps/f8c6b2c844a6fa8c330abb750e4cf5bbdb36a70140a58e87f6b79fb3024532aa/numerica-3.0.0/src/lib.rs:44:1
834.75 s
> |
834.75 s
> 44 | compile_error!("select a float backend: `float-mpfr` or `float-astro`");
834.75 s
> | ^^^^^^^^^^^^^^^^^^^^^^^^^^^^^^^^^^^^^^^^^^^^^^^^^^^^^^^^^^^^^^^^^^^^^^^
834.75 s
>
834.75 s
> error[E0432] : unresolved import `implementation::BackendRandState`
834.75 s
> --> /nix/store/5dfb7akvi1k3080zqfndr6jw2ay3di2p-vendor-cargo-deps/f8c6b2c844a6fa8c330abb750e4cf5bbdb36a70140a58e87f6b79fb3024532aa/numerica-3.0.0/src/domains/backend/integer.rs:1614:33
834.75 s
> |
834.75 s
> 1614 | pub(crate) use implementation::{BackendRandState, Complete, RemRounding};
834.75 s
> | ^^^^^^^^^^^^^^^^ no `BackendRandState` in `domains::backend::integer::implementation`
834.75 s
> |
834.75 s
> note : found an item that was configured out
834.75 s
> --> /nix/store/5dfb7akvi1k3080zqfndr6jw2ay3di2p-vendor-cargo-deps/f8c6b2c844a6fa8c330abb750e4cf5bbdb36a70140a58e87f6b79fb3024532aa/numerica-3.0.0/src/domains/backend/integer.rs:1378:23
834.75 s
> |
834.75 s
> 1377 | #[cfg(feature = "integer-malachite")]
834.75 s
> | ----------------------------- the item is gated behind the `integer-malachite` feature
834.75 s
> 1378 | pub(crate) struct BackendRandState {
834.75 s
> | ^^^^^^^^^^^^^^^^
834.75 s
> note : found an item that was configured out
834.75 s
> --> /nix/store/5dfb7akvi1k3080zqfndr6jw2ay3di2p-vendor-cargo-deps/f8c6b2c844a6fa8c330abb750e4cf5bbdb36a70140a58e87f6b79fb3024532aa/numerica-3.0.0/src/domains/backend/integer.rs:1413:23
834.75 s
> |
834.75 s
> 1412 | #[cfg(feature = "integer-gmp")]
834.75 s
> | ----------------------- the item is gated behind the `integer-gmp` feature
834.75 s
> 1413 | pub(crate) struct BackendRandState(rug::rand::RandState<'static>);
834.75 s
> | ^^^^^^^^^^^^^^^^
834.75 s
>
834.75 s
> error[E0432] : unresolved import `implementation::RawMultiPrecisionInteger`
834.75 s
> --> /nix/store/5dfb7akvi1k3080zqfndr6jw2ay3di2p-vendor-cargo-deps/f8c6b2c844a6fa8c330abb750e4cf5bbdb36a70140a58e87f6b79fb3024532aa/numerica-3.0.0/src/domains/backend/integer.rs:1616:61
834.75 s
> |
834.75 s
> 1616 | MultiPrecisionInteger, ParseMultiPrecisionIntegerError, RawMultiPrecisionInteger,
834.75 s
> | ^^^^^^^^^^^^^^^^^^^^^^^^ no `RawMultiPrecisionInteger` in `domains::backend::integer::implementation`
834.75 s
> |
834.75 s
> note : found an item that was configured out
834.75 s
> --> /nix/store/5dfb7akvi1k3080zqfndr6jw2ay3di2p-vendor-cargo-deps/f8c6b2c844a6fa8c330abb750e4cf5bbdb36a70140a58e87f6b79fb3024532aa/numerica-3.0.0/src/domains/backend/integer.rs:26:14
834.75 s
> |
834.75 s
> 25 | #[cfg(feature = "integer-malachite")]
834.75 s
> | ----------------------------- the item is gated behind the `integer-malachite` feature
834.75 s
> 26 | pub type RawMultiPrecisionInteger = malachite_nz::integer::Integer;
834.75 s
> | ^^^^^^^^^^^^^^^^^^^^^^^^
834.75 s
> note : found an item that was configured out
834.75 s
> --> /nix/store/5dfb7akvi1k3080zqfndr6jw2ay3di2p-vendor-cargo-deps/f8c6b2c844a6fa8c330abb750e4cf5bbdb36a70140a58e87f6b79fb3024532aa/numerica-3.0.0/src/domains/backend/integer.rs:29:14
834.75 s
> |
834.75 s
> 28 | #[cfg(feature = "integer-gmp")]
834.75 s
> | ----------------------- the item is gated behind the `integer-gmp` feature
834.75 s
> 29 | pub type RawMultiPrecisionInteger = rug::Integer;
834.75 s
> | ^^^^^^^^^^^^^^^^^^^^^^^^
834.75 s
> help : a similar name exists in the module
834.75 s
> |
834.75 s
> 1616 - MultiPrecisionInteger, ParseMultiPrecisionIntegerError, RawMultiPrecisionInteger ,
834.75 s
> 1616 + MultiPrecisionInteger, ParseMultiPrecisionIntegerError, MultiPrecisionInteger ,
834.75 s
> |
834.75 s
>
834.75 s
> error[E0432] : unresolved imports `implementation::from_be_bytes`, `implementation::to_be_bytes`
834.75 s
> --> /nix/store/5dfb7akvi1k3080zqfndr6jw2ay3di2p-vendor-cargo-deps/f8c6b2c844a6fa8c330abb750e4cf5bbdb36a70140a58e87f6b79fb3024532aa/numerica-3.0.0/src/domains/backend/integer.rs:1709:33
834.75 s
> |
834.75 s
> 1709 | pub(crate) use implementation::{from_be_bytes, to_be_bytes};
834.75 s
> | ^^^^^^^^^^^^^ ^^^^^^^^^^^ no `to_be_bytes` in `domains::backend::integer::implementation`
834.75 s
> | |
834.75 s
> | no `from_be_bytes` in `domains::backend::integer::implementation`
834.75 s
> |
834.75 s
> note : found an item that was configured out
834.75 s
> --> /nix/store/5dfb7akvi1k3080zqfndr6jw2ay3di2p-vendor-cargo-deps/f8c6b2c844a6fa8c330abb750e4cf5bbdb36a70140a58e87f6b79fb3024532aa/numerica-3.0.0/src/domains/backend/integer.rs:1370:19
834.75 s
> |
834.75 s
> 1369 | #[cfg(all(feature = "integer-malachite", feature = "bincode"))]
834.75 s
> | ----------------------------- the item is gated behind the `integer-malachite` feature
834.75 s
> 1370 | pub(crate) fn from_be_bytes(bytes: &[u8]) -> Result<MultiPrecisionInteger, &'static str> {
834.75 s
> | ^^^^^^^^^^^^^
834.75 s
> note : found an item that was configured out
834.75 s
> --> /nix/store/5dfb7akvi1k3080zqfndr6jw2ay3di2p-vendor-cargo-deps/f8c6b2c844a6fa8c330abb750e4cf5bbdb36a70140a58e87f6b79fb3024532aa/numerica-3.0.0/src/domains/backend/integer.rs:1405:19
834.75 s
> |
834.75 s
> 1404 | #[cfg(all(feature = "integer-gmp", feature = "bincode"))]
834.75 s
> | ----------------------- the item is gated behind the `integer-gmp` feature
834.75 s
> 1405 | pub(crate) fn from_be_bytes(bytes: &[u8]) -> Result<MultiPrecisionInteger, &'static str> {
834.75 s
> | ^^^^^^^^^^^^^
834.75 s
> note : found an item that was configured out
834.75 s
> --> /nix/store/5dfb7akvi1k3080zqfndr6jw2ay3di2p-vendor-cargo-deps/f8c6b2c844a6fa8c330abb750e4cf5bbdb36a70140a58e87f6b79fb3024532aa/numerica-3.0.0/src/domains/backend/integer.rs:1365:19
834.75 s
> |
834.75 s
> 1364 | #[cfg(all(feature = "integer-malachite", feature = "bincode"))]
834.75 s
> | ----------------------------- the item is gated behind the `integer-malachite` feature
834.75 s
> 1365 | pub(crate) fn to_be_bytes(value: &MultiPrecisionInteger) -> Vec<u8> {
834.75 s
> | ^^^^^^^^^^^
834.75 s
> note : found an item that was configured out
834.75 s
> --> /nix/store/5dfb7akvi1k3080zqfndr6jw2ay3di2p-vendor-cargo-deps/f8c6b2c844a6fa8c330abb750e4cf5bbdb36a70140a58e87f6b79fb3024532aa/numerica-3.0.0/src/domains/backend/integer.rs:1400:19
834.75 s
> |
834.75 s
> 1399 | #[cfg(all(feature = "integer-gmp", feature = "bincode"))]
834.75 s
> | ----------------------- the item is gated behind the `integer-gmp` feature
834.75 s
> 1400 | pub(crate) fn to_be_bytes(value: &MultiPrecisionInteger) -> Vec<u8> {
834.75 s
> | ^^^^^^^^^^^
834.75 s
>
834.75 s
> error[E0432] : unresolved imports `crate::domains::backend::float::Assign`, `crate::domains::backend::float::CompleteRound`, `crate::domains::backend::float::Constant`, `crate::domains::backend::float::MultiPrecisionFloat`, `crate::domains::backend::float::Pow`
834.75 s
> --> /nix/store/5dfb7akvi1k3080zqfndr6jw2ay3di2p-vendor-cargo-deps/f8c6b2c844a6fa8c330abb750e4cf5bbdb36a70140a58e87f6b79fb3024532aa/numerica-3.0.0/src/domains/float/multiprecision.rs:15:9
834.75 s
> |
834.75 s
> 15 | Assign, CompleteRound, Constant, MultiPrecisionFloat, MultiPrecisionFloatInteger,
834.75 s
> | ^^^^^^ ^^^^^^^^^^^^^ ^^^^^^^^ ^^^^^^^^^^^^^^^^^^^ no `MultiPrecisionFloat` in `domains::backend::float`
834.75 s
> | | | |
834.75 s
> | | | no `Constant` in `domains::backend::float`
834.75 s
> | | no `CompleteRound` in `domains::backend::float`
834.75 s
> | no `Assign` in `domains::backend::float`
834.75 s
> 16 | MultiPrecisionFloatRational, MultiPrecisionFloatRounding, Pow, RoundingDirection,
834.75 s
> | ^^^ no `Pow` in `domains::backend::float`
834.75 s
> |
834.75 s
> note : found an item that was configured out
834.75 s
> --> /nix/store/5dfb7akvi1k3080zqfndr6jw2ay3di2p-vendor-cargo-deps/f8c6b2c844a6fa8c330abb750e4cf5bbdb36a70140a58e87f6b79fb3024532aa/numerica-3.0.0/src/domains/backend/float.rs:17:5
834.75 s
> |
834.75 s
> 15 | #[cfg(feature = "float-mpfr")]
834.75 s
> | ---------------------- the item is gated behind the `float-mpfr` feature
834.75 s
> 16 | pub use rug::{
834.75 s
> 17 | Assign, Float as MultiPrecisionFloat, Rational as BackendRational,
834.75 s
> | ^^^^^^
834.75 s
> note : found an item that was configured out
834.75 s
> --> /nix/store/5dfb7akvi1k3080zqfndr6jw2ay3di2p-vendor-cargo-deps/f8c6b2c844a6fa8c330abb750e4cf5bbdb36a70140a58e87f6b79fb3024532aa/numerica-3.0.0/src/domains/backend/float.rs:1561:5
834.75 s
> |
834.75 s
> 1559 | #[cfg(feature = "float-astro")]
834.75 s
> | ----------------------- the item is gated behind the `float-astro` feature
834.75 s
> 1560 | pub use astro::{
834.75 s
> 1561 | Assign, BackendRational, CompleteRound, Constant, IntoMultiPrecisionFloat, MultiPrecisionFloat,
834.75 s
> | ^^^^^^
834.75 s
> note : found an item that was configured out
834.75 s
> --> /nix/store/5dfb7akvi1k3080zqfndr6jw2ay3di2p-vendor-cargo-deps/f8c6b2c844a6fa8c330abb750e4cf5bbdb36a70140a58e87f6b79fb3024532aa/numerica-3.0.0/src/domains/backend/float.rs:19:11
834.75 s
> |
834.75 s
> 15 | #[cfg(feature = "float-mpfr")]
834.75 s
> | ---------------------- the item is gated behind the `float-mpfr` feature
834.75 s
> ...
834.75 s
> 19 | ops::{CompleteRound, Pow},
834.75 s
> | ^^^^^^^^^^^^^
834.75 s
> note : found an item that was configured out
834.75 s
> --> /nix/store/5dfb7akvi1k3080zqfndr6jw2ay3di2p-vendor-cargo-deps/f8c6b2c844a6fa8c330abb750e4cf5bbdb36a70140a58e87f6b79fb3024532aa/numerica-3.0.0/src/domains/backend/float.rs:1561:30
834.75 s
> |
834.75 s
> 1559 | #[cfg(feature = "float-astro")]
834.75 s
> | ----------------------- the item is gated behind the `float-astro` feature
834.75 s
> 1560 | pub use astro::{
834.75 s
> 1561 | Assign, BackendRational, CompleteRound, Constant, IntoMultiPrecisionFloat, MultiPrecisionFloat,
834.75 s
> | ^^^^^^^^^^^^^
834.75 s
> note : found an item that was configured out
834.75 s
> --> /nix/store/5dfb7akvi1k3080zqfndr6jw2ay3di2p-vendor-cargo-deps/f8c6b2c844a6fa8c330abb750e4cf5bbdb36a70140a58e87f6b79fb3024532aa/numerica-3.0.0/src/domains/backend/float.rs:18:12
834.75 s
> |
834.75 s
> 15 | #[cfg(feature = "float-mpfr")]
834.75 s
> | ---------------------- the item is gated behind the `float-mpfr` feature
834.75 s
> ...
834.75 s
> 18 | float::Constant,
834.75 s
> | ^^^^^^^^
834.75 s
> note : found an item that was configured out
834.75 s
> --> /nix/store/5dfb7akvi1k3080zqfndr6jw2ay3di2p-vendor-cargo-deps/f8c6b2c844a6fa8c330abb750e4cf5bbdb36a70140a58e87f6b79fb3024532aa/numerica-3.0.0/src/domains/backend/float.rs:1561:45
834.75 s
> |
834.75 s
> 1559 | #[cfg(feature = "float-astro")]
834.75 s
> | ----------------------- the item is gated behind the `float-astro` feature
834.75 s
> 1560 | pub use astro::{
834.75 s
> 1561 | Assign, BackendRational, CompleteRound, Constant, IntoMultiPrecisionFloat, MultiPrecisionFloat,
834.75 s
> | ^^^^^^^^
834.75 s
> note : found an item that was configured out
834.75 s
> --> /nix/store/5dfb7akvi1k3080zqfndr6jw2ay3di2p-vendor-cargo-deps/f8c6b2c844a6fa8c330abb750e4cf5bbdb36a70140a58e87f6b79fb3024532aa/numerica-3.0.0/src/domains/backend/float.rs:17:22
834.75 s
> |
834.75 s
> 15 | #[cfg(feature = "float-mpfr")]
834.75 s
> | ---------------------- the item is gated behind the `float-mpfr` feature
834.75 s
> 16 | pub use rug::{
834.75 s
> 17 | Assign, Float as MultiPrecisionFloat, Rational as BackendRational,
834.75 s
> | ^^^^^^^^^^^^^^^^^^^
834.75 s
> note : found an item that was configured out
834.75 s
> --> /nix/store/5dfb7akvi1k3080zqfndr6jw2ay3di2p-vendor-cargo-deps/f8c6b2c844a6fa8c330abb750e4cf5bbdb36a70140a58e87f6b79fb3024532aa/numerica-3.0.0/src/domains/backend/float.rs:1561:80
834.75 s
> |
834.75 s
> 1559 | #[cfg(feature = "float-astro")]
834.75 s
> | ----------------------- the item is gated behind the `float-astro` feature
834.75 s
> 1560 | pub use astro::{
834.75 s
> 1561 | Assign, BackendRational, CompleteRound, Constant, IntoMultiPrecisionFloat, MultiPrecisionFloat,
834.75 s
> | ^^^^^^^^^^^^^^^^^^^
834.75 s
> note : found an item that was configured out
834.75 s
> --> /nix/store/5dfb7akvi1k3080zqfndr6jw2ay3di2p-vendor-cargo-deps/f8c6b2c844a6fa8c330abb750e4cf5bbdb36a70140a58e87f6b79fb3024532aa/numerica-3.0.0/src/domains/backend/float.rs:19:26
834.75 s
> |
834.75 s
> 15 | #[cfg(feature = "float-mpfr")]
834.75 s
> | ---------------------- the item is gated behind the `float-mpfr` feature
834.75 s
> ...
834.75 s
> 19 | ops::{CompleteRound, Pow},
834.75 s
> | ^^^
834.75 s
> note : found an item that was configured out
834.75 s
> --> /nix/store/5dfb7akvi1k3080zqfndr6jw2ay3di2p-vendor-cargo-deps/f8c6b2c844a6fa8c330abb750e4cf5bbdb36a70140a58e87f6b79fb3024532aa/numerica-3.0.0/src/domains/backend/float.rs:1562:5
834.75 s
> |
834.75 s
> 1559 | #[cfg(feature = "float-astro")]
834.75 s
> | ----------------------- the item is gated behind the `float-astro` feature
834.75 s
> ...
834.75 s
> 1562 | Pow,
834.75 s
> | ^^^
834.75 s
>
834.75 s
> error[E0425] : cannot find type `RawMultiPrecisionInteger` in this scope
834.75 s
> --> /nix/store/5dfb7akvi1k3080zqfndr6jw2ay3di2p-vendor-cargo-deps/f8c6b2c844a6fa8c330abb750e4cf5bbdb36a70140a58e87f6b79fb3024532aa/numerica-3.0.0/src/domains/backend/integer.rs:52:38
834.75 s
> |
834.75 s
> 52 | pub struct MultiPrecisionInteger(RawMultiPrecisionInteger);
834.75 s
> | ^^^^^^^^^^^^^^^^^^^^^^^^ not found in this scope
834.75 s
>
834.75 s
> error[E0425] : cannot find type `RawMultiPrecisionInteger` in this scope
834.75 s
> --> /nix/store/5dfb7akvi1k3080zqfndr6jw2ay3di2p-vendor-cargo-deps/f8c6b2c844a6fa8c330abb750e4cf5bbdb36a70140a58e87f6b79fb3024532aa/numerica-3.0.0/src/domains/backend/integer.rs:52:38
834.75 s
> |
834.75 s
> 52 | pub struct MultiPrecisionInteger(RawMultiPrecisionInteger);
834.75 s
> | ^^^^^^^^^^^^^^^^^^^^^^^^ not found in this scope
834.75 s
> |
834.75 s
> help : you might be missing a type parameter
834.75 s
> |
834.75 s
> 52 | pub struct MultiPrecisionInteger<RawMultiPrecisionInteger> (RawMultiPrecisionInteger);
834.75 s
> | ++++++++++++++++++++++++++
834.75 s
>
834.75 s
> error[E0425] : cannot find type `RawMultiPrecisionInteger` in this scope
834.75 s
> --> /nix/store/5dfb7akvi1k3080zqfndr6jw2ay3di2p-vendor-cargo-deps/f8c6b2c844a6fa8c330abb750e4cf5bbdb36a70140a58e87f6b79fb3024532aa/numerica-3.0.0/src/domains/backend/integer.rs:149:32
834.75 s
> |
834.75 s
> 52 | pub struct MultiPrecisionInteger(RawMultiPrecisionInteger);
834.75 s
> | ----------------------------------------------------------- similarly named struct `MultiPrecisionInteger` defined here
834.75 s
> ...
834.75 s
> 149 | pub fn from_raw(value: RawMultiPrecisionInteger) -> Self {
834.75 s
> | ^^^^^^^^^^^^^^^^^^^^^^^^
834.75 s
> |
834.75 s
> help : a struct with a similar name exists
834.75 s
> |
834.75 s
> 149 - pub fn from_raw(value: RawMultiPrecisionInteger ) -> Self {
834.75 s
> 149 + pub fn from_raw(value: MultiPrecisionInteger ) -> Self {
834.75 s
> |
834.75 s
>
834.75 s
> error[E0425] : cannot find type `RawMultiPrecisionInteger` in this scope
834.75 s
> --> /nix/store/5dfb7akvi1k3080zqfndr6jw2ay3di2p-vendor-cargo-deps/f8c6b2c844a6fa8c330abb750e4cf5bbdb36a70140a58e87f6b79fb3024532aa/numerica-3.0.0/src/domains/backend/integer.rs:187:34
834.75 s
> |
834.75 s
> 52 | pub struct MultiPrecisionInteger(RawMultiPrecisionInteger);
834.75 s
> | ----------------------------------------------------------- similarly named struct `MultiPrecisionInteger` defined here
834.75 s
> ...
834.75 s
> 187 | pub fn as_raw(&self) -> &RawMultiPrecisionInteger {
834.75 s
> | ^^^^^^^^^^^^^^^^^^^^^^^^
834.75 s
> |
834.75 s
> help : a struct with a similar name exists
834.75 s
> |
834.75 s
> 187 - pub fn as_raw(&self) -> &RawMultiPrecisionInteger {
834.75 s
> 187 + pub fn as_raw(&self) -> &MultiPrecisionInteger {
834.75 s
> |
834.75 s
>
834.75 s
> error[E0425] : cannot find type `RawMultiPrecisionInteger` in this scope
834.75 s
> --> /nix/store/5dfb7akvi1k3080zqfndr6jw2ay3di2p-vendor-cargo-deps/f8c6b2c844a6fa8c330abb750e4cf5bbdb36a70140a58e87f6b79fb3024532aa/numerica-3.0.0/src/domains/backend/integer.rs:193:33
834.75 s
> |
834.75 s
> 52 | pub struct MultiPrecisionInteger(RawMultiPrecisionInteger);
834.75 s
> | ----------------------------------------------------------- similarly named struct `MultiPrecisionInteger` defined here
834.75 s
> ...
834.75 s
> 193 | pub fn to_raw(&self) -> RawMultiPrecisionInteger {
834.75 s
> | ^^^^^^^^^^^^^^^^^^^^^^^^
834.75 s
> |
834.75 s
> help : a struct with a similar name exists
834.75 s
> |
834.75 s
> 193 - pub fn to_raw(&self) -> RawMultiPrecisionInteger {
834.75 s
> 193 + pub fn to_raw(&self) -> MultiPrecisionInteger {
834.75 s
> |
834.75 s
>
834.75 s
> error[E0425] : cannot find type `RawMultiPrecisionInteger` in this scope
834.75 s
> --> /nix/store/5dfb7akvi1k3080zqfndr6jw2ay3di2p-vendor-cargo-deps/f8c6b2c844a6fa8c330abb750e4cf5bbdb36a70140a58e87f6b79fb3024532aa/numerica-3.0.0/src/domains/backend/integer.rs:199:34
834.75 s
> |
834.75 s
> 52 | pub struct MultiPrecisionInteger(RawMultiPrecisionInteger);
834.75 s
> | ----------------------------------------------------------- similarly named struct `MultiPrecisionInteger` defined here
834.75 s
> ...
834.75 s
> 199 | pub fn into_raw(self) -> RawMultiPrecisionInteger {
834.75 s
> | ^^^^^^^^^^^^^^^^^^^^^^^^
834.75 s
> |
834.75 s
> help : a struct with a similar name exists
834.75 s
> |
834.75 s
> 199 - pub fn into_raw(self) -> RawMultiPrecisionInteger {
834.75 s
> 199 + pub fn into_raw(self) -> MultiPrecisionInteger {
834.75 s
> |
834.75 s
>
834.75 s
> error[E0425] : cannot find type `RawMultiPrecisionInteger` in this scope
834.75 s
> --> /nix/store/5dfb7akvi1k3080zqfndr6jw2ay3di2p-vendor-cargo-deps/f8c6b2c844a6fa8c330abb750e4cf5bbdb36a70140a58e87f6b79fb3024532aa/numerica-3.0.0/src/domains/backend/integer.rs:567:27
834.75 s
> |
834.75 s
> 52 | pub struct MultiPrecisionInteger(RawMultiPrecisionInteger);
834.75 s
> | ----------------------------------------------------------- similarly named struct `MultiPrecisionInteger` defined here
834.75 s
> ...
834.75 s
> 567 | fn rem_trunc(lhs: RawMultiPrecisionInteger, rhs: RawMultiPrecisionInteger) -> Self {
834.75 s
> | ^^^^^^^^^^^^^^^^^^^^^^^^
834.75 s
> |
834.75 s
> help : a struct with a similar name exists
834.75 s
> |
834.75 s
> 567 - fn rem_trunc(lhs: RawMultiPrecisionInteger , rhs: RawMultiPrecisionInteger) -> Self {
834.75 s
> 567 + fn rem_trunc(lhs: MultiPrecisionInteger , rhs: RawMultiPrecisionInteger) -> Self {
834.75 s
> |
834.75 s
>
834.75 s
> error[E0425] : cannot find type `RawMultiPrecisionInteger` in this scope
834.75 s
> --> /nix/store/5dfb7akvi1k3080zqfndr6jw2ay3di2p-vendor-cargo-deps/f8c6b2c844a6fa8c330abb750e4cf5bbdb36a70140a58e87f6b79fb3024532aa/numerica-3.0.0/src/domains/backend/integer.rs:567:58
834.75 s
> |
834.75 s
> 52 | pub struct MultiPrecisionInteger(RawMultiPrecisionInteger);
834.75 s
> | ----------------------------------------------------------- similarly named struct `MultiPrecisionInteger` defined here
834.75 s
> ...
834.75 s
> 567 | fn rem_trunc(lhs: RawMultiPrecisionInteger, rhs: RawMultiPrecisionInteger) -> Self {
834.75 s
> | ^^^^^^^^^^^^^^^^^^^^^^^^
834.75 s
> |
834.75 s
> help : a struct with a similar name exists
834.75 s
> |
834.75 s
> 567 - fn rem_trunc(lhs: RawMultiPrecisionInteger, rhs: RawMultiPrecisionInteger ) -> Self {
834.75 s
> 567 + fn rem_trunc(lhs: RawMultiPrecisionInteger, rhs: MultiPrecisionInteger ) -> Self {
834.75 s
> |
834.75 s
>
834.75 s
> error[E0425] : cannot find type `RawMultiPrecisionInteger` in this scope
834.75 s
> --> /nix/store/5dfb7akvi1k3080zqfndr6jw2ay3di2p-vendor-cargo-deps/f8c6b2c844a6fa8c330abb750e4cf5bbdb36a70140a58e87f6b79fb3024532aa/numerica-3.0.0/src/domains/backend/integer.rs:582:27
834.75 s
> |
834.75 s
> 52 | pub struct MultiPrecisionInteger(RawMultiPrecisionInteger);
834.75 s
> | ----------------------------------------------------------- similarly named struct `MultiPrecisionInteger` defined here
834.75 s
> ...
834.75 s
> 582 | fn shl_raw(value: RawMultiPrecisionInteger, rhs: u64) -> RawMultiPrecisionInteger {
834.75 s
> | ^^^^^^^^^^^^^^^^^^^^^^^^
834.75 s
> |
834.75 s
> help : a struct with a similar name exists
834.75 s
> |
834.75 s
> 582 - fn shl_raw(value: RawMultiPrecisionInteger , rhs: u64) -> RawMultiPrecisionInteger {
834.75 s
> 582 + fn shl_raw(value: MultiPrecisionInteger , rhs: u64) -> RawMultiPrecisionInteger {
834.75 s
> |
834.75 s
>
834.75 s
> error[E0425] : cannot find type `RawMultiPrecisionInteger` in this scope
834.75 s
> --> /nix/store/5dfb7akvi1k3080zqfndr6jw2ay3di2p-vendor-cargo-deps/f8c6b2c844a6fa8c330abb750e4cf5bbdb36a70140a58e87f6b79fb3024532aa/numerica-3.0.0/src/domains/backend/integer.rs:582:66
834.75 s
> |
834.75 s
> 52 | pub struct MultiPrecisionInteger(RawMultiPrecisionInteger);
834.75 s
> | ----------------------------------------------------------- similarly named struct `MultiPrecisionInteger` defined here
834.75 s
> ...
834.75 s
> 582 | fn shl_raw(value: RawMultiPrecisionInteger, rhs: u64) -> RawMultiPrecisionInteger {
834.75 s
> | ^^^^^^^^^^^^^^^^^^^^^^^^
834.75 s
> |
834.75 s
> help : a struct with a similar name exists
834.75 s
> |
834.75 s
> 582 - fn shl_raw(value: RawMultiPrecisionInteger, rhs: u64) -> RawMultiPrecisionInteger {
834.75 s
> 582 + fn shl_raw(value: RawMultiPrecisionInteger, rhs: u64) -> MultiPrecisionInteger {
834.75 s
> |
834.75 s
>
834.75 s
> error[E0425] : cannot find type `RawMultiPrecisionInteger` in this scope
834.75 s
> --> /nix/store/5dfb7akvi1k3080zqfndr6jw2ay3di2p-vendor-cargo-deps/f8c6b2c844a6fa8c330abb750e4cf5bbdb36a70140a58e87f6b79fb3024532aa/numerica-3.0.0/src/domains/backend/integer.rs:590:27
834.75 s
> |
834.75 s
> 52 | pub struct MultiPrecisionInteger(RawMultiPrecisionInteger);
834.75 s
> | ----------------------------------------------------------- similarly named struct `MultiPrecisionInteger` defined here
834.75 s
> ...
834.75 s
> 590 | fn shr_raw(value: RawMultiPrecisionInteger, rhs: u64) -> RawMultiPrecisionInteger {
834.75 s
> | ^^^^^^^^^^^^^^^^^^^^^^^^
834.75 s
> |
834.75 s
> help : a struct with a similar name exists
834.75 s
> |
834.75 s
> 590 - fn shr_raw(value: RawMultiPrecisionInteger , rhs: u64) -> RawMultiPrecisionInteger {
834.75 s
> 590 + fn shr_raw(value: MultiPrecisionInteger , rhs: u64) -> RawMultiPrecisionInteger {
834.75 s
> |
834.75 s
>
834.75 s
> error[E0425] : cannot find type `RawMultiPrecisionInteger` in this scope
834.75 s
> --> /nix/store/5dfb7akvi1k3080zqfndr6jw2ay3di2p-vendor-cargo-deps/f8c6b2c844a6fa8c330abb750e4cf5bbdb36a70140a58e87f6b79fb3024532aa/numerica-3.0.0/src/domains/backend/integer.rs:590:66
834.75 s
> |
834.75 s
> 52 | pub struct MultiPrecisionInteger(RawMultiPrecisionInteger);
834.75 s
> | ----------------------------------------------------------- similarly named struct `MultiPrecisionInteger` defined here
834.75 s
> ...
834.75 s
> 590 | fn shr_raw(value: RawMultiPrecisionInteger, rhs: u64) -> RawMultiPrecisionInteger {
834.75 s
> | ^^^^^^^^^^^^^^^^^^^^^^^^
834.75 s
> |
834.75 s
> help : a struct with a similar name exists
834.75 s
> |
834.75 s
> 590 - fn shr_raw(value: RawMultiPrecisionInteger, rhs: u64) -> RawMultiPrecisionInteger {
834.75 s
> 590 + fn shr_raw(value: RawMultiPrecisionInteger, rhs: u64) -> MultiPrecisionInteger {
834.75 s
> |
834.75 s
>
834.75 s
> error[E0425] : cannot find type `RawMultiPrecisionInteger` in this scope
834.75 s
> --> /nix/store/5dfb7akvi1k3080zqfndr6jw2ay3di2p-vendor-cargo-deps/f8c6b2c844a6fa8c330abb750e4cf5bbdb36a70140a58e87f6b79fb3024532aa/numerica-3.0.0/src/domains/backend/integer.rs:654:15
834.75 s
> |
834.75 s
> 52 | pub struct MultiPrecisionInteger(RawMultiPrecisionInteger);
834.75 s
> | ----------------------------------------------------------- similarly named struct `MultiPrecisionInteger` defined here
834.75 s
> ...
834.75 s
> 654 | impl From<RawMultiPrecisionInteger> for MultiPrecisionInteger {
834.75 s
> | ^^^^^^^^^^^^^^^^^^^^^^^^
834.75 s
> |
834.75 s
> help : a struct with a similar name exists
834.75 s
> |
834.75 s
> 654 - impl From<RawMultiPrecisionInteger > for MultiPrecisionInteger {
834.75 s
> 654 + impl From<MultiPrecisionInteger > for MultiPrecisionInteger {
834.75 s
> |
834.75 s
> help : you might be missing a type parameter
834.75 s
> |
834.75 s
> 654 | impl<RawMultiPrecisionInteger> From<RawMultiPrecisionInteger> for MultiPrecisionInteger {
834.75 s
> | ++++++++++++++++++++++++++
834.75 s
>
834.75 s
> error[E0425] : cannot find type `RawMultiPrecisionInteger` in this scope
834.75 s
> --> /nix/store/5dfb7akvi1k3080zqfndr6jw2ay3di2p-vendor-cargo-deps/f8c6b2c844a6fa8c330abb750e4cf5bbdb36a70140a58e87f6b79fb3024532aa/numerica-3.0.0/src/domains/backend/integer.rs:656:24
834.75 s
> |
834.75 s
> 52 | pub struct MultiPrecisionInteger(RawMultiPrecisionInteger);
834.75 s
> | ----------------------------------------------------------- similarly named struct `MultiPrecisionInteger` defined here
834.75 s
> ...
834.75 s
> 656 | fn from(value: RawMultiPrecisionInteger) -> Self {
834.75 s
> | ^^^^^^^^^^^^^^^^^^^^^^^^
834.75 s
> |
834.75 s
> help : a struct with a similar name exists
834.75 s
> |
834.75 s
> 656 - fn from(value: RawMultiPrecisionInteger ) -> Self {
834.75 s
> 656 + fn from(value: MultiPrecisionInteger ) -> Self {
834.75 s
> |
834.75 s
>
834.75 s
> error[E0425] : cannot find type `RawMultiPrecisionInteger` in this scope
834.75 s
> --> /nix/store/5dfb7akvi1k3080zqfndr6jw2ay3di2p-vendor-cargo-deps/f8c6b2c844a6fa8c330abb750e4cf5bbdb36a70140a58e87f6b79fb3024532aa/numerica-3.0.0/src/domains/backend/integer.rs:661:42
834.75 s
> |
834.75 s
> 52 | pub struct MultiPrecisionInteger(RawMultiPrecisionInteger);
834.75 s
> | ----------------------------------------------------------- similarly named struct `MultiPrecisionInteger` defined here
834.75 s
> ...
834.75 s
> 661 | impl From<MultiPrecisionInteger> for RawMultiPrecisionInteger {
834.75 s
> | ^^^^^^^^^^^^^^^^^^^^^^^^
834.75 s
> |
834.75 s
> help : a struct with a similar name exists
834.75 s
> |
834.75 s
> 661 - impl From<MultiPrecisionInteger> for RawMultiPrecisionInteger {
834.75 s
> 661 + impl From<MultiPrecisionInteger> for MultiPrecisionInteger {
834.75 s
> |
834.75 s
>
834.75 s
> error[E0433] : cannot find type `RawMultiPrecisionInteger` in this scope
834.75 s
> --> /nix/store/5dfb7akvi1k3080zqfndr6jw2ay3di2p-vendor-cargo-deps/f8c6b2c844a6fa8c330abb750e4cf5bbdb36a70140a58e87f6b79fb3024532aa/numerica-3.0.0/src/domains/backend/integer.rs:620:13
834.75 s
> |
834.75 s
> 620 | RawMultiPrecisionInteger::from_str(s)
834.75 s
> | ^^^^^^^^^^^^^^^^^^^^^^^^ use of undeclared type `RawMultiPrecisionInteger`
834.75 s
> |
834.75 s
> help : a struct with a similar name exists
834.75 s
> |
834.75 s
> 620 - RawMultiPrecisionInteger ::from_str(s)
834.75 s
> 620 + MultiPrecisionInteger ::from_str(s)
834.75 s
> |
834.75 s
>
834.75 s
> error[E0433] : cannot find type `RawMultiPrecisionInteger` in this scope
834.75 s
> --> /nix/store/5dfb7akvi1k3080zqfndr6jw2ay3di2p-vendor-cargo-deps/f8c6b2c844a6fa8c330abb750e4cf5bbdb36a70140a58e87f6b79fb3024532aa/numerica-3.0.0/src/domains/backend/integer.rs:674:35
834.75 s
> |
834.75 s
> 674 | self.0 == RawMultiPrecisionInteger::from(*other)
834.75 s
> | ^^^^^^^^^^^^^^^^^^^^^^^^ use of undeclared type `RawMultiPrecisionInteger`
834.75 s
> ...
834.75 s
> 702 | impl_cmp_primitive!(i32, i64, i128, u32, u64, u128);
834.75 s
> | --------------------------------------------------- in this macro invocation
834.75 s
> |
834.75 s
> = note : this error originates in the macro `impl_cmp_primitive` (in Nightly builds, run with -Z macro-backtrace for more info)
834.75 s
> help : a struct with a similar name exists
834.75 s
> |
834.75 s
> 674 - self.0 == RawMultiPrecisionInteger ::from(*other)
834.75 s
> 674 + self.0 == MultiPrecisionInteger ::from(*other)
834.75 s
> |
834.75 s
>
834.75 s
> error[E0433] : cannot find type `RawMultiPrecisionInteger` in this scope
834.75 s
> --> /nix/store/5dfb7akvi1k3080zqfndr6jw2ay3di2p-vendor-cargo-deps/f8c6b2c844a6fa8c330abb750e4cf5bbdb36a70140a58e87f6b79fb3024532aa/numerica-3.0.0/src/domains/backend/integer.rs:681:25
834.75 s
> |
834.75 s
> 681 | RawMultiPrecisionInteger::from(*self) == other.0
834.75 s
> | ^^^^^^^^^^^^^^^^^^^^^^^^ use of undeclared type `RawMultiPrecisionInteger`
834.75 s
> ...
834.75 s
> 702 | impl_cmp_primitive!(i32, i64, i128, u32, u64, u128);
834.75 s
> | --------------------------------------------------- in this macro invocation
834.75 s
> |
834.75 s
> = note : this error originates in the macro `impl_cmp_primitive` (in Nightly builds, run with -Z macro-backtrace for more info)
834.75 s
> help : a struct with a similar name exists
834.75 s
> |
834.75 s
> 681 - RawMultiPrecisionInteger ::from(*self) == other.0
834.75 s
> 681 + MultiPrecisionInteger ::from(*self) == other.0
834.75 s
> |
834.75 s
>
834.75 s
> error[E0433] : cannot find type `RawMultiPrecisionInteger` in this scope
834.75 s
> --> /nix/store/5dfb7akvi1k3080zqfndr6jw2ay3di2p-vendor-cargo-deps/f8c6b2c844a6fa8c330abb750e4cf5bbdb36a70140a58e87f6b79fb3024532aa/numerica-3.0.0/src/domains/backend/integer.rs:688:45
834.75 s
> |
834.75 s
> 688 | self.0.partial_cmp(&RawMultiPrecisionInteger::from(*other))
834.75 s
> | ^^^^^^^^^^^^^^^^^^^^^^^^ use of undeclared type `RawMultiPrecisionInteger`
834.75 s
> ...
834.75 s
> 702 | impl_cmp_primitive!(i32, i64, i128, u32, u64, u128);
834.75 s
> | --------------------------------------------------- in this macro invocation
834.75 s
> |
834.75 s
> = note : this error originates in the macro `impl_cmp_primitive` (in Nightly builds, run with -Z macro-backtrace for more info)
834.75 s
> help : a struct with a similar name exists
834.75 s
> |
834.75 s
> 688 - self.0.partial_cmp(&RawMultiPrecisionInteger ::from(*other))
834.75 s
> 688 + self.0.partial_cmp(&MultiPrecisionInteger ::from(*other))
834.75 s
> |
834.75 s
>
834.75 s
> error[E0433] : cannot find type `RawMultiPrecisionInteger` in this scope
834.75 s
> --> /nix/store/5dfb7akvi1k3080zqfndr6jw2ay3di2p-vendor-cargo-deps/f8c6b2c844a6fa8c330abb750e4cf5bbdb36a70140a58e87f6b79fb3024532aa/numerica-3.0.0/src/domains/backend/integer.rs:695:25
834.75 s
> |
834.75 s
> 695 | RawMultiPrecisionInteger::from(*self).partial_cmp(&other.0)
834.75 s
> | ^^^^^^^^^^^^^^^^^^^^^^^^ use of undeclared type `RawMultiPrecisionInteger`
834.75 s
> ...
834.75 s
> 702 | impl_cmp_primitive!(i32, i64, i128, u32, u64, u128);
834.75 s
> | --------------------------------------------------- in this macro invocation
834.75 s
> |
834.75 s
> = note : this error originates in the macro `impl_cmp_primitive` (in Nightly builds, run with -Z macro-backtrace for more info)
834.75 s
> help : a struct with a similar name exists
834.75 s
> |
834.75 s
> 695 - RawMultiPrecisionInteger ::from(*self).partial_cmp(&other.0)
834.75 s
> 695 + MultiPrecisionInteger ::from(*self).partial_cmp(&other.0)
834.75 s
> |
834.75 s
>
834.75 s
> error[E0433] : cannot find type `RawMultiPrecisionInteger` in this scope
834.75 s
> --> /nix/store/5dfb7akvi1k3080zqfndr6jw2ay3di2p-vendor-cargo-deps/f8c6b2c844a6fa8c330abb750e4cf5bbdb36a70140a58e87f6b79fb3024532aa/numerica-3.0.0/src/domains/backend/integer.rs:1180:35
834.75 s
> |
834.75 s
> 1180 | MultiPrecisionInteger(RawMultiPrecisionInteger::from((&self.0) & &rhs.0))
834.75 s
> | ^^^^^^^^^^^^^^^^^^^^^^^^ use of undeclared type `RawMultiPrecisionInteger`
834.75 s
> |
834.75 s
> help : a struct with a similar name exists
834.75 s
> |
834.75 s
> 1180 - MultiPrecisionInteger(RawMultiPrecisionInteger ::from((&self.0) & &rhs.0))
834.75 s
> 1180 + MultiPrecisionInteger(MultiPrecisionInteger ::from((&self.0) & &rhs.0))
834.75 s
> |
834.75 s
>
834.75 s
> error[E0433] : cannot find type `RawMultiPrecisionInteger` in this scope
834.75 s
> --> /nix/store/5dfb7akvi1k3080zqfndr6jw2ay3di2p-vendor-cargo-deps/f8c6b2c844a6fa8c330abb750e4cf5bbdb36a70140a58e87f6b79fb3024532aa/numerica-3.0.0/src/domains/backend/integer.rs:1212:35
834.75 s
> |
834.75 s
> 1212 | MultiPrecisionInteger(RawMultiPrecisionInteger::from(-&self.0))
834.75 s
> | ^^^^^^^^^^^^^^^^^^^^^^^^ use of undeclared type `RawMultiPrecisionInteger`
834.75 s
> |
834.75 s
> help : a struct with a similar name exists
834.75 s
> |
834.75 s
> 1212 - MultiPrecisionInteger(RawMultiPrecisionInteger ::from(-&self.0))
834.75 s
> 1212 + MultiPrecisionInteger(MultiPrecisionInteger ::from(-&self.0))
834.75 s
> |
834.75 s
>
834.75 s
> error[E0425] : cannot find function `write_lsf_bytes` in this scope
834.75 s
> --> /nix/store/5dfb7akvi1k3080zqfndr6jw2ay3di2p-vendor-cargo-deps/f8c6b2c844a6fa8c330abb750e4cf5bbdb36a70140a58e87f6b79fb3024532aa/numerica-3.0.0/src/domains/backend/integer.rs:1682:5
834.75 s
> |
834.75 s
> 1682 | write_lsf_bytes(value, &mut bytes);
834.75 s
> | ^^^^^^^^^^^^^^^ not found in this scope
834.75 s
>
834.75 s
> Some errors have detailed explanations: E0425, E0432, E0433.
834.75 s
> For more information about an error, try `rustc --explain E0425`.
834.75 s
> error : could not compile `numerica` (lib) due to 29 previous errors
834.75 s
> warning : build failed, waiting for other jobs to finish...
834.75 s
For full logs, run:
834.75 s
nix log /nix/store/623idw7bxrdblwflbqi3k630cvnna0if-alphal00p-docs-cargo-0.1.0.drv
834.79 s
Build failed.