build packages.x86_64-linux.alphal00p-docs-cargo-artifacts
0.06 s
$ /nix/store/9ypz3flqsrl5xl495mm8h645gadjsxi1-coreutils-9.11/bin/timeout --kill-after=15s 7200s /nix/store/23zk8sgzamrbmj1fday15szf7f2279s8-nix-2.34.7/bin/nix --extra-experimental-features nix-command --extra-experimental-features flakes --log-format internal-json build --no-link --print-out-paths git+https://github.com/alphal00p/gammaloop?ref=simplify-spenso-api&rev=ab00e4917295883add11f9855734aaee1d56926f&shallow=1#packages.x86_64-linux.alphal00p-docs-cargo-artifacts --print-build-logs
2.74 s
4.58 s
Downloading cached cargo-src-directories from https://cache.nix-ci.com
4.60 s
Downloading cached mirrors-list from https://cache.nix-ci.com
4.60 s
Downloading cached writable-tmpdir-as-home-hook from https://cache.nix-ci.com
4.60 s
Downloading cached curl-8.21.0-man from https://cache.nix-ci.com
4.60 s
Downloading cached cargo-install-hook.sh from https://cache.nix-ci.com
4.61 s
Downloading cached cargo-check-hook.sh from https://cache.nix-ci.com
4.61 s
Downloading cached cargo-build-hook.sh from https://cache.nix-ci.com
4.61 s
Downloading cached nghttp2 from https://cache.nix-ci.com
4.61 s
Downloading cached cargo-auditable from https://cache.nix-ci.com
4.62 s
Downloading cached diffutils from https://cache.nix-ci.com
4.62 s
Downloading cached openssl from https://cache.nix-ci.com
4.62 s
Downloading cached nghttp2-1.70.0-lib from https://cache.nix-ci.com
4.62 s
Downloading cached llvm-21.1.8-lib from https://cache.nix-ci.com
4.62 s
Downloaded cached cargo-src-directories (17 KiB) in 45ms
4.63 s
Progress: 0 of 56 built, 1 of 54 downloaded from cache (15 downloading)
4.63 s
Downloading cached diff from https://cache.nix-ci.com
4.63 s
Downloading cached equivalent from https://cache.nix-ci.com
4.63 s
Downloading cached anyhow from https://cache.nix-ci.com
4.65 s
Downloading cached hashbrown from https://cache.nix-ci.com
4.67 s
Downloaded cached curl-8.21.0-man (80 KiB) in 70ms
4.68 s
Downloaded cached writable-tmpdir-as-home-hook (760 B) in 81ms
4.69 s
Downloaded cached cargo-build-hook.sh (2688 B) in 79ms
4.70 s
Downloaded cached nghttp2 (96 B) in 86ms
4.70 s
Downloaded cached cargo-install-hook.sh (2008 B) in 100ms
4.71 s
Downloaded cached cargo-check-hook.sh (2608 B) in 100ms
4.71 s
Downloaded cached equivalent (21 KiB) in 77ms
4.71 s
Downloaded cached mirrors-list (8440 B) in 113ms
4.71 s
Downloaded cached diff (933 KiB) in 83ms
4.72 s
Downloaded cached nghttp2-1.70.0-lib (225 KiB) in 105ms
4.73 s
Downloaded cached anyhow (240 KiB) in 98ms
4.75 s
Downloaded cached cargo-auditable (2.7 MiB) in 133ms
4.76 s
Downloaded cached hashbrown (876 KiB) in 107ms
4.76 s
Downloaded cached diffutils (1.5 MiB) in 147ms
4.81 s
Downloaded cached openssl (8.9 MiB) in 190ms
5.03 s
Building /nix/store/rmdhm1rxn5d9pr8fvk12krfabz2vgw1r-cargo-package-directories-6.0.0.drv
5.03 s
Progress: 0 of 55 built (1 building), 2 of 54 downloaded from cache (15 downloading)
5.03 s
Progress: 0 of 55 built (1 building), 3 of 54 downloaded from cache (14 downloading)
5.03 s
Progress: 0 of 55 built (1 building), 4 of 54 downloaded from cache (13 downloading)
5.03 s
Progress: 0 of 55 built (1 building), 5 of 54 downloaded from cache (12 downloading)
5.03 s
Progress: 0 of 55 built (1 building), 6 of 54 downloaded from cache (11 downloading)
5.03 s
Progress: 0 of 55 built (1 building), 7 of 54 downloaded from cache (10 downloading)
5.03 s
Progress: 0 of 55 built (1 building), 8 of 54 downloaded from cache (9 downloading)
5.03 s
Progress: 0 of 55 built (1 building), 9 of 54 downloaded from cache (8 downloading)
5.03 s
Progress: 0 of 55 built (1 building), 10 of 54 downloaded from cache (7 downloading)
5.03 s
Progress: 0 of 55 built (1 building), 11 of 54 downloaded from cache (6 downloading)
5.04 s
Progress: 0 of 55 built (1 building), 12 of 54 downloaded from cache (5 downloading)
5.04 s
Progress: 0 of 55 built (1 building), 13 of 54 downloaded from cache (4 downloading)
5.04 s
Progress: 0 of 55 built (1 building), 14 of 54 downloaded from cache (3 downloading)
5.04 s
Progress: 0 of 55 built (1 building), 15 of 54 downloaded from cache (2 downloading)
5.04 s
Progress: 0 of 55 built (1 building), 16 of 54 downloaded from cache (1 downloading)
5.04 s
Downloading cached indexmap from https://cache.nix-ci.com
5.04 s
Downloading cached itoa from https://cache.nix-ci.com
5.04 s
Downloading cached quote from https://cache.nix-ci.com
5.04 s
Downloading cached pretty_assertions from https://cache.nix-ci.com
5.04 s
Downloading cached serde from https://cache.nix-ci.com
5.04 s
Downloading cached toml-1.1.4+spec from https://cache.nix-ci.com
5.04 s
Downloading cached serde_json from https://cache.nix-ci.com
5.05 s
Downloading cached toml_datetime-1.1.1+spec from https://cache.nix-ci.com
5.05 s
Downloading cached proc-macro2 from https://cache.nix-ci.com
5.05 s
Downloading cached serde_derive from https://cache.nix-ci.com
5.05 s
Downloading cached serde_spanned from https://cache.nix-ci.com
5.05 s
Downloading cached syn from https://cache.nix-ci.com
5.05 s
Downloading cached serde_core from https://cache.nix-ci.com
5.05 s
Downloading cached toml_edit-0.25.13+spec from https://cache.nix-ci.com
5.05 s
Downloading cached memchr from https://cache.nix-ci.com
5.14 s
Downloaded cached toml_edit-0.25.13+spec (359 KiB) in 88ms
5.14 s
Progress: 0 of 46 built (1 building), 17 of 54 downloaded from cache (15 downloading)
5.14 s
Downloading cached cargo-setup-hook.sh from https://cache.nix-ci.com
5.15 s
Downloaded cached pretty_assertions (127 KiB) in 107ms
5.15 s
Progress: 0 of 45 built (1 building), 18 of 54 downloaded from cache (15 downloading)
5.15 s
Downloading cached krb5-1.22.2-lib from https://cache.nix-ci.com
5.15 s
Downloaded cached itoa (53 KiB) in 110ms
5.15 s
Progress: 0 of 44 built (1 building), 19 of 54 downloaded from cache (15 downloading)
5.16 s
Downloading cached libssh2 from https://cache.nix-ci.com
5.18 s
[cargo-package-directories] Phase: unpackPhase
5.19 s
Downloaded cached serde (555 KiB) in 143ms
5.20 s
Downloaded cached toml_datetime-1.1.1+spec (71 KiB) in 151ms
5.20 s
Progress: 0 of 43 built (1 building), 20 of 54 downloaded from cache (15 downloading)
5.20 s
Progress: 0 of 42 built (1 building), 21 of 54 downloaded from cache (15 downloading)
5.20 s
Downloading cached openssl-3.6.3-bin from https://cache.nix-ci.com
5.20 s
Downloading cached nghttp2-1.70.0-dev from https://cache.nix-ci.com
5.20 s
Downloaded cached indexmap (530 KiB) in 157ms
5.20 s
Downloaded cached serde_derive (333 KiB) in 155ms
5.20 s
Progress: 0 of 41 built (1 building), 22 of 54 downloaded from cache (15 downloading)
5.21 s
Downloading cached toml_parser-1.1.3+spec from https://cache.nix-ci.com
5.21 s
Downloaded cached serde_core (389 KiB) in 161ms
5.21 s
Downloaded cached proc-macro2 (271 KiB) in 164ms
5.22 s
Progress: 0 of 40 built (1 building), 23 of 54 downloaded from cache (15 downloading)
5.22 s
Progress: 0 of 40 built (1 building), 24 of 54 downloaded from cache (14 downloading)
5.22 s
Progress: 0 of 40 built (1 building), 25 of 54 downloaded from cache (13 downloading)
5.22 s
[cargo-package-directories] setting SOURCE_DATE_EPOCH to timestamp 1153704088 of file "./crate/src/win.rs"
5.22 s
Downloading cached toml_writer-1.1.2+spec from https://cache.nix-ci.com
5.22 s
Downloading cached winnow from https://cache.nix-ci.com
5.22 s
Downloading cached unicode-ident from https://cache.nix-ci.com
5.25 s
Downloaded cached toml-1.1.4+spec (326 KiB) in 200ms
5.25 s
[cargo-package-directories] Phase: patchPhase
5.25 s
Progress: 0 of 37 built (1 building), 26 of 54 downloaded from cache (15 downloading)
5.25 s
[cargo-package-directories] Phase: updateAutotoolsGnuConfigScriptsPhase
5.25 s
[cargo-package-directories] Phase: installPhase
5.25 s
Downloading cached yansi from https://cache.nix-ci.com
5.25 s
Downloaded cached syn (2.3 MiB) in 204ms
5.26 s
Progress: 0 of 36 built (1 building), 27 of 54 downloaded from cache (15 downloading)
5.26 s
Downloading cached zmij from https://cache.nix-ci.com
5.26 s
Downloaded cached memchr (585 KiB) in 210ms
5.26 s
Progress: 0 of 35 built (1 building), 28 of 54 downloaded from cache (15 downloading)
5.26 s
Downloaded cached serde_spanned (35 KiB) in 216ms
5.27 s
Downloaded cached toml_writer-1.1.2+spec (74 KiB) in 59ms
5.28 s
Downloaded cached quote (142 KiB) in 233ms
5.28 s
Downloaded cached serde_json (751 KiB) in 238ms
5.32 s
Downloaded cached cargo-setup-hook.sh (3896 B) in 179ms
5.35 s
Downloaded cached libssh2 (330 KiB) in 191ms
5.37 s
Downloaded cached toml_parser-1.1.3+spec (241 KiB) in 163ms
5.37 s
Downloaded cached krb5-1.22.2-lib (2.7 MiB) in 220ms
5.38 s
Downloaded cached nghttp2-1.70.0-dev (241 KiB) in 175ms
5.38 s
[cargo-package-directories:post-build] Uploading to the NixCI cache: /nix/store/hhb3qdbd3qm0p7z1gv84k8rkazpqcvhp-cargo-package-directories-6.0.0
5.38 s
Downloaded cached zmij (95 KiB) in 125ms
5.39 s
Downloaded cached openssl-3.6.3-bin (1.3 MiB) in 192ms
5.39 s
Downloaded cached unicode-ident (335 KiB) in 178ms
5.39 s
Downloaded cached yansi (168 KiB) in 148ms
5.41 s
Downloaded cached winnow (1.3 MiB) in 192ms
5.52 s
[cargo-package-directories:post-build] warning: 'warn-short-path-literals' is deprecated, use 'lint-short-path-literals = ignore' instead
5.55 s
[cargo-package-directories:post-build] copying 1 paths...
5.56 s
[cargo-package-directories:post-build] copying path '/nix/store/hhb3qdbd3qm0p7z1gv84k8rkazpqcvhp-cargo-package-directories-6.0.0' to 'https://cache.nix-ci.com'...
6.31 s
[cargo-package-directories:post-build] warning: 'warn-short-path-literals' is deprecated, use 'lint-short-path-literals = ignore' instead
6.55 s
[cargo-package-directories:post-build] copying 2 paths...
6.55 s
[cargo-package-directories:post-build] copying path '/nix/store/q4prhfsb36xdpy3qfda4vys9ns1m20li-cargo-src-directories-6.0.0.drv' to 'https://cache.nix-ci.com'...
6.69 s
[cargo-package-directories:post-build] copying path '/nix/store/rmdhm1rxn5d9pr8fvk12krfabz2vgw1r-cargo-package-directories-6.0.0.drv' to 'https://cache.nix-ci.com'...
7.06 s
Uploaded cargo-package-directories in 1.7s
7.06 s
Progress: 1 of 35 built, 28 of 54 downloaded from cache (15 downloading)
7.06 s
Built cargo-package-directories in 2.0s
7.07 s
Progress: 1 of 34 built, 29 of 54 downloaded from cache (14 downloading)
7.07 s
Progress: 1 of 34 built, 30 of 54 downloaded from cache (13 downloading)
7.07 s
Progress: 1 of 34 built, 31 of 54 downloaded from cache (12 downloading)
7.07 s
Progress: 1 of 34 built, 32 of 54 downloaded from cache (11 downloading)
7.07 s
Progress: 1 of 34 built, 33 of 54 downloaded from cache (10 downloading)
7.07 s
Progress: 1 of 34 built, 34 of 54 downloaded from cache (9 downloading)
7.07 s
Progress: 1 of 34 built, 35 of 54 downloaded from cache (8 downloading)
7.07 s
Progress: 1 of 34 built, 36 of 54 downloaded from cache (7 downloading)
7.07 s
Progress: 1 of 34 built, 37 of 54 downloaded from cache (6 downloading)
7.07 s
Progress: 1 of 34 built, 38 of 54 downloaded from cache (5 downloading)
7.07 s
Progress: 1 of 34 built, 39 of 54 downloaded from cache (4 downloading)
7.07 s
Progress: 1 of 34 built, 40 of 54 downloaded from cache (3 downloading)
7.07 s
Progress: 1 of 34 built, 41 of 54 downloaded from cache (2 downloading)
7.07 s
Progress: 1 of 34 built, 42 of 54 downloaded from cache (1 downloading)
7.07 s
Downloading cached openssl-3.6.3-dev from https://cache.nix-ci.com
7.07 s
Downloading cached krb5 from https://cache.nix-ci.com
7.07 s
Downloading cached curl from https://cache.nix-ci.com
7.12 s
Building /nix/store/8v4f4iwk36icifw184zn43nfv9gyz6z6-cargo-vendor-dir.drv
7.13 s
[cargo-vendor-dir] structuredAttrs is enabled
7.14 s
Downloaded cached krb5 (1.3 MiB) in 68ms
7.14 s
Progress: 1 of 24 built (1 building), 43 of 54 downloaded from cache (3 downloading)
7.14 s
Downloading cached krb5-1.22.2-dev from https://cache.nix-ci.com
7.15 s
Downloaded cached curl (1.1 MiB) in 73ms
7.15 s
Progress: 1 of 24 built (1 building), 44 of 54 downloaded from cache (3 downloading)
7.15 s
Downloading cached curl-8.21.0-bin from https://cache.nix-ci.com
7.22 s
Downloaded cached curl-8.21.0-bin (373 KiB) in 68ms
7.22 s
Progress: 1 of 24 built (1 building), 45 of 54 downloaded from cache (3 downloading)
7.22 s
Downloaded cached openssl-3.6.3-dev (1.9 MiB) in 151ms
7.23 s
Progress: 1 of 24 built (1 building), 46 of 54 downloaded from cache (2 downloading)
7.23 s
Downloading cached libssh2-1.11.1-dev from https://cache.nix-ci.com
7.26 s
Downloaded cached krb5-1.22.2-dev (748 KiB) in 121ms
7.27 s
Progress: 1 of 24 built (1 building), 47 of 54 downloaded from cache (2 downloading)
7.28 s
Downloaded cached libssh2-1.11.1-dev (83 KiB) in 49ms
7.28 s
Progress: 1 of 24 built (1 building), 48 of 54 downloaded from cache (1 downloading)
7.29 s
Downloading cached curl-8.21.0-dev from https://cache.nix-ci.com
7.35 s
Downloaded cached curl-8.21.0-dev (273 KiB) in 62ms
7.35 s
Progress: 1 of 24 built (1 building), 49 of 54 downloaded from cache (1 downloading)
7.49 s
Building /nix/store/5kazng72ixfccf2k1y67l7pdd7vbz2hc-cargo-src-data-encoding-2.11.1.drv
7.58 s
Building /nix/store/bl6af2dbgz4fy7nf4ysyfdvqjagnx5bs-cargo-src-ed25519-compact-2.4.2.drv
7.64 s
Building /nix/store/8dfk1v5n8dkmmg0n95cmapfay5d02dsi-cargo-src-safe_arch-1.2.0.drv
7.70 s
Downloaded cached llvm-21.1.8-lib (540.2 MiB) in 3.0s
7.71 s
Building /nix/store/144sb3q21pbk9pmmwh83bl6wm02bv9k4-cargo-src-symjit-2.25.6.drv
7.77 s
Building /nix/store/qwipja8ixm8xjfa30qq8ilxaq9nwfh4y-cargo-src-wide-1.7.0.drv
7.77 s
Progress: 1 of 23 built (6 building), 50 of 54 downloaded from cache
7.77 s
[cargo-src-data-encoding] structuredAttrs is enabled
7.77 s
[cargo-src-data-encoding]
7.77 s
[cargo-src-data-encoding] trying https://static.crates.io/crates/data-encoding/2.11.1/download
7.77 s
[cargo-src-data-encoding] % Total % Received % Xferd Average Speed Time Time Time Current
7.77 s
[cargo-src-data-encoding] Dload Upload Total Spent Left Speed
7.77 s
[cargo-src-data-encoding]
7.77 s
[cargo-src-data-encoding] 0 0 0 0 0 0 0 0 0
7.77 s
[cargo-src-data-encoding] 100 22651 100 22651 0 0 441.6k 0 0
7.77 s
[cargo-src-data-encoding] 100 22651 100 22651 0 0 441.2k 0 0
7.77 s
[cargo-src-data-encoding] 100 22651 100 22651 0 0 440.9k 0 0
7.77 s
[cargo-src-ed25519-compact] structuredAttrs is enabled
7.77 s
[cargo-src-ed25519-compact]
7.77 s
[cargo-src-ed25519-compact] trying https://static.crates.io/crates/ed25519-compact/2.4.2/download
7.77 s
[cargo-src-ed25519-compact] % Total % Received % Xferd Average Speed Time Time Time Current
7.77 s
[cargo-src-ed25519-compact] Dload Upload Total Spent Left Speed
7.77 s
[cargo-src-ed25519-compact]
7.77 s
[cargo-src-ed25519-compact] 0 0 0 0 0 0 0 0 0
7.77 s
[cargo-src-ed25519-compact] 100 36964 100 36964 0 0 944.6k 0 0
7.77 s
[cargo-src-ed25519-compact] 100 36964 100 36964 0 0 943.5k 0 0
7.77 s
[cargo-src-ed25519-compact] 100 36964 100 36964 0 0 942.6k 0 0
7.77 s
[cargo-src-safe_arch] structuredAttrs is enabled
7.77 s
[cargo-src-safe_arch]
7.77 s
[cargo-src-safe_arch] trying https://static.crates.io/crates/safe_arch/1.2.0/download
7.77 s
[cargo-src-symjit] structuredAttrs is enabled
7.87 s
[cargo-vendor-dir:post-build] Uploading to the NixCI cache: /nix/store/f4nmhvmbpc1cbp8psy5minzlgk3xgjc1-cargo-vendor-dir
7.94 s
[cargo-vendor-dir:post-build] warning: 'warn-short-path-literals' is deprecated, use 'lint-short-path-literals = ignore' instead
7.97 s
[cargo-vendor-dir:post-build] copying 1 paths...
7.97 s
[cargo-vendor-dir:post-build] copying path '/nix/store/f4nmhvmbpc1cbp8psy5minzlgk3xgjc1-cargo-vendor-dir' to 'https://cache.nix-ci.com'...
8.68 s
[cargo-vendor-dir:post-build] warning: 'warn-short-path-literals' is deprecated, use 'lint-short-path-literals = ignore' instead
8.75 s
[cargo-vendor-dir:post-build] copying 0 paths...
8.77 s
Uploaded cargo-vendor-dir in 966ms
8.77 s
Progress: 2 of 24 built (5 building), 50 of 54 downloaded from cache
8.77 s
Built cargo-vendor-dir in 1.6s
8.77 s
Downloading cached rustc from https://cache.nix-ci.com
8.81 s
[cargo-src-data-encoding:post-build] Uploading to the NixCI cache: /nix/store/albvqkbz5scc9i246pgzw41y7ipd9b6r-cargo-src-data-encoding-2.11.1
8.98 s
[cargo-src-data-encoding:post-build] warning: 'warn-short-path-literals' is deprecated, use 'lint-short-path-literals = ignore' instead
9.00 s
[cargo-src-data-encoding:post-build] copying 1 paths...
9.00 s
[cargo-src-data-encoding:post-build] copying path '/nix/store/albvqkbz5scc9i246pgzw41y7ipd9b6r-cargo-src-data-encoding-2.11.1' to 'https://cache.nix-ci.com'...
9.70 s
[cargo-src-data-encoding:post-build] warning: 'warn-short-path-literals' is deprecated, use 'lint-short-path-literals = ignore' instead
9.95 s
[cargo-src-data-encoding:post-build] copying 1 paths...
9.95 s
[cargo-src-data-encoding:post-build] copying path '/nix/store/5kazng72ixfccf2k1y67l7pdd7vbz2hc-cargo-src-data-encoding-2.11.1.drv' to 'https://cache.nix-ci.com'...
10.17 s
Uploaded cargo-src-data-encoding in 1.3s
10.17 s
Progress: 3 of 24 built (4 building), 50 of 54 downloaded from cache (1 downloading)
10.17 s
Built cargo-src-data-encoding in 2.6s
10.26 s
[cargo-src-ed25519-compact:post-build] Uploading to the NixCI cache: /nix/store/zn7wi19x4wv84y7q754lnr3i93n53f4q-cargo-src-ed25519-compact-2.4.2
10.87 s
[cargo-src-ed25519-compact:post-build] warning: 'warn-short-path-literals' is deprecated, use 'lint-short-path-literals = ignore' instead
10.94 s
[cargo-src-ed25519-compact:post-build] copying 1 paths...
10.94 s
[cargo-src-ed25519-compact:post-build] copying path '/nix/store/zn7wi19x4wv84y7q754lnr3i93n53f4q-cargo-src-ed25519-compact-2.4.2' to 'https://cache.nix-ci.com'...
11.88 s
[cargo-src-ed25519-compact:post-build] warning: 'warn-short-path-literals' is deprecated, use 'lint-short-path-literals = ignore' instead
12.20 s
[cargo-src-ed25519-compact:post-build] copying 1 paths...
12.20 s
[cargo-src-ed25519-compact:post-build] copying path '/nix/store/bl6af2dbgz4fy7nf4ysyfdvqjagnx5bs-cargo-src-ed25519-compact-2.4.2.drv' to 'https://cache.nix-ci.com'...
12.57 s
Uploaded cargo-src-ed25519-compact in 2.3s
12.57 s
Progress: 4 of 25 built (3 building), 50 of 54 downloaded from cache (1 downloading)
12.57 s
Built cargo-src-ed25519-compact in 4.9s
12.57 s
[cargo-src-safe_arch] % Total % Received % Xferd Average Speed Time Time Time Current
12.57 s
[cargo-src-safe_arch] Dload Upload Total Spent Left Speed
12.57 s
[cargo-src-safe_arch]
12.57 s
[cargo-src-safe_arch] 0 0 0 0 0 0 0 0 0
12.57 s
[cargo-src-safe_arch] 100 92112 100 92112 0 0 1.84M 0 0
12.57 s
[cargo-src-safe_arch] 100 92112 100 92112 0 0 1.84M 0 0
12.57 s
[cargo-src-safe_arch] 100 92112 100 92112 0 0 1.83M 0 0
12.57 s
[cargo-src-symjit]
12.57 s
[cargo-src-symjit] trying https://static.crates.io/crates/symjit/2.25.6/download
12.57 s
[cargo-src-symjit] % Total % Received % Xferd Average Speed Time Time Time Current
12.57 s
[cargo-src-symjit] Dload Upload Total Spent Left Speed
12.57 s
[cargo-src-symjit]
12.57 s
[cargo-src-symjit] 0 0 0 0 0 0 0 0 0
12.57 s
[cargo-src-symjit] 100 155.6k 100 155.6k 0 0 3.00M 0 0
12.57 s
[cargo-src-symjit] 100 155.6k 100 155.6k 0 0 3.00M 0 0
12.57 s
[cargo-src-symjit] 100 155.6k 100 155.6k 0 0 2.99M 0 0
12.57 s
[cargo-src-wide] structuredAttrs is enabled
12.57 s
[cargo-src-wide]
12.57 s
[cargo-src-wide] trying https://static.crates.io/crates/wide/1.7.0/download
12.57 s
[cargo-src-wide] % Total % Received % Xferd Average Speed Time Time Time Current
12.57 s
[cargo-src-wide] Dload Upload Total Spent Left Speed
12.57 s
[cargo-src-wide]
12.57 s
[cargo-src-wide] 0 0 0 0 0 0 0 0 0
12.57 s
[cargo-src-wide] 100 204.7k 100 204.7k 0 0 4.77M 0 0
12.57 s
[cargo-src-wide] 100 204.7k 100 204.7k 0 0 4.76M 0 0
12.57 s
[cargo-src-wide] 100 204.7k 100 204.7k 0 0 4.76M 0 0
12.65 s
Building /nix/store/b0v3pqcn9qy95bb4bf87954hd63ii0w5-cargo-package-data-encoding-2.11.1.drv
12.73 s
Building /nix/store/bw3s31v62vqkcb9m2jhfi7w1lsl0iv6l-cargo-package-ed25519-compact-2.4.2.drv
12.89 s
[cargo-src-safe_arch:post-build] Uploading to the NixCI cache: /nix/store/abjapyabfd0q21b11ibh9n1m5pk0w1vk-cargo-src-safe_arch-1.2.0
13.47 s
[cargo-src-safe_arch:post-build] warning: 'warn-short-path-literals' is deprecated, use 'lint-short-path-literals = ignore' instead
13.52 s
[cargo-src-safe_arch:post-build] copying 1 paths...
13.52 s
[cargo-src-safe_arch:post-build] copying path '/nix/store/abjapyabfd0q21b11ibh9n1m5pk0w1vk-cargo-src-safe_arch-1.2.0' to 'https://cache.nix-ci.com'...
14.61 s
[cargo-src-safe_arch:post-build] warning: 'warn-short-path-literals' is deprecated, use 'lint-short-path-literals = ignore' instead
14.68 s
Downloaded cached rustc (1 GiB) in 5.9s
14.88 s
[cargo-src-safe_arch:post-build] copying 1 paths...
14.88 s
[cargo-src-safe_arch:post-build] copying path '/nix/store/8dfk1v5n8dkmmg0n95cmapfay5d02dsi-cargo-src-safe_arch-1.2.0.drv' to 'https://cache.nix-ci.com'...
15.34 s
Uploaded cargo-src-safe_arch in 2.5s
15.34 s
Progress: 5 of 24 built (4 building), 50 of 54 downloaded from cache (1 downloading)
15.34 s
Built cargo-src-safe_arch in 7.6s
15.46 s
[cargo-src-symjit:post-build] Uploading to the NixCI cache: /nix/store/mnr6gp5bvyh3g3n87iac9wsh4999ldg2-cargo-src-symjit-2.25.6
16.03 s
[cargo-src-symjit:post-build] warning: 'warn-short-path-literals' is deprecated, use 'lint-short-path-literals = ignore' instead
16.07 s
[cargo-src-symjit:post-build] copying 1 paths...
16.07 s
[cargo-src-symjit:post-build] copying path '/nix/store/mnr6gp5bvyh3g3n87iac9wsh4999ldg2-cargo-src-symjit-2.25.6' to 'https://cache.nix-ci.com'...
17.14 s
[cargo-src-symjit:post-build] warning: 'warn-short-path-literals' is deprecated, use 'lint-short-path-literals = ignore' instead
17.38 s
[cargo-src-symjit:post-build] copying 1 paths...
17.38 s
[cargo-src-symjit:post-build] copying path '/nix/store/144sb3q21pbk9pmmwh83bl6wm02bv9k4-cargo-src-symjit-2.25.6.drv' to 'https://cache.nix-ci.com'...
17.69 s
Uploaded cargo-src-symjit in 2.3s
17.69 s
Progress: 6 of 25 built (3 building), 50 of 54 downloaded from cache (1 downloading)
17.69 s
Built cargo-src-symjit in 9.9s
17.86 s
[cargo-src-wide:post-build] Uploading to the NixCI cache: /nix/store/mrg057l6249916xv37xlar2pd124g0sd-cargo-src-wide-1.7.0
18.43 s
[cargo-src-wide:post-build] warning: 'warn-short-path-literals' is deprecated, use 'lint-short-path-literals = ignore' instead
18.49 s
[cargo-src-wide:post-build] copying 1 paths...
18.49 s
[cargo-src-wide:post-build] copying path '/nix/store/mrg057l6249916xv37xlar2pd124g0sd-cargo-src-wide-1.7.0' to 'https://cache.nix-ci.com'...
19.52 s
[cargo-src-wide:post-build] warning: 'warn-short-path-literals' is deprecated, use 'lint-short-path-literals = ignore' instead
19.79 s
[cargo-src-wide:post-build] copying 1 paths...
19.79 s
[cargo-src-wide:post-build] copying path '/nix/store/qwipja8ixm8xjfa30qq8ilxaq9nwfh4y-cargo-src-wide-1.7.0.drv' to 'https://cache.nix-ci.com'...
20.14 s
Uploaded cargo-src-wide in 2.4s
20.15 s
Progress: 7 of 26 built (2 building), 50 of 54 downloaded from cache (1 downloading)
20.15 s
Built cargo-src-wide in 12.3s
20.22 s
Building /nix/store/7mffy5y1y6lwjsv6b6y2f8r9qslcncnw-cargo-package-safe_arch-1.2.0.drv
20.29 s
Building /nix/store/yb3ah609l7hv0w9galp5j1gsixaaqppw-cargo-package-symjit-2.25.6.drv
20.37 s
Building /nix/store/camfg48r1hxamv84zsy6q8h29sfi120f-cargo-package-wide-1.7.0.drv
20.37 s
Progress: 7 of 23 built (5 building), 51 of 54 downloaded from cache
20.37 s
[cargo-package-data-encoding] Phase: unpackPhase
20.37 s
[cargo-package-data-encoding] setting SOURCE_DATE_EPOCH to timestamp 1153704088 of file "./crate/src/lib.rs"
20.37 s
[cargo-package-data-encoding] Phase: patchPhase
20.37 s
[cargo-package-data-encoding] Phase: updateAutotoolsGnuConfigScriptsPhase
20.37 s
[cargo-package-data-encoding] Phase: installPhase
20.37 s
[cargo-package-ed25519-compact] Phase: unpackPhase
20.37 s
[cargo-package-ed25519-compact] setting SOURCE_DATE_EPOCH to timestamp 1153704088 of file "./crate/src/x25519.rs"
20.37 s
[cargo-package-ed25519-compact] Phase: patchPhase
20.37 s
[cargo-package-ed25519-compact] Phase: updateAutotoolsGnuConfigScriptsPhase
20.37 s
[cargo-package-ed25519-compact] Phase: installPhase
20.38 s
Downloading cached rustc-wrapper from https://cache.nix-ci.com
20.41 s
Downloaded cached rustc-wrapper (3368 B) in 39ms
20.51 s
[cargo-package-data-encoding:post-build] Uploading to the NixCI cache: /nix/store/scg1zyvpbq706j3x8vwap9jar3285vk9-cargo-package-data-encoding-2.11.1
21.01 s
[cargo-package-data-encoding:post-build] warning: 'warn-short-path-literals' is deprecated, use 'lint-short-path-literals = ignore' instead
21.05 s
[cargo-package-data-encoding:post-build] copying 1 paths...
21.05 s
[cargo-package-data-encoding:post-build] copying path '/nix/store/scg1zyvpbq706j3x8vwap9jar3285vk9-cargo-package-data-encoding-2.11.1' to 'https://cache.nix-ci.com'...
22.03 s
[cargo-package-data-encoding:post-build] warning: 'warn-short-path-literals' is deprecated, use 'lint-short-path-literals = ignore' instead
22.20 s
[cargo-package-data-encoding:post-build] copying 0 paths...
22.43 s
Uploaded cargo-package-data-encoding in 2.0s
22.44 s
Progress: 8 of 24 built (4 building), 51 of 54 downloaded from cache (1 downloading)
22.44 s
Built cargo-package-data-encoding in 9.7s
22.54 s
[cargo-package-ed25519-compact:post-build] Uploading to the NixCI cache: /nix/store/pklwyy84i3a5qig1cw6wjfhncka5vl61-cargo-package-ed25519-compact-2.4.2
23.07 s
[cargo-package-ed25519-compact:post-build] warning: 'warn-short-path-literals' is deprecated, use 'lint-short-path-literals = ignore' instead
23.11 s
[cargo-package-ed25519-compact:post-build] copying 1 paths...
23.11 s
[cargo-package-ed25519-compact:post-build] copying path '/nix/store/pklwyy84i3a5qig1cw6wjfhncka5vl61-cargo-package-ed25519-compact-2.4.2' to 'https://cache.nix-ci.com'...
24.05 s
[cargo-package-ed25519-compact:post-build] warning: 'warn-short-path-literals' is deprecated, use 'lint-short-path-literals = ignore' instead
24.24 s
[cargo-package-ed25519-compact:post-build] copying 0 paths...
24.51 s
Uploaded cargo-package-ed25519-compact in 2.0s
24.51 s
Progress: 9 of 25 built (3 building), 51 of 54 downloaded from cache (1 downloading)
24.51 s
Built cargo-package-ed25519-compact in 11.7s
24.52 s
Progress: 9 of 23 built (3 building), 52 of 54 downloaded from cache
24.52 s
[cargo-package-safe_arch] Phase: unpackPhase
24.52 s
[cargo-package-safe_arch] setting SOURCE_DATE_EPOCH to timestamp 1153704088 of file "./crate/tests/integration/ssse3_tests.rs"
24.52 s
[cargo-package-safe_arch] Phase: patchPhase
24.52 s
[cargo-package-safe_arch] Phase: updateAutotoolsGnuConfigScriptsPhase
24.52 s
[cargo-package-safe_arch] Phase: installPhase
24.52 s
[cargo-package-symjit] Phase: unpackPhase
24.52 s
[cargo-package-symjit] setting SOURCE_DATE_EPOCH to timestamp 1153704088 of file "./crate/upload_to_symjit.sh"
24.52 s
[cargo-package-symjit] Phase: patchPhase
24.52 s
[cargo-package-symjit] Phase: updateAutotoolsGnuConfigScriptsPhase
24.52 s
[cargo-package-symjit] Phase: installPhase
24.52 s
[cargo-package-wide] Phase: unpackPhase
24.52 s
[cargo-package-wide] setting SOURCE_DATE_EPOCH to timestamp 1153704088 of file "./crate/tests/utils/simd_chunks.rs"
24.52 s
[cargo-package-wide] Phase: patchPhase
24.52 s
[cargo-package-wide] Phase: updateAutotoolsGnuConfigScriptsPhase
24.52 s
[cargo-package-wide] Phase: installPhase
24.52 s
Downloading cached cargo from https://cache.nix-ci.com
24.67 s
[cargo-package-safe_arch:post-build] Uploading to the NixCI cache: /nix/store/xlnbx7l28walgi6ygfj4scr4177k2njw-cargo-package-safe_arch-1.2.0
24.77 s
[cargo-package-safe_arch:post-build] warning: 'warn-short-path-literals' is deprecated, use 'lint-short-path-literals = ignore' instead
24.80 s
[cargo-package-safe_arch:post-build] copying 1 paths...
24.80 s
[cargo-package-safe_arch:post-build] copying path '/nix/store/xlnbx7l28walgi6ygfj4scr4177k2njw-cargo-package-safe_arch-1.2.0' to 'https://cache.nix-ci.com'...
24.82 s
Downloaded cached cargo (38.1 MiB) in 306ms
25.91 s
[cargo-package-safe_arch:post-build] warning: 'warn-short-path-literals' is deprecated, use 'lint-short-path-literals = ignore' instead
26.06 s
[cargo-package-safe_arch:post-build] copying 0 paths...
26.32 s
Uploaded cargo-package-safe_arch in 1.7s
26.32 s
Progress: 10 of 23 built (2 building), 52 of 54 downloaded from cache (1 downloading)
26.32 s
Built cargo-package-safe_arch in 6.0s
26.46 s
[cargo-package-symjit:post-build] Uploading to the NixCI cache: /nix/store/adxx89nwbpykpfkkwylqry4ivibhzlfq-cargo-package-symjit-2.25.6
27.07 s
[cargo-package-symjit:post-build] warning: 'warn-short-path-literals' is deprecated, use 'lint-short-path-literals = ignore' instead
27.12 s
[cargo-package-symjit:post-build] copying 1 paths...
27.12 s
[cargo-package-symjit:post-build] copying path '/nix/store/adxx89nwbpykpfkkwylqry4ivibhzlfq-cargo-package-symjit-2.25.6' to 'https://cache.nix-ci.com'...
28.24 s
[cargo-package-symjit:post-build] warning: 'warn-short-path-literals' is deprecated, use 'lint-short-path-literals = ignore' instead
28.43 s
[cargo-package-symjit:post-build] copying 0 paths...
28.69 s
Uploaded cargo-package-symjit in 2.3s
28.69 s
Progress: 11 of 24 built (1 building), 52 of 54 downloaded from cache (1 downloading)
28.69 s
Built cargo-package-symjit in 8.3s
28.80 s
[cargo-package-wide:post-build] Uploading to the NixCI cache: /nix/store/qcn4sqvg7jbrb7qd19pdr3v8b6h7m5r9-cargo-package-wide-1.7.0
29.35 s
[cargo-package-wide:post-build] warning: 'warn-short-path-literals' is deprecated, use 'lint-short-path-literals = ignore' instead
29.40 s
[cargo-package-wide:post-build] copying 1 paths...
29.40 s
[cargo-package-wide:post-build] copying path '/nix/store/qcn4sqvg7jbrb7qd19pdr3v8b6h7m5r9-cargo-package-wide-1.7.0' to 'https://cache.nix-ci.com'...
30.40 s
[cargo-package-wide:post-build] warning: 'warn-short-path-literals' is deprecated, use 'lint-short-path-literals = ignore' instead
30.50 s
[cargo-package-wide:post-build] copying 0 paths...
30.52 s
Uploaded cargo-package-wide in 1.7s
30.52 s
Progress: 12 of 25 built, 52 of 54 downloaded from cache (1 downloading)
30.52 s
Built cargo-package-wide in 10.1s
30.63 s
Building /nix/store/lgdnnf7jry2x473nb6265y91ck6gyy8i-vendor-registry.drv
30.63 s
Progress: 12 of 22 built (1 building), 53 of 54 downloaded from cache
30.63 s
Downloading cached auditable-cargo from https://cache.nix-ci.com
30.67 s
Downloaded cached auditable-cargo (16 KiB) in 35ms
30.67 s
Progress: 12 of 21 built (1 building), 54 of 54 downloaded from cache
30.73 s
Building /nix/store/mgnhvgks1lcy7dp8bxxhmqkm331x87cy-crane-utils-0.0.1.drv
30.82 s
[crane-utils] Phase: unpackPhase
30.82 s
[crane-utils] unpacking source archive /nix/store/0j28arwrbgjrf5z45dcz8xv1krkazjp6-source
30.83 s
[crane-utils] source root is source
30.83 s
[crane-utils] Executing cargoSetupPostUnpackHook
30.95 s
[crane-utils] Finished cargoSetupPostUnpackHook
30.96 s
[crane-utils] Phase: patchPhase
30.97 s
[crane-utils] Executing cargoSetupPostPatchHook
30.97 s
[crane-utils] Validating consistency between /build/source/Cargo.lock and /build/cargo-vendor-dir/Cargo.lock
30.97 s
[crane-utils] Finished cargoSetupPostPatchHook
30.97 s
[crane-utils] Phase: updateAutotoolsGnuConfigScriptsPhase
30.98 s
[crane-utils] Phase: configurePhase
30.98 s
[crane-utils] Phase: buildPhase
30.99 s
[crane-utils] Executing cargoBuildHook
30.99 s
[crane-utils] cargoBuildHook flags: -j 16 --target x86_64-unknown-linux-gnu --offline --profile release
31.16 s
[crane-utils] Compiling serde_core v1.0.229
31.16 s
[crane-utils] Compiling proc-macro2 v1.0.106
31.16 s
[crane-utils] Compiling quote v1.0.45
31.16 s
[crane-utils] Compiling unicode-ident v1.0.24
31.16 s
[crane-utils] Compiling hashbrown v0.17.0
31.16 s
[crane-utils] Compiling equivalent v1.0.2
31.16 s
[crane-utils] Compiling winnow v1.0.1
31.16 s
[crane-utils] Compiling zmij v1.0.21
31.16 s
[crane-utils] Compiling serde v1.0.229
31.16 s
[crane-utils] Compiling toml_writer v1.1.2+spec-1.1.0
31.16 s
[crane-utils] Compiling anyhow v1.0.104
31.16 s
[crane-utils] Compiling serde_json v1.0.151
31.16 s
[crane-utils] Compiling itoa v1.0.18
31.18 s
[crane-utils] Compiling memchr v2.8.0
32.88 s
[vendor-registry:post-build] Uploading to the NixCI cache: /nix/store/3ravkp7frc5c1v6kv18d47bwy3254b0q-vendor-registry
33.31 s
[vendor-registry:post-build] warning: 'warn-short-path-literals' is deprecated, use 'lint-short-path-literals = ignore' instead
33.41 s
[vendor-registry:post-build] copying 0 paths...
33.84 s
[vendor-registry:post-build] warning: 'warn-short-path-literals' is deprecated, use 'lint-short-path-literals = ignore' instead
34.01 s
[vendor-registry:post-build] copying 0 paths...
34.13 s
Uploaded vendor-registry in 1.3s
34.13 s
Progress: 13 of 21 built (1 building), 54 of 54 downloaded from cache
34.14 s
Built vendor-registry in 3.5s
34.14 s
[crane-utils] Compiling indexmap v2.14.0
34.14 s
[crane-utils] Compiling syn v3.0.3
34.14 s
[crane-utils] Compiling toml_parser v1.1.3+spec-1.1.0
35.06 s
[crane-utils] Compiling toml_datetime v1.1.1+spec-1.1.0
35.06 s
[crane-utils] Compiling serde_spanned v1.1.1
35.49 s
[crane-utils] Compiling toml v1.1.4+spec-1.1.0
35.49 s
[crane-utils] Compiling toml_edit v0.25.13+spec-1.1.0
35.65 s
[crane-utils] Compiling serde_derive v1.0.229
42.54 s
[crane-utils] Compiling crane-utils v0.1.0 (/build/source)
44.26 s
[crane-utils] Finished `release` profile [optimized] target(s) in 13.24s
44.27 s
[crane-utils] Executing cargoInstallPostBuildHook
44.30 s
[crane-utils] Finished cargoInstallPostBuildHook
44.30 s
[crane-utils] Finished cargoBuildHook
44.30 s
[crane-utils] Phase: checkPhase
44.31 s
[crane-utils] Executing cargoCheckHook
44.31 s
[crane-utils] cargoCheckHook flags: -j 16 --profile release --target x86_64-unknown-linux-gnu --offline --
44.35 s
[crane-utils] Compiling yansi v1.0.1
44.35 s
[crane-utils] Compiling diff v0.1.13
44.72 s
[crane-utils] Compiling pretty_assertions v1.4.1
45.28 s
[crane-utils] Compiling crane-utils v0.1.0 (/build/source)
46.25 s
[crane-utils] Finished `release` profile [optimized] target(s) in 1.91s
46.25 s
[crane-utils] Running unittests src/bin/crane-json2toml.rs (target/x86_64-unknown-linux-gnu/release/deps/crane_json2toml-81e0493385ff602f)
46.26 s
[crane-utils]
46.26 s
[crane-utils] running 0 tests
46.26 s
[crane-utils]
46.26 s
[crane-utils] test result: ok. 0 passed; 0 failed; 0 ignored; 0 measured; 0 filtered out; finished in 0.00s
46.26 s
[crane-utils]
46.26 s
[crane-utils] Running unittests src/bin/crane-resolve-workspace-inheritance.rs (target/x86_64-unknown-linux-gnu/release/deps/crane_resolve_workspace_inheritance-17631877c58153a5)
46.27 s
[crane-utils]
46.27 s
[crane-utils] running 2 tests
46.27 s
[crane-utils] test tests::smoke ... ok
46.27 s
[crane-utils] test tests::dependency_comments_ignored ... ok
46.27 s
[crane-utils]
46.27 s
[crane-utils] test result: ok. 2 passed; 0 failed; 0 ignored; 0 measured; 0 filtered out; finished in 0.01s
46.27 s
[crane-utils]
46.28 s
[crane-utils] Finished cargoCheckHook
46.29 s
[crane-utils] Phase: installPhase
46.29 s
[crane-utils] Executing cargoInstallHook
46.37 s
[crane-utils] Finished cargoInstallHook
46.37 s
[crane-utils] Phase: fixupPhase
46.43 s
[crane-utils] shrinking RPATHs of ELF executables and libraries in /nix/store/carsnga6bh1ilqhsm8dx0h5zk0y8xwyn-crane-utils-0.0.1
46.43 s
[crane-utils] shrinking /nix/store/carsnga6bh1ilqhsm8dx0h5zk0y8xwyn-crane-utils-0.0.1/bin/crane-json2toml
46.44 s
[crane-utils] shrinking /nix/store/carsnga6bh1ilqhsm8dx0h5zk0y8xwyn-crane-utils-0.0.1/bin/crane-resolve-workspace-inheritance
46.45 s
[crane-utils] checking for references to /build/ in /nix/store/carsnga6bh1ilqhsm8dx0h5zk0y8xwyn-crane-utils-0.0.1...
46.51 s
[crane-utils] patching script interpreter paths in /nix/store/carsnga6bh1ilqhsm8dx0h5zk0y8xwyn-crane-utils-0.0.1
46.52 s
[crane-utils] stripping (with command strip and flags -S -p) in /nix/store/carsnga6bh1ilqhsm8dx0h5zk0y8xwyn-crane-utils-0.0.1/bin
46.79 s
[crane-utils:post-build] Uploading to the NixCI cache: /nix/store/carsnga6bh1ilqhsm8dx0h5zk0y8xwyn-crane-utils-0.0.1
47.43 s
[crane-utils:post-build] warning: 'warn-short-path-literals' is deprecated, use 'lint-short-path-literals = ignore' instead
47.51 s
[crane-utils:post-build] copying 1 paths...
47.51 s
[crane-utils:post-build] copying path '/nix/store/carsnga6bh1ilqhsm8dx0h5zk0y8xwyn-crane-utils-0.0.1' to 'https://cache.nix-ci.com'...
48.77 s
[crane-utils:post-build] warning: 'warn-short-path-literals' is deprecated, use 'lint-short-path-literals = ignore' instead
48.90 s
[crane-utils:post-build] copying 0 paths...
49.10 s
Uploaded crane-utils in 2.4s
49.11 s
Progress: 14 of 21 built, 54 of 54 downloaded from cache
49.11 s
Built crane-utils in 18.3s
49.18 s
Building /nix/store/na46kjhymjli7jd7pff8wkfa122xzf4z-cargo-git-https-github.com-lcnbr-tymbolica-e85233dd3d99e5fb458913d0d49f99d83466025b.drv
49.25 s
Building /nix/store/qwapb7f34bp8n062h8x79j013kdnhj7x-cargo-git-https-github.com-symbolica-dev-symbolica-ba3737137c2a2ccd7bb39f0441837d38ec867e78.drv
49.40 s
[cargo-git-https-github.com-lcnbr-tymbolica-e85233dd3d99e5fb458913d0d49f99d83466025b] Phase: unpackPhase
49.42 s
[cargo-git-https-github.com-lcnbr-tymbolica-e85233dd3d99e5fb458913d0d49f99d83466025b] unpacking source archive /nix/store/lpidf625irqgbrw108q6gpv9i61lwdqx-source
49.45 s
[cargo-git-https-github.com-symbolica-dev-symbolica-ba3737137c2a2ccd7bb39f0441837d38ec867e78] Phase: unpackPhase
49.46 s
[cargo-git-https-github.com-symbolica-dev-symbolica-ba3737137c2a2ccd7bb39f0441837d38ec867e78] unpacking source archive /nix/store/kkkp9vwl65fqi16gnrpr3bw5b241bsb2-source
49.48 s
[cargo-git-https-github.com-lcnbr-tymbolica-e85233dd3d99e5fb458913d0d49f99d83466025b] source root is source
49.50 s
[cargo-git-https-github.com-symbolica-dev-symbolica-ba3737137c2a2ccd7bb39f0441837d38ec867e78] source root is source
49.51 s
[cargo-git-https-github.com-lcnbr-tymbolica-e85233dd3d99e5fb458913d0d49f99d83466025b] Phase: patchPhase
49.52 s
[cargo-git-https-github.com-symbolica-dev-symbolica-ba3737137c2a2ccd7bb39f0441837d38ec867e78] Phase: patchPhase
49.52 s
[cargo-git-https-github.com-lcnbr-tymbolica-e85233dd3d99e5fb458913d0d49f99d83466025b] Phase: updateAutotoolsGnuConfigScriptsPhase
49.53 s
[cargo-git-https-github.com-symbolica-dev-symbolica-ba3737137c2a2ccd7bb39f0441837d38ec867e78] Phase: updateAutotoolsGnuConfigScriptsPhase
49.54 s
[cargo-git-https-github.com-lcnbr-tymbolica-e85233dd3d99e5fb458913d0d49f99d83466025b] Phase: installPhase
49.55 s
[cargo-git-https-github.com-symbolica-dev-symbolica-ba3737137c2a2ccd7bb39f0441837d38ec867e78] Phase: installPhase
49.59 s
[cargo-git-https-github.com-lcnbr-tymbolica-e85233dd3d99e5fb458913d0d49f99d83466025b] warning : manifest has no description, documentation, homepage or repository
49.59 s
[cargo-git-https-github.com-lcnbr-tymbolica-e85233dd3d99e5fb458913d0d49f99d83466025b] |
49.59 s
[cargo-git-https-github.com-lcnbr-tymbolica-e85233dd3d99e5fb458913d0d49f99d83466025b] = note : see https://doc.rust-lang.org/cargo/reference/manifest.html#package-metadata for more info
49.74 s
[cargo-git-https-github.com-lcnbr-tymbolica-e85233dd3d99e5fb458913d0d49f99d83466025b] warning : manifest has no description, documentation, homepage or repository
49.74 s
[cargo-git-https-github.com-lcnbr-tymbolica-e85233dd3d99e5fb458913d0d49f99d83466025b] |
49.74 s
[cargo-git-https-github.com-lcnbr-tymbolica-e85233dd3d99e5fb458913d0d49f99d83466025b] = note : see https://doc.rust-lang.org/cargo/reference/manifest.html#package-metadata for more info
49.88 s
[cargo-git-https-github.com-lcnbr-tymbolica-e85233dd3d99e5fb458913d0d49f99d83466025b] warning : manifest has no description, documentation, homepage or repository
49.88 s
[cargo-git-https-github.com-lcnbr-tymbolica-e85233dd3d99e5fb458913d0d49f99d83466025b] |
49.88 s
[cargo-git-https-github.com-lcnbr-tymbolica-e85233dd3d99e5fb458913d0d49f99d83466025b] = note : see https://doc.rust-lang.org/cargo/reference/manifest.html#package-metadata for more info
50.00 s
[cargo-git-https-github.com-lcnbr-tymbolica-e85233dd3d99e5fb458913d0d49f99d83466025b] warning : manifest has no description, documentation, homepage or repository
50.00 s
[cargo-git-https-github.com-lcnbr-tymbolica-e85233dd3d99e5fb458913d0d49f99d83466025b] |
50.00 s
[cargo-git-https-github.com-lcnbr-tymbolica-e85233dd3d99e5fb458913d0d49f99d83466025b] = note : see https://doc.rust-lang.org/cargo/reference/manifest.html#package-metadata for more info
51.53 s
[cargo-git-https-github.com-symbolica-dev-symbolica-ba3737137c2a2ccd7bb39f0441837d38ec867e78] warning : manifest has no description, license, license-file, documentation, homepage or repository
51.53 s
[cargo-git-https-github.com-symbolica-dev-symbolica-ba3737137c2a2ccd7bb39f0441837d38ec867e78] |
51.53 s
[cargo-git-https-github.com-symbolica-dev-symbolica-ba3737137c2a2ccd7bb39f0441837d38ec867e78] = note : see https://doc.rust-lang.org/cargo/reference/manifest.html#package-metadata for more info
51.67 s
[cargo-git-https-github.com-symbolica-dev-symbolica-ba3737137c2a2ccd7bb39f0441837d38ec867e78] warning : manifest has no description, license, license-file, documentation, homepage or repository
51.67 s
[cargo-git-https-github.com-symbolica-dev-symbolica-ba3737137c2a2ccd7bb39f0441837d38ec867e78] |
51.67 s
[cargo-git-https-github.com-symbolica-dev-symbolica-ba3737137c2a2ccd7bb39f0441837d38ec867e78] = note : see https://doc.rust-lang.org/cargo/reference/manifest.html#package-metadata for more info
52.04 s
[cargo-git-https-github.com-symbolica-dev-symbolica-ba3737137c2a2ccd7bb39f0441837d38ec867e78:post-build] Uploading to the NixCI cache: /nix/store/cd3p4zndy5vjpfgg4k8rn44gf8dibc3k-cargo-git-https-github.com-symbolica-dev-symbolica-ba3737137c2a2ccd7bb39f0441837d38ec867e78
52.70 s
[cargo-git-https-github.com-symbolica-dev-symbolica-ba3737137c2a2ccd7bb39f0441837d38ec867e78:post-build] warning: 'warn-short-path-literals' is deprecated, use 'lint-short-path-literals = ignore' instead
52.75 s
[cargo-git-https-github.com-symbolica-dev-symbolica-ba3737137c2a2ccd7bb39f0441837d38ec867e78:post-build] copying 1 paths...
52.75 s
[cargo-git-https-github.com-symbolica-dev-symbolica-ba3737137c2a2ccd7bb39f0441837d38ec867e78:post-build] copying path '/nix/store/cd3p4zndy5vjpfgg4k8rn44gf8dibc3k-cargo-git-https-github.com-symbolica-dev-symbolica-ba3737137c2a2ccd7bb39f0441837d38ec867e78' to 'https://cache.nix-ci.com'...
64.87 s
[cargo-git-https-github.com-symbolica-dev-symbolica-ba3737137c2a2ccd7bb39f0441837d38ec867e78:post-build] warning: 'warn-short-path-literals' is deprecated, use 'lint-short-path-literals = ignore' instead
65.06 s
[cargo-git-https-github.com-symbolica-dev-symbolica-ba3737137c2a2ccd7bb39f0441837d38ec867e78:post-build] copying 2 paths...
65.06 s
[cargo-git-https-github.com-symbolica-dev-symbolica-ba3737137c2a2ccd7bb39f0441837d38ec867e78:post-build] copying path '/nix/store/kkkp9vwl65fqi16gnrpr3bw5b241bsb2-source' to 'https://cache.nix-ci.com'...
77.73 s
[cargo-git-https-github.com-symbolica-dev-symbolica-ba3737137c2a2ccd7bb39f0441837d38ec867e78:post-build] copying path '/nix/store/qwapb7f34bp8n062h8x79j013kdnhj7x-cargo-git-https-github.com-symbolica-dev-symbolica-ba3737137c2a2ccd7bb39f0441837d38ec867e78.drv' to 'https://cache.nix-ci.com'...
77.81 s
Uploaded cargo-git-https-github.com-symbolica-dev-symbolica-ba3737137c2a2ccd7bb39f0441837d38ec867e78 in 25.8s
77.81 s
Progress: 15 of 21 built (1 building), 54 of 54 downloaded from cache
77.81 s
Built cargo-git-https-github.com-symbolica-dev-symbolica-ba3737137c2a2ccd7bb39f0441837d38ec867e78 in 28.5s
77.85 s
Building /nix/store/nb7v98mdbxwchsphg0jii6a21xzcc3p5-linkLockedDeps.drv
77.97 s
[cargo-git-https-github.com-lcnbr-tymbolica-e85233dd3d99e5fb458913d0d49f99d83466025b:post-build] Uploading to the NixCI cache: /nix/store/w78cfxg9ik0dlpzgkblr1rxwcd0rp9f4-cargo-git-https-github.com-lcnbr-tymbolica-e85233dd3d99e5fb458913d0d49f99d83466025b
78.04 s
[cargo-git-https-github.com-lcnbr-tymbolica-e85233dd3d99e5fb458913d0d49f99d83466025b:post-build] warning: 'warn-short-path-literals' is deprecated, use 'lint-short-path-literals = ignore' instead
78.05 s
[cargo-git-https-github.com-lcnbr-tymbolica-e85233dd3d99e5fb458913d0d49f99d83466025b:post-build] copying 1 paths...
78.05 s
[cargo-git-https-github.com-lcnbr-tymbolica-e85233dd3d99e5fb458913d0d49f99d83466025b:post-build] copying path '/nix/store/w78cfxg9ik0dlpzgkblr1rxwcd0rp9f4-cargo-git-https-github.com-lcnbr-tymbolica-e85233dd3d99e5fb458913d0d49f99d83466025b' to 'https://cache.nix-ci.com'...
87.33 s
[cargo-git-https-github.com-lcnbr-tymbolica-e85233dd3d99e5fb458913d0d49f99d83466025b:post-build] warning: 'warn-short-path-literals' is deprecated, use 'lint-short-path-literals = ignore' instead
87.50 s
[cargo-git-https-github.com-lcnbr-tymbolica-e85233dd3d99e5fb458913d0d49f99d83466025b:post-build] copying 0 paths...
87.52 s
Uploaded cargo-git-https-github.com-lcnbr-tymbolica-e85233dd3d99e5fb458913d0d49f99d83466025b in 9.5s
87.53 s
Progress: 16 of 21 built (1 building), 54 of 54 downloaded from cache
87.53 s
Built cargo-git-https-github.com-lcnbr-tymbolica-e85233dd3d99e5fb458913d0d49f99d83466025b in 38.3s
87.58 s
Building /nix/store/s87hnz4dmwjy7h4c4y3nsdl0vnrrilhi-linkLockedDeps.drv
87.62 s
[linkLockedDeps:post-build] Uploading to the NixCI cache: /nix/store/wvy1clxw53rsv4m2avrcr5r7lx7r0qxn-linkLockedDeps
87.68 s
[linkLockedDeps:post-build] warning: 'warn-short-path-literals' is deprecated, use 'lint-short-path-literals = ignore' instead
87.78 s
[linkLockedDeps:post-build] copying 0 paths...
89.27 s
[linkLockedDeps:post-build] warning: 'warn-short-path-literals' is deprecated, use 'lint-short-path-literals = ignore' instead
89.51 s
[linkLockedDeps:post-build] copying 0 paths...
89.78 s
Uploaded linkLockedDeps in 2.1s
89.78 s
Progress: 17 of 21 built (1 building), 54 of 54 downloaded from cache
89.78 s
Built linkLockedDeps in 11.9s
89.93 s
[linkLockedDeps:post-build] Uploading to the NixCI cache: /nix/store/xhwnwyvn2715nvlk8ifi55radx8vc2ps-linkLockedDeps
90.55 s
[linkLockedDeps:post-build] warning: 'warn-short-path-literals' is deprecated, use 'lint-short-path-literals = ignore' instead
90.68 s
[linkLockedDeps:post-build] copying 0 paths...
91.16 s
[linkLockedDeps:post-build] warning: 'warn-short-path-literals' is deprecated, use 'lint-short-path-literals = ignore' instead
91.30 s
[linkLockedDeps:post-build] copying 0 paths...
91.32 s
Uploaded linkLockedDeps in 1.5s
91.32 s
Progress: 18 of 21 built, 54 of 54 downloaded from cache
91.32 s
Built linkLockedDeps in 3.7s
91.43 s
Building /nix/store/bldni831zjd1rj8856xa6ny9q5957kfp-vendor-cargo-deps.drv
91.54 s
[vendor-cargo-deps:post-build] Uploading to the NixCI cache: /nix/store/5dfb7akvi1k3080zqfndr6jw2ay3di2p-vendor-cargo-deps
91.60 s
[vendor-cargo-deps:post-build] warning: 'warn-short-path-literals' is deprecated, use 'lint-short-path-literals = ignore' instead
91.65 s
[vendor-cargo-deps:post-build] copying 0 paths...
91.74 s
[vendor-cargo-deps:post-build] warning: 'warn-short-path-literals' is deprecated, use 'lint-short-path-literals = ignore' instead
91.88 s
[vendor-cargo-deps:post-build] copying 0 paths...
91.90 s
Uploaded vendor-cargo-deps in 378ms
91.90 s
Progress: 19 of 21 built, 54 of 54 downloaded from cache
91.90 s
Built vendor-cargo-deps in 470ms
92.01 s
Building /nix/store/623idw7bxrdblwflbqi3k630cvnna0if-alphal00p-docs-cargo-0.1.0.drv
92.06 s
[alphal00p-docs-cargo] cargoArtifacts not set, will not reuse any cargo artifacts
92.09 s
[alphal00p-docs-cargo] Phase: unpackPhase
92.09 s
[alphal00p-docs-cargo] unpacking source archive /nix/store/zw5i19nvfc6y8mffi47icfczb0q4x6ip-source
92.17 s
[alphal00p-docs-cargo] source root is source
92.19 s
[alphal00p-docs-cargo] Phase: patchPhase
92.21 s
[alphal00p-docs-cargo] Executing configureCargoCommonVars
92.21 s
[alphal00p-docs-cargo] Phase: updateAutotoolsGnuConfigScriptsPhase
92.23 s
[alphal00p-docs-cargo] Phase: configurePhase
92.23 s
[alphal00p-docs-cargo] will append /build/source/.cargo-home/config.toml with contents of /nix/store/5dfb7akvi1k3080zqfndr6jw2ay3di2p-vendor-cargo-deps/config.toml
92.23 s
[alphal00p-docs-cargo] default configurePhase, nothing to do
92.24 s
[alphal00p-docs-cargo] Phase: buildPhase
92.24 s
[alphal00p-docs-cargo] +++ command cargo --version
92.24 s
[alphal00p-docs-cargo] cargo 1.98.1 (797e8a9bc 2026-08-05)
92.25 s
[alphal00p-docs-cargo] +++ command cargo build --profile docs --locked -p alphal00p-docs-catalogs --bin alphal00p-docs-catalogs
92.64 s
[alphal00p-docs-cargo] Compiling proc-macro2 v1.0.106
92.64 s
[alphal00p-docs-cargo] Compiling unicode-ident v1.0.24
92.64 s
[alphal00p-docs-cargo] Compiling quote v1.0.45
92.64 s
[alphal00p-docs-cargo] Compiling serde_core v1.0.228
92.64 s
[alphal00p-docs-cargo] Compiling memchr v2.8.0
92.64 s
[alphal00p-docs-cargo] Compiling utf8parse v0.2.2
92.65 s
[alphal00p-docs-cargo] Compiling zmij v1.0.21
92.65 s
[alphal00p-docs-cargo] Compiling serde v1.0.228
92.66 s
[alphal00p-docs-cargo] Compiling anstyle v1.0.14
92.66 s
[alphal00p-docs-cargo] Compiling colorchoice v1.0.5
92.66 s
[alphal00p-docs-cargo] Compiling serde_json v1.0.149
92.66 s
[alphal00p-docs-cargo] Compiling is_terminal_polyfill v1.70.2
92.66 s
[alphal00p-docs-cargo] Compiling anstyle-query v1.1.5
92.66 s
[alphal00p-docs-cargo] Compiling thiserror v2.0.18
92.66 s
[alphal00p-docs-cargo] Compiling hashbrown v0.17.1
92.66 s
[alphal00p-docs-cargo] Compiling eyre v0.6.12
92.71 s
[alphal00p-docs-cargo] Compiling anstyle-parse v1.0.0
92.73 s
[alphal00p-docs-cargo] Compiling itoa v1.0.18
92.75 s
[alphal00p-docs-cargo] Compiling strsim v0.11.1
92.75 s
[alphal00p-docs-cargo] Compiling clap_lex v1.1.0
92.76 s
[alphal00p-docs-cargo] Compiling regex-syntax v0.8.10
92.89 s
[alphal00p-docs-cargo] Compiling equivalent v1.0.2
92.93 s
[alphal00p-docs-cargo] Compiling anstream v1.0.0
92.94 s
[alphal00p-docs-cargo] Compiling heck v0.5.0
92.96 s
[alphal00p-docs-cargo] Compiling indenter v0.3.4
92.99 s
[alphal00p-docs-cargo] Compiling once_cell v1.21.4
93.19 s
[alphal00p-docs-cargo] Compiling aho-corasick v1.1.4
93.19 s
[alphal00p-docs-cargo] Compiling clap_builder v4.6.0
93.65 s
[alphal00p-docs-cargo] Compiling syn v2.0.117
94.23 s
[alphal00p-docs-cargo] Compiling regex-automata v0.4.14
94.80 s
[alphal00p-docs-cargo] Compiling indexmap v2.14.0
95.45 s
[alphal00p-docs-cargo] Compiling thiserror-impl v2.0.18
95.45 s
[alphal00p-docs-cargo] Compiling serde_derive v1.0.228
95.45 s
[alphal00p-docs-cargo] Compiling clap_derive v4.6.1
95.45 s
[alphal00p-docs-cargo] Compiling alphal00p-docs-macros v0.1.0 (/build/source/crates/alphal00p-docs-macros)
95.59 s
[alphal00p-docs-cargo] Compiling regex v1.12.3
96.54 s
[alphal00p-docs-cargo] Compiling clap v4.6.1
97.60 s
[alphal00p-docs-cargo] Compiling alphal00p-docs-schema v0.1.0 (/build/source/crates/alphal00p-docs-schema)
98.13 s
[alphal00p-docs-cargo] Compiling alphal00p-docs-catalogs v0.1.0 (/build/source/crates/alphal00p-docs-catalogs)
103.62 s
[alphal00p-docs-cargo] Finished `docs` profile [unoptimized] target(s) in 11.36s
103.67 s
[alphal00p-docs-cargo] +++ command cargo build --profile docs --locked -p alphal00p-docs-python-exporter --features gammaloop
104.12 s
[alphal00p-docs-cargo] Compiling serde_core v1.0.228
104.12 s
[alphal00p-docs-cargo] Compiling libc v0.2.186
104.12 s
[alphal00p-docs-cargo] Compiling cfg-if v1.0.4
104.12 s
[alphal00p-docs-cargo] Compiling serde v1.0.228
104.12 s
[alphal00p-docs-cargo] Compiling memchr v2.8.0
104.12 s
[alphal00p-docs-cargo] Compiling autocfg v1.5.0
104.12 s
[alphal00p-docs-cargo] Compiling libm v0.2.16
104.13 s
[alphal00p-docs-cargo] Compiling version_check v0.9.5
104.13 s
[alphal00p-docs-cargo] Compiling either v1.15.0
104.14 s
[alphal00p-docs-cargo] Compiling zerocopy v0.8.48
104.15 s
[alphal00p-docs-cargo] Compiling crossbeam-utils v0.8.21
104.15 s
[alphal00p-docs-cargo] Compiling log v0.4.29
104.16 s
[alphal00p-docs-cargo] Compiling unicode-width v0.2.2
104.16 s
[alphal00p-docs-cargo] Compiling rayon-core v1.13.0
104.16 s
[alphal00p-docs-cargo] Compiling foldhash v0.2.0
104.16 s
[alphal00p-docs-cargo] Compiling target-lexicon v0.13.5
104.18 s
[alphal00p-docs-cargo] Compiling syn v2.0.117
104.29 s
[alphal00p-docs-cargo] Compiling syn v3.0.4
104.33 s
[alphal00p-docs-cargo] Compiling lazy_static v1.5.0
104.36 s
[alphal00p-docs-cargo] Compiling serde_json v1.0.149
104.39 s
[alphal00p-docs-cargo] Compiling paste v1.0.15
104.40 s
[alphal00p-docs-cargo] Compiling crunchy v0.2.4
104.42 s
[alphal00p-docs-cargo] Compiling siphasher v1.0.2
104.47 s
[alphal00p-docs-cargo] Compiling num-traits v0.2.19
104.49 s
[alphal00p-docs-cargo] Compiling getrandom v0.3.4
104.51 s
[alphal00p-docs-cargo] Compiling anyhow v1.0.102
104.56 s
[alphal00p-docs-cargo] Compiling aho-corasick v1.1.4
104.61 s
[alphal00p-docs-cargo] Compiling tiny-keccak v2.0.2
104.65 s
[alphal00p-docs-cargo] Compiling itertools v0.14.0
104.82 s
[alphal00p-docs-cargo] Compiling static_assertions v1.1.0
104.89 s
[alphal00p-docs-cargo] Compiling time-core v0.1.8
104.89 s
[alphal00p-docs-cargo] Compiling num-conv v0.2.1
104.91 s
[alphal00p-docs-cargo] Compiling powerfmt v0.2.0
104.91 s
[alphal00p-docs-cargo] Compiling rustix v1.1.4
104.99 s
[alphal00p-docs-cargo] Compiling crossbeam-epoch v0.9.18
105.06 s
[alphal00p-docs-cargo] Compiling deranged v0.5.8
105.08 s
[alphal00p-docs-cargo] Compiling time-macros v0.2.27
105.09 s
[alphal00p-docs-cargo] Compiling linux-raw-sys v0.12.1
105.17 s
[alphal00p-docs-cargo] Compiling pyo3-build-config v0.28.3
105.27 s
[alphal00p-docs-cargo] Compiling num_threads v0.1.7
105.38 s
[alphal00p-docs-cargo] Compiling crossbeam-deque v0.8.6
105.39 s
[alphal00p-docs-cargo] Compiling allocator-api2 v0.2.21
105.43 s
[alphal00p-docs-cargo] Compiling tracing-core v0.1.36
105.44 s
[alphal00p-docs-cargo] Compiling winnow v1.0.2
105.45 s
[alphal00p-docs-cargo] Compiling virtue v0.0.18
105.59 s
[alphal00p-docs-cargo] Compiling arrayvec v0.7.6
105.81 s
[alphal00p-docs-cargo] Compiling regex-automata v0.4.14
106.12 s
[alphal00p-docs-cargo] Compiling getrandom v0.2.17
106.20 s
[alphal00p-docs-cargo] Compiling rayon v1.12.0
106.24 s
[alphal00p-docs-cargo] Compiling hashbrown v0.16.1
106.39 s
[alphal00p-docs-cargo] Compiling bitflags v2.11.1
106.43 s
[alphal00p-docs-cargo] Compiling time v0.3.47
106.44 s
[alphal00p-docs-cargo] Compiling rand_core v0.6.4
106.45 s
[alphal00p-docs-cargo] Compiling rand_core v0.9.5
106.47 s
[alphal00p-docs-cargo] Compiling toml_parser v1.1.2+spec-1.1.0
106.61 s
[alphal00p-docs-cargo] Compiling bincode_derive v2.0.1
106.61 s
[alphal00p-docs-cargo] Compiling serde_spanned v1.1.1
106.63 s
[alphal00p-docs-cargo] Compiling phf_shared v0.11.3
106.72 s
[alphal00p-docs-cargo] Compiling unty v0.0.4
106.75 s
[alphal00p-docs-cargo] Compiling toml_writer v1.1.1+spec-1.1.0
106.76 s
[alphal00p-docs-cargo] Compiling gmp-mpfr-sys v1.7.1
106.80 s
[alphal00p-docs-cargo] Compiling num-integer v0.1.46
106.84 s
[alphal00p-docs-cargo] Compiling approx v0.5.1
106.88 s
[alphal00p-docs-cargo] Compiling pin-project-lite v0.2.17
106.92 s
[alphal00p-docs-cargo] Compiling nu-ansi-term v0.50.3
106.97 s
[alphal00p-docs-cargo] Compiling tracing-log v0.2.0
107.01 s
[alphal00p-docs-cargo] Compiling matrixmultiply v0.3.10
107.02 s
[alphal00p-docs-cargo] Compiling sharded-slab v0.1.7
107.12 s
[alphal00p-docs-cargo] Compiling hashbrown v0.17.1
107.20 s
[alphal00p-docs-cargo] Compiling thread_local v1.1.9
107.25 s
[alphal00p-docs-cargo] Compiling option-ext v0.2.0
107.33 s
[alphal00p-docs-cargo] Compiling rug v1.30.0
107.34 s
[alphal00p-docs-cargo] Compiling syn v1.0.109
107.44 s
[alphal00p-docs-cargo] Compiling typenum v1.20.0
107.46 s
[alphal00p-docs-cargo] Compiling dirs-sys v0.5.0
107.48 s
[alphal00p-docs-cargo] Compiling pyo3-ffi v0.28.3
107.53 s
[alphal00p-docs-cargo] Compiling num-complex v0.4.6
107.58 s
[alphal00p-docs-cargo] Compiling toml_datetime v1.1.1+spec-1.1.0
107.64 s
[alphal00p-docs-cargo] Compiling rawpointer v0.2.1
107.68 s
[alphal00p-docs-cargo] Compiling fnv v1.0.7
107.72 s
[alphal00p-docs-cargo] Compiling alloc-no-stdlib v2.0.4
107.73 s
[alphal00p-docs-cargo] Compiling dyn-clone v1.0.20
107.78 s
[alphal00p-docs-cargo] Compiling az v1.3.0
107.81 s
[alphal00p-docs-cargo] Compiling alloc-stdlib v0.2.2
107.89 s
[alphal00p-docs-cargo] Compiling pyo3-macros-backend v0.28.3
107.90 s
[alphal00p-docs-cargo] Compiling num-bigint v0.4.6
107.92 s
[alphal00p-docs-cargo] Compiling generic-array v0.14.7
107.99 s
[alphal00p-docs-cargo] Compiling colored v3.1.1
108.06 s
[alphal00p-docs-cargo] Compiling bytemuck_derive v1.12.0
108.07 s
[alphal00p-docs-cargo] Compiling bitflags v1.3.2
108.13 s
[alphal00p-docs-cargo] Compiling errno v0.3.14
108.26 s
[alphal00p-docs-cargo] Compiling getopts v0.2.24
108.30 s
[alphal00p-docs-cargo] Compiling signal-hook v0.3.18
108.32 s
[alphal00p-docs-cargo] Compiling same-file v1.0.6
108.33 s
[alphal00p-docs-cargo] Compiling ident_case v1.0.1
108.40 s
[alphal00p-docs-cargo] Compiling indexmap v2.14.0
108.42 s
[alphal00p-docs-cargo] Compiling parking_lot_core v0.9.12
108.43 s
[alphal00p-docs-cargo] Compiling walkdir v2.5.0
108.50 s
[alphal00p-docs-cargo] Compiling signal-hook-registry v1.4.8
108.57 s
[alphal00p-docs-cargo] Compiling synstructure v0.13.2
108.68 s
[alphal00p-docs-cargo] Compiling region v3.0.2
108.74 s
[alphal00p-docs-cargo] Compiling toml v1.1.2+spec-1.1.0
108.75 s
[alphal00p-docs-cargo] Compiling matchers v0.2.0
108.76 s
[alphal00p-docs-cargo] Compiling regex v1.12.3
108.77 s
[alphal00p-docs-cargo] Compiling const-random-macro v0.1.16
108.84 s
[alphal00p-docs-cargo] Compiling hugepage-rs v0.1.1
109.01 s
[alphal00p-docs-cargo] Compiling wasmtime-jit-icache-coherence v34.0.2
109.03 s
[alphal00p-docs-cargo] Compiling vte v0.14.1
109.05 s
[alphal00p-docs-cargo] Compiling smartstring v1.0.1
109.06 s
[alphal00p-docs-cargo] Compiling ahash v0.8.12
109.13 s
[alphal00p-docs-cargo] Compiling inventory v0.3.24
109.19 s
[alphal00p-docs-cargo] Compiling unic-char-range v0.9.0
109.20 s
[alphal00p-docs-cargo] Compiling unic-common v0.9.0
109.20 s
[alphal00p-docs-cargo] Compiling scopeguard v1.2.0
109.20 s
[alphal00p-docs-cargo] Compiling spec_math v0.1.6
109.20 s
[alphal00p-docs-cargo] Compiling const-random v0.1.18
109.24 s
[alphal00p-docs-cargo] Compiling unic-char-property v0.9.0
109.25 s
[alphal00p-docs-cargo] Compiling unic-ucd-version v0.9.0
109.28 s
[alphal00p-docs-cargo] Compiling lock_api v0.4.14
109.29 s
[alphal00p-docs-cargo] Compiling terminal_size v0.4.4
109.36 s
[alphal00p-docs-cargo] Compiling brotli-decompressor v5.0.0
109.40 s
[alphal00p-docs-cargo] Compiling mio v1.2.0
109.49 s
[alphal00p-docs-cargo] Compiling rustpython-parser-vendored v0.4.0
109.50 s
[alphal00p-docs-cargo] Compiling itertools v0.11.0
109.51 s
[alphal00p-docs-cargo] Compiling bytemuck v1.25.0
109.52 s
[alphal00p-docs-cargo] Compiling indenter v0.3.4
109.56 s
[alphal00p-docs-cargo] Compiling rustix v0.38.44
109.57 s
[alphal00p-docs-cargo] Compiling minimal-lexical v0.2.1
109.61 s
[alphal00p-docs-cargo] Compiling unicase v2.9.0
109.74 s
[alphal00p-docs-cargo] Compiling safe_arch v0.7.4
109.76 s
[alphal00p-docs-cargo] Compiling safe_arch v1.2.0
109.77 s
[alphal00p-docs-cargo] Compiling winnow v0.7.15
109.78 s
[alphal00p-docs-cargo] Compiling iana-time-zone v0.1.65
109.81 s
[alphal00p-docs-cargo] Compiling fastrand v2.4.1
109.82 s
[alphal00p-docs-cargo] Compiling clap_builder v4.6.0
109.84 s
[alphal00p-docs-cargo] Compiling nom v7.1.3
109.96 s
[alphal00p-docs-cargo] Compiling signal-hook-mio v0.2.5
110.04 s
[alphal00p-docs-cargo] Compiling wide v0.7.33
110.07 s
[alphal00p-docs-cargo] Compiling block-buffer v0.10.4
110.11 s
[alphal00p-docs-cargo] Compiling crypto-common v0.1.7
110.11 s
[alphal00p-docs-cargo] Compiling directories v6.0.0
110.18 s
[alphal00p-docs-cargo] Compiling wide v1.7.0
110.20 s
[alphal00p-docs-cargo] Compiling numpy v0.28.0
110.23 s
[alphal00p-docs-cargo] Compiling phf v0.11.3
110.24 s
[alphal00p-docs-cargo] Compiling brotli v8.0.2
110.25 s
[alphal00p-docs-cargo] Compiling libloading v0.9.0
110.35 s
[alphal00p-docs-cargo] Compiling byteorder v1.5.0
110.40 s
[alphal00p-docs-cargo] Compiling linux-raw-sys v0.4.15
110.41 s
[alphal00p-docs-cargo] Compiling serde_derive v1.0.228
110.46 s
[alphal00p-docs-cargo] Compiling zerocopy-derive v0.8.48
110.50 s
[alphal00p-docs-cargo] Compiling tracing-attributes v0.1.31
110.51 s
[alphal00p-docs-cargo] Compiling thiserror-impl v2.0.18
110.56 s
[alphal00p-docs-cargo] Compiling is-macro v0.3.7
110.78 s
[alphal00p-docs-cargo] Compiling strum_macros v0.27.2
110.82 s
[alphal00p-docs-cargo] Compiling clap_derive v4.6.1
111.39 s
[alphal00p-docs-cargo] Compiling simba v0.9.1
111.56 s
[alphal00p-docs-cargo] Compiling rustpython-parser-core v0.4.0
111.65 s
[alphal00p-docs-cargo] Compiling zerofrom-derive v0.1.7
111.77 s
[alphal00p-docs-cargo] Compiling ed25519-compact v2.4.2
111.85 s
[alphal00p-docs-cargo] Compiling data-encoding v2.11.1
112.24 s
[alphal00p-docs-cargo] Compiling unicode-segmentation v1.13.2
112.33 s
[alphal00p-docs-cargo] Compiling tracing v0.1.44
112.49 s
[alphal00p-docs-cargo] Compiling tinyjson v2.5.1
112.57 s
[alphal00p-docs-cargo] Compiling append-only-vec v0.1.8
112.60 s
[alphal00p-docs-cargo] Compiling bytes v1.11.1
112.67 s
[alphal00p-docs-cargo] Compiling self_cell v1.2.2
112.69 s
[alphal00p-docs-cargo] Compiling thiserror v2.0.18
112.76 s
[alphal00p-docs-cargo] Compiling rustc-hash v2.1.2
112.76 s
[alphal00p-docs-cargo] Compiling rustpython-ast v0.4.0
112.79 s
[alphal00p-docs-cargo] Compiling ansitok v0.3.0
112.92 s
[alphal00p-docs-cargo] Compiling yoke-derive v0.8.2
113.32 s
[alphal00p-docs-cargo] Compiling digest v0.10.7
113.33 s
[alphal00p-docs-cargo] Compiling unic-ucd-ident v0.9.0
113.44 s
[alphal00p-docs-cargo] Compiling clap v4.6.1
113.49 s
[alphal00p-docs-cargo] Compiling unic-emoji-char v0.9.0
113.52 s
[alphal00p-docs-cargo] Compiling pyo3 v0.28.3
113.52 s
[alphal00p-docs-cargo] Compiling bstr v1.12.1
113.53 s
[alphal00p-docs-cargo] Compiling phf_shared v0.13.1
113.54 s
[alphal00p-docs-cargo] Compiling zerofrom v0.1.8
113.62 s
[alphal00p-docs-cargo] Compiling stable_deref_trait v1.2.1
113.63 s
[alphal00p-docs-cargo] Compiling pyo3-macros v0.28.3
113.64 s
[alphal00p-docs-cargo] Compiling typeid v1.0.3
113.65 s
[alphal00p-docs-cargo] Compiling ciborium-io v0.2.2
113.67 s
[alphal00p-docs-cargo] Compiling getrandom v0.4.2
113.69 s
[alphal00p-docs-cargo] Compiling strum v0.27.2
113.69 s
[alphal00p-docs-cargo] Compiling plotters-backend v0.3.7
113.72 s
[alphal00p-docs-cargo] Compiling cpufeatures v0.2.17
113.75 s
[alphal00p-docs-cargo] Compiling rustc-hash v1.1.0
113.79 s
[alphal00p-docs-cargo] Compiling lalrpop-util v0.20.2
113.81 s
[alphal00p-docs-cargo] Compiling sha2 v0.10.9
113.83 s
[alphal00p-docs-cargo] Compiling eyre v0.6.12
113.91 s
[alphal00p-docs-cargo] Compiling plotters-svg v0.3.7
113.92 s
[alphal00p-docs-cargo] Compiling num-rational v0.4.2
113.93 s
[alphal00p-docs-cargo] Compiling zerovec-derive v0.11.6
114.00 s
[alphal00p-docs-cargo] Compiling globset v0.4.18
114.08 s
[alphal00p-docs-cargo] Compiling toml_datetime v0.7.5+spec-1.1.0
114.11 s
[alphal00p-docs-cargo] Compiling console v0.16.3
114.12 s
[alphal00p-docs-cargo] Compiling itertools v0.10.5
114.14 s
[alphal00p-docs-cargo] Compiling ucd-trie v0.1.7
114.33 s
[alphal00p-docs-cargo] Compiling toml_write v0.1.2
114.37 s
[alphal00p-docs-cargo] Compiling cast v0.3.0
114.38 s
[alphal00p-docs-cargo] Compiling adler2 v2.0.1
114.51 s
[alphal00p-docs-cargo] Compiling rustversion v1.0.22
114.52 s
[alphal00p-docs-cargo] Compiling symbolica v2.2.0 (https://github.com/symbolica-dev/symbolica?rev=ba3737137c2a2ccd7bb39f0441837d38ec867e78#ba373713)
114.56 s
[alphal00p-docs-cargo] Compiling simd-adler32 v0.3.10
114.58 s
[alphal00p-docs-cargo] Compiling pest v2.8.6
114.62 s
[alphal00p-docs-cargo] Compiling rust-embed-utils v8.11.0
114.72 s
[alphal00p-docs-cargo] Compiling miniz_oxide v0.8.9
114.75 s
[alphal00p-docs-cargo] Compiling toml v0.9.12+spec-1.1.0
114.76 s
[alphal00p-docs-cargo] Compiling yoke v0.8.3
114.89 s
[alphal00p-docs-cargo] Compiling plotters v0.3.7
114.96 s
[alphal00p-docs-cargo] Compiling ansi-str v0.9.0
114.98 s
[alphal00p-docs-cargo] Compiling ndarray v0.17.2
114.98 s
[alphal00p-docs-cargo] Compiling displaydoc v0.2.7
115.03 s
[alphal00p-docs-cargo] Compiling smallvec v1.15.1
115.08 s
[alphal00p-docs-cargo] Compiling bincode v2.0.1
115.35 s
[alphal00p-docs-cargo] Compiling tracing-serde v0.2.0
115.51 s
[alphal00p-docs-cargo] Compiling tracing-subscriber v0.3.23
115.53 s
[alphal00p-docs-cargo] Compiling chrono v0.4.44
115.65 s
[alphal00p-docs-cargo] Compiling xprec v0.2.2
115.69 s
[alphal00p-docs-cargo] Compiling parking_lot v0.12.5
115.75 s
[alphal00p-docs-cargo] Compiling toml_datetime v0.6.11
116.03 s
[alphal00p-docs-cargo] Compiling crossterm v0.28.1
116.05 s
[alphal00p-docs-cargo] Compiling bincode-trait-derive v0.1.1
116.07 s
[alphal00p-docs-cargo] Compiling serde_spanned v0.6.9
116.08 s
[alphal00p-docs-cargo] Compiling criterion-plot v0.5.0
116.09 s
[alphal00p-docs-cargo] Compiling zerovec v0.11.8
116.22 s
[alphal00p-docs-cargo] Compiling toml_edit v0.22.27
116.32 s
[alphal00p-docs-cargo] Compiling tinytemplate v1.2.1
116.62 s
[alphal00p-docs-cargo] Compiling is-terminal v0.4.17
116.72 s
[alphal00p-docs-cargo] Compiling slotmap v1.1.1
116.76 s
[alphal00p-docs-cargo] Compiling anes v0.1.6
116.78 s
[alphal00p-docs-cargo] Compiling maplit v1.0.2
116.87 s
[alphal00p-docs-cargo] Compiling oorandom v11.1.5
116.98 s
[alphal00p-docs-cargo] Compiling ppv-lite86 v0.2.21
117.07 s
[alphal00p-docs-cargo] Compiling half v2.7.1
117.09 s
[alphal00p-docs-cargo] Compiling bytecount v0.6.9
117.20 s
[alphal00p-docs-cargo] Compiling papergrid v0.18.0
117.32 s
[alphal00p-docs-cargo] Compiling rand_chacha v0.3.1
117.34 s
[alphal00p-docs-cargo] Compiling rand_chacha v0.9.0
117.35 s
[alphal00p-docs-cargo] Compiling pest_meta v2.8.6
117.40 s
[alphal00p-docs-cargo] Compiling ciborium-ll v0.2.2
117.52 s
[alphal00p-docs-cargo] Compiling rand v0.8.6
117.63 s
[alphal00p-docs-cargo] Compiling ciborium v0.2.2
117.80 s
[alphal00p-docs-cargo] Compiling rand v0.9.4
117.83 s
[alphal00p-docs-cargo] Compiling tinystr v0.8.4
117.88 s
[alphal00p-docs-cargo] Compiling ron v0.12.1
117.90 s
[alphal00p-docs-cargo] Compiling tempfile v3.27.0
117.91 s
[alphal00p-docs-cargo] Compiling testing_table v0.3.0
118.00 s
[alphal00p-docs-cargo] Compiling tabled_derive v0.12.0
118.03 s
[alphal00p-docs-cargo] Compiling toml_edit v0.25.11+spec-1.1.0
118.11 s
[alphal00p-docs-cargo] Compiling similar v2.7.0
118.30 s
[alphal00p-docs-cargo] Compiling phf_generator v0.11.3
118.47 s
[alphal00p-docs-cargo] Compiling phf_codegen v0.11.3
118.48 s
[alphal00p-docs-cargo] Compiling symjit v2.25.6
118.51 s
[alphal00p-docs-cargo] Compiling criterion v0.5.1
118.54 s
[alphal00p-docs-cargo] Compiling pest_generator v2.8.6
118.62 s
[alphal00p-docs-cargo] Compiling unicode_names2_generator v1.3.0
119.17 s
[alphal00p-docs-cargo] Compiling rustpython-parser v0.4.0
119.26 s
[alphal00p-docs-cargo] Compiling toml v0.8.23
119.38 s
[alphal00p-docs-cargo] Compiling insta v1.47.2
119.49 s
[alphal00p-docs-cargo] Compiling unic-langid-impl v0.9.6
119.65 s
[alphal00p-docs-cargo] Compiling tabled v0.22.0
119.65 s
[alphal00p-docs-cargo] Compiling unicode_names2 v1.3.0
119.70 s
[alphal00p-docs-cargo] Compiling proc-macro-error-attr v1.0.4
119.80 s
[alphal00p-docs-cargo] Compiling uncased v0.9.10
119.83 s
[alphal00p-docs-cargo] Compiling proc-macro2-diagnostics v0.10.1
120.04 s
[alphal00p-docs-cargo] Compiling strsim v0.10.0
120.04 s
[alphal00p-docs-cargo] Compiling radium v0.7.0
120.11 s
[alphal00p-docs-cargo] Compiling slab v0.4.12
120.25 s
[alphal00p-docs-cargo] Compiling pest_derive v2.8.6
120.26 s
[alphal00p-docs-cargo] Compiling darling_core v0.23.0
120.27 s
[alphal00p-docs-cargo] Compiling darling_core v0.14.4
120.36 s
[alphal00p-docs-cargo] Compiling figment v0.10.19
120.39 s
[alphal00p-docs-cargo] Compiling proc-macro-error v1.0.4
120.72 s
[alphal00p-docs-cargo] Compiling tap v1.0.1
120.83 s
[alphal00p-docs-cargo] Compiling ryu v1.0.23
120.93 s
[alphal00p-docs-cargo] Compiling wyz v0.5.1
121.15 s
[alphal00p-docs-cargo] Compiling castaway v0.2.4
121.17 s
[alphal00p-docs-cargo] Compiling instability v0.3.12
121.22 s
[alphal00p-docs-cargo] Compiling heck v0.4.1
121.28 s
[alphal00p-docs-cargo] Compiling find-msvc-tools v0.1.9
121.41 s
[alphal00p-docs-cargo] Compiling funty v2.0.0
121.42 s
[alphal00p-docs-cargo] Compiling shlex v1.3.0
121.54 s
[alphal00p-docs-cargo] Compiling indoc v2.0.7
121.57 s
[alphal00p-docs-cargo] Compiling cc v1.2.61
121.75 s
[alphal00p-docs-cargo] Compiling bitvec v1.0.1
121.89 s
[alphal00p-docs-cargo] Compiling duplicate v2.0.1
121.89 s
[alphal00p-docs-cargo] Compiling compact_str v0.9.0
122.22 s
[alphal00p-docs-cargo] Compiling dot-parser v0.5.1
122.38 s
[alphal00p-docs-cargo] Compiling darling_macro v0.14.4
122.81 s
[alphal00p-docs-cargo] Compiling darling_macro v0.23.0
122.81 s
[alphal00p-docs-cargo] Compiling kasuari v0.4.12
122.83 s
[alphal00p-docs-cargo] Compiling unicode-truncate v2.0.1
122.83 s
[alphal00p-docs-cargo] Compiling convert_case v0.10.0
122.93 s
[alphal00p-docs-cargo] Compiling serde_repr v0.1.20
122.95 s
[alphal00p-docs-cargo] Compiling env_filter v1.0.1
123.13 s
[alphal00p-docs-cargo] Compiling num-iter v0.1.45
123.15 s
[alphal00p-docs-cargo] Compiling lru v0.16.4
123.21 s
[alphal00p-docs-cargo] Compiling jiff v0.2.24
123.21 s
[alphal00p-docs-cargo] Compiling darling v0.14.4
123.27 s
[alphal00p-docs-cargo] Compiling ref-ops v0.2.5
123.29 s
[alphal00p-docs-cargo] Compiling convert_case v0.4.0
123.35 s
[alphal00p-docs-cargo] Compiling ratatui-core v0.1.0
123.40 s
[alphal00p-docs-cargo] Compiling derive_builder_core v0.11.2
123.40 s
[alphal00p-docs-cargo] Compiling num v0.4.3
123.43 s
[alphal00p-docs-cargo] Compiling derive_more-impl v2.1.1
123.45 s
[alphal00p-docs-cargo] Compiling blake3 v1.8.5
123.47 s
[alphal00p-docs-cargo] Compiling duplicate v1.0.0
123.53 s
[alphal00p-docs-cargo] Compiling enum-try-as-inner v0.1.1
123.57 s
[alphal00p-docs-cargo] Compiling darling v0.23.0
123.66 s
[alphal00p-docs-cargo] Compiling derive_more v0.99.20
123.68 s
[alphal00p-docs-cargo] Compiling delegate v0.12.0
123.73 s
[alphal00p-docs-cargo] Compiling rand_xoshiro v0.6.0
123.79 s
[alphal00p-docs-cargo] Compiling features v0.10.0
123.83 s
[alphal00p-docs-cargo] Compiling colored v2.2.0
123.84 s
[alphal00p-docs-cargo] Compiling thiserror v1.0.69
124.01 s
[alphal00p-docs-cargo] Compiling owo-colors v4.3.0
124.12 s
[alphal00p-docs-cargo] Compiling constcat v0.5.1
124.14 s
[alphal00p-docs-cargo] Compiling litrs v1.0.0
124.16 s
[alphal00p-docs-cargo] Compiling gat-lending-iterator v0.1.8
124.19 s
[alphal00p-docs-cargo] Compiling portable-atomic v1.13.1
124.24 s
[alphal00p-docs-cargo] Compiling object v0.37.3
124.27 s
[alphal00p-docs-cargo] Compiling cfg_aliases v0.2.1
124.35 s
[alphal00p-docs-cargo] Compiling nix v0.31.2
124.44 s
[alphal00p-docs-cargo] Compiling derive_builder_macro v0.11.2
124.55 s
[alphal00p-docs-cargo] Compiling derive_more v2.1.1
124.56 s
[alphal00p-docs-cargo] Compiling rand_distr v0.4.3
124.57 s
[alphal00p-docs-cargo] Compiling simba v0.6.0
124.61 s
[alphal00p-docs-cargo] Compiling phf_generator v0.13.1
124.62 s
[alphal00p-docs-cargo] Compiling nalgebra-macros v0.1.0
124.65 s
[alphal00p-docs-cargo] Compiling document-features v0.2.12
124.70 s
[alphal00p-docs-cargo] Compiling thiserror-impl v1.0.69
124.76 s
[alphal00p-docs-cargo] Compiling dirs v6.0.0
124.80 s
[alphal00p-docs-cargo] Compiling line-clipping v0.3.7
124.81 s
[alphal00p-docs-cargo] Compiling vte v0.15.0
124.83 s
[alphal00p-docs-cargo] Compiling joinery v2.1.0
124.85 s
[alphal00p-docs-cargo] Compiling clarabel v0.11.1
124.93 s
[alphal00p-docs-cargo] Compiling ref-cast v1.0.25
124.94 s
[alphal00p-docs-cargo] Compiling color-spantrace v0.3.0
124.94 s
[alphal00p-docs-cargo] Compiling constant_time_eq v0.4.2
124.94 s
[alphal00p-docs-cargo] Compiling cpufeatures v0.3.0
125.02 s
[alphal00p-docs-cargo] Compiling arrayref v0.3.9
125.08 s
[alphal00p-docs-cargo] Compiling gimli v0.32.3
125.09 s
[alphal00p-docs-cargo] Compiling titlecase v2.2.1
125.11 s
[alphal00p-docs-cargo] Compiling vt100 v0.16.2
125.24 s
[alphal00p-docs-cargo] Compiling derive_builder v0.11.2
125.28 s
[alphal00p-docs-cargo] Compiling ratatui-widgets v0.3.0
125.37 s
[alphal00p-docs-cargo] Compiling phf_macros v0.13.1
125.44 s
[alphal00p-docs-cargo] Compiling crossterm v0.29.0
125.48 s
[alphal00p-docs-cargo] Compiling tracing-error v0.2.1
125.80 s
[alphal00p-docs-cargo] Compiling serde-big-array v0.5.1
125.83 s
[alphal00p-docs-cargo] Compiling enum_dispatch v0.3.13
125.92 s
[alphal00p-docs-cargo] Compiling delegate v0.13.5
125.92 s
[alphal00p-docs-cargo] Compiling ref-cast-impl v1.0.25
126.42 s
[alphal00p-docs-cargo] Compiling serde_derive_internals v0.29.1
126.49 s
[alphal00p-docs-cargo] Compiling amd v0.2.2
126.63 s
[alphal00p-docs-cargo] Compiling env_logger v0.11.10
126.75 s
[alphal00p-docs-cargo] Compiling subprocess v0.2.15
126.87 s
[alphal00p-docs-cargo] Compiling rust_lisp v0.18.0
126.90 s
[alphal00p-docs-cargo] Compiling rustc-demangle v0.1.27
126.91 s
[alphal00p-docs-cargo] Compiling base64 v0.22.1
126.94 s
[alphal00p-docs-cargo] Compiling semver v1.0.28
126.98 s
[alphal00p-docs-cargo] Compiling vakint v0.1.2 (/build/source/crates/vakint)
127.13 s
[alphal00p-docs-cargo] Compiling unit-prefix v0.5.2
127.21 s
[alphal00p-docs-cargo] Compiling indicatif v0.18.4
127.26 s
[alphal00p-docs-cargo] Compiling ratatui-crossterm v0.1.0
127.29 s
[alphal00p-docs-cargo] Compiling phf v0.13.1
127.33 s
[alphal00p-docs-cargo] Compiling ratatui-macros v0.7.0
127.35 s
[alphal00p-docs-cargo] Compiling deprecate-until v1.0.0
127.41 s
[alphal00p-docs-cargo] Compiling string-template-plus v0.4.3
127.44 s
[alphal00p-docs-cargo] Compiling shellexpand v3.1.2
127.51 s
[alphal00p-docs-cargo] Compiling xpct v0.5.1
127.57 s
[alphal00p-docs-cargo] Compiling brotli-decompressor v4.0.3
127.63 s
[alphal00p-docs-cargo] Compiling integer-sqrt v0.1.5
127.68 s
[alphal00p-docs-cargo] Compiling schemars_derive v1.2.1
127.71 s
[alphal00p-docs-cargo] Compiling crossbeam-channel v0.5.15
127.86 s
[alphal00p-docs-cargo] Compiling itertools v0.12.1
127.92 s
[alphal00p-docs-cargo] Compiling include_dir_macros v0.7.4
128.00 s
[alphal00p-docs-cargo] Compiling gammaloop-tracing-filter-macros v0.1.0 (/build/source/crates/gammaloop-tracing-filter-macros)
128.09 s
[alphal00p-docs-cargo] Compiling addr2line v0.25.1
128.10 s
[alphal00p-docs-cargo] Compiling symlink v0.1.0
128.12 s
[alphal00p-docs-cargo] Compiling version-compare v0.2.1
128.17 s
[alphal00p-docs-cargo] Compiling gammalooprs v0.3.4 (/build/source/crates/gammalooprs)
128.33 s
[alphal00p-docs-cargo] Compiling unsafe-libyaml v0.2.11
128.36 s
[alphal00p-docs-cargo] Compiling tracing-appender v0.2.5
128.39 s
[alphal00p-docs-cargo] Compiling include_dir v0.7.4
128.40 s
[alphal00p-docs-cargo] Compiling brotli v7.0.0
128.41 s
[alphal00p-docs-cargo] Compiling pathfinding v4.15.0
128.50 s
[alphal00p-docs-cargo] Compiling nalgebra v0.29.0
128.52 s
[alphal00p-docs-cargo] Compiling ctrlc v3.5.2
128.55 s
[alphal00p-docs-cargo] Compiling tracing-indicatif v0.3.14
128.58 s
[alphal00p-docs-cargo] Compiling pyo3-stub-gen-derive v0.17.2
128.69 s
[alphal00p-docs-cargo] Compiling rust-embed-impl v8.11.0
128.70 s
[alphal00p-docs-cargo] Compiling ratatui v0.30.0
128.75 s
[alphal00p-docs-cargo] Compiling json5 v0.4.1
128.93 s
[alphal00p-docs-cargo] Compiling backtrace v0.3.76
129.03 s
[alphal00p-docs-cargo] Compiling serde_yaml v0.9.34+deprecated
129.04 s
[alphal00p-docs-cargo] Compiling strum_macros v0.26.4
129.07 s
[alphal00p-docs-cargo] Compiling typed-index-collections v3.5.0
129.12 s
[alphal00p-docs-cargo] Compiling vectorize v0.2.0
129.13 s
[alphal00p-docs-cargo] Compiling clap_complete v4.6.3
129.14 s
[alphal00p-docs-cargo] Compiling strip-ansi-escapes v0.2.1
129.19 s
[alphal00p-docs-cargo] Compiling gammaloop-api v0.1.0 (/build/source/crates/gammaloop-api)
129.32 s
[alphal00p-docs-cargo] Compiling fd-lock v4.0.4
129.35 s
[alphal00p-docs-cargo] Compiling itertools v0.13.0
129.36 s
[alphal00p-docs-cargo] Compiling ringbuffer v0.16.0
129.47 s
[alphal00p-docs-cargo] Compiling color-eyre v0.6.5
129.51 s
[alphal00p-docs-cargo] Compiling base62 v2.2.4
129.58 s
[alphal00p-docs-cargo] Compiling strum v0.26.3
129.61 s
[alphal00p-docs-cargo] Compiling clap_complete_nushell v4.6.0
129.69 s
[alphal00p-docs-cargo] Compiling sysinfo v0.33.1
129.86 s
[alphal00p-docs-cargo] Compiling schemars v1.2.1
130.15 s
[alphal00p-docs-cargo] Compiling rust-embed v8.11.0
130.60 s
[alphal00p-docs-cargo] Compiling reedline v0.42.0
130.70 s
[alphal00p-docs-cargo] Compiling pyo3-stub-gen v0.17.2
133.66 s
[alphal00p-docs-cargo] Compiling statrs v0.16.1
134.55 s
[alphal00p-docs-cargo] Compiling momtrop v0.3.0
279.23 s
[alphal00p-docs-cargo] Compiling numerica v3.0.0 (https://github.com/symbolica-dev/symbolica?rev=ba3737137c2a2ccd7bb39f0441837d38ec867e78#ba373713)
281.98 s
[alphal00p-docs-cargo] Compiling graphica v3.0.0 (https://github.com/symbolica-dev/symbolica?rev=ba3737137c2a2ccd7bb39f0441837d38ec867e78#ba373713)
310.55 s
[alphal00p-docs-cargo] Compiling symbolica-utils v0.1.0 (/build/source/crates/symbolica-utils)
330.46 s
[alphal00p-docs-cargo] Compiling gammaloop-workspace-hack v0.1.0 (/build/source/crates/gammaloop-workspace-hack)
330.47 s
[alphal00p-docs-cargo] Compiling spenso-macros v0.3.2 (/build/source/crates/spenso-macros)
330.82 s
[alphal00p-docs-cargo] Compiling linnet v0.17.0 (/build/source/crates/linnet)
334.24 s
[alphal00p-docs-cargo] Compiling spenso v0.6.0 (/build/source/crates/spenso)
340.19 s
[alphal00p-docs-cargo] Compiling idenso v0.3.0 (/build/source/crates/idenso)
340.19 s
[alphal00p-docs-cargo] Compiling gammaloop-tracing-filter v0.1.0 (/build/source/crates/gammaloop-tracing-filter)
343.43 s
[alphal00p-docs-cargo] Compiling spenso-hep-lib v0.1.7 (/build/source/crates/spenso-hep-lib)
429.97 s
[alphal00p-docs-cargo] Compiling alphal00p-docs-python-exporter v0.1.0 (/build/source/crates/alphal00p-docs-python-exporter)
447.22 s
[alphal00p-docs-cargo] Finished `docs` profile [unoptimized] target(s) in 5m 43s
447.30 s
[alphal00p-docs-cargo] +++ command cargo build --profile docs --locked -p alphal00p-docs-python-exporter --features linnet
447.70 s
[alphal00p-docs-cargo] Compiling libc v0.2.186
447.70 s
[alphal00p-docs-cargo] Compiling serde_core v1.0.228
447.70 s
[alphal00p-docs-cargo] Compiling zerocopy v0.8.48
447.70 s
[alphal00p-docs-cargo] Compiling log v0.4.29
447.72 s
[alphal00p-docs-cargo] Compiling num-traits v0.2.19
447.72 s
[alphal00p-docs-cargo] Compiling syn v1.0.109
447.73 s
[alphal00p-docs-cargo] Compiling syn v2.0.117
447.73 s
[alphal00p-docs-cargo] Compiling ahash v0.7.8
447.73 s
[alphal00p-docs-cargo] Compiling bytecheck v0.6.12
447.74 s
[alphal00p-docs-cargo] Compiling regex-syntax v0.8.10
447.78 s
[alphal00p-docs-cargo] Compiling rend v0.4.2
447.78 s
[alphal00p-docs-cargo] Compiling simdutf8 v0.1.5
447.78 s
[alphal00p-docs-cargo] Compiling indexmap v2.14.0
447.78 s
[alphal00p-docs-cargo] Compiling ahash v0.8.12
447.79 s
[alphal00p-docs-cargo] Compiling figment v0.10.19
447.81 s
[alphal00p-docs-cargo] Compiling cgmath v0.18.0
447.91 s
[alphal00p-docs-cargo] Compiling either v1.15.0
448.08 s
[alphal00p-docs-cargo] Compiling rkyv v0.7.46
448.13 s
[alphal00p-docs-cargo] Compiling itertools v0.11.0
448.17 s
[alphal00p-docs-cargo] Compiling bincode v2.0.1
448.19 s
[alphal00p-docs-cargo] Compiling pyo3 v0.28.3
448.36 s
[alphal00p-docs-cargo] Compiling venial v0.5.0
448.42 s
[alphal00p-docs-cargo] Compiling seahash v4.1.0
448.45 s
[alphal00p-docs-cargo] Compiling winnow v1.0.2
448.56 s
[alphal00p-docs-cargo] Compiling arrayvec v0.7.6
448.57 s
[alphal00p-docs-cargo] Compiling rustix v1.1.4
448.62 s
[alphal00p-docs-cargo] Compiling smallvec v1.15.1
448.67 s
[alphal00p-docs-cargo] Compiling bitflags v2.11.1
448.77 s
[alphal00p-docs-cargo] Compiling polycool v0.4.0
448.99 s
[alphal00p-docs-cargo] Compiling winnow v0.7.15
449.00 s
[alphal00p-docs-cargo] Compiling toml_writer v1.1.1+spec-1.1.0
449.10 s
[alphal00p-docs-cargo] Compiling linnet-py v0.1.0 (/build/source/crates/linnet-py)
449.25 s
[alphal00p-docs-cargo] Compiling toml_parser v1.1.2+spec-1.1.0
449.28 s
[alphal00p-docs-cargo] Compiling kurbo v0.13.1
449.49 s
[alphal00p-docs-cargo] Compiling wasm-minimal-protocol v0.2.0
449.75 s
[alphal00p-docs-cargo] Compiling num-integer v0.1.46
449.75 s
[alphal00p-docs-cargo] Compiling approx v0.4.0
449.75 s
[alphal00p-docs-cargo] Compiling chrono v0.4.44
449.89 s
[alphal00p-docs-cargo] Compiling num-complex v0.4.6
450.02 s
[alphal00p-docs-cargo] Compiling regex-automata v0.4.14
450.46 s
[alphal00p-docs-cargo] Compiling num-bigint v0.4.6
450.98 s
[alphal00p-docs-cargo] Compiling getrandom v0.2.17
450.98 s
[alphal00p-docs-cargo] Compiling dirs-sys v0.5.0
450.98 s
[alphal00p-docs-cargo] Compiling pyo3-ffi v0.28.3
451.06 s
[alphal00p-docs-cargo] Compiling getrandom v0.4.2
451.34 s
[alphal00p-docs-cargo] Compiling rand_core v0.6.4
451.42 s
[alphal00p-docs-cargo] Compiling const-random-macro v0.1.16
451.54 s
[alphal00p-docs-cargo] Compiling dirs v6.0.0
451.65 s
[alphal00p-docs-cargo] Compiling shellexpand v3.1.2
451.78 s
[alphal00p-docs-cargo] Compiling hashbrown v0.12.3
452.15 s
[alphal00p-docs-cargo] Compiling const-random v0.1.18
453.07 s
[alphal00p-docs-cargo] Compiling toml_datetime v0.7.5+spec-1.1.0
453.07 s
[alphal00p-docs-cargo] Compiling serde_spanned v1.1.1
453.07 s
[alphal00p-docs-cargo] Compiling serde_json v1.0.149
453.43 s
[alphal00p-docs-cargo] Compiling tempfile v3.27.0
453.48 s
[alphal00p-docs-cargo] Compiling toml v0.9.12+spec-1.1.0
454.31 s
[alphal00p-docs-cargo] Compiling globset v0.4.18
454.43 s
[alphal00p-docs-cargo] Compiling ptr_meta_derive v0.1.4
454.44 s
[alphal00p-docs-cargo] Compiling bytecheck_derive v0.6.12
454.44 s
[alphal00p-docs-cargo] Compiling rkyv_derive v0.7.46
454.48 s
[alphal00p-docs-cargo] Compiling ppv-lite86 v0.2.21
454.85 s
[alphal00p-docs-cargo] Compiling rand_chacha v0.3.1
455.11 s
[alphal00p-docs-cargo] Compiling rust-embed-utils v8.11.0
455.16 s
[alphal00p-docs-cargo] Compiling rand v0.8.6
455.31 s
[alphal00p-docs-cargo] Compiling ptr_meta v0.1.4
455.74 s
[alphal00p-docs-cargo] Compiling pest_generator v2.8.6
455.74 s
[alphal00p-docs-cargo] Compiling proc-macro2-diagnostics v0.10.1
455.74 s
[alphal00p-docs-cargo] Compiling pyo3-macros-backend v0.28.3
456.21 s
[alphal00p-docs-cargo] Compiling phf_generator v0.11.3
456.32 s
[alphal00p-docs-cargo] Compiling phf_codegen v0.11.3
456.50 s
[alphal00p-docs-cargo] Compiling unicode_names2_generator v1.3.0
456.53 s
[alphal00p-docs-cargo] Compiling rustpython-parser v0.4.0
456.54 s
[alphal00p-docs-cargo] Compiling zerocopy-derive v0.8.48
456.54 s
[alphal00p-docs-cargo] Compiling serde_derive v1.0.228
456.54 s
[alphal00p-docs-cargo] Compiling is-macro v0.3.7
456.55 s
[alphal00p-docs-cargo] Compiling thiserror-impl v2.0.18
456.55 s
[alphal00p-docs-cargo] Compiling pest_derive v2.8.6
456.56 s
[alphal00p-docs-cargo] Compiling duplicate v2.0.1
456.56 s
[alphal00p-docs-cargo] Compiling bincode-trait-derive v0.1.1
456.56 s
[alphal00p-docs-cargo] Compiling serde_repr v0.1.20
456.56 s
[alphal00p-docs-cargo] Compiling rust-embed-impl v8.11.0
457.30 s
[alphal00p-docs-cargo] Compiling unicode_names2 v1.3.0
457.48 s
[alphal00p-docs-cargo] Compiling rustpython-parser-core v0.4.0
457.59 s
[alphal00p-docs-cargo] Compiling rustpython-ast v0.4.0
457.96 s
[alphal00p-docs-cargo] Compiling dot-parser v0.5.1
458.87 s
[alphal00p-docs-cargo] Compiling rust-embed v8.11.0
458.99 s
[alphal00p-docs-cargo] Compiling thiserror v2.0.18
461.03 s
[alphal00p-docs-cargo] Compiling serde v1.0.228
461.24 s
[alphal00p-docs-cargo] Compiling pyo3-macros v0.28.3
461.76 s
[alphal00p-docs-cargo] Compiling bitvec v1.0.1
464.22 s
[alphal00p-docs-cargo] Compiling half v2.7.1
464.54 s
[alphal00p-docs-cargo] Compiling ciborium-ll v0.2.2
464.74 s
[alphal00p-docs-cargo] Compiling ciborium v0.2.2
465.31 s
[alphal00p-docs-cargo] Compiling kurvst v0.1.0 (/build/source/crates/kurvst)
466.27 s
[alphal00p-docs-cargo] Compiling pyo3-stub-gen-derive v0.17.2
467.42 s
[alphal00p-docs-cargo] Compiling linnet v0.17.0 (/build/source/crates/linnet)
468.23 s
[alphal00p-docs-cargo] Compiling pyo3-stub-gen v0.17.2
472.48 s
[alphal00p-docs-cargo] Compiling linnest v0.1.0 (/build/source/crates/linnest)
489.99 s
[alphal00p-docs-cargo] Compiling alphal00p-docs-python-exporter v0.1.0 (/build/source/crates/alphal00p-docs-python-exporter)
491.29 s
[alphal00p-docs-cargo] Finished `docs` profile [unoptimized] target(s) in 43.99s
491.37 s
[alphal00p-docs-cargo] +++ command cargo build --profile docs --locked -p alphal00p-docs-python-exporter --features spenso
491.92 s
[alphal00p-docs-cargo] Compiling pyo3-build-config v0.28.3
491.93 s
[alphal00p-docs-cargo] Compiling symbolica v2.2.0 (https://github.com/symbolica-dev/symbolica?rev=ba3737137c2a2ccd7bb39f0441837d38ec867e78#ba373713)
491.94 s
[alphal00p-docs-cargo] Compiling syn v1.0.109
491.95 s
[alphal00p-docs-cargo] Compiling figment v0.10.19
492.40 s
[alphal00p-docs-cargo] Compiling proc-macro-error v1.0.4
492.55 s
[alphal00p-docs-cargo] Compiling duplicate v1.0.0
492.82 s
[alphal00p-docs-cargo] Compiling pyo3-macros-backend v0.28.3
492.82 s
[alphal00p-docs-cargo] Compiling numpy v0.28.0
492.82 s
[alphal00p-docs-cargo] Compiling pyo3-ffi v0.28.3
492.82 s
[alphal00p-docs-cargo] Compiling pyo3 v0.28.3
495.19 s
[alphal00p-docs-cargo] Compiling pyo3-macros v0.28.3
498.64 s
[alphal00p-docs-cargo] Compiling pyo3-stub-gen v0.17.2
499.41 s
[alphal00p-docs-cargo] Compiling gammaloop-workspace-hack v0.1.0 (/build/source/crates/gammaloop-workspace-hack)
499.42 s
[alphal00p-docs-cargo] Compiling numerica v3.0.0 (https://github.com/symbolica-dev/symbolica?rev=ba3737137c2a2ccd7bb39f0441837d38ec867e78#ba373713)
502.97 s
[alphal00p-docs-cargo] Compiling graphica v3.0.0 (https://github.com/symbolica-dev/symbolica?rev=ba3737137c2a2ccd7bb39f0441837d38ec867e78#ba373713)
535.77 s
[alphal00p-docs-cargo] Compiling symbolica-utils v0.1.0 (/build/source/crates/symbolica-utils)
535.77 s
[alphal00p-docs-cargo] Compiling tymbolica-atom-payload v0.1.0 (https://github.com/lcnbr/tymbolica?rev=e85233dd3d99e5fb458913d0d49f99d83466025b#e85233dd)
536.19 s
[alphal00p-docs-cargo] Compiling linnet v0.17.0 (/build/source/crates/linnet)
540.50 s
[alphal00p-docs-cargo] Compiling spenso v0.6.0 (/build/source/crates/spenso)
547.24 s
[alphal00p-docs-cargo] Compiling idenso v0.3.0 (/build/source/crates/idenso)
551.15 s
[alphal00p-docs-cargo] Compiling spenso-hep-lib v0.1.7 (/build/source/crates/spenso-hep-lib)
551.44 s
[alphal00p-docs-cargo] Compiling spynso3 v0.1.2 (/build/source/crates/spynso3)
555.95 s
[alphal00p-docs-cargo] Compiling alphal00p-docs-python-exporter v0.1.0 (/build/source/crates/alphal00p-docs-python-exporter)
563.64 s
[alphal00p-docs-cargo] Finished `docs` profile [unoptimized] target(s) in 1m 12s
563.69 s
[alphal00p-docs-cargo] +++ command cargo build --profile docs --locked -p alphal00p-docs-python-exporter --features idenso
564.05 s
[alphal00p-docs-cargo] Compiling pyo3 v0.28.3
566.23 s
[alphal00p-docs-cargo] Compiling numpy v0.28.0
566.71 s
[alphal00p-docs-cargo] Compiling pyo3-stub-gen v0.17.2
567.29 s
[alphal00p-docs-cargo] Compiling numerica v3.0.0 (https://github.com/symbolica-dev/symbolica?rev=ba3737137c2a2ccd7bb39f0441837d38ec867e78#ba373713)
570.30 s
[alphal00p-docs-cargo] Compiling graphica v3.0.0 (https://github.com/symbolica-dev/symbolica?rev=ba3737137c2a2ccd7bb39f0441837d38ec867e78#ba373713)
570.52 s
[alphal00p-docs-cargo] Compiling symbolica v2.2.0 (https://github.com/symbolica-dev/symbolica?rev=ba3737137c2a2ccd7bb39f0441837d38ec867e78#ba373713)
597.99 s
[alphal00p-docs-cargo] Compiling gammaloop-workspace-hack v0.1.0 (/build/source/crates/gammaloop-workspace-hack)
597.99 s
[alphal00p-docs-cargo] Compiling symbolica-utils v0.1.0 (/build/source/crates/symbolica-utils)
598.21 s
[alphal00p-docs-cargo] Compiling linnet v0.17.0 (/build/source/crates/linnet)
600.80 s
[alphal00p-docs-cargo] Compiling spenso v0.6.0 (/build/source/crates/spenso)
605.95 s
[alphal00p-docs-cargo] Compiling idenso v0.3.0 (/build/source/crates/idenso)
612.45 s
[alphal00p-docs-cargo] Compiling alphal00p-docs-python-exporter v0.1.0 (/build/source/crates/alphal00p-docs-python-exporter)
621.17 s
[alphal00p-docs-cargo] Finished `docs` profile [unoptimized] target(s) in 57.46s
621.23 s
[alphal00p-docs-cargo] +++ command cargo build --profile docs --locked -p alphal00p-docs-python-exporter --features vakint
621.70 s
[alphal00p-docs-cargo] Compiling libc v0.2.186
621.71 s
[alphal00p-docs-cargo] Compiling tiny-keccak v2.0.2
621.72 s
[alphal00p-docs-cargo] Compiling bytemuck v1.25.0
621.72 s
[alphal00p-docs-cargo] Compiling matrixmultiply v0.3.10
621.73 s
[alphal00p-docs-cargo] Compiling pyo3 v0.28.3
621.73 s
[alphal00p-docs-cargo] Compiling getrandom v0.3.4
621.74 s
[alphal00p-docs-cargo] Compiling pyo3-macros-backend v0.28.3
621.74 s
[alphal00p-docs-cargo] Compiling regex-automata v0.4.14
621.74 s
[alphal00p-docs-cargo] Compiling pyo3-ffi v0.28.3
621.74 s
[alphal00p-docs-cargo] Compiling num-integer v0.1.46
621.75 s
[alphal00p-docs-cargo] Compiling ahash v0.8.12
621.76 s
[alphal00p-docs-cargo] Compiling approx v0.5.1
621.77 s
[alphal00p-docs-cargo] Compiling serde v1.0.228
621.77 s
[alphal00p-docs-cargo] Compiling itertools v0.14.0
621.78 s
[alphal00p-docs-cargo] Compiling smallvec v1.15.1
621.78 s
[alphal00p-docs-cargo] Compiling gmp-mpfr-sys v1.7.1
621.89 s
[alphal00p-docs-cargo] Compiling safe_arch v0.7.4
621.91 s
[alphal00p-docs-cargo] Compiling safe_arch v1.2.0
621.96 s
[alphal00p-docs-cargo] Compiling rayon v1.12.0
622.00 s
[alphal00p-docs-cargo] Compiling smartstring v1.0.1
622.07 s
[alphal00p-docs-cargo] Compiling rand_core v0.9.5
622.12 s
[alphal00p-docs-cargo] Compiling phf_shared v0.13.1
622.25 s
[alphal00p-docs-cargo] Compiling wide v0.7.33
622.29 s
[alphal00p-docs-cargo] Compiling rand_chacha v0.9.0
622.32 s
[alphal00p-docs-cargo] Compiling tracing-attributes v0.1.31
622.33 s
[alphal00p-docs-cargo] Compiling fastrand v2.4.1
622.46 s
[alphal00p-docs-cargo] Compiling phf_generator v0.13.1
622.48 s
[alphal00p-docs-cargo] Compiling symbolica v2.2.0 (https://github.com/symbolica-dev/symbolica?rev=ba3737137c2a2ccd7bb39f0441837d38ec867e78#ba373713)
622.49 s
[alphal00p-docs-cargo] Compiling rug v1.30.0
622.57 s
[alphal00p-docs-cargo] Compiling ndarray v0.17.2
622.62 s
[alphal00p-docs-cargo] Compiling rand v0.9.4
622.64 s
[alphal00p-docs-cargo] Compiling phf_macros v0.13.1
622.77 s
[alphal00p-docs-cargo] Compiling directories v6.0.0
622.81 s
[alphal00p-docs-cargo] Compiling subprocess v0.2.15
622.86 s
[alphal00p-docs-cargo] Compiling vakint v0.1.2 (/build/source/crates/vakint)
623.04 s
[alphal00p-docs-cargo] Compiling wide v1.7.0
623.56 s
[alphal00p-docs-cargo] Compiling getrandom v0.2.17
623.64 s
[alphal00p-docs-cargo] Compiling rand_core v0.6.4
623.67 s
[alphal00p-docs-cargo] Compiling phf v0.13.1
623.83 s
[alphal00p-docs-cargo] Compiling rand_chacha v0.3.1
623.93 s
[alphal00p-docs-cargo] Compiling tracing v0.1.44
624.00 s
[alphal00p-docs-cargo] Compiling rand v0.8.6
624.15 s
[alphal00p-docs-cargo] Compiling simba v0.9.1
624.41 s
[alphal00p-docs-cargo] Compiling phf_generator v0.11.3
624.51 s
[alphal00p-docs-cargo] Compiling phf_codegen v0.11.3
624.60 s
[alphal00p-docs-cargo] Compiling unicode_names2_generator v1.3.0
624.62 s
[alphal00p-docs-cargo] Compiling rustpython-parser v0.4.0
624.94 s
[alphal00p-docs-cargo] Compiling unicode_names2 v1.3.0
624.95 s
[alphal00p-docs-cargo] Compiling matchers v0.2.0
624.95 s
[alphal00p-docs-cargo] Compiling regex v1.12.3
625.01 s
[alphal00p-docs-cargo] Compiling tracing-subscriber v0.3.23
625.36 s
[alphal00p-docs-cargo] Compiling titlecase v2.2.1
625.51 s
[alphal00p-docs-cargo] Compiling pyo3-macros v0.28.3
625.56 s
[alphal00p-docs-cargo] Compiling string-template-plus v0.4.3
627.34 s
[alphal00p-docs-cargo] Compiling xprec v0.2.2
628.72 s
[alphal00p-docs-cargo] Compiling numpy v0.28.0
630.41 s
[alphal00p-docs-cargo] Compiling pyo3-stub-gen-derive v0.17.2
631.66 s
[alphal00p-docs-cargo] Compiling pyo3-stub-gen v0.17.2
632.26 s
[alphal00p-docs-cargo] Compiling numerica v3.0.0 (https://github.com/symbolica-dev/symbolica?rev=ba3737137c2a2ccd7bb39f0441837d38ec867e78#ba373713)
632.39 s
[alphal00p-docs-cargo] error : select an integer backend: `integer-gmp` or `integer-malachite`
632.39 s
[alphal00p-docs-cargo] --> /nix/store/5dfb7akvi1k3080zqfndr6jw2ay3di2p-vendor-cargo-deps/f8c6b2c844a6fa8c330abb750e4cf5bbdb36a70140a58e87f6b79fb3024532aa/numerica-3.0.0/src/lib.rs:40:1
632.39 s
[alphal00p-docs-cargo] |
632.39 s
[alphal00p-docs-cargo] 40 | compile_error!("select an integer backend: `integer-gmp` or `integer-malachite`");
632.39 s
[alphal00p-docs-cargo] | ^^^^^^^^^^^^^^^^^^^^^^^^^^^^^^^^^^^^^^^^^^^^^^^^^^^^^^^^^^^^^^^^^^^^^^^^^^^^^^^^^
632.39 s
[alphal00p-docs-cargo]
632.39 s
[alphal00p-docs-cargo] error : select a float backend: `float-mpfr` or `float-astro`
632.39 s
[alphal00p-docs-cargo] --> /nix/store/5dfb7akvi1k3080zqfndr6jw2ay3di2p-vendor-cargo-deps/f8c6b2c844a6fa8c330abb750e4cf5bbdb36a70140a58e87f6b79fb3024532aa/numerica-3.0.0/src/lib.rs:44:1
632.39 s
[alphal00p-docs-cargo] |
632.39 s
[alphal00p-docs-cargo] 44 | compile_error!("select a float backend: `float-mpfr` or `float-astro`");
632.39 s
[alphal00p-docs-cargo] | ^^^^^^^^^^^^^^^^^^^^^^^^^^^^^^^^^^^^^^^^^^^^^^^^^^^^^^^^^^^^^^^^^^^^^^^
632.39 s
[alphal00p-docs-cargo]
632.59 s
[alphal00p-docs-cargo] error[E0432] : unresolved import `implementation::BackendRandState`
632.59 s
[alphal00p-docs-cargo] --> /nix/store/5dfb7akvi1k3080zqfndr6jw2ay3di2p-vendor-cargo-deps/f8c6b2c844a6fa8c330abb750e4cf5bbdb36a70140a58e87f6b79fb3024532aa/numerica-3.0.0/src/domains/backend/integer.rs:1614:33
632.59 s
[alphal00p-docs-cargo] |
632.59 s
[alphal00p-docs-cargo] 1614 | pub(crate) use implementation::{BackendRandState, Complete, RemRounding};
632.59 s
[alphal00p-docs-cargo] | ^^^^^^^^^^^^^^^^ no `BackendRandState` in `domains::backend::integer::implementation`
632.59 s
[alphal00p-docs-cargo] |
632.59 s
[alphal00p-docs-cargo] note : found an item that was configured out
632.59 s
[alphal00p-docs-cargo] --> /nix/store/5dfb7akvi1k3080zqfndr6jw2ay3di2p-vendor-cargo-deps/f8c6b2c844a6fa8c330abb750e4cf5bbdb36a70140a58e87f6b79fb3024532aa/numerica-3.0.0/src/domains/backend/integer.rs:1378:23
632.59 s
[alphal00p-docs-cargo] |
632.59 s
[alphal00p-docs-cargo] 1377 | #[cfg(feature = "integer-malachite")]
632.59 s
[alphal00p-docs-cargo] | ----------------------------- the item is gated behind the `integer-malachite` feature
632.59 s
[alphal00p-docs-cargo] 1378 | pub(crate) struct BackendRandState {
632.59 s
[alphal00p-docs-cargo] | ^^^^^^^^^^^^^^^^
632.59 s
[alphal00p-docs-cargo] note : found an item that was configured out
632.59 s
[alphal00p-docs-cargo] --> /nix/store/5dfb7akvi1k3080zqfndr6jw2ay3di2p-vendor-cargo-deps/f8c6b2c844a6fa8c330abb750e4cf5bbdb36a70140a58e87f6b79fb3024532aa/numerica-3.0.0/src/domains/backend/integer.rs:1413:23
632.59 s
[alphal00p-docs-cargo] |
632.59 s
[alphal00p-docs-cargo] 1412 | #[cfg(feature = "integer-gmp")]
632.59 s
[alphal00p-docs-cargo] | ----------------------- the item is gated behind the `integer-gmp` feature
632.59 s
[alphal00p-docs-cargo] 1413 | pub(crate) struct BackendRandState(rug::rand::RandState<'static>);
632.59 s
[alphal00p-docs-cargo] | ^^^^^^^^^^^^^^^^
632.59 s
[alphal00p-docs-cargo]
632.59 s
[alphal00p-docs-cargo] error[E0432] : unresolved import `implementation::RawMultiPrecisionInteger`
632.59 s
[alphal00p-docs-cargo] --> /nix/store/5dfb7akvi1k3080zqfndr6jw2ay3di2p-vendor-cargo-deps/f8c6b2c844a6fa8c330abb750e4cf5bbdb36a70140a58e87f6b79fb3024532aa/numerica-3.0.0/src/domains/backend/integer.rs:1616:61
632.59 s
[alphal00p-docs-cargo] |
632.59 s
[alphal00p-docs-cargo] 1616 | MultiPrecisionInteger, ParseMultiPrecisionIntegerError, RawMultiPrecisionInteger,
632.59 s
[alphal00p-docs-cargo] | ^^^^^^^^^^^^^^^^^^^^^^^^ no `RawMultiPrecisionInteger` in `domains::backend::integer::implementation`
632.59 s
[alphal00p-docs-cargo] |
632.59 s
[alphal00p-docs-cargo] note : found an item that was configured out
632.59 s
[alphal00p-docs-cargo] --> /nix/store/5dfb7akvi1k3080zqfndr6jw2ay3di2p-vendor-cargo-deps/f8c6b2c844a6fa8c330abb750e4cf5bbdb36a70140a58e87f6b79fb3024532aa/numerica-3.0.0/src/domains/backend/integer.rs:26:14
632.59 s
[alphal00p-docs-cargo] |
632.59 s
[alphal00p-docs-cargo] 25 | #[cfg(feature = "integer-malachite")]
632.59 s
[alphal00p-docs-cargo] | ----------------------------- the item is gated behind the `integer-malachite` feature
632.59 s
[alphal00p-docs-cargo] 26 | pub type RawMultiPrecisionInteger = malachite_nz::integer::Integer;
632.59 s
[alphal00p-docs-cargo] | ^^^^^^^^^^^^^^^^^^^^^^^^
632.59 s
[alphal00p-docs-cargo] note : found an item that was configured out
632.59 s
[alphal00p-docs-cargo] --> /nix/store/5dfb7akvi1k3080zqfndr6jw2ay3di2p-vendor-cargo-deps/f8c6b2c844a6fa8c330abb750e4cf5bbdb36a70140a58e87f6b79fb3024532aa/numerica-3.0.0/src/domains/backend/integer.rs:29:14
632.59 s
[alphal00p-docs-cargo] |
632.59 s
[alphal00p-docs-cargo] 28 | #[cfg(feature = "integer-gmp")]
632.59 s
[alphal00p-docs-cargo] | ----------------------- the item is gated behind the `integer-gmp` feature
632.59 s
[alphal00p-docs-cargo] 29 | pub type RawMultiPrecisionInteger = rug::Integer;
632.59 s
[alphal00p-docs-cargo] | ^^^^^^^^^^^^^^^^^^^^^^^^
632.59 s
[alphal00p-docs-cargo] help : a similar name exists in the module
632.59 s
[alphal00p-docs-cargo] |
632.59 s
[alphal00p-docs-cargo] 1616 - MultiPrecisionInteger, ParseMultiPrecisionIntegerError, RawMultiPrecisionInteger ,
632.59 s
[alphal00p-docs-cargo] 1616 + MultiPrecisionInteger, ParseMultiPrecisionIntegerError, MultiPrecisionInteger ,
632.59 s
[alphal00p-docs-cargo] |
632.59 s
[alphal00p-docs-cargo]
632.59 s
[alphal00p-docs-cargo] error[E0432] : unresolved imports `implementation::from_be_bytes`, `implementation::to_be_bytes`
632.59 s
[alphal00p-docs-cargo] --> /nix/store/5dfb7akvi1k3080zqfndr6jw2ay3di2p-vendor-cargo-deps/f8c6b2c844a6fa8c330abb750e4cf5bbdb36a70140a58e87f6b79fb3024532aa/numerica-3.0.0/src/domains/backend/integer.rs:1709:33
632.59 s
[alphal00p-docs-cargo] |
632.59 s
[alphal00p-docs-cargo] 1709 | pub(crate) use implementation::{from_be_bytes, to_be_bytes};
632.59 s
[alphal00p-docs-cargo] | ^^^^^^^^^^^^^ ^^^^^^^^^^^ no `to_be_bytes` in `domains::backend::integer::implementation`
632.59 s
[alphal00p-docs-cargo] | |
632.59 s
[alphal00p-docs-cargo] | no `from_be_bytes` in `domains::backend::integer::implementation`
632.59 s
[alphal00p-docs-cargo] |
632.59 s
[alphal00p-docs-cargo] note : found an item that was configured out
632.59 s
[alphal00p-docs-cargo] --> /nix/store/5dfb7akvi1k3080zqfndr6jw2ay3di2p-vendor-cargo-deps/f8c6b2c844a6fa8c330abb750e4cf5bbdb36a70140a58e87f6b79fb3024532aa/numerica-3.0.0/src/domains/backend/integer.rs:1370:19
632.59 s
[alphal00p-docs-cargo] |
632.59 s
[alphal00p-docs-cargo] 1369 | #[cfg(all(feature = "integer-malachite", feature = "bincode"))]
632.59 s
[alphal00p-docs-cargo] | ----------------------------- the item is gated behind the `integer-malachite` feature
632.59 s
[alphal00p-docs-cargo] 1370 | pub(crate) fn from_be_bytes(bytes: &[u8]) -> Result<MultiPrecisionInteger, &'static str> {
632.59 s
[alphal00p-docs-cargo] | ^^^^^^^^^^^^^
632.59 s
[alphal00p-docs-cargo] note : found an item that was configured out
632.59 s
[alphal00p-docs-cargo] --> /nix/store/5dfb7akvi1k3080zqfndr6jw2ay3di2p-vendor-cargo-deps/f8c6b2c844a6fa8c330abb750e4cf5bbdb36a70140a58e87f6b79fb3024532aa/numerica-3.0.0/src/domains/backend/integer.rs:1405:19
632.59 s
[alphal00p-docs-cargo] |
632.59 s
[alphal00p-docs-cargo] 1404 | #[cfg(all(feature = "integer-gmp", feature = "bincode"))]
632.59 s
[alphal00p-docs-cargo] | ----------------------- the item is gated behind the `integer-gmp` feature
632.59 s
[alphal00p-docs-cargo] 1405 | pub(crate) fn from_be_bytes(bytes: &[u8]) -> Result<MultiPrecisionInteger, &'static str> {
632.59 s
[alphal00p-docs-cargo] | ^^^^^^^^^^^^^
632.59 s
[alphal00p-docs-cargo] note : found an item that was configured out
632.59 s
[alphal00p-docs-cargo] --> /nix/store/5dfb7akvi1k3080zqfndr6jw2ay3di2p-vendor-cargo-deps/f8c6b2c844a6fa8c330abb750e4cf5bbdb36a70140a58e87f6b79fb3024532aa/numerica-3.0.0/src/domains/backend/integer.rs:1365:19
632.59 s
[alphal00p-docs-cargo] |
632.59 s
[alphal00p-docs-cargo] 1364 | #[cfg(all(feature = "integer-malachite", feature = "bincode"))]
632.59 s
[alphal00p-docs-cargo] | ----------------------------- the item is gated behind the `integer-malachite` feature
632.59 s
[alphal00p-docs-cargo] 1365 | pub(crate) fn to_be_bytes(value: &MultiPrecisionInteger) -> Vec<u8> {
632.59 s
[alphal00p-docs-cargo] | ^^^^^^^^^^^
632.59 s
[alphal00p-docs-cargo] note : found an item that was configured out
632.59 s
[alphal00p-docs-cargo] --> /nix/store/5dfb7akvi1k3080zqfndr6jw2ay3di2p-vendor-cargo-deps/f8c6b2c844a6fa8c330abb750e4cf5bbdb36a70140a58e87f6b79fb3024532aa/numerica-3.0.0/src/domains/backend/integer.rs:1400:19
632.59 s
[alphal00p-docs-cargo] |
632.59 s
[alphal00p-docs-cargo] 1399 | #[cfg(all(feature = "integer-gmp", feature = "bincode"))]
632.59 s
[alphal00p-docs-cargo] | ----------------------- the item is gated behind the `integer-gmp` feature
632.59 s
[alphal00p-docs-cargo] 1400 | pub(crate) fn to_be_bytes(value: &MultiPrecisionInteger) -> Vec<u8> {
632.59 s
[alphal00p-docs-cargo] | ^^^^^^^^^^^
632.59 s
[alphal00p-docs-cargo]
632.60 s
[alphal00p-docs-cargo] error[E0432] : unresolved imports `crate::domains::backend::float::Assign`, `crate::domains::backend::float::CompleteRound`, `crate::domains::backend::float::Constant`, `crate::domains::backend::float::MultiPrecisionFloat`, `crate::domains::backend::float::Pow`
632.60 s
[alphal00p-docs-cargo] --> /nix/store/5dfb7akvi1k3080zqfndr6jw2ay3di2p-vendor-cargo-deps/f8c6b2c844a6fa8c330abb750e4cf5bbdb36a70140a58e87f6b79fb3024532aa/numerica-3.0.0/src/domains/float/multiprecision.rs:15:9
632.60 s
[alphal00p-docs-cargo] |
632.60 s
[alphal00p-docs-cargo] 15 | Assign, CompleteRound, Constant, MultiPrecisionFloat, MultiPrecisionFloatInteger,
632.60 s
[alphal00p-docs-cargo] | ^^^^^^ ^^^^^^^^^^^^^ ^^^^^^^^ ^^^^^^^^^^^^^^^^^^^ no `MultiPrecisionFloat` in `domains::backend::float`
632.60 s
[alphal00p-docs-cargo] | | | |
632.60 s
[alphal00p-docs-cargo] | | | no `Constant` in `domains::backend::float`
632.60 s
[alphal00p-docs-cargo] | | no `CompleteRound` in `domains::backend::float`
632.60 s
[alphal00p-docs-cargo] | no `Assign` in `domains::backend::float`
632.60 s
[alphal00p-docs-cargo] 16 | MultiPrecisionFloatRational, MultiPrecisionFloatRounding, Pow, RoundingDirection,
632.60 s
[alphal00p-docs-cargo] | ^^^ no `Pow` in `domains::backend::float`
632.60 s
[alphal00p-docs-cargo] |
632.60 s
[alphal00p-docs-cargo] note : found an item that was configured out
632.60 s
[alphal00p-docs-cargo] --> /nix/store/5dfb7akvi1k3080zqfndr6jw2ay3di2p-vendor-cargo-deps/f8c6b2c844a6fa8c330abb750e4cf5bbdb36a70140a58e87f6b79fb3024532aa/numerica-3.0.0/src/domains/backend/float.rs:17:5
632.60 s
[alphal00p-docs-cargo] |
632.60 s
[alphal00p-docs-cargo] 15 | #[cfg(feature = "float-mpfr")]
632.60 s
[alphal00p-docs-cargo] | ---------------------- the item is gated behind the `float-mpfr` feature
632.60 s
[alphal00p-docs-cargo] 16 | pub use rug::{
632.60 s
[alphal00p-docs-cargo] 17 | Assign, Float as MultiPrecisionFloat, Rational as BackendRational,
632.60 s
[alphal00p-docs-cargo] | ^^^^^^
632.60 s
[alphal00p-docs-cargo] note : found an item that was configured out
632.60 s
[alphal00p-docs-cargo] --> /nix/store/5dfb7akvi1k3080zqfndr6jw2ay3di2p-vendor-cargo-deps/f8c6b2c844a6fa8c330abb750e4cf5bbdb36a70140a58e87f6b79fb3024532aa/numerica-3.0.0/src/domains/backend/float.rs:1561:5
632.60 s
[alphal00p-docs-cargo] |
632.60 s
[alphal00p-docs-cargo] 1559 | #[cfg(feature = "float-astro")]
632.60 s
[alphal00p-docs-cargo] | ----------------------- the item is gated behind the `float-astro` feature
632.60 s
[alphal00p-docs-cargo] 1560 | pub use astro::{
632.60 s
[alphal00p-docs-cargo] 1561 | Assign, BackendRational, CompleteRound, Constant, IntoMultiPrecisionFloat, MultiPrecisionFloat,
632.60 s
[alphal00p-docs-cargo] | ^^^^^^
632.60 s
[alphal00p-docs-cargo] note : found an item that was configured out
632.60 s
[alphal00p-docs-cargo] --> /nix/store/5dfb7akvi1k3080zqfndr6jw2ay3di2p-vendor-cargo-deps/f8c6b2c844a6fa8c330abb750e4cf5bbdb36a70140a58e87f6b79fb3024532aa/numerica-3.0.0/src/domains/backend/float.rs:19:11
632.60 s
[alphal00p-docs-cargo] |
632.60 s
[alphal00p-docs-cargo] 15 | #[cfg(feature = "float-mpfr")]
632.60 s
[alphal00p-docs-cargo] | ---------------------- the item is gated behind the `float-mpfr` feature
632.60 s
[alphal00p-docs-cargo] ...
632.60 s
[alphal00p-docs-cargo] 19 | ops::{CompleteRound, Pow},
632.60 s
[alphal00p-docs-cargo] | ^^^^^^^^^^^^^
632.60 s
[alphal00p-docs-cargo] note : found an item that was configured out
632.60 s
[alphal00p-docs-cargo] --> /nix/store/5dfb7akvi1k3080zqfndr6jw2ay3di2p-vendor-cargo-deps/f8c6b2c844a6fa8c330abb750e4cf5bbdb36a70140a58e87f6b79fb3024532aa/numerica-3.0.0/src/domains/backend/float.rs:1561:30
632.60 s
[alphal00p-docs-cargo] |
632.60 s
[alphal00p-docs-cargo] 1559 | #[cfg(feature = "float-astro")]
632.60 s
[alphal00p-docs-cargo] | ----------------------- the item is gated behind the `float-astro` feature
632.60 s
[alphal00p-docs-cargo] 1560 | pub use astro::{
632.60 s
[alphal00p-docs-cargo] 1561 | Assign, BackendRational, CompleteRound, Constant, IntoMultiPrecisionFloat, MultiPrecisionFloat,
632.60 s
[alphal00p-docs-cargo] | ^^^^^^^^^^^^^
632.60 s
[alphal00p-docs-cargo] note : found an item that was configured out
632.60 s
[alphal00p-docs-cargo] --> /nix/store/5dfb7akvi1k3080zqfndr6jw2ay3di2p-vendor-cargo-deps/f8c6b2c844a6fa8c330abb750e4cf5bbdb36a70140a58e87f6b79fb3024532aa/numerica-3.0.0/src/domains/backend/float.rs:18:12
632.60 s
[alphal00p-docs-cargo] |
632.60 s
[alphal00p-docs-cargo] 15 | #[cfg(feature = "float-mpfr")]
632.60 s
[alphal00p-docs-cargo] | ---------------------- the item is gated behind the `float-mpfr` feature
632.60 s
[alphal00p-docs-cargo] ...
632.60 s
[alphal00p-docs-cargo] 18 | float::Constant,
632.60 s
[alphal00p-docs-cargo] | ^^^^^^^^
632.60 s
[alphal00p-docs-cargo] note : found an item that was configured out
632.60 s
[alphal00p-docs-cargo] --> /nix/store/5dfb7akvi1k3080zqfndr6jw2ay3di2p-vendor-cargo-deps/f8c6b2c844a6fa8c330abb750e4cf5bbdb36a70140a58e87f6b79fb3024532aa/numerica-3.0.0/src/domains/backend/float.rs:1561:45
632.60 s
[alphal00p-docs-cargo] |
632.60 s
[alphal00p-docs-cargo] 1559 | #[cfg(feature = "float-astro")]
632.60 s
[alphal00p-docs-cargo] | ----------------------- the item is gated behind the `float-astro` feature
632.60 s
[alphal00p-docs-cargo] 1560 | pub use astro::{
632.60 s
[alphal00p-docs-cargo] 1561 | Assign, BackendRational, CompleteRound, Constant, IntoMultiPrecisionFloat, MultiPrecisionFloat,
632.60 s
[alphal00p-docs-cargo] | ^^^^^^^^
632.60 s
[alphal00p-docs-cargo] note : found an item that was configured out
632.60 s
[alphal00p-docs-cargo] --> /nix/store/5dfb7akvi1k3080zqfndr6jw2ay3di2p-vendor-cargo-deps/f8c6b2c844a6fa8c330abb750e4cf5bbdb36a70140a58e87f6b79fb3024532aa/numerica-3.0.0/src/domains/backend/float.rs:17:22
632.60 s
[alphal00p-docs-cargo] |
632.60 s
[alphal00p-docs-cargo] 15 | #[cfg(feature = "float-mpfr")]
632.60 s
[alphal00p-docs-cargo] | ---------------------- the item is gated behind the `float-mpfr` feature
632.60 s
[alphal00p-docs-cargo] 16 | pub use rug::{
632.60 s
[alphal00p-docs-cargo] 17 | Assign, Float as MultiPrecisionFloat, Rational as BackendRational,
632.60 s
[alphal00p-docs-cargo] | ^^^^^^^^^^^^^^^^^^^
632.60 s
[alphal00p-docs-cargo] note : found an item that was configured out
632.60 s
[alphal00p-docs-cargo] --> /nix/store/5dfb7akvi1k3080zqfndr6jw2ay3di2p-vendor-cargo-deps/f8c6b2c844a6fa8c330abb750e4cf5bbdb36a70140a58e87f6b79fb3024532aa/numerica-3.0.0/src/domains/backend/float.rs:1561:80
632.60 s
[alphal00p-docs-cargo] |
632.60 s
[alphal00p-docs-cargo] 1559 | #[cfg(feature = "float-astro")]
632.60 s
[alphal00p-docs-cargo] | ----------------------- the item is gated behind the `float-astro` feature
632.60 s
[alphal00p-docs-cargo] 1560 | pub use astro::{
632.60 s
[alphal00p-docs-cargo] 1561 | Assign, BackendRational, CompleteRound, Constant, IntoMultiPrecisionFloat, MultiPrecisionFloat,
632.60 s
[alphal00p-docs-cargo] | ^^^^^^^^^^^^^^^^^^^
632.60 s
[alphal00p-docs-cargo] note : found an item that was configured out
632.60 s
[alphal00p-docs-cargo] --> /nix/store/5dfb7akvi1k3080zqfndr6jw2ay3di2p-vendor-cargo-deps/f8c6b2c844a6fa8c330abb750e4cf5bbdb36a70140a58e87f6b79fb3024532aa/numerica-3.0.0/src/domains/backend/float.rs:19:26
632.60 s
[alphal00p-docs-cargo] |
632.60 s
[alphal00p-docs-cargo] 15 | #[cfg(feature = "float-mpfr")]
632.60 s
[alphal00p-docs-cargo] | ---------------------- the item is gated behind the `float-mpfr` feature
632.60 s
[alphal00p-docs-cargo] ...
632.60 s
[alphal00p-docs-cargo] 19 | ops::{CompleteRound, Pow},
632.60 s
[alphal00p-docs-cargo] | ^^^
632.60 s
[alphal00p-docs-cargo] note : found an item that was configured out
632.60 s
[alphal00p-docs-cargo] --> /nix/store/5dfb7akvi1k3080zqfndr6jw2ay3di2p-vendor-cargo-deps/f8c6b2c844a6fa8c330abb750e4cf5bbdb36a70140a58e87f6b79fb3024532aa/numerica-3.0.0/src/domains/backend/float.rs:1562:5
632.60 s
[alphal00p-docs-cargo] |
632.60 s
[alphal00p-docs-cargo] 1559 | #[cfg(feature = "float-astro")]
632.60 s
[alphal00p-docs-cargo] | ----------------------- the item is gated behind the `float-astro` feature
632.60 s
[alphal00p-docs-cargo] ...
632.60 s
[alphal00p-docs-cargo] 1562 | Pow,
632.60 s
[alphal00p-docs-cargo] | ^^^
632.60 s
[alphal00p-docs-cargo]
632.88 s
[alphal00p-docs-cargo] error[E0425] : cannot find type `RawMultiPrecisionInteger` in this scope
632.88 s
[alphal00p-docs-cargo] --> /nix/store/5dfb7akvi1k3080zqfndr6jw2ay3di2p-vendor-cargo-deps/f8c6b2c844a6fa8c330abb750e4cf5bbdb36a70140a58e87f6b79fb3024532aa/numerica-3.0.0/src/domains/backend/integer.rs:52:38
632.88 s
[alphal00p-docs-cargo] |
632.88 s
[alphal00p-docs-cargo] 52 | pub struct MultiPrecisionInteger(RawMultiPrecisionInteger);
632.88 s
[alphal00p-docs-cargo] | ^^^^^^^^^^^^^^^^^^^^^^^^ not found in this scope
632.88 s
[alphal00p-docs-cargo]
632.89 s
[alphal00p-docs-cargo] error[E0425] : cannot find type `RawMultiPrecisionInteger` in this scope
632.89 s
[alphal00p-docs-cargo] --> /nix/store/5dfb7akvi1k3080zqfndr6jw2ay3di2p-vendor-cargo-deps/f8c6b2c844a6fa8c330abb750e4cf5bbdb36a70140a58e87f6b79fb3024532aa/numerica-3.0.0/src/domains/backend/integer.rs:52:38
632.89 s
[alphal00p-docs-cargo] |
632.89 s
[alphal00p-docs-cargo] 52 | pub struct MultiPrecisionInteger(RawMultiPrecisionInteger);
632.89 s
[alphal00p-docs-cargo] | ^^^^^^^^^^^^^^^^^^^^^^^^ not found in this scope
632.89 s
[alphal00p-docs-cargo] |
632.89 s
[alphal00p-docs-cargo] help : you might be missing a type parameter
632.89 s
[alphal00p-docs-cargo] |
632.89 s
[alphal00p-docs-cargo] 52 | pub struct MultiPrecisionInteger<RawMultiPrecisionInteger> (RawMultiPrecisionInteger);
632.89 s
[alphal00p-docs-cargo] | ++++++++++++++++++++++++++
632.89 s
[alphal00p-docs-cargo]
632.89 s
[alphal00p-docs-cargo] error[E0425] : cannot find type `RawMultiPrecisionInteger` in this scope
632.89 s
[alphal00p-docs-cargo] --> /nix/store/5dfb7akvi1k3080zqfndr6jw2ay3di2p-vendor-cargo-deps/f8c6b2c844a6fa8c330abb750e4cf5bbdb36a70140a58e87f6b79fb3024532aa/numerica-3.0.0/src/domains/backend/integer.rs:149:32
632.89 s
[alphal00p-docs-cargo] |
632.89 s
[alphal00p-docs-cargo] 52 | pub struct MultiPrecisionInteger(RawMultiPrecisionInteger);
632.89 s
[alphal00p-docs-cargo] | ----------------------------------------------------------- similarly named struct `MultiPrecisionInteger` defined here
632.89 s
[alphal00p-docs-cargo] ...
632.89 s
[alphal00p-docs-cargo] 149 | pub fn from_raw(value: RawMultiPrecisionInteger) -> Self {
632.89 s
[alphal00p-docs-cargo] | ^^^^^^^^^^^^^^^^^^^^^^^^
632.89 s
[alphal00p-docs-cargo] |
632.89 s
[alphal00p-docs-cargo] help : a struct with a similar name exists
632.89 s
[alphal00p-docs-cargo] |
632.89 s
[alphal00p-docs-cargo] 149 - pub fn from_raw(value: RawMultiPrecisionInteger ) -> Self {
632.89 s
[alphal00p-docs-cargo] 149 + pub fn from_raw(value: MultiPrecisionInteger ) -> Self {
632.89 s
[alphal00p-docs-cargo] |
632.89 s
[alphal00p-docs-cargo]
632.89 s
[alphal00p-docs-cargo] error[E0425] : cannot find type `RawMultiPrecisionInteger` in this scope
632.89 s
[alphal00p-docs-cargo] --> /nix/store/5dfb7akvi1k3080zqfndr6jw2ay3di2p-vendor-cargo-deps/f8c6b2c844a6fa8c330abb750e4cf5bbdb36a70140a58e87f6b79fb3024532aa/numerica-3.0.0/src/domains/backend/integer.rs:187:34
632.89 s
[alphal00p-docs-cargo] |
632.89 s
[alphal00p-docs-cargo] 52 | pub struct MultiPrecisionInteger(RawMultiPrecisionInteger);
632.89 s
[alphal00p-docs-cargo] | ----------------------------------------------------------- similarly named struct `MultiPrecisionInteger` defined here
632.89 s
[alphal00p-docs-cargo] ...
632.89 s
[alphal00p-docs-cargo] 187 | pub fn as_raw(&self) -> &RawMultiPrecisionInteger {
632.89 s
[alphal00p-docs-cargo] | ^^^^^^^^^^^^^^^^^^^^^^^^
632.89 s
[alphal00p-docs-cargo] |
632.89 s
[alphal00p-docs-cargo] help : a struct with a similar name exists
632.89 s
[alphal00p-docs-cargo] |
632.89 s
[alphal00p-docs-cargo] 187 - pub fn as_raw(&self) -> &RawMultiPrecisionInteger {
632.89 s
[alphal00p-docs-cargo] 187 + pub fn as_raw(&self) -> &MultiPrecisionInteger {
632.89 s
[alphal00p-docs-cargo] |
632.89 s
[alphal00p-docs-cargo]
632.90 s
[alphal00p-docs-cargo] error[E0425] : cannot find type `RawMultiPrecisionInteger` in this scope
632.90 s
[alphal00p-docs-cargo] --> /nix/store/5dfb7akvi1k3080zqfndr6jw2ay3di2p-vendor-cargo-deps/f8c6b2c844a6fa8c330abb750e4cf5bbdb36a70140a58e87f6b79fb3024532aa/numerica-3.0.0/src/domains/backend/integer.rs:193:33
632.90 s
[alphal00p-docs-cargo] |
632.90 s
[alphal00p-docs-cargo] 52 | pub struct MultiPrecisionInteger(RawMultiPrecisionInteger);
632.90 s
[alphal00p-docs-cargo] | ----------------------------------------------------------- similarly named struct `MultiPrecisionInteger` defined here
632.90 s
[alphal00p-docs-cargo] ...
632.90 s
[alphal00p-docs-cargo] 193 | pub fn to_raw(&self) -> RawMultiPrecisionInteger {
632.90 s
[alphal00p-docs-cargo] | ^^^^^^^^^^^^^^^^^^^^^^^^
632.90 s
[alphal00p-docs-cargo] |
632.90 s
[alphal00p-docs-cargo] help : a struct with a similar name exists
632.90 s
[alphal00p-docs-cargo] |
632.90 s
[alphal00p-docs-cargo] 193 - pub fn to_raw(&self) -> RawMultiPrecisionInteger {
632.90 s
[alphal00p-docs-cargo] 193 + pub fn to_raw(&self) -> MultiPrecisionInteger {
632.90 s
[alphal00p-docs-cargo] |
632.90 s
[alphal00p-docs-cargo]
632.90 s
[alphal00p-docs-cargo] error[E0425] : cannot find type `RawMultiPrecisionInteger` in this scope
632.90 s
[alphal00p-docs-cargo] --> /nix/store/5dfb7akvi1k3080zqfndr6jw2ay3di2p-vendor-cargo-deps/f8c6b2c844a6fa8c330abb750e4cf5bbdb36a70140a58e87f6b79fb3024532aa/numerica-3.0.0/src/domains/backend/integer.rs:199:34
632.90 s
[alphal00p-docs-cargo] |
632.90 s
[alphal00p-docs-cargo] 52 | pub struct MultiPrecisionInteger(RawMultiPrecisionInteger);
632.90 s
[alphal00p-docs-cargo] | ----------------------------------------------------------- similarly named struct `MultiPrecisionInteger` defined here
632.90 s
[alphal00p-docs-cargo] ...
632.90 s
[alphal00p-docs-cargo] 199 | pub fn into_raw(self) -> RawMultiPrecisionInteger {
632.90 s
[alphal00p-docs-cargo] | ^^^^^^^^^^^^^^^^^^^^^^^^
632.90 s
[alphal00p-docs-cargo] |
632.90 s
[alphal00p-docs-cargo] help : a struct with a similar name exists
632.90 s
[alphal00p-docs-cargo] |
632.90 s
[alphal00p-docs-cargo] 199 - pub fn into_raw(self) -> RawMultiPrecisionInteger {
632.90 s
[alphal00p-docs-cargo] 199 + pub fn into_raw(self) -> MultiPrecisionInteger {
632.90 s
[alphal00p-docs-cargo] |
632.90 s
[alphal00p-docs-cargo]
632.91 s
[alphal00p-docs-cargo] error[E0425] : cannot find type `RawMultiPrecisionInteger` in this scope
632.91 s
[alphal00p-docs-cargo] --> /nix/store/5dfb7akvi1k3080zqfndr6jw2ay3di2p-vendor-cargo-deps/f8c6b2c844a6fa8c330abb750e4cf5bbdb36a70140a58e87f6b79fb3024532aa/numerica-3.0.0/src/domains/backend/integer.rs:567:27
632.91 s
[alphal00p-docs-cargo] |
632.91 s
[alphal00p-docs-cargo] 52 | pub struct MultiPrecisionInteger(RawMultiPrecisionInteger);
632.91 s
[alphal00p-docs-cargo] | ----------------------------------------------------------- similarly named struct `MultiPrecisionInteger` defined here
632.91 s
[alphal00p-docs-cargo] ...
632.91 s
[alphal00p-docs-cargo] 567 | fn rem_trunc(lhs: RawMultiPrecisionInteger, rhs: RawMultiPrecisionInteger) -> Self {
632.91 s
[alphal00p-docs-cargo] | ^^^^^^^^^^^^^^^^^^^^^^^^
632.91 s
[alphal00p-docs-cargo] |
632.91 s
[alphal00p-docs-cargo] help : a struct with a similar name exists
632.91 s
[alphal00p-docs-cargo] |
632.91 s
[alphal00p-docs-cargo] 567 - fn rem_trunc(lhs: RawMultiPrecisionInteger , rhs: RawMultiPrecisionInteger) -> Self {
632.91 s
[alphal00p-docs-cargo] 567 + fn rem_trunc(lhs: MultiPrecisionInteger , rhs: RawMultiPrecisionInteger) -> Self {
632.91 s
[alphal00p-docs-cargo] |
632.91 s
[alphal00p-docs-cargo]
632.91 s
[alphal00p-docs-cargo] error[E0425] : cannot find type `RawMultiPrecisionInteger` in this scope
632.91 s
[alphal00p-docs-cargo] --> /nix/store/5dfb7akvi1k3080zqfndr6jw2ay3di2p-vendor-cargo-deps/f8c6b2c844a6fa8c330abb750e4cf5bbdb36a70140a58e87f6b79fb3024532aa/numerica-3.0.0/src/domains/backend/integer.rs:567:58
632.91 s
[alphal00p-docs-cargo] |
632.91 s
[alphal00p-docs-cargo] 52 | pub struct MultiPrecisionInteger(RawMultiPrecisionInteger);
632.91 s
[alphal00p-docs-cargo] | ----------------------------------------------------------- similarly named struct `MultiPrecisionInteger` defined here
632.91 s
[alphal00p-docs-cargo] ...
632.91 s
[alphal00p-docs-cargo] 567 | fn rem_trunc(lhs: RawMultiPrecisionInteger, rhs: RawMultiPrecisionInteger) -> Self {
632.91 s
[alphal00p-docs-cargo] | ^^^^^^^^^^^^^^^^^^^^^^^^
632.91 s
[alphal00p-docs-cargo] |
632.91 s
[alphal00p-docs-cargo] help : a struct with a similar name exists
632.91 s
[alphal00p-docs-cargo] |
632.91 s
[alphal00p-docs-cargo] 567 - fn rem_trunc(lhs: RawMultiPrecisionInteger, rhs: RawMultiPrecisionInteger ) -> Self {
632.91 s
[alphal00p-docs-cargo] 567 + fn rem_trunc(lhs: RawMultiPrecisionInteger, rhs: MultiPrecisionInteger ) -> Self {
632.91 s
[alphal00p-docs-cargo] |
632.91 s
[alphal00p-docs-cargo]
632.91 s
[alphal00p-docs-cargo] error[E0425] : cannot find type `RawMultiPrecisionInteger` in this scope
632.91 s
[alphal00p-docs-cargo] --> /nix/store/5dfb7akvi1k3080zqfndr6jw2ay3di2p-vendor-cargo-deps/f8c6b2c844a6fa8c330abb750e4cf5bbdb36a70140a58e87f6b79fb3024532aa/numerica-3.0.0/src/domains/backend/integer.rs:582:27
632.91 s
[alphal00p-docs-cargo] |
632.91 s
[alphal00p-docs-cargo] 52 | pub struct MultiPrecisionInteger(RawMultiPrecisionInteger);
632.91 s
[alphal00p-docs-cargo] | ----------------------------------------------------------- similarly named struct `MultiPrecisionInteger` defined here
632.91 s
[alphal00p-docs-cargo] ...
632.91 s
[alphal00p-docs-cargo] 582 | fn shl_raw(value: RawMultiPrecisionInteger, rhs: u64) -> RawMultiPrecisionInteger {
632.91 s
[alphal00p-docs-cargo] | ^^^^^^^^^^^^^^^^^^^^^^^^
632.91 s
[alphal00p-docs-cargo] |
632.91 s
[alphal00p-docs-cargo] help : a struct with a similar name exists
632.91 s
[alphal00p-docs-cargo] |
632.91 s
[alphal00p-docs-cargo] 582 - fn shl_raw(value: RawMultiPrecisionInteger , rhs: u64) -> RawMultiPrecisionInteger {
632.91 s
[alphal00p-docs-cargo] 582 + fn shl_raw(value: MultiPrecisionInteger , rhs: u64) -> RawMultiPrecisionInteger {
632.91 s
[alphal00p-docs-cargo] |
632.91 s
[alphal00p-docs-cargo]
632.92 s
[alphal00p-docs-cargo] error[E0425] : cannot find type `RawMultiPrecisionInteger` in this scope
632.92 s
[alphal00p-docs-cargo] --> /nix/store/5dfb7akvi1k3080zqfndr6jw2ay3di2p-vendor-cargo-deps/f8c6b2c844a6fa8c330abb750e4cf5bbdb36a70140a58e87f6b79fb3024532aa/numerica-3.0.0/src/domains/backend/integer.rs:582:66
632.92 s
[alphal00p-docs-cargo] |
632.92 s
[alphal00p-docs-cargo] 52 | pub struct MultiPrecisionInteger(RawMultiPrecisionInteger);
632.92 s
[alphal00p-docs-cargo] | ----------------------------------------------------------- similarly named struct `MultiPrecisionInteger` defined here
632.92 s
[alphal00p-docs-cargo] ...
632.92 s
[alphal00p-docs-cargo] 582 | fn shl_raw(value: RawMultiPrecisionInteger, rhs: u64) -> RawMultiPrecisionInteger {
632.92 s
[alphal00p-docs-cargo] | ^^^^^^^^^^^^^^^^^^^^^^^^
632.92 s
[alphal00p-docs-cargo] |
632.92 s
[alphal00p-docs-cargo] help : a struct with a similar name exists
632.92 s
[alphal00p-docs-cargo] |
632.92 s
[alphal00p-docs-cargo] 582 - fn shl_raw(value: RawMultiPrecisionInteger, rhs: u64) -> RawMultiPrecisionInteger {
632.92 s
[alphal00p-docs-cargo] 582 + fn shl_raw(value: RawMultiPrecisionInteger, rhs: u64) -> MultiPrecisionInteger {
632.92 s
[alphal00p-docs-cargo] |
632.92 s
[alphal00p-docs-cargo]
632.92 s
[alphal00p-docs-cargo] error[E0425] : cannot find type `RawMultiPrecisionInteger` in this scope
632.92 s
[alphal00p-docs-cargo] --> /nix/store/5dfb7akvi1k3080zqfndr6jw2ay3di2p-vendor-cargo-deps/f8c6b2c844a6fa8c330abb750e4cf5bbdb36a70140a58e87f6b79fb3024532aa/numerica-3.0.0/src/domains/backend/integer.rs:590:27
632.92 s
[alphal00p-docs-cargo] |
632.92 s
[alphal00p-docs-cargo] 52 | pub struct MultiPrecisionInteger(RawMultiPrecisionInteger);
632.92 s
[alphal00p-docs-cargo] | ----------------------------------------------------------- similarly named struct `MultiPrecisionInteger` defined here
632.92 s
[alphal00p-docs-cargo] ...
632.92 s
[alphal00p-docs-cargo] 590 | fn shr_raw(value: RawMultiPrecisionInteger, rhs: u64) -> RawMultiPrecisionInteger {
632.92 s
[alphal00p-docs-cargo] | ^^^^^^^^^^^^^^^^^^^^^^^^
632.92 s
[alphal00p-docs-cargo] |
632.92 s
[alphal00p-docs-cargo] help : a struct with a similar name exists
632.92 s
[alphal00p-docs-cargo] |
632.92 s
[alphal00p-docs-cargo] 590 - fn shr_raw(value: RawMultiPrecisionInteger , rhs: u64) -> RawMultiPrecisionInteger {
632.92 s
[alphal00p-docs-cargo] 590 + fn shr_raw(value: MultiPrecisionInteger , rhs: u64) -> RawMultiPrecisionInteger {
632.92 s
[alphal00p-docs-cargo] |
632.92 s
[alphal00p-docs-cargo]
632.92 s
[alphal00p-docs-cargo] error[E0425] : cannot find type `RawMultiPrecisionInteger` in this scope
632.92 s
[alphal00p-docs-cargo] --> /nix/store/5dfb7akvi1k3080zqfndr6jw2ay3di2p-vendor-cargo-deps/f8c6b2c844a6fa8c330abb750e4cf5bbdb36a70140a58e87f6b79fb3024532aa/numerica-3.0.0/src/domains/backend/integer.rs:590:66
632.92 s
[alphal00p-docs-cargo] |
632.92 s
[alphal00p-docs-cargo] 52 | pub struct MultiPrecisionInteger(RawMultiPrecisionInteger);
632.92 s
[alphal00p-docs-cargo] | ----------------------------------------------------------- similarly named struct `MultiPrecisionInteger` defined here
632.92 s
[alphal00p-docs-cargo] ...
632.92 s
[alphal00p-docs-cargo] 590 | fn shr_raw(value: RawMultiPrecisionInteger, rhs: u64) -> RawMultiPrecisionInteger {
632.92 s
[alphal00p-docs-cargo] | ^^^^^^^^^^^^^^^^^^^^^^^^
632.92 s
[alphal00p-docs-cargo] |
632.92 s
[alphal00p-docs-cargo] help : a struct with a similar name exists
632.92 s
[alphal00p-docs-cargo] |
632.92 s
[alphal00p-docs-cargo] 590 - fn shr_raw(value: RawMultiPrecisionInteger, rhs: u64) -> RawMultiPrecisionInteger {
632.92 s
[alphal00p-docs-cargo] 590 + fn shr_raw(value: RawMultiPrecisionInteger, rhs: u64) -> MultiPrecisionInteger {
632.92 s
[alphal00p-docs-cargo] |
632.92 s
[alphal00p-docs-cargo]
632.92 s
[alphal00p-docs-cargo] error[E0425] : cannot find type `RawMultiPrecisionInteger` in this scope
632.92 s
[alphal00p-docs-cargo] --> /nix/store/5dfb7akvi1k3080zqfndr6jw2ay3di2p-vendor-cargo-deps/f8c6b2c844a6fa8c330abb750e4cf5bbdb36a70140a58e87f6b79fb3024532aa/numerica-3.0.0/src/domains/backend/integer.rs:654:15
632.92 s
[alphal00p-docs-cargo] |
632.92 s
[alphal00p-docs-cargo] 52 | pub struct MultiPrecisionInteger(RawMultiPrecisionInteger);
632.92 s
[alphal00p-docs-cargo] | ----------------------------------------------------------- similarly named struct `MultiPrecisionInteger` defined here
632.92 s
[alphal00p-docs-cargo] ...
632.92 s
[alphal00p-docs-cargo] 654 | impl From<RawMultiPrecisionInteger> for MultiPrecisionInteger {
632.92 s
[alphal00p-docs-cargo] | ^^^^^^^^^^^^^^^^^^^^^^^^
632.92 s
[alphal00p-docs-cargo] |
632.92 s
[alphal00p-docs-cargo] help : a struct with a similar name exists
632.92 s
[alphal00p-docs-cargo] |
632.92 s
[alphal00p-docs-cargo] 654 - impl From<RawMultiPrecisionInteger > for MultiPrecisionInteger {
632.92 s
[alphal00p-docs-cargo] 654 + impl From<MultiPrecisionInteger > for MultiPrecisionInteger {
632.92 s
[alphal00p-docs-cargo] |
632.92 s
[alphal00p-docs-cargo] help : you might be missing a type parameter
632.92 s
[alphal00p-docs-cargo] |
632.92 s
[alphal00p-docs-cargo] 654 | impl<RawMultiPrecisionInteger> From<RawMultiPrecisionInteger> for MultiPrecisionInteger {
632.92 s
[alphal00p-docs-cargo] | ++++++++++++++++++++++++++
632.92 s
[alphal00p-docs-cargo]
632.93 s
[alphal00p-docs-cargo] error[E0425] : cannot find type `RawMultiPrecisionInteger` in this scope
632.93 s
[alphal00p-docs-cargo] --> /nix/store/5dfb7akvi1k3080zqfndr6jw2ay3di2p-vendor-cargo-deps/f8c6b2c844a6fa8c330abb750e4cf5bbdb36a70140a58e87f6b79fb3024532aa/numerica-3.0.0/src/domains/backend/integer.rs:656:24
632.93 s
[alphal00p-docs-cargo] |
632.93 s
[alphal00p-docs-cargo] 52 | pub struct MultiPrecisionInteger(RawMultiPrecisionInteger);
632.93 s
[alphal00p-docs-cargo] | ----------------------------------------------------------- similarly named struct `MultiPrecisionInteger` defined here
632.93 s
[alphal00p-docs-cargo] ...
632.93 s
[alphal00p-docs-cargo] 656 | fn from(value: RawMultiPrecisionInteger) -> Self {
632.93 s
[alphal00p-docs-cargo] | ^^^^^^^^^^^^^^^^^^^^^^^^
632.93 s
[alphal00p-docs-cargo] |
632.93 s
[alphal00p-docs-cargo] help : a struct with a similar name exists
632.93 s
[alphal00p-docs-cargo] |
632.93 s
[alphal00p-docs-cargo] 656 - fn from(value: RawMultiPrecisionInteger ) -> Self {
632.93 s
[alphal00p-docs-cargo] 656 + fn from(value: MultiPrecisionInteger ) -> Self {
632.93 s
[alphal00p-docs-cargo] |
632.93 s
[alphal00p-docs-cargo]
632.93 s
[alphal00p-docs-cargo] error[E0425] : cannot find type `RawMultiPrecisionInteger` in this scope
632.93 s
[alphal00p-docs-cargo] --> /nix/store/5dfb7akvi1k3080zqfndr6jw2ay3di2p-vendor-cargo-deps/f8c6b2c844a6fa8c330abb750e4cf5bbdb36a70140a58e87f6b79fb3024532aa/numerica-3.0.0/src/domains/backend/integer.rs:661:42
632.93 s
[alphal00p-docs-cargo] |
632.93 s
[alphal00p-docs-cargo] 52 | pub struct MultiPrecisionInteger(RawMultiPrecisionInteger);
632.93 s
[alphal00p-docs-cargo] | ----------------------------------------------------------- similarly named struct `MultiPrecisionInteger` defined here
632.93 s
[alphal00p-docs-cargo] ...
632.93 s
[alphal00p-docs-cargo] 661 | impl From<MultiPrecisionInteger> for RawMultiPrecisionInteger {
632.93 s
[alphal00p-docs-cargo] | ^^^^^^^^^^^^^^^^^^^^^^^^
632.93 s
[alphal00p-docs-cargo] |
632.93 s
[alphal00p-docs-cargo] help : a struct with a similar name exists
632.93 s
[alphal00p-docs-cargo] |
632.93 s
[alphal00p-docs-cargo] 661 - impl From<MultiPrecisionInteger> for RawMultiPrecisionInteger {
632.93 s
[alphal00p-docs-cargo] 661 + impl From<MultiPrecisionInteger> for MultiPrecisionInteger {
632.93 s
[alphal00p-docs-cargo] |
632.93 s
[alphal00p-docs-cargo]
633.31 s
[alphal00p-docs-cargo] error[E0433] : cannot find type `RawMultiPrecisionInteger` in this scope
633.31 s
[alphal00p-docs-cargo] --> /nix/store/5dfb7akvi1k3080zqfndr6jw2ay3di2p-vendor-cargo-deps/f8c6b2c844a6fa8c330abb750e4cf5bbdb36a70140a58e87f6b79fb3024532aa/numerica-3.0.0/src/domains/backend/integer.rs:620:13
633.31 s
[alphal00p-docs-cargo] |
633.31 s
[alphal00p-docs-cargo] 620 | RawMultiPrecisionInteger::from_str(s)
633.31 s
[alphal00p-docs-cargo] | ^^^^^^^^^^^^^^^^^^^^^^^^ use of undeclared type `RawMultiPrecisionInteger`
633.31 s
[alphal00p-docs-cargo] |
633.31 s
[alphal00p-docs-cargo] help : a struct with a similar name exists
633.31 s
[alphal00p-docs-cargo] |
633.31 s
[alphal00p-docs-cargo] 620 - RawMultiPrecisionInteger ::from_str(s)
633.31 s
[alphal00p-docs-cargo] 620 + MultiPrecisionInteger ::from_str(s)
633.31 s
[alphal00p-docs-cargo] |
633.31 s
[alphal00p-docs-cargo]
633.31 s
[alphal00p-docs-cargo] error[E0433] : cannot find type `RawMultiPrecisionInteger` in this scope
633.31 s
[alphal00p-docs-cargo] --> /nix/store/5dfb7akvi1k3080zqfndr6jw2ay3di2p-vendor-cargo-deps/f8c6b2c844a6fa8c330abb750e4cf5bbdb36a70140a58e87f6b79fb3024532aa/numerica-3.0.0/src/domains/backend/integer.rs:674:35
633.31 s
[alphal00p-docs-cargo] |
633.31 s
[alphal00p-docs-cargo] 674 | self.0 == RawMultiPrecisionInteger::from(*other)
633.31 s
[alphal00p-docs-cargo] | ^^^^^^^^^^^^^^^^^^^^^^^^ use of undeclared type `RawMultiPrecisionInteger`
633.31 s
[alphal00p-docs-cargo] ...
633.31 s
[alphal00p-docs-cargo] 702 | impl_cmp_primitive!(i32, i64, i128, u32, u64, u128);
633.31 s
[alphal00p-docs-cargo] | --------------------------------------------------- in this macro invocation
633.31 s
[alphal00p-docs-cargo] |
633.31 s
[alphal00p-docs-cargo] = note : this error originates in the macro `impl_cmp_primitive` (in Nightly builds, run with -Z macro-backtrace for more info)
633.31 s
[alphal00p-docs-cargo] help : a struct with a similar name exists
633.31 s
[alphal00p-docs-cargo] |
633.31 s
[alphal00p-docs-cargo] 674 - self.0 == RawMultiPrecisionInteger ::from(*other)
633.31 s
[alphal00p-docs-cargo] 674 + self.0 == MultiPrecisionInteger ::from(*other)
633.31 s
[alphal00p-docs-cargo] |
633.31 s
[alphal00p-docs-cargo]
633.31 s
[alphal00p-docs-cargo] error[E0433] : cannot find type `RawMultiPrecisionInteger` in this scope
633.31 s
[alphal00p-docs-cargo] --> /nix/store/5dfb7akvi1k3080zqfndr6jw2ay3di2p-vendor-cargo-deps/f8c6b2c844a6fa8c330abb750e4cf5bbdb36a70140a58e87f6b79fb3024532aa/numerica-3.0.0/src/domains/backend/integer.rs:681:25
633.31 s
[alphal00p-docs-cargo] |
633.31 s
[alphal00p-docs-cargo] 681 | RawMultiPrecisionInteger::from(*self) == other.0
633.31 s
[alphal00p-docs-cargo] | ^^^^^^^^^^^^^^^^^^^^^^^^ use of undeclared type `RawMultiPrecisionInteger`
633.31 s
[alphal00p-docs-cargo] ...
633.31 s
[alphal00p-docs-cargo] 702 | impl_cmp_primitive!(i32, i64, i128, u32, u64, u128);
633.31 s
[alphal00p-docs-cargo] | --------------------------------------------------- in this macro invocation
633.31 s
[alphal00p-docs-cargo] |
633.31 s
[alphal00p-docs-cargo] = note : this error originates in the macro `impl_cmp_primitive` (in Nightly builds, run with -Z macro-backtrace for more info)
633.31 s
[alphal00p-docs-cargo] help : a struct with a similar name exists
633.31 s
[alphal00p-docs-cargo] |
633.31 s
[alphal00p-docs-cargo] 681 - RawMultiPrecisionInteger ::from(*self) == other.0
633.31 s
[alphal00p-docs-cargo] 681 + MultiPrecisionInteger ::from(*self) == other.0
633.31 s
[alphal00p-docs-cargo] |
633.31 s
[alphal00p-docs-cargo]
633.31 s
[alphal00p-docs-cargo] error[E0433] : cannot find type `RawMultiPrecisionInteger` in this scope
633.31 s
[alphal00p-docs-cargo] --> /nix/store/5dfb7akvi1k3080zqfndr6jw2ay3di2p-vendor-cargo-deps/f8c6b2c844a6fa8c330abb750e4cf5bbdb36a70140a58e87f6b79fb3024532aa/numerica-3.0.0/src/domains/backend/integer.rs:688:45
633.31 s
[alphal00p-docs-cargo] |
633.31 s
[alphal00p-docs-cargo] 688 | self.0.partial_cmp(&RawMultiPrecisionInteger::from(*other))
633.31 s
[alphal00p-docs-cargo] | ^^^^^^^^^^^^^^^^^^^^^^^^ use of undeclared type `RawMultiPrecisionInteger`
633.31 s
[alphal00p-docs-cargo] ...
633.31 s
[alphal00p-docs-cargo] 702 | impl_cmp_primitive!(i32, i64, i128, u32, u64, u128);
633.31 s
[alphal00p-docs-cargo] | --------------------------------------------------- in this macro invocation
633.31 s
[alphal00p-docs-cargo] |
633.31 s
[alphal00p-docs-cargo] = note : this error originates in the macro `impl_cmp_primitive` (in Nightly builds, run with -Z macro-backtrace for more info)
633.31 s
[alphal00p-docs-cargo] help : a struct with a similar name exists
633.31 s
[alphal00p-docs-cargo] |
633.31 s
[alphal00p-docs-cargo] 688 - self.0.partial_cmp(&RawMultiPrecisionInteger ::from(*other))
633.31 s
[alphal00p-docs-cargo] 688 + self.0.partial_cmp(&MultiPrecisionInteger ::from(*other))
633.31 s
[alphal00p-docs-cargo] |
633.31 s
[alphal00p-docs-cargo]
633.31 s
[alphal00p-docs-cargo] error[E0433] : cannot find type `RawMultiPrecisionInteger` in this scope
633.31 s
[alphal00p-docs-cargo] --> /nix/store/5dfb7akvi1k3080zqfndr6jw2ay3di2p-vendor-cargo-deps/f8c6b2c844a6fa8c330abb750e4cf5bbdb36a70140a58e87f6b79fb3024532aa/numerica-3.0.0/src/domains/backend/integer.rs:695:25
633.31 s
[alphal00p-docs-cargo] |
633.31 s
[alphal00p-docs-cargo] 695 | RawMultiPrecisionInteger::from(*self).partial_cmp(&other.0)
633.31 s
[alphal00p-docs-cargo] | ^^^^^^^^^^^^^^^^^^^^^^^^ use of undeclared type `RawMultiPrecisionInteger`
633.31 s
[alphal00p-docs-cargo] ...
633.31 s
[alphal00p-docs-cargo] 702 | impl_cmp_primitive!(i32, i64, i128, u32, u64, u128);
633.31 s
[alphal00p-docs-cargo] | --------------------------------------------------- in this macro invocation
633.31 s
[alphal00p-docs-cargo] |
633.31 s
[alphal00p-docs-cargo] = note : this error originates in the macro `impl_cmp_primitive` (in Nightly builds, run with -Z macro-backtrace for more info)
633.31 s
[alphal00p-docs-cargo] help : a struct with a similar name exists
633.31 s
[alphal00p-docs-cargo] |
633.31 s
[alphal00p-docs-cargo] 695 - RawMultiPrecisionInteger ::from(*self).partial_cmp(&other.0)
633.31 s
[alphal00p-docs-cargo] 695 + MultiPrecisionInteger ::from(*self).partial_cmp(&other.0)
633.31 s
[alphal00p-docs-cargo] |
633.31 s
[alphal00p-docs-cargo]
633.31 s
[alphal00p-docs-cargo] error[E0433] : cannot find type `RawMultiPrecisionInteger` in this scope
633.31 s
[alphal00p-docs-cargo] --> /nix/store/5dfb7akvi1k3080zqfndr6jw2ay3di2p-vendor-cargo-deps/f8c6b2c844a6fa8c330abb750e4cf5bbdb36a70140a58e87f6b79fb3024532aa/numerica-3.0.0/src/domains/backend/integer.rs:1180:35
633.31 s
[alphal00p-docs-cargo] |
633.31 s
[alphal00p-docs-cargo] 1180 | MultiPrecisionInteger(RawMultiPrecisionInteger::from((&self.0) & &rhs.0))
633.31 s
[alphal00p-docs-cargo] | ^^^^^^^^^^^^^^^^^^^^^^^^ use of undeclared type `RawMultiPrecisionInteger`
633.31 s
[alphal00p-docs-cargo] |
633.31 s
[alphal00p-docs-cargo] help : a struct with a similar name exists
633.31 s
[alphal00p-docs-cargo] |
633.31 s
[alphal00p-docs-cargo] 1180 - MultiPrecisionInteger(RawMultiPrecisionInteger ::from((&self.0) & &rhs.0))
633.31 s
[alphal00p-docs-cargo] 1180 + MultiPrecisionInteger(MultiPrecisionInteger ::from((&self.0) & &rhs.0))
633.31 s
[alphal00p-docs-cargo] |
633.31 s
[alphal00p-docs-cargo]
633.31 s
[alphal00p-docs-cargo] error[E0433] : cannot find type `RawMultiPrecisionInteger` in this scope
633.31 s
[alphal00p-docs-cargo] --> /nix/store/5dfb7akvi1k3080zqfndr6jw2ay3di2p-vendor-cargo-deps/f8c6b2c844a6fa8c330abb750e4cf5bbdb36a70140a58e87f6b79fb3024532aa/numerica-3.0.0/src/domains/backend/integer.rs:1212:35
633.31 s
[alphal00p-docs-cargo] |
633.31 s
[alphal00p-docs-cargo] 1212 | MultiPrecisionInteger(RawMultiPrecisionInteger::from(-&self.0))
633.31 s
[alphal00p-docs-cargo] | ^^^^^^^^^^^^^^^^^^^^^^^^ use of undeclared type `RawMultiPrecisionInteger`
633.31 s
[alphal00p-docs-cargo] |
633.31 s
[alphal00p-docs-cargo] help : a struct with a similar name exists
633.31 s
[alphal00p-docs-cargo] |
633.31 s
[alphal00p-docs-cargo] 1212 - MultiPrecisionInteger(RawMultiPrecisionInteger ::from(-&self.0))
633.31 s
[alphal00p-docs-cargo] 1212 + MultiPrecisionInteger(MultiPrecisionInteger ::from(-&self.0))
633.31 s
[alphal00p-docs-cargo] |
633.31 s
[alphal00p-docs-cargo]
633.31 s
[alphal00p-docs-cargo] error[E0425] : cannot find function `write_lsf_bytes` in this scope
633.31 s
[alphal00p-docs-cargo] --> /nix/store/5dfb7akvi1k3080zqfndr6jw2ay3di2p-vendor-cargo-deps/f8c6b2c844a6fa8c330abb750e4cf5bbdb36a70140a58e87f6b79fb3024532aa/numerica-3.0.0/src/domains/backend/integer.rs:1682:5
633.31 s
[alphal00p-docs-cargo] |
633.31 s
[alphal00p-docs-cargo] 1682 | write_lsf_bytes(value, &mut bytes);
633.31 s
[alphal00p-docs-cargo] | ^^^^^^^^^^^^^^^ not found in this scope
633.31 s
[alphal00p-docs-cargo]
633.31 s
[alphal00p-docs-cargo] Some errors have detailed explanations: E0425, E0432, E0433.
633.31 s
[alphal00p-docs-cargo] For more information about an error, try `rustc --explain E0425`.
633.33 s
[alphal00p-docs-cargo] error : could not compile `numerica` (lib) due to 29 previous errors
633.33 s
[alphal00p-docs-cargo] warning : build failed, waiting for other jobs to finish...
718.77 s
Progress: 19 of 20 built (1 failed), 54 of 54 downloaded from cache
718.77 s
Failed to build alphal00p-docs-cargo after 10m26s
718.81 s
Cannot build ' /nix/store/623idw7bxrdblwflbqi3k630cvnna0if-alphal00p-docs-cargo-0.1.0.drv '.
718.81 s
Reason: builder failed with exit code 101 .
718.81 s
Output paths:
718.81 s
/nix/store/rh9khp691qr9mzy0lnbbniym9gpm688f-alphal00p-docs-cargo-0.1.0
718.81 s
Last 1200 log lines:
718.81 s
> cargoArtifacts not set, will not reuse any cargo artifacts
718.81 s
> Running phase: unpackPhase
718.81 s
> unpacking source archive /nix/store/zw5i19nvfc6y8mffi47icfczb0q4x6ip-source
718.81 s
> source root is source
718.81 s
> Running phase: patchPhase
718.81 s
> Executing configureCargoCommonVars
718.81 s
> Running phase: updateAutotoolsGnuConfigScriptsPhase
718.81 s
> Running phase: configurePhase
718.81 s
> will append /build/source/.cargo-home/config.toml with contents of /nix/store/5dfb7akvi1k3080zqfndr6jw2ay3di2p-vendor-cargo-deps/config.toml
718.81 s
> default configurePhase, nothing to do
718.81 s
> Running phase: buildPhase
718.81 s
> +++ command cargo --version
718.81 s
> cargo 1.98.1 (797e8a9bc 2026-08-05)
718.81 s
> +++ command cargo build --profile docs --locked -p alphal00p-docs-catalogs --bin alphal00p-docs-catalogs
718.81 s
> Compiling proc-macro2 v1.0.106
718.81 s
> Compiling unicode-ident v1.0.24
718.81 s
> Compiling quote v1.0.45
718.81 s
> Compiling serde_core v1.0.228
718.81 s
> Compiling memchr v2.8.0
718.81 s
> Compiling utf8parse v0.2.2
718.81 s
> Compiling zmij v1.0.21
718.81 s
> Compiling serde v1.0.228
718.81 s
> Compiling anstyle v1.0.14
718.81 s
> Compiling colorchoice v1.0.5
718.81 s
> Compiling serde_json v1.0.149
718.81 s
> Compiling is_terminal_polyfill v1.70.2
718.81 s
> Compiling anstyle-query v1.1.5
718.81 s
> Compiling thiserror v2.0.18
718.81 s
> Compiling hashbrown v0.17.1
718.81 s
> Compiling eyre v0.6.12
718.81 s
> Compiling anstyle-parse v1.0.0
718.81 s
> Compiling itoa v1.0.18
718.81 s
> Compiling strsim v0.11.1
718.81 s
> Compiling clap_lex v1.1.0
718.81 s
> Compiling regex-syntax v0.8.10
718.81 s
> Compiling equivalent v1.0.2
718.81 s
> Compiling anstream v1.0.0
718.81 s
> Compiling heck v0.5.0
718.81 s
> Compiling indenter v0.3.4
718.81 s
> Compiling once_cell v1.21.4
718.81 s
> Compiling aho-corasick v1.1.4
718.81 s
> Compiling clap_builder v4.6.0
718.81 s
> Compiling syn v2.0.117
718.81 s
> Compiling regex-automata v0.4.14
718.81 s
> Compiling indexmap v2.14.0
718.81 s
> Compiling thiserror-impl v2.0.18
718.81 s
> Compiling serde_derive v1.0.228
718.81 s
> Compiling clap_derive v4.6.1
718.81 s
> Compiling alphal00p-docs-macros v0.1.0 (/build/source/crates/alphal00p-docs-macros)
718.81 s
> Compiling regex v1.12.3
718.81 s
> Compiling clap v4.6.1
718.81 s
> Compiling alphal00p-docs-schema v0.1.0 (/build/source/crates/alphal00p-docs-schema)
718.81 s
> Compiling alphal00p-docs-catalogs v0.1.0 (/build/source/crates/alphal00p-docs-catalogs)
718.81 s
> Finished `docs` profile [unoptimized] target(s) in 11.36s
718.81 s
> +++ command cargo build --profile docs --locked -p alphal00p-docs-python-exporter --features gammaloop
718.81 s
> Compiling serde_core v1.0.228
718.81 s
> Compiling libc v0.2.186
718.81 s
> Compiling cfg-if v1.0.4
718.81 s
> Compiling serde v1.0.228
718.81 s
> Compiling memchr v2.8.0
718.81 s
> Compiling autocfg v1.5.0
718.81 s
> Compiling libm v0.2.16
718.81 s
> Compiling version_check v0.9.5
718.81 s
> Compiling either v1.15.0
718.81 s
> Compiling zerocopy v0.8.48
718.81 s
> Compiling crossbeam-utils v0.8.21
718.81 s
> Compiling log v0.4.29
718.81 s
> Compiling unicode-width v0.2.2
718.81 s
> Compiling rayon-core v1.13.0
718.81 s
> Compiling foldhash v0.2.0
718.81 s
> Compiling target-lexicon v0.13.5
718.81 s
> Compiling syn v2.0.117
718.81 s
> Compiling syn v3.0.4
718.81 s
> Compiling lazy_static v1.5.0
718.81 s
> Compiling serde_json v1.0.149
718.81 s
> Compiling paste v1.0.15
718.81 s
> Compiling crunchy v0.2.4
718.81 s
> Compiling siphasher v1.0.2
718.81 s
> Compiling num-traits v0.2.19
718.81 s
> Compiling getrandom v0.3.4
718.81 s
> Compiling anyhow v1.0.102
718.81 s
> Compiling aho-corasick v1.1.4
718.81 s
> Compiling tiny-keccak v2.0.2
718.81 s
> Compiling itertools v0.14.0
718.81 s
> Compiling static_assertions v1.1.0
718.81 s
> Compiling time-core v0.1.8
718.81 s
> Compiling num-conv v0.2.1
718.81 s
> Compiling powerfmt v0.2.0
718.81 s
> Compiling rustix v1.1.4
718.81 s
> Compiling crossbeam-epoch v0.9.18
718.81 s
> Compiling deranged v0.5.8
718.81 s
> Compiling time-macros v0.2.27
718.81 s
> Compiling linux-raw-sys v0.12.1
718.81 s
> Compiling pyo3-build-config v0.28.3
718.81 s
> Compiling num_threads v0.1.7
718.81 s
> Compiling crossbeam-deque v0.8.6
718.81 s
> Compiling allocator-api2 v0.2.21
718.81 s
> Compiling tracing-core v0.1.36
718.81 s
> Compiling winnow v1.0.2
718.81 s
> Compiling virtue v0.0.18
718.81 s
> Compiling arrayvec v0.7.6
718.81 s
> Compiling regex-automata v0.4.14
718.81 s
> Compiling getrandom v0.2.17
718.81 s
> Compiling rayon v1.12.0
718.81 s
> Compiling hashbrown v0.16.1
718.81 s
> Compiling bitflags v2.11.1
718.81 s
> Compiling time v0.3.47
718.81 s
> Compiling rand_core v0.6.4
718.81 s
> Compiling rand_core v0.9.5
718.81 s
> Compiling toml_parser v1.1.2+spec-1.1.0
718.81 s
> Compiling bincode_derive v2.0.1
718.81 s
> Compiling serde_spanned v1.1.1
718.81 s
> Compiling phf_shared v0.11.3
718.81 s
> Compiling unty v0.0.4
718.81 s
> Compiling toml_writer v1.1.1+spec-1.1.0
718.81 s
> Compiling gmp-mpfr-sys v1.7.1
718.81 s
> Compiling num-integer v0.1.46
718.81 s
> Compiling approx v0.5.1
718.81 s
> Compiling pin-project-lite v0.2.17
718.81 s
> Compiling nu-ansi-term v0.50.3
718.81 s
> Compiling tracing-log v0.2.0
718.81 s
> Compiling matrixmultiply v0.3.10
718.81 s
> Compiling sharded-slab v0.1.7
718.81 s
> Compiling hashbrown v0.17.1
718.81 s
> Compiling thread_local v1.1.9
718.81 s
> Compiling option-ext v0.2.0
718.81 s
> Compiling rug v1.30.0
718.81 s
> Compiling syn v1.0.109
718.81 s
> Compiling typenum v1.20.0
718.81 s
> Compiling dirs-sys v0.5.0
718.81 s
> Compiling pyo3-ffi v0.28.3
718.81 s
> Compiling num-complex v0.4.6
718.81 s
> Compiling toml_datetime v1.1.1+spec-1.1.0
718.81 s
> Compiling rawpointer v0.2.1
718.81 s
> Compiling fnv v1.0.7
718.81 s
> Compiling alloc-no-stdlib v2.0.4
718.81 s
> Compiling dyn-clone v1.0.20
718.81 s
> Compiling az v1.3.0
718.81 s
> Compiling alloc-stdlib v0.2.2
718.81 s
> Compiling pyo3-macros-backend v0.28.3
718.81 s
> Compiling num-bigint v0.4.6
718.81 s
> Compiling generic-array v0.14.7
718.81 s
> Compiling colored v3.1.1
718.81 s
> Compiling bytemuck_derive v1.12.0
718.81 s
> Compiling bitflags v1.3.2
718.81 s
> Compiling errno v0.3.14
718.81 s
> Compiling getopts v0.2.24
718.81 s
> Compiling signal-hook v0.3.18
718.81 s
> Compiling same-file v1.0.6
718.81 s
> Compiling ident_case v1.0.1
718.81 s
> Compiling indexmap v2.14.0
718.81 s
> Compiling parking_lot_core v0.9.12
718.81 s
> Compiling walkdir v2.5.0
718.81 s
> Compiling signal-hook-registry v1.4.8
718.81 s
> Compiling synstructure v0.13.2
718.81 s
> Compiling region v3.0.2
718.81 s
> Compiling toml v1.1.2+spec-1.1.0
718.81 s
> Compiling matchers v0.2.0
718.81 s
> Compiling regex v1.12.3
718.81 s
> Compiling const-random-macro v0.1.16
718.81 s
> Compiling hugepage-rs v0.1.1
718.81 s
> Compiling wasmtime-jit-icache-coherence v34.0.2
718.81 s
> Compiling vte v0.14.1
718.81 s
> Compiling smartstring v1.0.1
718.81 s
> Compiling ahash v0.8.12
718.81 s
> Compiling inventory v0.3.24
718.81 s
> Compiling unic-char-range v0.9.0
718.81 s
> Compiling unic-common v0.9.0
718.81 s
> Compiling scopeguard v1.2.0
718.81 s
> Compiling spec_math v0.1.6
718.81 s
> Compiling const-random v0.1.18
718.81 s
> Compiling unic-char-property v0.9.0
718.81 s
> Compiling unic-ucd-version v0.9.0
718.81 s
> Compiling lock_api v0.4.14
718.81 s
> Compiling terminal_size v0.4.4
718.81 s
> Compiling brotli-decompressor v5.0.0
718.81 s
> Compiling mio v1.2.0
718.81 s
> Compiling rustpython-parser-vendored v0.4.0
718.81 s
> Compiling itertools v0.11.0
718.81 s
> Compiling bytemuck v1.25.0
718.81 s
> Compiling indenter v0.3.4
718.81 s
> Compiling rustix v0.38.44
718.81 s
> Compiling minimal-lexical v0.2.1
718.81 s
> Compiling unicase v2.9.0
718.81 s
> Compiling safe_arch v0.7.4
718.81 s
> Compiling safe_arch v1.2.0
718.81 s
> Compiling winnow v0.7.15
718.81 s
> Compiling iana-time-zone v0.1.65
718.81 s
> Compiling fastrand v2.4.1
718.81 s
> Compiling clap_builder v4.6.0
718.81 s
> Compiling nom v7.1.3
718.81 s
> Compiling signal-hook-mio v0.2.5
718.81 s
> Compiling wide v0.7.33
718.81 s
> Compiling block-buffer v0.10.4
718.81 s
> Compiling crypto-common v0.1.7
718.81 s
> Compiling directories v6.0.0
718.81 s
> Compiling wide v1.7.0
718.81 s
> Compiling numpy v0.28.0
718.81 s
> Compiling phf v0.11.3
718.81 s
> Compiling brotli v8.0.2
718.81 s
> Compiling libloading v0.9.0
718.81 s
> Compiling byteorder v1.5.0
718.81 s
> Compiling linux-raw-sys v0.4.15
718.81 s
> Compiling serde_derive v1.0.228
718.81 s
> Compiling zerocopy-derive v0.8.48
718.81 s
> Compiling tracing-attributes v0.1.31
718.81 s
> Compiling thiserror-impl v2.0.18
718.81 s
> Compiling is-macro v0.3.7
718.81 s
> Compiling strum_macros v0.27.2
718.81 s
> Compiling clap_derive v4.6.1
718.81 s
> Compiling simba v0.9.1
718.81 s
> Compiling rustpython-parser-core v0.4.0
718.81 s
> Compiling zerofrom-derive v0.1.7
718.81 s
> Compiling ed25519-compact v2.4.2
718.81 s
> Compiling data-encoding v2.11.1
718.81 s
> Compiling unicode-segmentation v1.13.2
718.81 s
> Compiling tracing v0.1.44
718.81 s
> Compiling tinyjson v2.5.1
718.81 s
> Compiling append-only-vec v0.1.8
718.81 s
> Compiling bytes v1.11.1
718.81 s
> Compiling self_cell v1.2.2
718.81 s
> Compiling thiserror v2.0.18
718.81 s
> Compiling rustc-hash v2.1.2
718.81 s
> Compiling rustpython-ast v0.4.0
718.81 s
> Compiling ansitok v0.3.0
718.81 s
> Compiling yoke-derive v0.8.2
718.81 s
> Compiling digest v0.10.7
718.81 s
> Compiling unic-ucd-ident v0.9.0
718.81 s
> Compiling clap v4.6.1
718.81 s
> Compiling unic-emoji-char v0.9.0
718.81 s
> Compiling pyo3 v0.28.3
718.81 s
> Compiling bstr v1.12.1
718.81 s
> Compiling phf_shared v0.13.1
718.81 s
> Compiling zerofrom v0.1.8
718.81 s
> Compiling stable_deref_trait v1.2.1
718.81 s
> Compiling pyo3-macros v0.28.3
718.81 s
> Compiling typeid v1.0.3
718.81 s
> Compiling ciborium-io v0.2.2
718.81 s
> Compiling getrandom v0.4.2
718.81 s
> Compiling strum v0.27.2
718.81 s
> Compiling plotters-backend v0.3.7
718.81 s
> Compiling cpufeatures v0.2.17
718.81 s
> Compiling rustc-hash v1.1.0
718.81 s
> Compiling lalrpop-util v0.20.2
718.81 s
> Compiling sha2 v0.10.9
718.81 s
> Compiling eyre v0.6.12
718.81 s
> Compiling plotters-svg v0.3.7
718.81 s
> Compiling num-rational v0.4.2
718.81 s
> Compiling zerovec-derive v0.11.6
718.81 s
> Compiling globset v0.4.18
718.81 s
> Compiling toml_datetime v0.7.5+spec-1.1.0
718.81 s
> Compiling console v0.16.3
718.81 s
> Compiling itertools v0.10.5
718.81 s
> Compiling ucd-trie v0.1.7
718.81 s
> Compiling toml_write v0.1.2
718.81 s
> Compiling cast v0.3.0
718.81 s
> Compiling adler2 v2.0.1
718.81 s
> Compiling rustversion v1.0.22
718.81 s
> Compiling symbolica v2.2.0 (https://github.com/symbolica-dev/symbolica?rev=ba3737137c2a2ccd7bb39f0441837d38ec867e78#ba373713)
718.81 s
> Compiling simd-adler32 v0.3.10
718.81 s
> Compiling pest v2.8.6
718.81 s
> Compiling rust-embed-utils v8.11.0
718.81 s
> Compiling miniz_oxide v0.8.9
718.81 s
> Compiling toml v0.9.12+spec-1.1.0
718.81 s
> Compiling yoke v0.8.3
718.81 s
> Compiling plotters v0.3.7
718.81 s
> Compiling ansi-str v0.9.0
718.81 s
> Compiling ndarray v0.17.2
718.81 s
> Compiling displaydoc v0.2.7
718.81 s
> Compiling smallvec v1.15.1
718.81 s
> Compiling bincode v2.0.1
718.81 s
> Compiling tracing-serde v0.2.0
718.81 s
> Compiling tracing-subscriber v0.3.23
718.81 s
> Compiling chrono v0.4.44
718.81 s
> Compiling xprec v0.2.2
718.81 s
> Compiling parking_lot v0.12.5
718.81 s
> Compiling toml_datetime v0.6.11
718.81 s
> Compiling crossterm v0.28.1
718.81 s
> Compiling bincode-trait-derive v0.1.1
718.81 s
> Compiling serde_spanned v0.6.9
718.81 s
> Compiling criterion-plot v0.5.0
718.81 s
> Compiling zerovec v0.11.8
718.81 s
> Compiling toml_edit v0.22.27
718.81 s
> Compiling tinytemplate v1.2.1
718.81 s
> Compiling is-terminal v0.4.17
718.81 s
> Compiling slotmap v1.1.1
718.81 s
> Compiling anes v0.1.6
718.81 s
> Compiling maplit v1.0.2
718.81 s
> Compiling oorandom v11.1.5
718.81 s
> Compiling ppv-lite86 v0.2.21
718.81 s
> Compiling half v2.7.1
718.81 s
> Compiling bytecount v0.6.9
718.81 s
> Compiling papergrid v0.18.0
718.81 s
> Compiling rand_chacha v0.3.1
718.81 s
> Compiling rand_chacha v0.9.0
718.81 s
> Compiling pest_meta v2.8.6
718.81 s
> Compiling ciborium-ll v0.2.2
718.81 s
> Compiling rand v0.8.6
718.81 s
> Compiling ciborium v0.2.2
718.81 s
> Compiling rand v0.9.4
718.81 s
> Compiling tinystr v0.8.4
718.81 s
> Compiling ron v0.12.1
718.81 s
> Compiling tempfile v3.27.0
718.81 s
> Compiling testing_table v0.3.0
718.81 s
> Compiling tabled_derive v0.12.0
718.81 s
> Compiling toml_edit v0.25.11+spec-1.1.0
718.81 s
> Compiling similar v2.7.0
718.81 s
> Compiling phf_generator v0.11.3
718.81 s
> Compiling phf_codegen v0.11.3
718.81 s
> Compiling symjit v2.25.6
718.81 s
> Compiling criterion v0.5.1
718.81 s
> Compiling pest_generator v2.8.6
718.81 s
> Compiling unicode_names2_generator v1.3.0
718.81 s
> Compiling rustpython-parser v0.4.0
718.81 s
> Compiling toml v0.8.23
718.81 s
> Compiling insta v1.47.2
718.81 s
> Compiling unic-langid-impl v0.9.6
718.81 s
> Compiling tabled v0.22.0
718.81 s
> Compiling unicode_names2 v1.3.0
718.81 s
> Compiling proc-macro-error-attr v1.0.4
718.81 s
> Compiling uncased v0.9.10
718.81 s
> Compiling proc-macro2-diagnostics v0.10.1
718.81 s
> Compiling strsim v0.10.0
718.81 s
> Compiling radium v0.7.0
718.81 s
> Compiling slab v0.4.12
718.81 s
> Compiling pest_derive v2.8.6
718.81 s
> Compiling darling_core v0.23.0
718.81 s
> Compiling darling_core v0.14.4
718.81 s
> Compiling figment v0.10.19
718.81 s
> Compiling proc-macro-error v1.0.4
718.81 s
> Compiling tap v1.0.1
718.81 s
> Compiling ryu v1.0.23
718.81 s
> Compiling wyz v0.5.1
718.81 s
> Compiling castaway v0.2.4
718.81 s
> Compiling instability v0.3.12
718.81 s
> Compiling heck v0.4.1
718.81 s
> Compiling find-msvc-tools v0.1.9
718.81 s
> Compiling funty v2.0.0
718.81 s
> Compiling shlex v1.3.0
718.81 s
> Compiling indoc v2.0.7
718.81 s
> Compiling cc v1.2.61
718.81 s
> Compiling bitvec v1.0.1
718.81 s
> Compiling duplicate v2.0.1
718.81 s
> Compiling compact_str v0.9.0
718.81 s
> Compiling dot-parser v0.5.1
718.81 s
> Compiling darling_macro v0.14.4
718.81 s
> Compiling darling_macro v0.23.0
718.81 s
> Compiling kasuari v0.4.12
718.81 s
> Compiling unicode-truncate v2.0.1
718.81 s
> Compiling convert_case v0.10.0
718.81 s
> Compiling serde_repr v0.1.20
718.81 s
> Compiling env_filter v1.0.1
718.81 s
> Compiling num-iter v0.1.45
718.81 s
> Compiling lru v0.16.4
718.81 s
> Compiling jiff v0.2.24
718.81 s
> Compiling darling v0.14.4
718.81 s
> Compiling ref-ops v0.2.5
718.81 s
> Compiling convert_case v0.4.0
718.81 s
> Compiling ratatui-core v0.1.0
718.81 s
> Compiling derive_builder_core v0.11.2
718.81 s
> Compiling num v0.4.3
718.81 s
> Compiling derive_more-impl v2.1.1
718.81 s
> Compiling blake3 v1.8.5
718.81 s
> Compiling duplicate v1.0.0
718.81 s
> Compiling enum-try-as-inner v0.1.1
718.81 s
> Compiling darling v0.23.0
718.81 s
> Compiling derive_more v0.99.20
718.81 s
> Compiling delegate v0.12.0
718.81 s
> Compiling rand_xoshiro v0.6.0
718.81 s
> Compiling features v0.10.0
718.81 s
> Compiling colored v2.2.0
718.81 s
> Compiling thiserror v1.0.69
718.81 s
> Compiling owo-colors v4.3.0
718.81 s
> Compiling constcat v0.5.1
718.81 s
> Compiling litrs v1.0.0
718.81 s
> Compiling gat-lending-iterator v0.1.8
718.81 s
> Compiling portable-atomic v1.13.1
718.81 s
> Compiling object v0.37.3
718.81 s
> Compiling cfg_aliases v0.2.1
718.81 s
> Compiling nix v0.31.2
718.81 s
> Compiling derive_builder_macro v0.11.2
718.81 s
> Compiling derive_more v2.1.1
718.81 s
> Compiling rand_distr v0.4.3
718.81 s
> Compiling simba v0.6.0
718.81 s
> Compiling phf_generator v0.13.1
718.81 s
> Compiling nalgebra-macros v0.1.0
718.81 s
> Compiling document-features v0.2.12
718.81 s
> Compiling thiserror-impl v1.0.69
718.81 s
> Compiling dirs v6.0.0
718.81 s
> Compiling line-clipping v0.3.7
718.81 s
> Compiling vte v0.15.0
718.81 s
> Compiling joinery v2.1.0
718.81 s
> Compiling clarabel v0.11.1
718.81 s
> Compiling ref-cast v1.0.25
718.81 s
> Compiling color-spantrace v0.3.0
718.81 s
> Compiling constant_time_eq v0.4.2
718.81 s
> Compiling cpufeatures v0.3.0
718.81 s
> Compiling arrayref v0.3.9
718.81 s
> Compiling gimli v0.32.3
718.81 s
> Compiling titlecase v2.2.1
718.81 s
> Compiling vt100 v0.16.2
718.81 s
> Compiling derive_builder v0.11.2
718.81 s
> Compiling ratatui-widgets v0.3.0
718.81 s
> Compiling phf_macros v0.13.1
718.81 s
> Compiling crossterm v0.29.0
718.81 s
> Compiling tracing-error v0.2.1
718.81 s
> Compiling serde-big-array v0.5.1
718.81 s
> Compiling enum_dispatch v0.3.13
718.81 s
> Compiling delegate v0.13.5
718.81 s
> Compiling ref-cast-impl v1.0.25
718.81 s
> Compiling serde_derive_internals v0.29.1
718.81 s
> Compiling amd v0.2.2
718.81 s
> Compiling env_logger v0.11.10
718.81 s
> Compiling subprocess v0.2.15
718.81 s
> Compiling rust_lisp v0.18.0
718.81 s
> Compiling rustc-demangle v0.1.27
718.81 s
> Compiling base64 v0.22.1
718.81 s
> Compiling semver v1.0.28
718.81 s
> Compiling vakint v0.1.2 (/build/source/crates/vakint)
718.81 s
> Compiling unit-prefix v0.5.2
718.81 s
> Compiling indicatif v0.18.4
718.81 s
> Compiling ratatui-crossterm v0.1.0
718.81 s
> Compiling phf v0.13.1
718.81 s
> Compiling ratatui-macros v0.7.0
718.81 s
> Compiling deprecate-until v1.0.0
718.81 s
> Compiling string-template-plus v0.4.3
718.81 s
> Compiling shellexpand v3.1.2
718.81 s
> Compiling xpct v0.5.1
718.81 s
> Compiling brotli-decompressor v4.0.3
718.81 s
> Compiling integer-sqrt v0.1.5
718.81 s
> Compiling schemars_derive v1.2.1
718.81 s
> Compiling crossbeam-channel v0.5.15
718.81 s
> Compiling itertools v0.12.1
718.81 s
> Compiling include_dir_macros v0.7.4
718.81 s
> Compiling gammaloop-tracing-filter-macros v0.1.0 (/build/source/crates/gammaloop-tracing-filter-macros)
718.81 s
> Compiling addr2line v0.25.1
718.81 s
> Compiling symlink v0.1.0
718.81 s
> Compiling version-compare v0.2.1
718.81 s
> Compiling gammalooprs v0.3.4 (/build/source/crates/gammalooprs)
718.81 s
> Compiling unsafe-libyaml v0.2.11
718.81 s
> Compiling tracing-appender v0.2.5
718.81 s
> Compiling include_dir v0.7.4
718.81 s
> Compiling brotli v7.0.0
718.81 s
> Compiling pathfinding v4.15.0
718.81 s
> Compiling nalgebra v0.29.0
718.81 s
> Compiling ctrlc v3.5.2
718.81 s
> Compiling tracing-indicatif v0.3.14
718.81 s
> Compiling pyo3-stub-gen-derive v0.17.2
718.81 s
> Compiling rust-embed-impl v8.11.0
718.81 s
> Compiling ratatui v0.30.0
718.81 s
> Compiling json5 v0.4.1
718.81 s
> Compiling backtrace v0.3.76
718.81 s
> Compiling serde_yaml v0.9.34+deprecated
718.81 s
> Compiling strum_macros v0.26.4
718.81 s
> Compiling typed-index-collections v3.5.0
718.81 s
> Compiling vectorize v0.2.0
718.81 s
> Compiling clap_complete v4.6.3
718.81 s
> Compiling strip-ansi-escapes v0.2.1
718.81 s
> Compiling gammaloop-api v0.1.0 (/build/source/crates/gammaloop-api)
718.81 s
> Compiling fd-lock v4.0.4
718.81 s
> Compiling itertools v0.13.0
718.81 s
> Compiling ringbuffer v0.16.0
718.81 s
> Compiling color-eyre v0.6.5
718.81 s
> Compiling base62 v2.2.4
718.81 s
> Compiling strum v0.26.3
718.81 s
> Compiling clap_complete_nushell v4.6.0
718.81 s
> Compiling sysinfo v0.33.1
718.81 s
> Compiling schemars v1.2.1
718.81 s
> Compiling rust-embed v8.11.0
718.81 s
> Compiling reedline v0.42.0
718.81 s
> Compiling pyo3-stub-gen v0.17.2
718.81 s
> Compiling statrs v0.16.1
718.81 s
> Compiling momtrop v0.3.0
718.81 s
> Compiling numerica v3.0.0 (https://github.com/symbolica-dev/symbolica?rev=ba3737137c2a2ccd7bb39f0441837d38ec867e78#ba373713)
718.81 s
> Compiling graphica v3.0.0 (https://github.com/symbolica-dev/symbolica?rev=ba3737137c2a2ccd7bb39f0441837d38ec867e78#ba373713)
718.81 s
> Compiling symbolica-utils v0.1.0 (/build/source/crates/symbolica-utils)
718.81 s
> Compiling gammaloop-workspace-hack v0.1.0 (/build/source/crates/gammaloop-workspace-hack)
718.81 s
> Compiling spenso-macros v0.3.2 (/build/source/crates/spenso-macros)
718.81 s
> Compiling linnet v0.17.0 (/build/source/crates/linnet)
718.81 s
> Compiling spenso v0.6.0 (/build/source/crates/spenso)
718.81 s
> Compiling idenso v0.3.0 (/build/source/crates/idenso)
718.81 s
> Compiling gammaloop-tracing-filter v0.1.0 (/build/source/crates/gammaloop-tracing-filter)
718.81 s
> Compiling spenso-hep-lib v0.1.7 (/build/source/crates/spenso-hep-lib)
718.81 s
> Compiling alphal00p-docs-python-exporter v0.1.0 (/build/source/crates/alphal00p-docs-python-exporter)
718.81 s
> Finished `docs` profile [unoptimized] target(s) in 5m 43s
718.81 s
> +++ command cargo build --profile docs --locked -p alphal00p-docs-python-exporter --features linnet
718.81 s
> Compiling libc v0.2.186
718.81 s
> Compiling serde_core v1.0.228
718.81 s
> Compiling zerocopy v0.8.48
718.81 s
> Compiling log v0.4.29
718.81 s
> Compiling num-traits v0.2.19
718.81 s
> Compiling syn v1.0.109
718.81 s
> Compiling syn v2.0.117
718.81 s
> Compiling ahash v0.7.8
718.81 s
> Compiling bytecheck v0.6.12
718.81 s
> Compiling regex-syntax v0.8.10
718.81 s
> Compiling rend v0.4.2
718.81 s
> Compiling simdutf8 v0.1.5
718.81 s
> Compiling indexmap v2.14.0
718.81 s
> Compiling ahash v0.8.12
718.81 s
> Compiling figment v0.10.19
718.81 s
> Compiling cgmath v0.18.0
718.81 s
> Compiling either v1.15.0
718.81 s
> Compiling rkyv v0.7.46
718.81 s
> Compiling itertools v0.11.0
718.81 s
> Compiling bincode v2.0.1
718.81 s
> Compiling pyo3 v0.28.3
718.81 s
> Compiling venial v0.5.0
718.81 s
> Compiling seahash v4.1.0
718.81 s
> Compiling winnow v1.0.2
718.81 s
> Compiling arrayvec v0.7.6
718.81 s
> Compiling rustix v1.1.4
718.81 s
> Compiling smallvec v1.15.1
718.81 s
> Compiling bitflags v2.11.1
718.81 s
> Compiling polycool v0.4.0
718.81 s
> Compiling winnow v0.7.15
718.81 s
> Compiling toml_writer v1.1.1+spec-1.1.0
718.81 s
> Compiling linnet-py v0.1.0 (/build/source/crates/linnet-py)
718.81 s
> Compiling toml_parser v1.1.2+spec-1.1.0
718.81 s
> Compiling kurbo v0.13.1
718.81 s
> Compiling wasm-minimal-protocol v0.2.0
718.81 s
> Compiling num-integer v0.1.46
718.81 s
> Compiling approx v0.4.0
718.81 s
> Compiling chrono v0.4.44
718.81 s
> Compiling num-complex v0.4.6
718.81 s
> Compiling regex-automata v0.4.14
718.81 s
> Compiling num-bigint v0.4.6
718.81 s
> Compiling getrandom v0.2.17
718.81 s
> Compiling dirs-sys v0.5.0
718.81 s
> Compiling pyo3-ffi v0.28.3
718.81 s
> Compiling getrandom v0.4.2
718.81 s
> Compiling rand_core v0.6.4
718.81 s
> Compiling const-random-macro v0.1.16
718.81 s
> Compiling dirs v6.0.0
718.81 s
> Compiling shellexpand v3.1.2
718.81 s
> Compiling hashbrown v0.12.3
718.81 s
> Compiling const-random v0.1.18
718.81 s
> Compiling toml_datetime v0.7.5+spec-1.1.0
718.81 s
> Compiling serde_spanned v1.1.1
718.81 s
> Compiling serde_json v1.0.149
718.81 s
> Compiling tempfile v3.27.0
718.81 s
> Compiling toml v0.9.12+spec-1.1.0
718.81 s
> Compiling globset v0.4.18
718.81 s
> Compiling ptr_meta_derive v0.1.4
718.81 s
> Compiling bytecheck_derive v0.6.12
718.81 s
> Compiling rkyv_derive v0.7.46
718.81 s
> Compiling ppv-lite86 v0.2.21
718.81 s
> Compiling rand_chacha v0.3.1
718.81 s
> Compiling rust-embed-utils v8.11.0
718.81 s
> Compiling rand v0.8.6
718.81 s
> Compiling ptr_meta v0.1.4
718.81 s
> Compiling pest_generator v2.8.6
718.81 s
> Compiling proc-macro2-diagnostics v0.10.1
718.81 s
> Compiling pyo3-macros-backend v0.28.3
718.81 s
> Compiling phf_generator v0.11.3
718.81 s
> Compiling phf_codegen v0.11.3
718.81 s
> Compiling unicode_names2_generator v1.3.0
718.81 s
> Compiling rustpython-parser v0.4.0
718.81 s
> Compiling zerocopy-derive v0.8.48
718.81 s
> Compiling serde_derive v1.0.228
718.81 s
> Compiling is-macro v0.3.7
718.81 s
> Compiling thiserror-impl v2.0.18
718.81 s
> Compiling pest_derive v2.8.6
718.81 s
> Compiling duplicate v2.0.1
718.81 s
> Compiling bincode-trait-derive v0.1.1
718.81 s
> Compiling serde_repr v0.1.20
718.81 s
> Compiling rust-embed-impl v8.11.0
718.81 s
> Compiling unicode_names2 v1.3.0
718.81 s
> Compiling rustpython-parser-core v0.4.0
718.81 s
> Compiling rustpython-ast v0.4.0
718.81 s
> Compiling dot-parser v0.5.1
718.81 s
> Compiling rust-embed v8.11.0
718.81 s
> Compiling thiserror v2.0.18
718.81 s
> Compiling serde v1.0.228
718.81 s
> Compiling pyo3-macros v0.28.3
718.81 s
> Compiling bitvec v1.0.1
718.81 s
> Compiling half v2.7.1
718.81 s
> Compiling ciborium-ll v0.2.2
718.81 s
> Compiling ciborium v0.2.2
718.81 s
> Compiling kurvst v0.1.0 (/build/source/crates/kurvst)
718.81 s
> Compiling pyo3-stub-gen-derive v0.17.2
718.81 s
> Compiling linnet v0.17.0 (/build/source/crates/linnet)
718.81 s
> Compiling pyo3-stub-gen v0.17.2
718.81 s
> Compiling linnest v0.1.0 (/build/source/crates/linnest)
718.81 s
> Compiling alphal00p-docs-python-exporter v0.1.0 (/build/source/crates/alphal00p-docs-python-exporter)
718.81 s
> Finished `docs` profile [unoptimized] target(s) in 43.99s
718.81 s
> +++ command cargo build --profile docs --locked -p alphal00p-docs-python-exporter --features spenso
718.81 s
> Compiling pyo3-build-config v0.28.3
718.81 s
> Compiling symbolica v2.2.0 (https://github.com/symbolica-dev/symbolica?rev=ba3737137c2a2ccd7bb39f0441837d38ec867e78#ba373713)
718.81 s
> Compiling syn v1.0.109
718.81 s
> Compiling figment v0.10.19
718.81 s
> Compiling proc-macro-error v1.0.4
718.81 s
> Compiling duplicate v1.0.0
718.81 s
> Compiling pyo3-macros-backend v0.28.3
718.81 s
> Compiling numpy v0.28.0
718.81 s
> Compiling pyo3-ffi v0.28.3
718.81 s
> Compiling pyo3 v0.28.3
718.81 s
> Compiling pyo3-macros v0.28.3
718.81 s
> Compiling pyo3-stub-gen v0.17.2
718.81 s
> Compiling gammaloop-workspace-hack v0.1.0 (/build/source/crates/gammaloop-workspace-hack)
718.81 s
> Compiling numerica v3.0.0 (https://github.com/symbolica-dev/symbolica?rev=ba3737137c2a2ccd7bb39f0441837d38ec867e78#ba373713)
718.81 s
> Compiling graphica v3.0.0 (https://github.com/symbolica-dev/symbolica?rev=ba3737137c2a2ccd7bb39f0441837d38ec867e78#ba373713)
718.81 s
> Compiling symbolica-utils v0.1.0 (/build/source/crates/symbolica-utils)
718.81 s
> Compiling tymbolica-atom-payload v0.1.0 (https://github.com/lcnbr/tymbolica?rev=e85233dd3d99e5fb458913d0d49f99d83466025b#e85233dd)
718.81 s
> Compiling linnet v0.17.0 (/build/source/crates/linnet)
718.81 s
> Compiling spenso v0.6.0 (/build/source/crates/spenso)
718.81 s
> Compiling idenso v0.3.0 (/build/source/crates/idenso)
718.81 s
> Compiling spenso-hep-lib v0.1.7 (/build/source/crates/spenso-hep-lib)
718.81 s
> Compiling spynso3 v0.1.2 (/build/source/crates/spynso3)
718.81 s
> Compiling alphal00p-docs-python-exporter v0.1.0 (/build/source/crates/alphal00p-docs-python-exporter)
718.81 s
> Finished `docs` profile [unoptimized] target(s) in 1m 12s
718.81 s
> +++ command cargo build --profile docs --locked -p alphal00p-docs-python-exporter --features idenso
718.81 s
> Compiling pyo3 v0.28.3
718.81 s
> Compiling numpy v0.28.0
718.81 s
> Compiling pyo3-stub-gen v0.17.2
718.81 s
> Compiling numerica v3.0.0 (https://github.com/symbolica-dev/symbolica?rev=ba3737137c2a2ccd7bb39f0441837d38ec867e78#ba373713)
718.81 s
> Compiling graphica v3.0.0 (https://github.com/symbolica-dev/symbolica?rev=ba3737137c2a2ccd7bb39f0441837d38ec867e78#ba373713)
718.81 s
> Compiling symbolica v2.2.0 (https://github.com/symbolica-dev/symbolica?rev=ba3737137c2a2ccd7bb39f0441837d38ec867e78#ba373713)
718.81 s
> Compiling gammaloop-workspace-hack v0.1.0 (/build/source/crates/gammaloop-workspace-hack)
718.81 s
> Compiling symbolica-utils v0.1.0 (/build/source/crates/symbolica-utils)
718.81 s
> Compiling linnet v0.17.0 (/build/source/crates/linnet)
718.81 s
> Compiling spenso v0.6.0 (/build/source/crates/spenso)
718.81 s
> Compiling idenso v0.3.0 (/build/source/crates/idenso)
718.81 s
> Compiling alphal00p-docs-python-exporter v0.1.0 (/build/source/crates/alphal00p-docs-python-exporter)
718.81 s
> Finished `docs` profile [unoptimized] target(s) in 57.46s
718.81 s
> +++ command cargo build --profile docs --locked -p alphal00p-docs-python-exporter --features vakint
718.81 s
> Compiling libc v0.2.186
718.81 s
> Compiling tiny-keccak v2.0.2
718.81 s
> Compiling bytemuck v1.25.0
718.81 s
> Compiling matrixmultiply v0.3.10
718.81 s
> Compiling pyo3 v0.28.3
718.81 s
> Compiling getrandom v0.3.4
718.81 s
> Compiling pyo3-macros-backend v0.28.3
718.81 s
> Compiling regex-automata v0.4.14
718.81 s
> Compiling pyo3-ffi v0.28.3
718.81 s
> Compiling num-integer v0.1.46
718.81 s
> Compiling ahash v0.8.12
718.81 s
> Compiling approx v0.5.1
718.81 s
> Compiling serde v1.0.228
718.81 s
> Compiling itertools v0.14.0
718.81 s
> Compiling smallvec v1.15.1
718.81 s
> Compiling gmp-mpfr-sys v1.7.1
718.81 s
> Compiling safe_arch v0.7.4
718.81 s
> Compiling safe_arch v1.2.0
718.81 s
> Compiling rayon v1.12.0
718.81 s
> Compiling smartstring v1.0.1
718.81 s
> Compiling rand_core v0.9.5
718.81 s
> Compiling phf_shared v0.13.1
718.81 s
> Compiling wide v0.7.33
718.81 s
> Compiling rand_chacha v0.9.0
718.81 s
> Compiling tracing-attributes v0.1.31
718.81 s
> Compiling fastrand v2.4.1
718.81 s
> Compiling phf_generator v0.13.1
718.81 s
> Compiling symbolica v2.2.0 (https://github.com/symbolica-dev/symbolica?rev=ba3737137c2a2ccd7bb39f0441837d38ec867e78#ba373713)
718.81 s
> Compiling rug v1.30.0
718.81 s
> Compiling ndarray v0.17.2
718.81 s
> Compiling rand v0.9.4
718.81 s
> Compiling phf_macros v0.13.1
718.81 s
> Compiling directories v6.0.0
718.81 s
> Compiling subprocess v0.2.15
718.81 s
> Compiling vakint v0.1.2 (/build/source/crates/vakint)
718.81 s
> Compiling wide v1.7.0
718.81 s
> Compiling getrandom v0.2.17
718.81 s
> Compiling rand_core v0.6.4
718.81 s
> Compiling phf v0.13.1
718.81 s
> Compiling rand_chacha v0.3.1
718.81 s
> Compiling tracing v0.1.44
718.81 s
> Compiling rand v0.8.6
718.81 s
> Compiling simba v0.9.1
718.81 s
> Compiling phf_generator v0.11.3
718.81 s
> Compiling phf_codegen v0.11.3
718.81 s
> Compiling unicode_names2_generator v1.3.0
718.81 s
> Compiling rustpython-parser v0.4.0
718.81 s
> Compiling unicode_names2 v1.3.0
718.81 s
> Compiling matchers v0.2.0
718.81 s
> Compiling regex v1.12.3
718.81 s
> Compiling tracing-subscriber v0.3.23
718.81 s
> Compiling titlecase v2.2.1
718.81 s
> Compiling pyo3-macros v0.28.3
718.81 s
> Compiling string-template-plus v0.4.3
718.81 s
> Compiling xprec v0.2.2
718.81 s
> Compiling numpy v0.28.0
718.81 s
> Compiling pyo3-stub-gen-derive v0.17.2
718.81 s
> Compiling pyo3-stub-gen v0.17.2
718.81 s
> Compiling numerica v3.0.0 (https://github.com/symbolica-dev/symbolica?rev=ba3737137c2a2ccd7bb39f0441837d38ec867e78#ba373713)
718.81 s
> error : select an integer backend: `integer-gmp` or `integer-malachite`
718.81 s
> --> /nix/store/5dfb7akvi1k3080zqfndr6jw2ay3di2p-vendor-cargo-deps/f8c6b2c844a6fa8c330abb750e4cf5bbdb36a70140a58e87f6b79fb3024532aa/numerica-3.0.0/src/lib.rs:40:1
718.81 s
> |
718.81 s
> 40 | compile_error!("select an integer backend: `integer-gmp` or `integer-malachite`");
718.81 s
> | ^^^^^^^^^^^^^^^^^^^^^^^^^^^^^^^^^^^^^^^^^^^^^^^^^^^^^^^^^^^^^^^^^^^^^^^^^^^^^^^^^
718.81 s
>
718.81 s
> error : select a float backend: `float-mpfr` or `float-astro`
718.81 s
> --> /nix/store/5dfb7akvi1k3080zqfndr6jw2ay3di2p-vendor-cargo-deps/f8c6b2c844a6fa8c330abb750e4cf5bbdb36a70140a58e87f6b79fb3024532aa/numerica-3.0.0/src/lib.rs:44:1
718.81 s
> |
718.81 s
> 44 | compile_error!("select a float backend: `float-mpfr` or `float-astro`");
718.81 s
> | ^^^^^^^^^^^^^^^^^^^^^^^^^^^^^^^^^^^^^^^^^^^^^^^^^^^^^^^^^^^^^^^^^^^^^^^
718.81 s
>
718.81 s
> error[E0432] : unresolved import `implementation::BackendRandState`
718.81 s
> --> /nix/store/5dfb7akvi1k3080zqfndr6jw2ay3di2p-vendor-cargo-deps/f8c6b2c844a6fa8c330abb750e4cf5bbdb36a70140a58e87f6b79fb3024532aa/numerica-3.0.0/src/domains/backend/integer.rs:1614:33
718.81 s
> |
718.81 s
> 1614 | pub(crate) use implementation::{BackendRandState, Complete, RemRounding};
718.81 s
> | ^^^^^^^^^^^^^^^^ no `BackendRandState` in `domains::backend::integer::implementation`
718.81 s
> |
718.81 s
> note : found an item that was configured out
718.81 s
> --> /nix/store/5dfb7akvi1k3080zqfndr6jw2ay3di2p-vendor-cargo-deps/f8c6b2c844a6fa8c330abb750e4cf5bbdb36a70140a58e87f6b79fb3024532aa/numerica-3.0.0/src/domains/backend/integer.rs:1378:23
718.81 s
> |
718.81 s
> 1377 | #[cfg(feature = "integer-malachite")]
718.81 s
> | ----------------------------- the item is gated behind the `integer-malachite` feature
718.81 s
> 1378 | pub(crate) struct BackendRandState {
718.81 s
> | ^^^^^^^^^^^^^^^^
718.81 s
> note : found an item that was configured out
718.81 s
> --> /nix/store/5dfb7akvi1k3080zqfndr6jw2ay3di2p-vendor-cargo-deps/f8c6b2c844a6fa8c330abb750e4cf5bbdb36a70140a58e87f6b79fb3024532aa/numerica-3.0.0/src/domains/backend/integer.rs:1413:23
718.81 s
> |
718.81 s
> 1412 | #[cfg(feature = "integer-gmp")]
718.81 s
> | ----------------------- the item is gated behind the `integer-gmp` feature
718.81 s
> 1413 | pub(crate) struct BackendRandState(rug::rand::RandState<'static>);
718.81 s
> | ^^^^^^^^^^^^^^^^
718.81 s
>
718.81 s
> error[E0432] : unresolved import `implementation::RawMultiPrecisionInteger`
718.81 s
> --> /nix/store/5dfb7akvi1k3080zqfndr6jw2ay3di2p-vendor-cargo-deps/f8c6b2c844a6fa8c330abb750e4cf5bbdb36a70140a58e87f6b79fb3024532aa/numerica-3.0.0/src/domains/backend/integer.rs:1616:61
718.81 s
> |
718.81 s
> 1616 | MultiPrecisionInteger, ParseMultiPrecisionIntegerError, RawMultiPrecisionInteger,
718.81 s
> | ^^^^^^^^^^^^^^^^^^^^^^^^ no `RawMultiPrecisionInteger` in `domains::backend::integer::implementation`
718.81 s
> |
718.81 s
> note : found an item that was configured out
718.81 s
> --> /nix/store/5dfb7akvi1k3080zqfndr6jw2ay3di2p-vendor-cargo-deps/f8c6b2c844a6fa8c330abb750e4cf5bbdb36a70140a58e87f6b79fb3024532aa/numerica-3.0.0/src/domains/backend/integer.rs:26:14
718.81 s
> |
718.81 s
> 25 | #[cfg(feature = "integer-malachite")]
718.81 s
> | ----------------------------- the item is gated behind the `integer-malachite` feature
718.81 s
> 26 | pub type RawMultiPrecisionInteger = malachite_nz::integer::Integer;
718.81 s
> | ^^^^^^^^^^^^^^^^^^^^^^^^
718.81 s
> note : found an item that was configured out
718.81 s
> --> /nix/store/5dfb7akvi1k3080zqfndr6jw2ay3di2p-vendor-cargo-deps/f8c6b2c844a6fa8c330abb750e4cf5bbdb36a70140a58e87f6b79fb3024532aa/numerica-3.0.0/src/domains/backend/integer.rs:29:14
718.81 s
> |
718.81 s
> 28 | #[cfg(feature = "integer-gmp")]
718.81 s
> | ----------------------- the item is gated behind the `integer-gmp` feature
718.81 s
> 29 | pub type RawMultiPrecisionInteger = rug::Integer;
718.81 s
> | ^^^^^^^^^^^^^^^^^^^^^^^^
718.81 s
> help : a similar name exists in the module
718.81 s
> |
718.81 s
> 1616 - MultiPrecisionInteger, ParseMultiPrecisionIntegerError, RawMultiPrecisionInteger ,
718.81 s
> 1616 + MultiPrecisionInteger, ParseMultiPrecisionIntegerError, MultiPrecisionInteger ,
718.81 s
> |
718.81 s
>
718.81 s
> error[E0432] : unresolved imports `implementation::from_be_bytes`, `implementation::to_be_bytes`
718.81 s
> --> /nix/store/5dfb7akvi1k3080zqfndr6jw2ay3di2p-vendor-cargo-deps/f8c6b2c844a6fa8c330abb750e4cf5bbdb36a70140a58e87f6b79fb3024532aa/numerica-3.0.0/src/domains/backend/integer.rs:1709:33
718.81 s
> |
718.81 s
> 1709 | pub(crate) use implementation::{from_be_bytes, to_be_bytes};
718.81 s
> | ^^^^^^^^^^^^^ ^^^^^^^^^^^ no `to_be_bytes` in `domains::backend::integer::implementation`
718.81 s
> | |
718.81 s
> | no `from_be_bytes` in `domains::backend::integer::implementation`
718.81 s
> |
718.81 s
> note : found an item that was configured out
718.81 s
> --> /nix/store/5dfb7akvi1k3080zqfndr6jw2ay3di2p-vendor-cargo-deps/f8c6b2c844a6fa8c330abb750e4cf5bbdb36a70140a58e87f6b79fb3024532aa/numerica-3.0.0/src/domains/backend/integer.rs:1370:19
718.81 s
> |
718.81 s
> 1369 | #[cfg(all(feature = "integer-malachite", feature = "bincode"))]
718.81 s
> | ----------------------------- the item is gated behind the `integer-malachite` feature
718.81 s
> 1370 | pub(crate) fn from_be_bytes(bytes: &[u8]) -> Result<MultiPrecisionInteger, &'static str> {
718.81 s
> | ^^^^^^^^^^^^^
718.81 s
> note : found an item that was configured out
718.81 s
> --> /nix/store/5dfb7akvi1k3080zqfndr6jw2ay3di2p-vendor-cargo-deps/f8c6b2c844a6fa8c330abb750e4cf5bbdb36a70140a58e87f6b79fb3024532aa/numerica-3.0.0/src/domains/backend/integer.rs:1405:19
718.81 s
> |
718.81 s
> 1404 | #[cfg(all(feature = "integer-gmp", feature = "bincode"))]
718.81 s
> | ----------------------- the item is gated behind the `integer-gmp` feature
718.81 s
> 1405 | pub(crate) fn from_be_bytes(bytes: &[u8]) -> Result<MultiPrecisionInteger, &'static str> {
718.81 s
> | ^^^^^^^^^^^^^
718.81 s
> note : found an item that was configured out
718.81 s
> --> /nix/store/5dfb7akvi1k3080zqfndr6jw2ay3di2p-vendor-cargo-deps/f8c6b2c844a6fa8c330abb750e4cf5bbdb36a70140a58e87f6b79fb3024532aa/numerica-3.0.0/src/domains/backend/integer.rs:1365:19
718.81 s
> |
718.81 s
> 1364 | #[cfg(all(feature = "integer-malachite", feature = "bincode"))]
718.81 s
> | ----------------------------- the item is gated behind the `integer-malachite` feature
718.81 s
> 1365 | pub(crate) fn to_be_bytes(value: &MultiPrecisionInteger) -> Vec<u8> {
718.81 s
> | ^^^^^^^^^^^
718.81 s
> note : found an item that was configured out
718.81 s
> --> /nix/store/5dfb7akvi1k3080zqfndr6jw2ay3di2p-vendor-cargo-deps/f8c6b2c844a6fa8c330abb750e4cf5bbdb36a70140a58e87f6b79fb3024532aa/numerica-3.0.0/src/domains/backend/integer.rs:1400:19
718.81 s
> |
718.81 s
> 1399 | #[cfg(all(feature = "integer-gmp", feature = "bincode"))]
718.81 s
> | ----------------------- the item is gated behind the `integer-gmp` feature
718.81 s
> 1400 | pub(crate) fn to_be_bytes(value: &MultiPrecisionInteger) -> Vec<u8> {
718.81 s
> | ^^^^^^^^^^^
718.81 s
>
718.81 s
> error[E0432] : unresolved imports `crate::domains::backend::float::Assign`, `crate::domains::backend::float::CompleteRound`, `crate::domains::backend::float::Constant`, `crate::domains::backend::float::MultiPrecisionFloat`, `crate::domains::backend::float::Pow`
718.81 s
> --> /nix/store/5dfb7akvi1k3080zqfndr6jw2ay3di2p-vendor-cargo-deps/f8c6b2c844a6fa8c330abb750e4cf5bbdb36a70140a58e87f6b79fb3024532aa/numerica-3.0.0/src/domains/float/multiprecision.rs:15:9
718.81 s
> |
718.81 s
> 15 | Assign, CompleteRound, Constant, MultiPrecisionFloat, MultiPrecisionFloatInteger,
718.81 s
> | ^^^^^^ ^^^^^^^^^^^^^ ^^^^^^^^ ^^^^^^^^^^^^^^^^^^^ no `MultiPrecisionFloat` in `domains::backend::float`
718.81 s
> | | | |
718.81 s
> | | | no `Constant` in `domains::backend::float`
718.81 s
> | | no `CompleteRound` in `domains::backend::float`
718.81 s
> | no `Assign` in `domains::backend::float`
718.81 s
> 16 | MultiPrecisionFloatRational, MultiPrecisionFloatRounding, Pow, RoundingDirection,
718.81 s
> | ^^^ no `Pow` in `domains::backend::float`
718.81 s
> |
718.81 s
> note : found an item that was configured out
718.81 s
> --> /nix/store/5dfb7akvi1k3080zqfndr6jw2ay3di2p-vendor-cargo-deps/f8c6b2c844a6fa8c330abb750e4cf5bbdb36a70140a58e87f6b79fb3024532aa/numerica-3.0.0/src/domains/backend/float.rs:17:5
718.81 s
> |
718.81 s
> 15 | #[cfg(feature = "float-mpfr")]
718.81 s
> | ---------------------- the item is gated behind the `float-mpfr` feature
718.81 s
> 16 | pub use rug::{
718.81 s
> 17 | Assign, Float as MultiPrecisionFloat, Rational as BackendRational,
718.81 s
> | ^^^^^^
718.81 s
> note : found an item that was configured out
718.81 s
> --> /nix/store/5dfb7akvi1k3080zqfndr6jw2ay3di2p-vendor-cargo-deps/f8c6b2c844a6fa8c330abb750e4cf5bbdb36a70140a58e87f6b79fb3024532aa/numerica-3.0.0/src/domains/backend/float.rs:1561:5
718.81 s
> |
718.81 s
> 1559 | #[cfg(feature = "float-astro")]
718.81 s
> | ----------------------- the item is gated behind the `float-astro` feature
718.81 s
> 1560 | pub use astro::{
718.81 s
> 1561 | Assign, BackendRational, CompleteRound, Constant, IntoMultiPrecisionFloat, MultiPrecisionFloat,
718.81 s
> | ^^^^^^
718.81 s
> note : found an item that was configured out
718.81 s
> --> /nix/store/5dfb7akvi1k3080zqfndr6jw2ay3di2p-vendor-cargo-deps/f8c6b2c844a6fa8c330abb750e4cf5bbdb36a70140a58e87f6b79fb3024532aa/numerica-3.0.0/src/domains/backend/float.rs:19:11
718.81 s
> |
718.81 s
> 15 | #[cfg(feature = "float-mpfr")]
718.81 s
> | ---------------------- the item is gated behind the `float-mpfr` feature
718.81 s
> ...
718.81 s
> 19 | ops::{CompleteRound, Pow},
718.81 s
> | ^^^^^^^^^^^^^
718.81 s
> note : found an item that was configured out
718.81 s
> --> /nix/store/5dfb7akvi1k3080zqfndr6jw2ay3di2p-vendor-cargo-deps/f8c6b2c844a6fa8c330abb750e4cf5bbdb36a70140a58e87f6b79fb3024532aa/numerica-3.0.0/src/domains/backend/float.rs:1561:30
718.81 s
> |
718.81 s
> 1559 | #[cfg(feature = "float-astro")]
718.81 s
> | ----------------------- the item is gated behind the `float-astro` feature
718.81 s
> 1560 | pub use astro::{
718.81 s
> 1561 | Assign, BackendRational, CompleteRound, Constant, IntoMultiPrecisionFloat, MultiPrecisionFloat,
718.81 s
> | ^^^^^^^^^^^^^
718.81 s
> note : found an item that was configured out
718.81 s
> --> /nix/store/5dfb7akvi1k3080zqfndr6jw2ay3di2p-vendor-cargo-deps/f8c6b2c844a6fa8c330abb750e4cf5bbdb36a70140a58e87f6b79fb3024532aa/numerica-3.0.0/src/domains/backend/float.rs:18:12
718.81 s
> |
718.81 s
> 15 | #[cfg(feature = "float-mpfr")]
718.81 s
> | ---------------------- the item is gated behind the `float-mpfr` feature
718.81 s
> ...
718.81 s
> 18 | float::Constant,
718.81 s
> | ^^^^^^^^
718.81 s
> note : found an item that was configured out
718.81 s
> --> /nix/store/5dfb7akvi1k3080zqfndr6jw2ay3di2p-vendor-cargo-deps/f8c6b2c844a6fa8c330abb750e4cf5bbdb36a70140a58e87f6b79fb3024532aa/numerica-3.0.0/src/domains/backend/float.rs:1561:45
718.81 s
> |
718.81 s
> 1559 | #[cfg(feature = "float-astro")]
718.81 s
> | ----------------------- the item is gated behind the `float-astro` feature
718.81 s
> 1560 | pub use astro::{
718.81 s
> 1561 | Assign, BackendRational, CompleteRound, Constant, IntoMultiPrecisionFloat, MultiPrecisionFloat,
718.81 s
> | ^^^^^^^^
718.81 s
> note : found an item that was configured out
718.81 s
> --> /nix/store/5dfb7akvi1k3080zqfndr6jw2ay3di2p-vendor-cargo-deps/f8c6b2c844a6fa8c330abb750e4cf5bbdb36a70140a58e87f6b79fb3024532aa/numerica-3.0.0/src/domains/backend/float.rs:17:22
718.81 s
> |
718.81 s
> 15 | #[cfg(feature = "float-mpfr")]
718.81 s
> | ---------------------- the item is gated behind the `float-mpfr` feature
718.81 s
> 16 | pub use rug::{
718.81 s
> 17 | Assign, Float as MultiPrecisionFloat, Rational as BackendRational,
718.81 s
> | ^^^^^^^^^^^^^^^^^^^
718.81 s
> note : found an item that was configured out
718.81 s
> --> /nix/store/5dfb7akvi1k3080zqfndr6jw2ay3di2p-vendor-cargo-deps/f8c6b2c844a6fa8c330abb750e4cf5bbdb36a70140a58e87f6b79fb3024532aa/numerica-3.0.0/src/domains/backend/float.rs:1561:80
718.81 s
> |
718.81 s
> 1559 | #[cfg(feature = "float-astro")]
718.81 s
> | ----------------------- the item is gated behind the `float-astro` feature
718.81 s
> 1560 | pub use astro::{
718.81 s
> 1561 | Assign, BackendRational, CompleteRound, Constant, IntoMultiPrecisionFloat, MultiPrecisionFloat,
718.81 s
> | ^^^^^^^^^^^^^^^^^^^
718.81 s
> note : found an item that was configured out
718.81 s
> --> /nix/store/5dfb7akvi1k3080zqfndr6jw2ay3di2p-vendor-cargo-deps/f8c6b2c844a6fa8c330abb750e4cf5bbdb36a70140a58e87f6b79fb3024532aa/numerica-3.0.0/src/domains/backend/float.rs:19:26
718.81 s
> |
718.81 s
> 15 | #[cfg(feature = "float-mpfr")]
718.81 s
> | ---------------------- the item is gated behind the `float-mpfr` feature
718.81 s
> ...
718.81 s
> 19 | ops::{CompleteRound, Pow},
718.81 s
> | ^^^
718.81 s
> note : found an item that was configured out
718.81 s
> --> /nix/store/5dfb7akvi1k3080zqfndr6jw2ay3di2p-vendor-cargo-deps/f8c6b2c844a6fa8c330abb750e4cf5bbdb36a70140a58e87f6b79fb3024532aa/numerica-3.0.0/src/domains/backend/float.rs:1562:5
718.81 s
> |
718.81 s
> 1559 | #[cfg(feature = "float-astro")]
718.81 s
> | ----------------------- the item is gated behind the `float-astro` feature
718.81 s
> ...
718.81 s
> 1562 | Pow,
718.81 s
> | ^^^
718.81 s
>
718.81 s
> error[E0425] : cannot find type `RawMultiPrecisionInteger` in this scope
718.81 s
> --> /nix/store/5dfb7akvi1k3080zqfndr6jw2ay3di2p-vendor-cargo-deps/f8c6b2c844a6fa8c330abb750e4cf5bbdb36a70140a58e87f6b79fb3024532aa/numerica-3.0.0/src/domains/backend/integer.rs:52:38
718.81 s
> |
718.81 s
> 52 | pub struct MultiPrecisionInteger(RawMultiPrecisionInteger);
718.81 s
> | ^^^^^^^^^^^^^^^^^^^^^^^^ not found in this scope
718.81 s
>
718.81 s
> error[E0425] : cannot find type `RawMultiPrecisionInteger` in this scope
718.81 s
> --> /nix/store/5dfb7akvi1k3080zqfndr6jw2ay3di2p-vendor-cargo-deps/f8c6b2c844a6fa8c330abb750e4cf5bbdb36a70140a58e87f6b79fb3024532aa/numerica-3.0.0/src/domains/backend/integer.rs:52:38
718.81 s
> |
718.81 s
> 52 | pub struct MultiPrecisionInteger(RawMultiPrecisionInteger);
718.81 s
> | ^^^^^^^^^^^^^^^^^^^^^^^^ not found in this scope
718.81 s
> |
718.81 s
> help : you might be missing a type parameter
718.81 s
> |
718.81 s
> 52 | pub struct MultiPrecisionInteger<RawMultiPrecisionInteger> (RawMultiPrecisionInteger);
718.81 s
> | ++++++++++++++++++++++++++
718.81 s
>
718.81 s
> error[E0425] : cannot find type `RawMultiPrecisionInteger` in this scope
718.81 s
> --> /nix/store/5dfb7akvi1k3080zqfndr6jw2ay3di2p-vendor-cargo-deps/f8c6b2c844a6fa8c330abb750e4cf5bbdb36a70140a58e87f6b79fb3024532aa/numerica-3.0.0/src/domains/backend/integer.rs:149:32
718.81 s
> |
718.81 s
> 52 | pub struct MultiPrecisionInteger(RawMultiPrecisionInteger);
718.81 s
> | ----------------------------------------------------------- similarly named struct `MultiPrecisionInteger` defined here
718.81 s
> ...
718.81 s
> 149 | pub fn from_raw(value: RawMultiPrecisionInteger) -> Self {
718.81 s
> | ^^^^^^^^^^^^^^^^^^^^^^^^
718.81 s
> |
718.81 s
> help : a struct with a similar name exists
718.81 s
> |
718.81 s
> 149 - pub fn from_raw(value: RawMultiPrecisionInteger ) -> Self {
718.81 s
> 149 + pub fn from_raw(value: MultiPrecisionInteger ) -> Self {
718.81 s
> |
718.81 s
>
718.81 s
> error[E0425] : cannot find type `RawMultiPrecisionInteger` in this scope
718.81 s
> --> /nix/store/5dfb7akvi1k3080zqfndr6jw2ay3di2p-vendor-cargo-deps/f8c6b2c844a6fa8c330abb750e4cf5bbdb36a70140a58e87f6b79fb3024532aa/numerica-3.0.0/src/domains/backend/integer.rs:187:34
718.81 s
> |
718.81 s
> 52 | pub struct MultiPrecisionInteger(RawMultiPrecisionInteger);
718.81 s
> | ----------------------------------------------------------- similarly named struct `MultiPrecisionInteger` defined here
718.81 s
> ...
718.81 s
> 187 | pub fn as_raw(&self) -> &RawMultiPrecisionInteger {
718.81 s
> | ^^^^^^^^^^^^^^^^^^^^^^^^
718.81 s
> |
718.81 s
> help : a struct with a similar name exists
718.81 s
> |
718.81 s
> 187 - pub fn as_raw(&self) -> &RawMultiPrecisionInteger {
718.81 s
> 187 + pub fn as_raw(&self) -> &MultiPrecisionInteger {
718.81 s
> |
718.81 s
>
718.81 s
> error[E0425] : cannot find type `RawMultiPrecisionInteger` in this scope
718.81 s
> --> /nix/store/5dfb7akvi1k3080zqfndr6jw2ay3di2p-vendor-cargo-deps/f8c6b2c844a6fa8c330abb750e4cf5bbdb36a70140a58e87f6b79fb3024532aa/numerica-3.0.0/src/domains/backend/integer.rs:193:33
718.81 s
> |
718.81 s
> 52 | pub struct MultiPrecisionInteger(RawMultiPrecisionInteger);
718.81 s
> | ----------------------------------------------------------- similarly named struct `MultiPrecisionInteger` defined here
718.81 s
> ...
718.81 s
> 193 | pub fn to_raw(&self) -> RawMultiPrecisionInteger {
718.81 s
> | ^^^^^^^^^^^^^^^^^^^^^^^^
718.81 s
> |
718.81 s
> help : a struct with a similar name exists
718.81 s
> |
718.81 s
> 193 - pub fn to_raw(&self) -> RawMultiPrecisionInteger {
718.81 s
> 193 + pub fn to_raw(&self) -> MultiPrecisionInteger {
718.81 s
> |
718.81 s
>
718.81 s
> error[E0425] : cannot find type `RawMultiPrecisionInteger` in this scope
718.81 s
> --> /nix/store/5dfb7akvi1k3080zqfndr6jw2ay3di2p-vendor-cargo-deps/f8c6b2c844a6fa8c330abb750e4cf5bbdb36a70140a58e87f6b79fb3024532aa/numerica-3.0.0/src/domains/backend/integer.rs:199:34
718.81 s
> |
718.81 s
> 52 | pub struct MultiPrecisionInteger(RawMultiPrecisionInteger);
718.81 s
> | ----------------------------------------------------------- similarly named struct `MultiPrecisionInteger` defined here
718.81 s
> ...
718.81 s
> 199 | pub fn into_raw(self) -> RawMultiPrecisionInteger {
718.81 s
> | ^^^^^^^^^^^^^^^^^^^^^^^^
718.81 s
> |
718.81 s
> help : a struct with a similar name exists
718.81 s
> |
718.81 s
> 199 - pub fn into_raw(self) -> RawMultiPrecisionInteger {
718.81 s
> 199 + pub fn into_raw(self) -> MultiPrecisionInteger {
718.81 s
> |
718.81 s
>
718.81 s
> error[E0425] : cannot find type `RawMultiPrecisionInteger` in this scope
718.81 s
> --> /nix/store/5dfb7akvi1k3080zqfndr6jw2ay3di2p-vendor-cargo-deps/f8c6b2c844a6fa8c330abb750e4cf5bbdb36a70140a58e87f6b79fb3024532aa/numerica-3.0.0/src/domains/backend/integer.rs:567:27
718.81 s
> |
718.81 s
> 52 | pub struct MultiPrecisionInteger(RawMultiPrecisionInteger);
718.81 s
> | ----------------------------------------------------------- similarly named struct `MultiPrecisionInteger` defined here
718.81 s
> ...
718.81 s
> 567 | fn rem_trunc(lhs: RawMultiPrecisionInteger, rhs: RawMultiPrecisionInteger) -> Self {
718.81 s
> | ^^^^^^^^^^^^^^^^^^^^^^^^
718.81 s
> |
718.81 s
> help : a struct with a similar name exists
718.81 s
> |
718.81 s
> 567 - fn rem_trunc(lhs: RawMultiPrecisionInteger , rhs: RawMultiPrecisionInteger) -> Self {
718.81 s
> 567 + fn rem_trunc(lhs: MultiPrecisionInteger , rhs: RawMultiPrecisionInteger) -> Self {
718.81 s
> |
718.81 s
>
718.81 s
> error[E0425] : cannot find type `RawMultiPrecisionInteger` in this scope
718.81 s
> --> /nix/store/5dfb7akvi1k3080zqfndr6jw2ay3di2p-vendor-cargo-deps/f8c6b2c844a6fa8c330abb750e4cf5bbdb36a70140a58e87f6b79fb3024532aa/numerica-3.0.0/src/domains/backend/integer.rs:567:58
718.81 s
> |
718.81 s
> 52 | pub struct MultiPrecisionInteger(RawMultiPrecisionInteger);
718.81 s
> | ----------------------------------------------------------- similarly named struct `MultiPrecisionInteger` defined here
718.81 s
> ...
718.81 s
> 567 | fn rem_trunc(lhs: RawMultiPrecisionInteger, rhs: RawMultiPrecisionInteger) -> Self {
718.81 s
> | ^^^^^^^^^^^^^^^^^^^^^^^^
718.81 s
> |
718.81 s
> help : a struct with a similar name exists
718.81 s
> |
718.81 s
> 567 - fn rem_trunc(lhs: RawMultiPrecisionInteger, rhs: RawMultiPrecisionInteger ) -> Self {
718.81 s
> 567 + fn rem_trunc(lhs: RawMultiPrecisionInteger, rhs: MultiPrecisionInteger ) -> Self {
718.81 s
> |
718.81 s
>
718.81 s
> error[E0425] : cannot find type `RawMultiPrecisionInteger` in this scope
718.81 s
> --> /nix/store/5dfb7akvi1k3080zqfndr6jw2ay3di2p-vendor-cargo-deps/f8c6b2c844a6fa8c330abb750e4cf5bbdb36a70140a58e87f6b79fb3024532aa/numerica-3.0.0/src/domains/backend/integer.rs:582:27
718.81 s
> |
718.81 s
> 52 | pub struct MultiPrecisionInteger(RawMultiPrecisionInteger);
718.81 s
> | ----------------------------------------------------------- similarly named struct `MultiPrecisionInteger` defined here
718.81 s
> ...
718.81 s
> 582 | fn shl_raw(value: RawMultiPrecisionInteger, rhs: u64) -> RawMultiPrecisionInteger {
718.81 s
> | ^^^^^^^^^^^^^^^^^^^^^^^^
718.81 s
> |
718.81 s
> help : a struct with a similar name exists
718.81 s
> |
718.81 s
> 582 - fn shl_raw(value: RawMultiPrecisionInteger , rhs: u64) -> RawMultiPrecisionInteger {
718.81 s
> 582 + fn shl_raw(value: MultiPrecisionInteger , rhs: u64) -> RawMultiPrecisionInteger {
718.81 s
> |
718.81 s
>
718.81 s
> error[E0425] : cannot find type `RawMultiPrecisionInteger` in this scope
718.81 s
> --> /nix/store/5dfb7akvi1k3080zqfndr6jw2ay3di2p-vendor-cargo-deps/f8c6b2c844a6fa8c330abb750e4cf5bbdb36a70140a58e87f6b79fb3024532aa/numerica-3.0.0/src/domains/backend/integer.rs:582:66
718.81 s
> |
718.81 s
> 52 | pub struct MultiPrecisionInteger(RawMultiPrecisionInteger);
718.81 s
> | ----------------------------------------------------------- similarly named struct `MultiPrecisionInteger` defined here
718.81 s
> ...
718.81 s
> 582 | fn shl_raw(value: RawMultiPrecisionInteger, rhs: u64) -> RawMultiPrecisionInteger {
718.81 s
> | ^^^^^^^^^^^^^^^^^^^^^^^^
718.81 s
> |
718.81 s
> help : a struct with a similar name exists
718.81 s
> |
718.81 s
> 582 - fn shl_raw(value: RawMultiPrecisionInteger, rhs: u64) -> RawMultiPrecisionInteger {
718.81 s
> 582 + fn shl_raw(value: RawMultiPrecisionInteger, rhs: u64) -> MultiPrecisionInteger {
718.81 s
> |
718.81 s
>
718.81 s
> error[E0425] : cannot find type `RawMultiPrecisionInteger` in this scope
718.81 s
> --> /nix/store/5dfb7akvi1k3080zqfndr6jw2ay3di2p-vendor-cargo-deps/f8c6b2c844a6fa8c330abb750e4cf5bbdb36a70140a58e87f6b79fb3024532aa/numerica-3.0.0/src/domains/backend/integer.rs:590:27
718.81 s
> |
718.81 s
> 52 | pub struct MultiPrecisionInteger(RawMultiPrecisionInteger);
718.81 s
> | ----------------------------------------------------------- similarly named struct `MultiPrecisionInteger` defined here
718.81 s
> ...
718.81 s
> 590 | fn shr_raw(value: RawMultiPrecisionInteger, rhs: u64) -> RawMultiPrecisionInteger {
718.81 s
> | ^^^^^^^^^^^^^^^^^^^^^^^^
718.81 s
> |
718.81 s
> help : a struct with a similar name exists
718.81 s
> |
718.81 s
> 590 - fn shr_raw(value: RawMultiPrecisionInteger , rhs: u64) -> RawMultiPrecisionInteger {
718.81 s
> 590 + fn shr_raw(value: MultiPrecisionInteger , rhs: u64) -> RawMultiPrecisionInteger {
718.81 s
> |
718.81 s
>
718.81 s
> error[E0425] : cannot find type `RawMultiPrecisionInteger` in this scope
718.81 s
> --> /nix/store/5dfb7akvi1k3080zqfndr6jw2ay3di2p-vendor-cargo-deps/f8c6b2c844a6fa8c330abb750e4cf5bbdb36a70140a58e87f6b79fb3024532aa/numerica-3.0.0/src/domains/backend/integer.rs:590:66
718.81 s
> |
718.81 s
> 52 | pub struct MultiPrecisionInteger(RawMultiPrecisionInteger);
718.81 s
> | ----------------------------------------------------------- similarly named struct `MultiPrecisionInteger` defined here
718.81 s
> ...
718.81 s
> 590 | fn shr_raw(value: RawMultiPrecisionInteger, rhs: u64) -> RawMultiPrecisionInteger {
718.81 s
> | ^^^^^^^^^^^^^^^^^^^^^^^^
718.81 s
> |
718.81 s
> help : a struct with a similar name exists
718.81 s
> |
718.81 s
> 590 - fn shr_raw(value: RawMultiPrecisionInteger, rhs: u64) -> RawMultiPrecisionInteger {
718.81 s
> 590 + fn shr_raw(value: RawMultiPrecisionInteger, rhs: u64) -> MultiPrecisionInteger {
718.81 s
> |
718.81 s
>
718.81 s
> error[E0425] : cannot find type `RawMultiPrecisionInteger` in this scope
718.81 s
> --> /nix/store/5dfb7akvi1k3080zqfndr6jw2ay3di2p-vendor-cargo-deps/f8c6b2c844a6fa8c330abb750e4cf5bbdb36a70140a58e87f6b79fb3024532aa/numerica-3.0.0/src/domains/backend/integer.rs:654:15
718.81 s
> |
718.81 s
> 52 | pub struct MultiPrecisionInteger(RawMultiPrecisionInteger);
718.81 s
> | ----------------------------------------------------------- similarly named struct `MultiPrecisionInteger` defined here
718.81 s
> ...
718.81 s
> 654 | impl From<RawMultiPrecisionInteger> for MultiPrecisionInteger {
718.81 s
> | ^^^^^^^^^^^^^^^^^^^^^^^^
718.81 s
> |
718.81 s
> help : a struct with a similar name exists
718.81 s
> |
718.81 s
> 654 - impl From<RawMultiPrecisionInteger > for MultiPrecisionInteger {
718.81 s
> 654 + impl From<MultiPrecisionInteger > for MultiPrecisionInteger {
718.81 s
> |
718.81 s
> help : you might be missing a type parameter
718.81 s
> |
718.81 s
> 654 | impl<RawMultiPrecisionInteger> From<RawMultiPrecisionInteger> for MultiPrecisionInteger {
718.81 s
> | ++++++++++++++++++++++++++
718.81 s
>
718.81 s
> error[E0425] : cannot find type `RawMultiPrecisionInteger` in this scope
718.81 s
> --> /nix/store/5dfb7akvi1k3080zqfndr6jw2ay3di2p-vendor-cargo-deps/f8c6b2c844a6fa8c330abb750e4cf5bbdb36a70140a58e87f6b79fb3024532aa/numerica-3.0.0/src/domains/backend/integer.rs:656:24
718.81 s
> |
718.81 s
> 52 | pub struct MultiPrecisionInteger(RawMultiPrecisionInteger);
718.81 s
> | ----------------------------------------------------------- similarly named struct `MultiPrecisionInteger` defined here
718.81 s
> ...
718.81 s
> 656 | fn from(value: RawMultiPrecisionInteger) -> Self {
718.81 s
> | ^^^^^^^^^^^^^^^^^^^^^^^^
718.81 s
> |
718.81 s
> help : a struct with a similar name exists
718.81 s
> |
718.81 s
> 656 - fn from(value: RawMultiPrecisionInteger ) -> Self {
718.81 s
> 656 + fn from(value: MultiPrecisionInteger ) -> Self {
718.81 s
> |
718.81 s
>
718.81 s
> error[E0425] : cannot find type `RawMultiPrecisionInteger` in this scope
718.81 s
> --> /nix/store/5dfb7akvi1k3080zqfndr6jw2ay3di2p-vendor-cargo-deps/f8c6b2c844a6fa8c330abb750e4cf5bbdb36a70140a58e87f6b79fb3024532aa/numerica-3.0.0/src/domains/backend/integer.rs:661:42
718.81 s
> |
718.81 s
> 52 | pub struct MultiPrecisionInteger(RawMultiPrecisionInteger);
718.81 s
> | ----------------------------------------------------------- similarly named struct `MultiPrecisionInteger` defined here
718.81 s
> ...
718.81 s
> 661 | impl From<MultiPrecisionInteger> for RawMultiPrecisionInteger {
718.81 s
> | ^^^^^^^^^^^^^^^^^^^^^^^^
718.81 s
> |
718.81 s
> help : a struct with a similar name exists
718.81 s
> |
718.81 s
> 661 - impl From<MultiPrecisionInteger> for RawMultiPrecisionInteger {
718.81 s
> 661 + impl From<MultiPrecisionInteger> for MultiPrecisionInteger {
718.81 s
> |
718.81 s
>
718.81 s
> error[E0433] : cannot find type `RawMultiPrecisionInteger` in this scope
718.81 s
> --> /nix/store/5dfb7akvi1k3080zqfndr6jw2ay3di2p-vendor-cargo-deps/f8c6b2c844a6fa8c330abb750e4cf5bbdb36a70140a58e87f6b79fb3024532aa/numerica-3.0.0/src/domains/backend/integer.rs:620:13
718.81 s
> |
718.81 s
> 620 | RawMultiPrecisionInteger::from_str(s)
718.81 s
> | ^^^^^^^^^^^^^^^^^^^^^^^^ use of undeclared type `RawMultiPrecisionInteger`
718.81 s
> |
718.81 s
> help : a struct with a similar name exists
718.81 s
> |
718.81 s
> 620 - RawMultiPrecisionInteger ::from_str(s)
718.81 s
> 620 + MultiPrecisionInteger ::from_str(s)
718.81 s
> |
718.81 s
>
718.81 s
> error[E0433] : cannot find type `RawMultiPrecisionInteger` in this scope
718.81 s
> --> /nix/store/5dfb7akvi1k3080zqfndr6jw2ay3di2p-vendor-cargo-deps/f8c6b2c844a6fa8c330abb750e4cf5bbdb36a70140a58e87f6b79fb3024532aa/numerica-3.0.0/src/domains/backend/integer.rs:674:35
718.81 s
> |
718.81 s
> 674 | self.0 == RawMultiPrecisionInteger::from(*other)
718.81 s
> | ^^^^^^^^^^^^^^^^^^^^^^^^ use of undeclared type `RawMultiPrecisionInteger`
718.81 s
> ...
718.81 s
> 702 | impl_cmp_primitive!(i32, i64, i128, u32, u64, u128);
718.81 s
> | --------------------------------------------------- in this macro invocation
718.81 s
> |
718.81 s
> = note : this error originates in the macro `impl_cmp_primitive` (in Nightly builds, run with -Z macro-backtrace for more info)
718.81 s
> help : a struct with a similar name exists
718.81 s
> |
718.81 s
> 674 - self.0 == RawMultiPrecisionInteger ::from(*other)
718.81 s
> 674 + self.0 == MultiPrecisionInteger ::from(*other)
718.81 s
> |
718.81 s
>
718.81 s
> error[E0433] : cannot find type `RawMultiPrecisionInteger` in this scope
718.81 s
> --> /nix/store/5dfb7akvi1k3080zqfndr6jw2ay3di2p-vendor-cargo-deps/f8c6b2c844a6fa8c330abb750e4cf5bbdb36a70140a58e87f6b79fb3024532aa/numerica-3.0.0/src/domains/backend/integer.rs:681:25
718.81 s
> |
718.81 s
> 681 | RawMultiPrecisionInteger::from(*self) == other.0
718.81 s
> | ^^^^^^^^^^^^^^^^^^^^^^^^ use of undeclared type `RawMultiPrecisionInteger`
718.81 s
> ...
718.81 s
> 702 | impl_cmp_primitive!(i32, i64, i128, u32, u64, u128);
718.81 s
> | --------------------------------------------------- in this macro invocation
718.81 s
> |
718.81 s
> = note : this error originates in the macro `impl_cmp_primitive` (in Nightly builds, run with -Z macro-backtrace for more info)
718.81 s
> help : a struct with a similar name exists
718.81 s
> |
718.81 s
> 681 - RawMultiPrecisionInteger ::from(*self) == other.0
718.81 s
> 681 + MultiPrecisionInteger ::from(*self) == other.0
718.81 s
> |
718.81 s
>
718.81 s
> error[E0433] : cannot find type `RawMultiPrecisionInteger` in this scope
718.81 s
> --> /nix/store/5dfb7akvi1k3080zqfndr6jw2ay3di2p-vendor-cargo-deps/f8c6b2c844a6fa8c330abb750e4cf5bbdb36a70140a58e87f6b79fb3024532aa/numerica-3.0.0/src/domains/backend/integer.rs:688:45
718.81 s
> |
718.81 s
> 688 | self.0.partial_cmp(&RawMultiPrecisionInteger::from(*other))
718.81 s
> | ^^^^^^^^^^^^^^^^^^^^^^^^ use of undeclared type `RawMultiPrecisionInteger`
718.81 s
> ...
718.81 s
> 702 | impl_cmp_primitive!(i32, i64, i128, u32, u64, u128);
718.81 s
> | --------------------------------------------------- in this macro invocation
718.81 s
> |
718.81 s
> = note : this error originates in the macro `impl_cmp_primitive` (in Nightly builds, run with -Z macro-backtrace for more info)
718.81 s
> help : a struct with a similar name exists
718.81 s
> |
718.81 s
> 688 - self.0.partial_cmp(&RawMultiPrecisionInteger ::from(*other))
718.81 s
> 688 + self.0.partial_cmp(&MultiPrecisionInteger ::from(*other))
718.81 s
> |
718.81 s
>
718.81 s
> error[E0433] : cannot find type `RawMultiPrecisionInteger` in this scope
718.81 s
> --> /nix/store/5dfb7akvi1k3080zqfndr6jw2ay3di2p-vendor-cargo-deps/f8c6b2c844a6fa8c330abb750e4cf5bbdb36a70140a58e87f6b79fb3024532aa/numerica-3.0.0/src/domains/backend/integer.rs:695:25
718.81 s
> |
718.81 s
> 695 | RawMultiPrecisionInteger::from(*self).partial_cmp(&other.0)
718.81 s
> | ^^^^^^^^^^^^^^^^^^^^^^^^ use of undeclared type `RawMultiPrecisionInteger`
718.81 s
> ...
718.81 s
> 702 | impl_cmp_primitive!(i32, i64, i128, u32, u64, u128);
718.81 s
> | --------------------------------------------------- in this macro invocation
718.81 s
> |
718.81 s
> = note : this error originates in the macro `impl_cmp_primitive` (in Nightly builds, run with -Z macro-backtrace for more info)
718.81 s
> help : a struct with a similar name exists
718.81 s
> |
718.81 s
> 695 - RawMultiPrecisionInteger ::from(*self).partial_cmp(&other.0)
718.81 s
> 695 + MultiPrecisionInteger ::from(*self).partial_cmp(&other.0)
718.81 s
> |
718.81 s
>
718.81 s
> error[E0433] : cannot find type `RawMultiPrecisionInteger` in this scope
718.81 s
> --> /nix/store/5dfb7akvi1k3080zqfndr6jw2ay3di2p-vendor-cargo-deps/f8c6b2c844a6fa8c330abb750e4cf5bbdb36a70140a58e87f6b79fb3024532aa/numerica-3.0.0/src/domains/backend/integer.rs:1180:35
718.81 s
> |
718.81 s
> 1180 | MultiPrecisionInteger(RawMultiPrecisionInteger::from((&self.0) & &rhs.0))
718.81 s
> | ^^^^^^^^^^^^^^^^^^^^^^^^ use of undeclared type `RawMultiPrecisionInteger`
718.81 s
> |
718.81 s
> help : a struct with a similar name exists
718.81 s
> |
718.81 s
> 1180 - MultiPrecisionInteger(RawMultiPrecisionInteger ::from((&self.0) & &rhs.0))
718.81 s
> 1180 + MultiPrecisionInteger(MultiPrecisionInteger ::from((&self.0) & &rhs.0))
718.81 s
> |
718.81 s
>
718.81 s
> error[E0433] : cannot find type `RawMultiPrecisionInteger` in this scope
718.81 s
> --> /nix/store/5dfb7akvi1k3080zqfndr6jw2ay3di2p-vendor-cargo-deps/f8c6b2c844a6fa8c330abb750e4cf5bbdb36a70140a58e87f6b79fb3024532aa/numerica-3.0.0/src/domains/backend/integer.rs:1212:35
718.81 s
> |
718.81 s
> 1212 | MultiPrecisionInteger(RawMultiPrecisionInteger::from(-&self.0))
718.81 s
> | ^^^^^^^^^^^^^^^^^^^^^^^^ use of undeclared type `RawMultiPrecisionInteger`
718.81 s
> |
718.81 s
> help : a struct with a similar name exists
718.81 s
> |
718.81 s
> 1212 - MultiPrecisionInteger(RawMultiPrecisionInteger ::from(-&self.0))
718.81 s
> 1212 + MultiPrecisionInteger(MultiPrecisionInteger ::from(-&self.0))
718.81 s
> |
718.81 s
>
718.81 s
> error[E0425] : cannot find function `write_lsf_bytes` in this scope
718.81 s
> --> /nix/store/5dfb7akvi1k3080zqfndr6jw2ay3di2p-vendor-cargo-deps/f8c6b2c844a6fa8c330abb750e4cf5bbdb36a70140a58e87f6b79fb3024532aa/numerica-3.0.0/src/domains/backend/integer.rs:1682:5
718.81 s
> |
718.81 s
> 1682 | write_lsf_bytes(value, &mut bytes);
718.81 s
> | ^^^^^^^^^^^^^^^ not found in this scope
718.81 s
>
718.81 s
> Some errors have detailed explanations: E0425, E0432, E0433.
718.81 s
> For more information about an error, try `rustc --explain E0425`.
718.81 s
> error : could not compile `numerica` (lib) due to 29 previous errors
718.81 s
> warning : build failed, waiting for other jobs to finish...
718.81 s
For full logs, run:
718.81 s
nix log /nix/store/623idw7bxrdblwflbqi3k630cvnna0if-alphal00p-docs-cargo-0.1.0.drv
718.84 s
Build failed.