52.29 sgammaloop-nextest-core> The application panicked (crashed).
52.29 sgammaloop-nextest-core> Message: called `Result::unwrap()` on an `Err` value: Custom { kind: Other, error: "Could not compile code: g++ -shared -O3 -fPIC -ffast-math -funsafe-math-optimizations -march=native -o /build/gammaloop-native-thermal-1616/thermal_0_0.so /build/gammaloop-native-thermal-1616/thermal_0_0.cpp\nwarning: Skipping impure flag -march=native because NIX_ENFORCE_NO_NATIVE is set\n/build/gammaloop-native-thermal-1616/thermal_0_0.cpp: In function 'void thermal_realf64(const double*, double*, double*)':\n/build/gammaloop-native-thermal-1616/thermal_0_0.cpp:27:16: error: 'symbolica_tanh' was not declared in this scope\n 27 | Z[6] = symbolica_tanh(Z[6]);\n | ^~~~~~~~~~~~~~\n" }
53.42 sgammaloop-nextest-core> The application panicked (crashed).
53.42 sgammaloop-nextest-core> Message: called `Result::unwrap()` on an `Err` value:
53.42 sgammaloop-nextest-core> 0: Could not compile code: g++ -shared -O2 -fPIC -march=native -o /build/gammaloop-hyperbolic-c++-53-false-1957/hyperbolic.so /build/gammaloop-hyperbolic-c++-53-false-1957/hyperbolic.cpp
53.42 sgammaloop-nextest-core> warning: Skipping impure flag -march=native because NIX_ENFORCE_NO_NATIVE is set
53.42 sgammaloop-nextest-core> /build/gammaloop-hyperbolic-c++-53-false-1957/hyperbolic.cpp: In instantiation of 'void hyperbolic_complexf64_gen(T*, T*, T*) [with T = std::complex<double>]':
53.42 sgammaloop-nextest-core> /build/gammaloop-hyperbolic-c++-53-false-1957/hyperbolic.cpp:60:28: required from here
53.42 sgammaloop-nextest-core> /build/gammaloop-hyperbolic-c++-53-false-1957/hyperbolic.cpp:17:30: error: 'symbolica_sinh' was not declared in this scope
53.42 sgammaloop-nextest-core> /build/gammaloop-hyperbolic-c++-53-false-1957/hyperbolic.cpp:18:30: error: 'symbolica_cosh' was not declared in this scope
53.42 sgammaloop-nextest-core> /build/gammaloop-hyperbolic-c++-53-false-1957/hyperbolic.cpp:19:30: error: 'symbolica_tanh' was not declared in this scope
53.42 sgammaloop-nextest-core> /build/gammaloop-hyperbolic-c++-53-false-1957/hyperbolic.cpp:20:30: error: 'symbolica_sech' was not declared in this scope
53.42 sgammaloop-nextest-core> /build/gammaloop-hyperbolic-c++-53-false-1957/hyperbolic.cpp:23:31: error: 'symbolica_coth' was not declared in this scope
53.42 sgammaloop-nextest-core> /build/gammaloop-hyperbolic-c++-53-false-1957/hyperbolic.cpp:24:31: error: 'symbolica_csch' was not declared in this scope
53.53 sgammaloop-nextest-core> The application panicked (crashed).
53.53 sgammaloop-nextest-core> Message: called `Result::unwrap()` on an `Err` value:
53.53 sgammaloop-nextest-core> 0: Could not compile code: g++ -shared -O2 -fPIC -ffast-math -funsafe-math-optimizations -march=native -o /build/gammaloop-hyperbolic-c++-53-true-1950/hyperbolic.so /build/gammaloop-hyperbolic-c++-53-true-1950/hyperbolic.cpp
53.53 sgammaloop-nextest-core> warning: Skipping impure flag -march=native because NIX_ENFORCE_NO_NATIVE is set
53.53 sgammaloop-nextest-core> /build/gammaloop-hyperbolic-c++-53-true-1950/hyperbolic.cpp: In instantiation of 'void hyperbolic_complexf64_gen(T*, T*, T*) [with T = std::complex<double>]':
53.53 sgammaloop-nextest-core> /build/gammaloop-hyperbolic-c++-53-true-1950/hyperbolic.cpp:60:28: required from here
53.53 sgammaloop-nextest-core> /build/gammaloop-hyperbolic-c++-53-true-1950/hyperbolic.cpp:17:30: error: 'symbolica_sinh' was not declared in this scope
53.53 sgammaloop-nextest-core> /build/gammaloop-hyperbolic-c++-53-true-1950/hyperbolic.cpp:18:30: error: 'symbolica_cosh' was not declared in this scope
53.53 sgammaloop-nextest-core> /build/gammaloop-hyperbolic-c++-53-true-1950/hyperbolic.cpp:19:30: error: 'symbolica_tanh' was not declared in this scope
53.53 sgammaloop-nextest-core> /build/gammaloop-hyperbolic-c++-53-true-1950/hyperbolic.cpp:20:30: error: 'symbolica_sech' was not declared in this scope
53.53 sgammaloop-nextest-core> /build/gammaloop-hyperbolic-c++-53-true-1950/hyperbolic.cpp:23:31: error: 'symbolica_coth' was not declared in this scope
53.53 sgammaloop-nextest-core> /build/gammaloop-hyperbolic-c++-53-true-1950/hyperbolic.cpp:24:31: error: 'symbolica_csch' was not declared in this scope
60.50 sgammaloop-nextest-core> infinite real part: coth d0: 8 failures; first z=(inf 0), re: got NaN, expected 1.000000000000000e0, error=NaN, tolerance=2.84e-14; unexpected nonfinite result
60.50 sgammaloop-nextest-core> infinite real part: tanh d0: 4 failures; first z=(inf 0), re: got NaN, expected 1.000000000000000e0, error=NaN, tolerance=2.84e-14; unexpected nonfinite result
60.50 sgammaloop-nextest-core> near poles: coth d0: 160 failures; first z=(-9.7656250e-4 -4.7123890e0), re: got -9.765621895971165e-4, expected -9.765621895592603e-4, error=-3.79e-14, tolerance=2.78e-17; component accuracy
60.50 sgammaloop-nextest-core> near poles: csch d0: 8 failures; first z=(-9.3326362e-302 0), re: got -inf, expected -1.071508607186267e301, error=-inf, tolerance=3.05e287; unexpected nonfinite result
60.50 sgammaloop-nextest-core> near poles: tanh d0: 152 failures; first z=(-9.7656250e-4 -4.7123890e0), re: got -1.024000325481117e3, expected -1.024000325520813e3, error=3.97e-8, tolerance=2.91e-11; component accuracy
60.50 sgammaloop-nextest-core> pole neighbors: coth d0: 26 failures; first z=(0 -4.7123890e0), re: got NaN, expected 0, error=NaN, tolerance=9.88e-324; unexpected nonfinite result
60.50 sgammaloop-nextest-core> pole neighbors: csch d0: 2 failures; first z=(0 -4.9406565e-324), re: got NaN, expected 0, error=NaN, tolerance=9.88e-324; unexpected nonfinite result
60.50 sgammaloop-nextest-core> pole neighbors: tanh d0: 24 failures; first z=(0 -4.7123890e0), re: got NaN, expected 0, error=NaN, tolerance=9.88e-324; unexpected nonfinite result
60.50 sgammaloop-nextest-core> range boundary: cosh d0: 58 failures; first z=(-7.1100000e2 0), im: got NaN, expected -0, error=NaN, tolerance=9.88e-324; unexpected nonfinite result
60.50 sgammaloop-nextest-core> range boundary: coth d0: 480 failures; first z=(-3.5600000e2 0), re: got NaN, expected -1.000000000000000e0, error=NaN, tolerance=2.84e-14; unexpected nonfinite result
60.50 sgammaloop-nextest-core> range boundary: csch d0: 308 failures; first z=(-3.5600000e2 0), re: got -0, expected -4.922598761629717e-155, error=4.92e-155, tolerance=2.47e-324; premature zero
60.50 sgammaloop-nextest-core> range boundary: sech d0: 308 failures; first z=(-3.5600000e2 0), re: got 0, expected 4.922598761629717e-155, error=-4.92e-155, tolerance=2.47e-324; premature zero
60.50 sgammaloop-nextest-core> range boundary: sinh d0: 58 failures; first z=(-7.1100000e2 0), im: got NaN, expected 0, error=NaN, tolerance=9.88e-324; unexpected nonfinite result
60.50 sgammaloop-nextest-core> range boundary: tanh d0: 268 failures; first z=(-3.5600000e2 0), re: got NaN, expected -1.000000000000000e0, error=NaN, tolerance=2.84e-14; unexpected nonfinite result
60.50 sgammaloop-nextest-core> tiny: coth d0: 68 failures; first z=(-2.4099199e-181 0), re: got -inf, expected -4.149515568880993e180, error=-inf, tolerance=1.18e167; unexpected nonfinite result
60.50 sgammaloop-nextest-core> tiny: csch d0: 68 failures; first z=(-2.4099199e-181 0), re: got -inf, expected -4.149515568880993e180, error=-inf, tolerance=1.18e167; unexpected nonfinite result
60.89 sgammaloop-nextest-core> infinite real part: coth d0: 8 failures; first z=(inf 0), re: got NaN, expected 1.000000000000000e0, error=NaN, tolerance=2.84e-14; unexpected nonfinite result
60.89 sgammaloop-nextest-core> infinite real part: tanh d0: 4 failures; first z=(inf 0), re: got NaN, expected 1.000000000000000e0, error=NaN, tolerance=2.84e-14; unexpected nonfinite result
60.89 sgammaloop-nextest-core> near poles: coth d0: 160 failures; first z=(-9.7656250e-4 -4.7123890e0), re: got -9.765621895971165e-4, expected -9.765621895592603e-4, error=-3.79e-14, tolerance=2.78e-17; component accuracy
60.89 sgammaloop-nextest-core> near poles: csch d0: 8 failures; first z=(-9.3326362e-302 0), re: got -inf, expected -1.071508607186267e301, error=-inf, tolerance=3.05e287; unexpected nonfinite result
60.89 sgammaloop-nextest-core> near poles: tanh d0: 152 failures; first z=(-9.7656250e-4 -4.7123890e0), re: got -1.024000325481117e3, expected -1.024000325520813e3, error=3.97e-8, tolerance=2.91e-11; component accuracy
60.89 sgammaloop-nextest-core> pole neighbors: coth d0: 26 failures; first z=(0 -4.7123890e0), re: got NaN, expected 0, error=NaN, tolerance=9.88e-324; unexpected nonfinite result
60.89 sgammaloop-nextest-core> pole neighbors: csch d0: 2 failures; first z=(0 -4.9406565e-324), re: got NaN, expected 0, error=NaN, tolerance=9.88e-324; unexpected nonfinite result
60.89 sgammaloop-nextest-core> pole neighbors: tanh d0: 24 failures; first z=(0 -4.7123890e0), re: got NaN, expected 0, error=NaN, tolerance=9.88e-324; unexpected nonfinite result
60.89 sgammaloop-nextest-core> range boundary: cosh d0: 58 failures; first z=(-7.1100000e2 0), im: got NaN, expected -0, error=NaN, tolerance=9.88e-324; unexpected nonfinite result
60.89 sgammaloop-nextest-core> range boundary: coth d0: 480 failures; first z=(-3.5600000e2 0), re: got NaN, expected -1.000000000000000e0, error=NaN, tolerance=2.84e-14; unexpected nonfinite result
60.89 sgammaloop-nextest-core> range boundary: csch d0: 308 failures; first z=(-3.5600000e2 0), re: got -0, expected -4.922598761629717e-155, error=4.92e-155, tolerance=2.47e-324; premature zero
60.89 sgammaloop-nextest-core> range boundary: sech d0: 308 failures; first z=(-3.5600000e2 0), re: got 0, expected 4.922598761629717e-155, error=-4.92e-155, tolerance=2.47e-324; premature zero
60.89 sgammaloop-nextest-core> range boundary: sinh d0: 58 failures; first z=(-7.1100000e2 0), im: got NaN, expected 0, error=NaN, tolerance=9.88e-324; unexpected nonfinite result
60.89 sgammaloop-nextest-core> range boundary: tanh d0: 268 failures; first z=(-3.5600000e2 0), re: got NaN, expected -1.000000000000000e0, error=NaN, tolerance=2.84e-14; unexpected nonfinite result
60.89 sgammaloop-nextest-core> tiny: coth d0: 68 failures; first z=(-2.4099199e-181 0), re: got -inf, expected -4.149515568880993e180, error=-inf, tolerance=1.18e167; unexpected nonfinite result
60.89 sgammaloop-nextest-core> tiny: csch d0: 68 failures; first z=(-2.4099199e-181 0), re: got -inf, expected -4.149515568880993e180, error=-inf, tolerance=1.18e167; unexpected nonfinite result
74.93 sgammaloop-nextest-core> The application panicked (crashed).
74.93 sgammaloop-nextest-core> Message: called `Result::unwrap()` on an `Err` value: Custom { kind: Other, error: "Could not compile code: g++ -shared -O3 -fPIC -ffast-math -funsafe-math-optimizations -march=native -o /build/gammaloop-native-thermal-1616/thermal_0_0.so /build/gammaloop-native-thermal-1616/thermal_0_0.cpp\nwarning: Skipping impure flag -march=native because NIX_ENFORCE_NO_NATIVE is set\n/build/gammaloop-native-thermal-1616/thermal_0_0.cpp: In function 'void thermal_realf64(const double*, double*, double*)':\n/build/gammaloop-native-thermal-1616/thermal_0_0.cpp:27:16: error: 'symbolica_tanh' was not declared in this scope\n 27 | Z[6] = symbolica_tanh(Z[6]);\n | ^~~~~~~~~~~~~~\n" }
74.93 sgammaloop-nextest-core> The application panicked (crashed).
74.93 sgammaloop-nextest-core> Message: called `Result::unwrap()` on an `Err` value:
74.93 sgammaloop-nextest-core> 0: Could not compile code: g++ -shared -O2 -fPIC -march=native -o /build/gammaloop-hyperbolic-c++-53-false-1957/hyperbolic.so /build/gammaloop-hyperbolic-c++-53-false-1957/hyperbolic.cpp
74.93 sgammaloop-nextest-core> warning: Skipping impure flag -march=native because NIX_ENFORCE_NO_NATIVE is set
74.93 sgammaloop-nextest-core> /build/gammaloop-hyperbolic-c++-53-false-1957/hyperbolic.cpp: In instantiation of 'void hyperbolic_complexf64_gen(T*, T*, T*) [with T = std::complex<double>]':
74.93 sgammaloop-nextest-core> /build/gammaloop-hyperbolic-c++-53-false-1957/hyperbolic.cpp:60:28: required from here
74.93 sgammaloop-nextest-core> /build/gammaloop-hyperbolic-c++-53-false-1957/hyperbolic.cpp:17:30: error: 'symbolica_sinh' was not declared in this scope
74.93 sgammaloop-nextest-core> /build/gammaloop-hyperbolic-c++-53-false-1957/hyperbolic.cpp:18:30: error: 'symbolica_cosh' was not declared in this scope
74.94 sgammaloop-nextest-core> /build/gammaloop-hyperbolic-c++-53-false-1957/hyperbolic.cpp:19:30: error: 'symbolica_tanh' was not declared in this scope
74.94 sgammaloop-nextest-core> /build/gammaloop-hyperbolic-c++-53-false-1957/hyperbolic.cpp:20:30: error: 'symbolica_sech' was not declared in this scope
74.94 sgammaloop-nextest-core> /build/gammaloop-hyperbolic-c++-53-false-1957/hyperbolic.cpp:23:31: error: 'symbolica_coth' was not declared in this scope
74.94 sgammaloop-nextest-core> /build/gammaloop-hyperbolic-c++-53-false-1957/hyperbolic.cpp:24:31: error: 'symbolica_csch' was not declared in this scope
74.94 sgammaloop-nextest-core> The application panicked (crashed).
74.94 sgammaloop-nextest-core> Message: called `Result::unwrap()` on an `Err` value:
74.94 sgammaloop-nextest-core> 0: Could not compile code: g++ -shared -O2 -fPIC -ffast-math -funsafe-math-optimizations -march=native -o /build/gammaloop-hyperbolic-c++-53-true-1950/hyperbolic.so /build/gammaloop-hyperbolic-c++-53-true-1950/hyperbolic.cpp
74.94 sgammaloop-nextest-core> warning: Skipping impure flag -march=native because NIX_ENFORCE_NO_NATIVE is set
74.94 sgammaloop-nextest-core> /build/gammaloop-hyperbolic-c++-53-true-1950/hyperbolic.cpp: In instantiation of 'void hyperbolic_complexf64_gen(T*, T*, T*) [with T = std::complex<double>]':
74.94 sgammaloop-nextest-core> /build/gammaloop-hyperbolic-c++-53-true-1950/hyperbolic.cpp:60:28: required from here
74.94 sgammaloop-nextest-core> /build/gammaloop-hyperbolic-c++-53-true-1950/hyperbolic.cpp:17:30: error: 'symbolica_sinh' was not declared in this scope
74.94 sgammaloop-nextest-core> /build/gammaloop-hyperbolic-c++-53-true-1950/hyperbolic.cpp:18:30: error: 'symbolica_cosh' was not declared in this scope
74.94 sgammaloop-nextest-core> /build/gammaloop-hyperbolic-c++-53-true-1950/hyperbolic.cpp:19:30: error: 'symbolica_tanh' was not declared in this scope
74.94 sgammaloop-nextest-core> /build/gammaloop-hyperbolic-c++-53-true-1950/hyperbolic.cpp:20:30: error: 'symbolica_sech' was not declared in this scope
74.94 sgammaloop-nextest-core> /build/gammaloop-hyperbolic-c++-53-true-1950/hyperbolic.cpp:23:31: error: 'symbolica_coth' was not declared in this scope
74.94 sgammaloop-nextest-core> /build/gammaloop-hyperbolic-c++-53-true-1950/hyperbolic.cpp:24:31: error: 'symbolica_csch' was not declared in this scope
74.94 sgammaloop-nextest-core> infinite real part: coth d0: 8 failures; first z=(inf 0), re: got NaN, expected 1.000000000000000e0, error=NaN, tolerance=2.84e-14; unexpected nonfinite result
74.94 sgammaloop-nextest-core> infinite real part: tanh d0: 4 failures; first z=(inf 0), re: got NaN, expected 1.000000000000000e0, error=NaN, tolerance=2.84e-14; unexpected nonfinite result
74.94 sgammaloop-nextest-core> near poles: coth d0: 160 failures; first z=(-9.7656250e-4 -4.7123890e0), re: got -9.765621895971165e-4, expected -9.765621895592603e-4, error=-3.79e-14, tolerance=2.78e-17; component accuracy
74.94 sgammaloop-nextest-core> near poles: csch d0: 8 failures; first z=(-9.3326362e-302 0), re: got -inf, expected -1.071508607186267e301, error=-inf, tolerance=3.05e287; unexpected nonfinite result
74.94 sgammaloop-nextest-core> near poles: tanh d0: 152 failures; first z=(-9.7656250e-4 -4.7123890e0), re: got -1.024000325481117e3, expected -1.024000325520813e3, error=3.97e-8, tolerance=2.91e-11; component accuracy
74.94 sgammaloop-nextest-core> pole neighbors: coth d0: 26 failures; first z=(0 -4.7123890e0), re: got NaN, expected 0, error=NaN, tolerance=9.88e-324; unexpected nonfinite result
74.94 sgammaloop-nextest-core> pole neighbors: csch d0: 2 failures; first z=(0 -4.9406565e-324), re: got NaN, expected 0, error=NaN, tolerance=9.88e-324; unexpected nonfinite result
74.94 sgammaloop-nextest-core> pole neighbors: tanh d0: 24 failures; first z=(0 -4.7123890e0), re: got NaN, expected 0, error=NaN, tolerance=9.88e-324; unexpected nonfinite result
74.94 sgammaloop-nextest-core> range boundary: cosh d0: 58 failures; first z=(-7.1100000e2 0), im: got NaN, expected -0, error=NaN, tolerance=9.88e-324; unexpected nonfinite result
74.94 sgammaloop-nextest-core> range boundary: coth d0: 480 failures; first z=(-3.5600000e2 0), re: got NaN, expected -1.000000000000000e0, error=NaN, tolerance=2.84e-14; unexpected nonfinite result
74.94 sgammaloop-nextest-core> range boundary: csch d0: 308 failures; first z=(-3.5600000e2 0), re: got -0, expected -4.922598761629717e-155, error=4.92e-155, tolerance=2.47e-324; premature zero
74.94 sgammaloop-nextest-core> range boundary: sech d0: 308 failures; first z=(-3.5600000e2 0), re: got 0, expected 4.922598761629717e-155, error=-4.92e-155, tolerance=2.47e-324; premature zero
74.94 sgammaloop-nextest-core> range boundary: sinh d0: 58 failures; first z=(-7.1100000e2 0), im: got NaN, expected 0, error=NaN, tolerance=9.88e-324; unexpected nonfinite result
74.94 sgammaloop-nextest-core> range boundary: tanh d0: 268 failures; first z=(-3.5600000e2 0), re: got NaN, expected -1.000000000000000e0, error=NaN, tolerance=2.84e-14; unexpected nonfinite result
74.94 sgammaloop-nextest-core> tiny: coth d0: 68 failures; first z=(-2.4099199e-181 0), re: got -inf, expected -4.149515568880993e180, error=-inf, tolerance=1.18e167; unexpected nonfinite result
74.94 sgammaloop-nextest-core> tiny: csch d0: 68 failures; first z=(-2.4099199e-181 0), re: got -inf, expected -4.149515568880993e180, error=-inf, tolerance=1.18e167; unexpected nonfinite result
74.94 sgammaloop-nextest-core> infinite real part: coth d0: 8 failures; first z=(inf 0), re: got NaN, expected 1.000000000000000e0, error=NaN, tolerance=2.84e-14; unexpected nonfinite result
74.94 sgammaloop-nextest-core> infinite real part: tanh d0: 4 failures; first z=(inf 0), re: got NaN, expected 1.000000000000000e0, error=NaN, tolerance=2.84e-14; unexpected nonfinite result
74.94 sgammaloop-nextest-core> near poles: coth d0: 160 failures; first z=(-9.7656250e-4 -4.7123890e0), re: got -9.765621895971165e-4, expected -9.765621895592603e-4, error=-3.79e-14, tolerance=2.78e-17; component accuracy
74.94 sgammaloop-nextest-core> near poles: csch d0: 8 failures; first z=(-9.3326362e-302 0), re: got -inf, expected -1.071508607186267e301, error=-inf, tolerance=3.05e287; unexpected nonfinite result
74.94 sgammaloop-nextest-core> near poles: tanh d0: 152 failures; first z=(-9.7656250e-4 -4.7123890e0), re: got -1.024000325481117e3, expected -1.024000325520813e3, error=3.97e-8, tolerance=2.91e-11; component accuracy
74.94 sgammaloop-nextest-core> pole neighbors: coth d0: 26 failures; first z=(0 -4.7123890e0), re: got NaN, expected 0, error=NaN, tolerance=9.88e-324; unexpected nonfinite result
74.94 sgammaloop-nextest-core> pole neighbors: csch d0: 2 failures; first z=(0 -4.9406565e-324), re: got NaN, expected 0, error=NaN, tolerance=9.88e-324; unexpected nonfinite result
74.94 sgammaloop-nextest-core> pole neighbors: tanh d0: 24 failures; first z=(0 -4.7123890e0), re: got NaN, expected 0, error=NaN, tolerance=9.88e-324; unexpected nonfinite result
74.94 sgammaloop-nextest-core> range boundary: cosh d0: 58 failures; first z=(-7.1100000e2 0), im: got NaN, expected -0, error=NaN, tolerance=9.88e-324; unexpected nonfinite result
74.94 sgammaloop-nextest-core> range boundary: coth d0: 480 failures; first z=(-3.5600000e2 0), re: got NaN, expected -1.000000000000000e0, error=NaN, tolerance=2.84e-14; unexpected nonfinite result
74.94 sgammaloop-nextest-core> range boundary: csch d0: 308 failures; first z=(-3.5600000e2 0), re: got -0, expected -4.922598761629717e-155, error=4.92e-155, tolerance=2.47e-324; premature zero
74.94 sgammaloop-nextest-core> range boundary: sech d0: 308 failures; first z=(-3.5600000e2 0), re: got 0, expected 4.922598761629717e-155, error=-4.92e-155, tolerance=2.47e-324; premature zero
74.94 sgammaloop-nextest-core> range boundary: sinh d0: 58 failures; first z=(-7.1100000e2 0), im: got NaN, expected 0, error=NaN, tolerance=9.88e-324; unexpected nonfinite result
74.94 sgammaloop-nextest-core> range boundary: tanh d0: 268 failures; first z=(-3.5600000e2 0), re: got NaN, expected -1.000000000000000e0, error=NaN, tolerance=2.84e-14; unexpected nonfinite result
74.94 sgammaloop-nextest-core> tiny: coth d0: 68 failures; first z=(-2.4099199e-181 0), re: got -inf, expected -4.149515568880993e180, error=-inf, tolerance=1.18e167; unexpected nonfinite result
74.94 sgammaloop-nextest-core> tiny: csch d0: 68 failures; first z=(-2.4099199e-181 0), re: got -inf, expected -4.149515568880993e180, error=-inf, tolerance=1.18e167; unexpected nonfinite result
75.08 sgammaloop-nextest-core> The application panicked (crashed).
75.08 sgammaloop-nextest-core> Message: called `Result::unwrap()` on an `Err` value: Custom { kind: Other, error: "Could not compile code: g++ -shared -O3 -fPIC -ffast-math -funsafe-math-optimizations -march=native -o /build/gammaloop-native-thermal-1616/thermal_0_0.so /build/gammaloop-native-thermal-1616/thermal_0_0.cpp\nwarning: Skipping impure flag -march=native because NIX_ENFORCE_NO_NATIVE is set\n/build/gammaloop-native-thermal-1616/thermal_0_0.cpp: In function 'void thermal_realf64(const double*, double*, double*)':\n/build/gammaloop-native-thermal-1616/thermal_0_0.cpp:27:16: error: 'symbolica_tanh' was not declared in this scope\n 27 | Z[6] = symbolica_tanh(Z[6]);\n | ^~~~~~~~~~~~~~\n" }
75.08 sgammaloop-nextest-core> The application panicked (crashed).
75.08 sgammaloop-nextest-core> Message: called `Result::unwrap()` on an `Err` value:
75.08 sgammaloop-nextest-core> 0: Could not compile code: g++ -shared -O2 -fPIC -march=native -o /build/gammaloop-hyperbolic-c++-53-false-1957/hyperbolic.so /build/gammaloop-hyperbolic-c++-53-false-1957/hyperbolic.cpp
75.08 sgammaloop-nextest-core> warning: Skipping impure flag -march=native because NIX_ENFORCE_NO_NATIVE is set
75.08 sgammaloop-nextest-core> /build/gammaloop-hyperbolic-c++-53-false-1957/hyperbolic.cpp: In instantiation of 'void hyperbolic_complexf64_gen(T*, T*, T*) [with T = std::complex<double>]':
75.08 sgammaloop-nextest-core> /build/gammaloop-hyperbolic-c++-53-false-1957/hyperbolic.cpp:60:28: required from here
75.08 sgammaloop-nextest-core> /build/gammaloop-hyperbolic-c++-53-false-1957/hyperbolic.cpp:17:30: error: 'symbolica_sinh' was not declared in this scope
75.08 sgammaloop-nextest-core> /build/gammaloop-hyperbolic-c++-53-false-1957/hyperbolic.cpp:18:30: error: 'symbolica_cosh' was not declared in this scope
75.08 sgammaloop-nextest-core> /build/gammaloop-hyperbolic-c++-53-false-1957/hyperbolic.cpp:19:30: error: 'symbolica_tanh' was not declared in this scope
75.08 sgammaloop-nextest-core> /build/gammaloop-hyperbolic-c++-53-false-1957/hyperbolic.cpp:20:30: error: 'symbolica_sech' was not declared in this scope
75.08 sgammaloop-nextest-core> /build/gammaloop-hyperbolic-c++-53-false-1957/hyperbolic.cpp:23:31: error: 'symbolica_coth' was not declared in this scope
75.08 sgammaloop-nextest-core> /build/gammaloop-hyperbolic-c++-53-false-1957/hyperbolic.cpp:24:31: error: 'symbolica_csch' was not declared in this scope
75.08 sgammaloop-nextest-core> The application panicked (crashed).
75.08 sgammaloop-nextest-core> Message: called `Result::unwrap()` on an `Err` value:
75.08 sgammaloop-nextest-core> 0: Could not compile code: g++ -shared -O2 -fPIC -ffast-math -funsafe-math-optimizations -march=native -o /build/gammaloop-hyperbolic-c++-53-true-1950/hyperbolic.so /build/gammaloop-hyperbolic-c++-53-true-1950/hyperbolic.cpp
75.08 sgammaloop-nextest-core> warning: Skipping impure flag -march=native because NIX_ENFORCE_NO_NATIVE is set
75.08 sgammaloop-nextest-core> /build/gammaloop-hyperbolic-c++-53-true-1950/hyperbolic.cpp: In instantiation of 'void hyperbolic_complexf64_gen(T*, T*, T*) [with T = std::complex<double>]':
75.08 sgammaloop-nextest-core> /build/gammaloop-hyperbolic-c++-53-true-1950/hyperbolic.cpp:60:28: required from here
75.08 sgammaloop-nextest-core> /build/gammaloop-hyperbolic-c++-53-true-1950/hyperbolic.cpp:17:30: error: 'symbolica_sinh' was not declared in this scope
75.08 sgammaloop-nextest-core> /build/gammaloop-hyperbolic-c++-53-true-1950/hyperbolic.cpp:18:30: error: 'symbolica_cosh' was not declared in this scope
75.08 sgammaloop-nextest-core> /build/gammaloop-hyperbolic-c++-53-true-1950/hyperbolic.cpp:19:30: error: 'symbolica_tanh' was not declared in this scope
75.08 sgammaloop-nextest-core> /build/gammaloop-hyperbolic-c++-53-true-1950/hyperbolic.cpp:20:30: error: 'symbolica_sech' was not declared in this scope
75.08 sgammaloop-nextest-core> /build/gammaloop-hyperbolic-c++-53-true-1950/hyperbolic.cpp:23:31: error: 'symbolica_coth' was not declared in this scope
75.08 sgammaloop-nextest-core> /build/gammaloop-hyperbolic-c++-53-true-1950/hyperbolic.cpp:24:31: error: 'symbolica_csch' was not declared in this scope
75.08 sgammaloop-nextest-core> infinite real part: coth d0: 8 failures; first z=(inf 0), re: got NaN, expected 1.000000000000000e0, error=NaN, tolerance=2.84e-14; unexpected nonfinite result
75.08 sgammaloop-nextest-core> infinite real part: tanh d0: 4 failures; first z=(inf 0), re: got NaN, expected 1.000000000000000e0, error=NaN, tolerance=2.84e-14; unexpected nonfinite result
75.08 sgammaloop-nextest-core> near poles: coth d0: 160 failures; first z=(-9.7656250e-4 -4.7123890e0), re: got -9.765621895971165e-4, expected -9.765621895592603e-4, error=-3.79e-14, tolerance=2.78e-17; component accuracy
75.08 sgammaloop-nextest-core> near poles: csch d0: 8 failures; first z=(-9.3326362e-302 0), re: got -inf, expected -1.071508607186267e301, error=-inf, tolerance=3.05e287; unexpected nonfinite result
75.08 sgammaloop-nextest-core> near poles: tanh d0: 152 failures; first z=(-9.7656250e-4 -4.7123890e0), re: got -1.024000325481117e3, expected -1.024000325520813e3, error=3.97e-8, tolerance=2.91e-11; component accuracy
75.08 sgammaloop-nextest-core> pole neighbors: coth d0: 26 failures; first z=(0 -4.7123890e0), re: got NaN, expected 0, error=NaN, tolerance=9.88e-324; unexpected nonfinite result
75.08 sgammaloop-nextest-core> pole neighbors: csch d0: 2 failures; first z=(0 -4.9406565e-324), re: got NaN, expected 0, error=NaN, tolerance=9.88e-324; unexpected nonfinite result
75.08 sgammaloop-nextest-core> pole neighbors: tanh d0: 24 failures; first z=(0 -4.7123890e0), re: got NaN, expected 0, error=NaN, tolerance=9.88e-324; unexpected nonfinite result
75.08 sgammaloop-nextest-core> range boundary: cosh d0: 58 failures; first z=(-7.1100000e2 0), im: got NaN, expected -0, error=NaN, tolerance=9.88e-324; unexpected nonfinite result
75.08 sgammaloop-nextest-core> range boundary: coth d0: 480 failures; first z=(-3.5600000e2 0), re: got NaN, expected -1.000000000000000e0, error=NaN, tolerance=2.84e-14; unexpected nonfinite result
75.08 sgammaloop-nextest-core> range boundary: csch d0: 308 failures; first z=(-3.5600000e2 0), re: got -0, expected -4.922598761629717e-155, error=4.92e-155, tolerance=2.47e-324; premature zero
75.08 sgammaloop-nextest-core> range boundary: sech d0: 308 failures; first z=(-3.5600000e2 0), re: got 0, expected 4.922598761629717e-155, error=-4.92e-155, tolerance=2.47e-324; premature zero
75.08 sgammaloop-nextest-core> range boundary: sinh d0: 58 failures; first z=(-7.1100000e2 0), im: got NaN, expected 0, error=NaN, tolerance=9.88e-324; unexpected nonfinite result
75.08 sgammaloop-nextest-core> range boundary: tanh d0: 268 failures; first z=(-3.5600000e2 0), re: got NaN, expected -1.000000000000000e0, error=NaN, tolerance=2.84e-14; unexpected nonfinite result
75.08 sgammaloop-nextest-core> tiny: coth d0: 68 failures; first z=(-2.4099199e-181 0), re: got -inf, expected -4.149515568880993e180, error=-inf, tolerance=1.18e167; unexpected nonfinite result
75.08 sgammaloop-nextest-core> tiny: csch d0: 68 failures; first z=(-2.4099199e-181 0), re: got -inf, expected -4.149515568880993e180, error=-inf, tolerance=1.18e167; unexpected nonfinite result
75.09 sgammaloop-nextest-core> infinite real part: coth d0: 8 failures; first z=(inf 0), re: got NaN, expected 1.000000000000000e0, error=NaN, tolerance=2.84e-14; unexpected nonfinite result
75.09 sgammaloop-nextest-core> infinite real part: tanh d0: 4 failures; first z=(inf 0), re: got NaN, expected 1.000000000000000e0, error=NaN, tolerance=2.84e-14; unexpected nonfinite result
75.09 sgammaloop-nextest-core> near poles: coth d0: 160 failures; first z=(-9.7656250e-4 -4.7123890e0), re: got -9.765621895971165e-4, expected -9.765621895592603e-4, error=-3.79e-14, tolerance=2.78e-17; component accuracy
75.09 sgammaloop-nextest-core> near poles: csch d0: 8 failures; first z=(-9.3326362e-302 0), re: got -inf, expected -1.071508607186267e301, error=-inf, tolerance=3.05e287; unexpected nonfinite result
75.09 sgammaloop-nextest-core> near poles: tanh d0: 152 failures; first z=(-9.7656250e-4 -4.7123890e0), re: got -1.024000325481117e3, expected -1.024000325520813e3, error=3.97e-8, tolerance=2.91e-11; component accuracy
75.09 sgammaloop-nextest-core> pole neighbors: coth d0: 26 failures; first z=(0 -4.7123890e0), re: got NaN, expected 0, error=NaN, tolerance=9.88e-324; unexpected nonfinite result
75.09 sgammaloop-nextest-core> pole neighbors: csch d0: 2 failures; first z=(0 -4.9406565e-324), re: got NaN, expected 0, error=NaN, tolerance=9.88e-324; unexpected nonfinite result
75.09 sgammaloop-nextest-core> pole neighbors: tanh d0: 24 failures; first z=(0 -4.7123890e0), re: got NaN, expected 0, error=NaN, tolerance=9.88e-324; unexpected nonfinite result
75.09 sgammaloop-nextest-core> range boundary: cosh d0: 58 failures; first z=(-7.1100000e2 0), im: got NaN, expected -0, error=NaN, tolerance=9.88e-324; unexpected nonfinite result
75.09 sgammaloop-nextest-core> range boundary: coth d0: 480 failures; first z=(-3.5600000e2 0), re: got NaN, expected -1.000000000000000e0, error=NaN, tolerance=2.84e-14; unexpected nonfinite result
75.09 sgammaloop-nextest-core> range boundary: csch d0: 308 failures; first z=(-3.5600000e2 0), re: got -0, expected -4.922598761629717e-155, error=4.92e-155, tolerance=2.47e-324; premature zero
75.09 sgammaloop-nextest-core> range boundary: sech d0: 308 failures; first z=(-3.5600000e2 0), re: got 0, expected 4.922598761629717e-155, error=-4.92e-155, tolerance=2.47e-324; premature zero
75.09 sgammaloop-nextest-core> range boundary: sinh d0: 58 failures; first z=(-7.1100000e2 0), im: got NaN, expected 0, error=NaN, tolerance=9.88e-324; unexpected nonfinite result
75.09 sgammaloop-nextest-core> range boundary: tanh d0: 268 failures; first z=(-3.5600000e2 0), re: got NaN, expected -1.000000000000000e0, error=NaN, tolerance=2.84e-14; unexpected nonfinite result
75.09 sgammaloop-nextest-core> tiny: coth d0: 68 failures; first z=(-2.4099199e-181 0), re: got -inf, expected -4.149515568880993e180, error=-inf, tolerance=1.18e167; unexpected nonfinite result
75.09 sgammaloop-nextest-core> tiny: csch d0: 68 failures; first z=(-2.4099199e-181 0), re: got -inf, expected -4.149515568880993e180, error=-inf, tolerance=1.18e167; unexpected nonfinite result
315.27 sgammaloop-nextest-core> test eval::thermal_reference_tests::thermal_energy_numerators_preserve_propagator_cancellation has been running for over 60 seconds
315.27 sgammaloop-nextest-core> test eval::thermal_reference_tests::thermal_energy_numerators_preserve_propagator_cancellation has been running for over 60 seconds
315.65 sgammaloop-nextest-core> test eval::thermal_reference_tests::thermal_energy_numerators_preserve_propagator_cancellation has been running for over 60 seconds
315.75 s > ━━━━━━━━━━━━━━━━━━━━━━━━━━━━━━━━━━ BACKTRACE ━━━━━━━━━━━━━━━━━━━━━━━━━━━━━━━━━━━
315.75 s > 1: <color_eyre[51793ea62743adbd]::config::PanicHook>::panic_report<unknown>
315.75 s > at <unknown source file>:<unknown line>
315.75 s > 2: <color_eyre[51793ea62743adbd]::config::PanicHook>::into_panic_hook::{closure#0}<unknown>
315.75 s > at <unknown source file>:<unknown line>
315.75 s > 3: std[bcb96dfbba0ab899]::panicking::panic_with_hook<unknown>
315.75 s > at <unknown source file>:<unknown line>
315.75 s > 4: std[bcb96dfbba0ab899]::panicking::panic_handler::{closure#0}<unknown>
315.75 s > at <unknown source file>:<unknown line>
315.75 s > 5: std[bcb96dfbba0ab899]::sys::backtrace::__rust_end_short_backtrace::<std[bcb96dfbba0ab899]::panicking::panic_handler::{closure#0}, !><unknown>
315.75 s > at <unknown source file>:<unknown line>
315.75 s > 6: __rustc[6c289b9f9c454d21]::rust_begin_unwind<unknown>
315.75 s > at <unknown source file>:<unknown line>
315.75 s > 7: core[940e698046960fd5]::panicking::panic_fmt<unknown>
315.75 s > at <unknown source file>:<unknown line>
315.75 s > 8: <gammalooprs[e669b34b0f7bca9e]::integrands::process::evaluators::hyperbolic_tests::Checks>::finish<unknown>
315.75 s > at <unknown source file>:<unknown line>
315.75 s > 9: gammalooprs[e669b34b0f7bca9e]::integrands::process::evaluators::hyperbolic_tests::check_backend::<gammalooprs[e669b34b0f7bca9e]::utils::VarFloat<1000u32>, gammalooprs[e669b34b0f7bca9e]::integrands::process::evaluators::hyperbolic_tests::hyperbolic_eager_arb::{closure#0}><unknown>
315.75 s > at <unknown source file>:<unknown line>
315.75 s > 10: <gammalooprs[e669b34b0f7bca9e]::integrands::process::evaluators::hyperbolic_tests::hyperbolic_eager_arb::{closure#0} as core[940e698046960fd5]::ops::function::FnOnce<()>>::call_once<unknown>
315.75 s > at <unknown source file>:<unknown line>
315.75 s > 11: test[75d6903177b1d7e9]::__rust_begin_short_backtrace::<core[940e698046960fd5]::result::Result<(), alloc[2ea6bcb46fca0c42]::string::String>, fn() -> core[940e698046960fd5]::result::Result<(), alloc[2ea6bcb46fca0c42]::string::String>><unknown>
315.75 s > at <unknown source file>:<unknown line>
315.75 s > 12: test[75d6903177b1d7e9]::run_test::{closure#0}<unknown>
315.75 s > at <unknown source file>:<unknown line>
315.75 s > 13: std[bcb96dfbba0ab899]::sys::backtrace::__rust_begin_short_backtrace::<test[75d6903177b1d7e9]::run_test::{closure#1}, ()><unknown>
315.75 s > at <unknown source file>:<unknown line>
315.75 s > 14: <std[bcb96dfbba0ab899]::thread::lifecycle::spawn_unchecked<test[75d6903177b1d7e9]::run_test::{closure#1}, ()>::{closure#1} as core[940e698046960fd5]::ops::function::FnOnce<()>>::call_once::{shim:vtable#0}<unknown>
315.75 s > at <unknown source file>:<unknown line>
315.75 s > 15: <std[bcb96dfbba0ab899]::sys::thread::unix::Thread>::new::thread_start<unknown>
315.75 s > at <unknown source file>:<unknown line>
315.75 s > Message: called `Result::unwrap()` on an `Err` value: Custom { kind: Other, error: "Could not compile code: g++ -shared -O3 -fPIC -ffast-math -funsafe-math-optimizations -march=native -o /build/gammaloop-native-thermal-1616/thermal_0_0.so /build/gammaloop-native-thermal-1616/thermal_0_0.cpp\nwarning: Skipping impure flag -march=native because NIX_ENFORCE_NO_NATIVE is set\n/build/gammaloop-native-thermal-1616/thermal_0_0.cpp: In function 'void thermal_realf64(const double*, double*, double*)':\n/build/gammaloop-native-thermal-1616/thermal_0_0.cpp:27:16: error: 'symbolica_tanh' was not declared in this scope\n 27 | Z[6] = symbolica_tanh(Z[6]);\n | ^~~~~~~~~~~~~~\n" }
315.75 s > Location: crates/gammalooprs/src/graph/feynman_graph.rs:1213
315.75 s > ━━━━━━━━━━━━━━━━━━━━━━━━━━━━━━━━━━ BACKTRACE ━━━━━━━━━━━━━━━━━━━━━━━━━━━━━━━━━━━
315.75 s > 1: <color_eyre[51793ea62743adbd]::config::PanicHook>::panic_report<unknown>
315.75 s > at <unknown source file>:<unknown line>
315.75 s > 2: <color_eyre[51793ea62743adbd]::config::PanicHook>::into_panic_hook::{closure#0}<unknown>
315.75 s > at <unknown source file>:<unknown line>
315.75 s > 3: std[bcb96dfbba0ab899]::panicking::panic_with_hook<unknown>
315.75 s > at <unknown source file>:<unknown line>
315.75 s > 4: std[bcb96dfbba0ab899]::panicking::panic_handler::{closure#0}<unknown>
315.75 s > at <unknown source file>:<unknown line>
315.75 s > 5: std[bcb96dfbba0ab899]::sys::backtrace::__rust_end_short_backtrace::<std[bcb96dfbba0ab899]::panicking::panic_handler::{closure#0}, !><unknown>
315.75 s > at <unknown source file>:<unknown line>
315.75 s > 6: __rustc[6c289b9f9c454d21]::rust_begin_unwind<unknown>
315.75 s > at <unknown source file>:<unknown line>
315.75 s > 7: core[940e698046960fd5]::panicking::panic_fmt<unknown>
315.75 s > at <unknown source file>:<unknown line>
315.75 s > 8: core[940e698046960fd5]::result::unwrap_failed<unknown>
315.75 s > at <unknown source file>:<unknown line>
315.75 s > 9: gammalooprs[e669b34b0f7bca9e]::graph::feynman_graph::tests::native_thermal_distributions<unknown>
315.75 s > at <unknown source file>:<unknown line>
315.75 s > 10: <gammalooprs[e669b34b0f7bca9e]::graph::feynman_graph::tests::native_thermal_distributions::{closure#0} as core[940e698046960fd5]::ops::function::FnOnce<()>>::call_once<unknown>
315.75 s > at <unknown source file>:<unknown line>
315.75 s > 11: test[75d6903177b1d7e9]::__rust_begin_short_backtrace::<core[940e698046960fd5]::result::Result<(), alloc[2ea6bcb46fca0c42]::string::String>, fn() -> core[940e698046960fd5]::result::Result<(), alloc[2ea6bcb46fca0c42]::string::String>><unknown>
315.75 s > at <unknown source file>:<unknown line>
315.75 s > 12: test[75d6903177b1d7e9]::run_test::{closure#0}<unknown>
315.75 s > at <unknown source file>:<unknown line>
315.75 s > 13: std[bcb96dfbba0ab899]::sys::backtrace::__rust_begin_short_backtrace::<test[75d6903177b1d7e9]::run_test::{closure#1}, ()><unknown>
315.75 s > at <unknown source file>:<unknown line>
315.75 s > 14: <std[bcb96dfbba0ab899]::thread::lifecycle::spawn_unchecked<test[75d6903177b1d7e9]::run_test::{closure#1}, ()>::{closure#1} as core[940e698046960fd5]::ops::function::FnOnce<()>>::call_once::{shim:vtable#0}<unknown>
315.75 s > at <unknown source file>:<unknown line>
315.75 s > 15: <std[bcb96dfbba0ab899]::sys::thread::unix::Thread>::new::thread_start<unknown>
315.75 s > at <unknown source file>:<unknown line>
315.75 s > ━━━━━━━━━━━━━━━━━━━━━━━━━━━━━━━━━━ BACKTRACE ━━━━━━━━━━━━━━━━━━━━━━━━━━━━━━━━━━━
315.75 s > 1: <color_eyre[51793ea62743adbd]::config::PanicHook>::panic_report<unknown>
315.75 s > at <unknown source file>:<unknown line>
315.75 s > 2: <color_eyre[51793ea62743adbd]::config::PanicHook>::into_panic_hook::{closure#0}<unknown>
315.75 s > at <unknown source file>:<unknown line>
315.75 s > 3: std[bcb96dfbba0ab899]::panicking::panic_with_hook<unknown>
315.75 s > at <unknown source file>:<unknown line>
315.75 s > 4: std[bcb96dfbba0ab899]::panicking::panic_handler::{closure#0}<unknown>
315.75 s > at <unknown source file>:<unknown line>
315.75 s > 5: std[bcb96dfbba0ab899]::sys::backtrace::__rust_end_short_backtrace::<std[bcb96dfbba0ab899]::panicking::panic_handler::{closure#0}, !><unknown>
315.75 s > at <unknown source file>:<unknown line>
315.75 s > 6: __rustc[6c289b9f9c454d21]::rust_begin_unwind<unknown>
315.75 s > at <unknown source file>:<unknown line>
315.75 s > 7: core[940e698046960fd5]::panicking::panic_fmt<unknown>
315.75 s > at <unknown source file>:<unknown line>
315.75 s > 8: core[940e698046960fd5]::panicking::assert_failed_inner<unknown>
315.75 s > at <unknown source file>:<unknown line>
315.75 s > 9: core[940e698046960fd5]::panicking::assert_failed::<f64, f64><unknown>
315.75 s > at <unknown source file>:<unknown line>
315.75 s > 10: gammalooprs[e669b34b0f7bca9e]::integrands::process::param_builder::tests::thermal_tanh_remains_finite_at_uv_scales_and_preserves_derivatives<unknown>
315.75 s > at <unknown source file>:<unknown line>
315.75 s > 11: <gammalooprs[e669b34b0f7bca9e]::integrands::process::param_builder::tests::thermal_tanh_remains_finite_at_uv_scales_and_preserves_derivatives::{closure#0} as core[940e698046960fd5]::ops::function::FnOnce<()>>::call_once<unknown>
315.75 s > at <unknown source file>:<unknown line>
315.75 s > 12: test[75d6903177b1d7e9]::__rust_begin_short_backtrace::<core[940e698046960fd5]::result::Result<(), alloc[2ea6bcb46fca0c42]::string::String>, fn() -> core[940e698046960fd5]::result::Result<(), alloc[2ea6bcb46fca0c42]::string::String>><unknown>
315.75 s > at <unknown source file>:<unknown line>
315.75 s > 13: test[75d6903177b1d7e9]::run_test::{closure#0}<unknown>
315.75 s > at <unknown source file>:<unknown line>
315.75 s > 14: std[bcb96dfbba0ab899]::sys::backtrace::__rust_begin_short_backtrace::<test[75d6903177b1d7e9]::run_test::{closure#1}, ()><unknown>
315.75 s > at <unknown source file>:<unknown line>
315.75 s > 15: <std[bcb96dfbba0ab899]::thread::lifecycle::spawn_unchecked<test[75d6903177b1d7e9]::run_test::{closure#1}, ()>::{closure#1} as core[940e698046960fd5]::ops::function::FnOnce<()>>::call_once::{shim:vtable#0}<unknown>
315.75 s > at <unknown source file>:<unknown line>
315.75 s > 16: <std[bcb96dfbba0ab899]::sys::thread::unix::Thread>::new::thread_start<unknown>
315.75 s > at <unknown source file>:<unknown line>
315.75 s > Message: called `Result::unwrap()` on an `Err` value:
315.75 s > 0: Could not compile code: g++ -shared -O2 -fPIC -march=native -o /build/gammaloop-hyperbolic-c++-53-false-1957/hyperbolic.so /build/gammaloop-hyperbolic-c++-53-false-1957/hyperbolic.cpp
315.75 s > warning: Skipping impure flag -march=native because NIX_ENFORCE_NO_NATIVE is set
315.75 s > /build/gammaloop-hyperbolic-c++-53-false-1957/hyperbolic.cpp: In instantiation of 'void hyperbolic_complexf64_gen(T*, T*, T*) [with T = std::complex<double>]':
315.75 s > /build/gammaloop-hyperbolic-c++-53-false-1957/hyperbolic.cpp:60:28: required from here
315.75 s > 60 | hyperbolic_complexf64_gen(params, buffer, out);
315.75 s > | ~~~~~~~~~~~~~~~~~~~~~~~~~^~~~~~~~~~~~~~~~~~~~~
315.75 s > /build/gammaloop-hyperbolic-c++-53-false-1957/hyperbolic.cpp:17:30: error: 'symbolica_sinh' was not declared in this scope
315.75 s > ━━━━━━━━━━━━━━━━━━━━━━━━━━━━━━━━━━ BACKTRACE ━━━━━━━━━━━━━━━━━━━━━━━━━━━━━━━━━━━
315.75 s > 1: <color_eyre[51793ea62743adbd]::config::EyreHook>::into_eyre_hook::{closure#0}<unknown>
315.75 s > at <unknown source file>:<unknown line>
315.75 s > 2: eyre[cb2fd339c0c40fca]::capture_handler<unknown>
315.75 s > at <unknown source file>:<unknown line>
315.75 s > 3: <eyre[cb2fd339c0c40fca]::Report>::from_std::<std[bcb96dfbba0ab899]::io::error::Error><unknown>
315.75 s > at <unknown source file>:<unknown line>
315.75 s > 4: <gammalooprs[e669b34b0f7bca9e]::integrands::process::evaluators::GenericEvaluator>::compile_external::<std[bcb96dfbba0ab899]::path::PathBuf, &str, std[bcb96dfbba0ab899]::path::PathBuf><unknown>
315.75 s > at <unknown source file>:<unknown line>
315.75 s > 5: gammalooprs[e669b34b0f7bca9e]::integrands::process::evaluators::hyperbolic_tests::check_backend::<f64, gammalooprs[e669b34b0f7bca9e]::integrands::process::evaluators::hyperbolic_tests::hyperbolic_cpp_strict::{closure#0}><unknown>
315.75 s > at <unknown source file>:<unknown line>
315.75 s > 6: gammalooprs[e669b34b0f7bca9e]::integrands::process::evaluators::hyperbolic_tests::hyperbolic_cpp_strict<unknown>
315.75 s > at <unknown source file>:<unknown line>
315.75 s > 7: <gammalooprs[e669b34b0f7bca9e]::integrands::process::evaluators::hyperbolic_tests::hyperbolic_cpp_strict::{closure#0} as core[940e698046960fd5]::ops::function::FnOnce<()>>::call_once<unknown>
315.75 s > at <unknown source file>:<unknown line>
315.75 s > 8: test[75d6903177b1d7e9]::__rust_begin_short_backtrace::<core[940e698046960fd5]::result::Result<(), alloc[2ea6bcb46fca0c42]::string::String>, fn() -> core[940e698046960fd5]::result::Result<(), alloc[2ea6bcb46fca0c42]::string::String>><unknown>
315.75 s > at <unknown source file>:<unknown line>
315.75 s > 9: test[75d6903177b1d7e9]::run_test::{closure#0}<unknown>
315.75 s > at <unknown source file>:<unknown line>
315.75 s > 10: std[bcb96dfbba0ab899]::sys::backtrace::__rust_begin_short_backtrace::<test[75d6903177b1d7e9]::run_test::{closure#1}, ()><unknown>
315.75 s > at <unknown source file>:<unknown line>
315.75 s > 11: <std[bcb96dfbba0ab899]::thread::lifecycle::spawn_unchecked<test[75d6903177b1d7e9]::run_test::{closure#1}, ()>::{closure#1} as core[940e698046960fd5]::ops::function::FnOnce<()>>::call_once::{shim:vtable#0}<unknown>
315.75 s > at <unknown source file>:<unknown line>
315.75 s > 12: <std[bcb96dfbba0ab899]::sys::thread::unix::Thread>::new::thread_start<unknown>
315.75 s > at <unknown source file>:<unknown line>
315.75 s > ━━━━━━━━━━━━━━━━━━━━━━━━━━━━━━━━━━ BACKTRACE ━━━━━━━━━━━━━━━━━━━━━━━━━━━━━━━━━━━
315.75 s > 1: <color_eyre[51793ea62743adbd]::config::PanicHook>::panic_report<unknown>
315.75 s > at <unknown source file>:<unknown line>
315.75 s > 2: <color_eyre[51793ea62743adbd]::config::PanicHook>::into_panic_hook::{closure#0}<unknown>
315.75 s > at <unknown source file>:<unknown line>
315.75 s > 3: std[bcb96dfbba0ab899]::panicking::panic_with_hook<unknown>
315.75 s > at <unknown source file>:<unknown line>
315.75 s > 4: std[bcb96dfbba0ab899]::panicking::panic_handler::{closure#0}<unknown>
315.75 s > at <unknown source file>:<unknown line>
315.75 s > 5: std[bcb96dfbba0ab899]::sys::backtrace::__rust_end_short_backtrace::<std[bcb96dfbba0ab899]::panicking::panic_handler::{closure#0}, !><unknown>
315.75 s > at <unknown source file>:<unknown line>
315.75 s > 6: __rustc[6c289b9f9c454d21]::rust_begin_unwind<unknown>
315.75 s > at <unknown source file>:<unknown line>
315.75 s > 7: core[940e698046960fd5]::panicking::panic_fmt<unknown>
315.75 s > at <unknown source file>:<unknown line>
315.75 s > 8: core[940e698046960fd5]::result::unwrap_failed<unknown>
315.75 s > at <unknown source file>:<unknown line>
315.75 s > 9: gammalooprs[e669b34b0f7bca9e]::integrands::process::evaluators::hyperbolic_tests::check_backend::<f64, gammalooprs[e669b34b0f7bca9e]::integrands::process::evaluators::hyperbolic_tests::hyperbolic_cpp_strict::{closure#0}><unknown>
315.75 s > at <unknown source file>:<unknown line>
315.75 s > 10: gammalooprs[e669b34b0f7bca9e]::integrands::process::evaluators::hyperbolic_tests::hyperbolic_cpp_strict<unknown>
315.75 s > at <unknown source file>:<unknown line>
315.75 s > 11: <gammalooprs[e669b34b0f7bca9e]::integrands::process::evaluators::hyperbolic_tests::hyperbolic_cpp_strict::{closure#0} as core[940e698046960fd5]::ops::function::FnOnce<()>>::call_once<unknown>
315.75 s > at <unknown source file>:<unknown line>
315.75 s > 12: test[75d6903177b1d7e9]::__rust_begin_short_backtrace::<core[940e698046960fd5]::result::Result<(), alloc[2ea6bcb46fca0c42]::string::String>, fn() -> core[940e698046960fd5]::result::Result<(), alloc[2ea6bcb46fca0c42]::string::String>><unknown>
315.75 s > at <unknown source file>:<unknown line>
315.75 s > 13: test[75d6903177b1d7e9]::run_test::{closure#0}<unknown>
315.75 s > at <unknown source file>:<unknown line>
315.75 s > 14: std[bcb96dfbba0ab899]::sys::backtrace::__rust_begin_short_backtrace::<test[75d6903177b1d7e9]::run_test::{closure#1}, ()><unknown>
315.75 s > at <unknown source file>:<unknown line>
315.75 s > 15: <std[bcb96dfbba0ab899]::thread::lifecycle::spawn_unchecked<test[75d6903177b1d7e9]::run_test::{closure#1}, ()>::{closure#1} as core[940e698046960fd5]::ops::function::FnOnce<()>>::call_once::{shim:vtable#0}<unknown>
315.75 s > at <unknown source file>:<unknown line>
315.75 s > 16: <std[bcb96dfbba0ab899]::sys::thread::unix::Thread>::new::thread_start<unknown>
315.75 s > at <unknown source file>:<unknown line>
315.75 s > Message: called `Result::unwrap()` on an `Err` value:
315.75 s > 0: Could not compile code: g++ -shared -O2 -fPIC -ffast-math -funsafe-math-optimizations -march=native -o /build/gammaloop-hyperbolic-c++-53-true-1950/hyperbolic.so /build/gammaloop-hyperbolic-c++-53-true-1950/hyperbolic.cpp
315.75 s > warning: Skipping impure flag -march=native because NIX_ENFORCE_NO_NATIVE is set
315.75 s > /build/gammaloop-hyperbolic-c++-53-true-1950/hyperbolic.cpp: In instantiation of 'void hyperbolic_complexf64_gen(T*, T*, T*) [with T = std::complex<double>]':
315.75 s > /build/gammaloop-hyperbolic-c++-53-true-1950/hyperbolic.cpp:60:28: required from here
315.75 s > 60 | hyperbolic_complexf64_gen(params, buffer, out);
315.75 s > | ~~~~~~~~~~~~~~~~~~~~~~~~~^~~~~~~~~~~~~~~~~~~~~
315.75 s > /build/gammaloop-hyperbolic-c++-53-true-1950/hyperbolic.cpp:17:30: error: 'symbolica_sinh' was not declared in this scope
315.75 s > ━━━━━━━━━━━━━━━━━━━━━━━━━━━━━━━━━━ BACKTRACE ━━━━━━━━━━━━━━━━━━━━━━━━━━━━━━━━━━━
315.75 s > 1: <color_eyre[51793ea62743adbd]::config::EyreHook>::into_eyre_hook::{closure#0}<unknown>
315.75 s > at <unknown source file>:<unknown line>
315.75 s > 2: eyre[cb2fd339c0c40fca]::capture_handler<unknown>
315.75 s > at <unknown source file>:<unknown line>
315.75 s > 3: <eyre[cb2fd339c0c40fca]::Report>::from_std::<std[bcb96dfbba0ab899]::io::error::Error><unknown>
315.75 s > at <unknown source file>:<unknown line>
315.75 s > 4: <gammalooprs[e669b34b0f7bca9e]::integrands::process::evaluators::GenericEvaluator>::compile_external::<std[bcb96dfbba0ab899]::path::PathBuf, &str, std[bcb96dfbba0ab899]::path::PathBuf><unknown>
315.75 s > at <unknown source file>:<unknown line>
315.75 s > 5: gammalooprs[e669b34b0f7bca9e]::integrands::process::evaluators::hyperbolic_tests::check_backend::<f64, gammalooprs[e669b34b0f7bca9e]::integrands::process::evaluators::hyperbolic_tests::hyperbolic_cpp_production::{closure#0}><unknown>
315.75 s > at <unknown source file>:<unknown line>
315.75 s > 6: gammalooprs[e669b34b0f7bca9e]::integrands::process::evaluators::hyperbolic_tests::hyperbolic_cpp_production<unknown>
315.75 s > at <unknown source file>:<unknown line>
315.75 s > 7: <gammalooprs[e669b34b0f7bca9e]::integrands::process::evaluators::hyperbolic_tests::hyperbolic_cpp_production::{closure#0} as core[940e698046960fd5]::ops::function::FnOnce<()>>::call_once<unknown>
315.75 s > at <unknown source file>:<unknown line>
315.75 s > 8: test[75d6903177b1d7e9]::__rust_begin_short_backtrace::<core[940e698046960fd5]::result::Result<(), alloc[2ea6bcb46fca0c42]::string::String>, fn() -> core[940e698046960fd5]::result::Result<(), alloc[2ea6bcb46fca0c42]::string::String>><unknown>
315.75 s > at <unknown source file>:<unknown line>
315.75 s > 9: test[75d6903177b1d7e9]::run_test::{closure#0}<unknown>
315.75 s > at <unknown source file>:<unknown line>
315.75 s > 10: std[bcb96dfbba0ab899]::sys::backtrace::__rust_begin_short_backtrace::<test[75d6903177b1d7e9]::run_test::{closure#1}, ()><unknown>
315.75 s > at <unknown source file>:<unknown line>
315.75 s > 11: <std[bcb96dfbba0ab899]::thread::lifecycle::spawn_unchecked<test[75d6903177b1d7e9]::run_test::{closure#1}, ()>::{closure#1} as core[940e698046960fd5]::ops::function::FnOnce<()>>::call_once::{shim:vtable#0}<unknown>
315.75 s > at <unknown source file>:<unknown line>
315.75 s > 12: <std[bcb96dfbba0ab899]::sys::thread::unix::Thread>::new::thread_start<unknown>
315.75 s > at <unknown source file>:<unknown line>
315.75 s > ━━━━━━━━━━━━━━━━━━━━━━━━━━━━━━━━━━ BACKTRACE ━━━━━━━━━━━━━━━━━━━━━━━━━━━━━━━━━━━
315.75 s > 1: <color_eyre[51793ea62743adbd]::config::PanicHook>::panic_report<unknown>
315.75 s > at <unknown source file>:<unknown line>
315.75 s > 2: <color_eyre[51793ea62743adbd]::config::PanicHook>::into_panic_hook::{closure#0}<unknown>
315.75 s > at <unknown source file>:<unknown line>
315.75 s > 3: std[bcb96dfbba0ab899]::panicking::panic_with_hook<unknown>
315.75 s > at <unknown source file>:<unknown line>
315.75 s > 4: std[bcb96dfbba0ab899]::panicking::panic_handler::{closure#0}<unknown>
315.75 s > at <unknown source file>:<unknown line>
315.75 s > 5: std[bcb96dfbba0ab899]::sys::backtrace::__rust_end_short_backtrace::<std[bcb96dfbba0ab899]::panicking::panic_handler::{closure#0}, !><unknown>
315.75 s > at <unknown source file>:<unknown line>
315.75 s > 6: __rustc[6c289b9f9c454d21]::rust_begin_unwind<unknown>
315.75 s > at <unknown source file>:<unknown line>
315.75 s > 7: core[940e698046960fd5]::panicking::panic_fmt<unknown>
315.75 s > at <unknown source file>:<unknown line>
315.75 s > 8: core[940e698046960fd5]::result::unwrap_failed<unknown>
315.75 s > at <unknown source file>:<unknown line>
315.75 s > 9: gammalooprs[e669b34b0f7bca9e]::integrands::process::evaluators::hyperbolic_tests::check_backend::<f64, gammalooprs[e669b34b0f7bca9e]::integrands::process::evaluators::hyperbolic_tests::hyperbolic_cpp_production::{closure#0}><unknown>
315.75 s > at <unknown source file>:<unknown line>
315.75 s > 10: gammalooprs[e669b34b0f7bca9e]::integrands::process::evaluators::hyperbolic_tests::hyperbolic_cpp_production<unknown>
315.75 s > at <unknown source file>:<unknown line>
315.75 s > 11: <gammalooprs[e669b34b0f7bca9e]::integrands::process::evaluators::hyperbolic_tests::hyperbolic_cpp_production::{closure#0} as core[940e698046960fd5]::ops::function::FnOnce<()>>::call_once<unknown>
315.75 s > at <unknown source file>:<unknown line>
315.75 s > 12: test[75d6903177b1d7e9]::__rust_begin_short_backtrace::<core[940e698046960fd5]::result::Result<(), alloc[2ea6bcb46fca0c42]::string::String>, fn() -> core[940e698046960fd5]::result::Result<(), alloc[2ea6bcb46fca0c42]::string::String>><unknown>
315.75 s > at <unknown source file>:<unknown line>
315.75 s > 13: test[75d6903177b1d7e9]::run_test::{closure#0}<unknown>
315.75 s > at <unknown source file>:<unknown line>
315.75 s > 14: std[bcb96dfbba0ab899]::sys::backtrace::__rust_begin_short_backtrace::<test[75d6903177b1d7e9]::run_test::{closure#1}, ()><unknown>
315.75 s > at <unknown source file>:<unknown line>
315.75 s > 15: <std[bcb96dfbba0ab899]::thread::lifecycle::spawn_unchecked<test[75d6903177b1d7e9]::run_test::{closure#1}, ()>::{closure#1} as core[940e698046960fd5]::ops::function::FnOnce<()>>::call_once::{shim:vtable#0}<unknown>
315.75 s > at <unknown source file>:<unknown line>
315.75 s > 16: <std[bcb96dfbba0ab899]::sys::thread::unix::Thread>::new::thread_start<unknown>
315.75 s > at <unknown source file>:<unknown line>
315.75 s > infinite real part: coth d0: 8 failures; first z=(inf 0), re: got NaN, expected 1.000000000000000e0, error=NaN, tolerance=2.84e-14; unexpected nonfinite result
315.75 s > infinite real part: tanh d0: 4 failures; first z=(inf 0), re: got NaN, expected 1.000000000000000e0, error=NaN, tolerance=2.84e-14; unexpected nonfinite result
315.75 s > near poles: coth d0: 160 failures; first z=(-9.7656250e-4 -4.7123890e0), re: got -9.765621895971165e-4, expected -9.765621895592603e-4, error=-3.79e-14, tolerance=2.78e-17; component accuracy
315.75 s > near poles: csch d0: 8 failures; first z=(-9.3326362e-302 0), re: got -inf, expected -1.071508607186267e301, error=-inf, tolerance=3.05e287; unexpected nonfinite result
315.75 s > near poles: tanh d0: 152 failures; first z=(-9.7656250e-4 -4.7123890e0), re: got -1.024000325481117e3, expected -1.024000325520813e3, error=3.97e-8, tolerance=2.91e-11; component accuracy
315.75 s > pole neighbors: coth d0: 26 failures; first z=(0 -4.7123890e0), re: got NaN, expected 0, error=NaN, tolerance=9.88e-324; unexpected nonfinite result
315.75 s > pole neighbors: csch d0: 2 failures; first z=(0 -4.9406565e-324), re: got NaN, expected 0, error=NaN, tolerance=9.88e-324; unexpected nonfinite result
315.75 s > pole neighbors: tanh d0: 24 failures; first z=(0 -4.7123890e0), re: got NaN, expected 0, error=NaN, tolerance=9.88e-324; unexpected nonfinite result
315.75 s > range boundary: cosh d0: 58 failures; first z=(-7.1100000e2 0), im: got NaN, expected -0, error=NaN, tolerance=9.88e-324; unexpected nonfinite result
315.75 s > range boundary: coth d0: 480 failures; first z=(-3.5600000e2 0), re: got NaN, expected -1.000000000000000e0, error=NaN, tolerance=2.84e-14; unexpected nonfinite result
315.75 s > range boundary: csch d0: 308 failures; first z=(-3.5600000e2 0), re: got -0, expected -4.922598761629717e-155, error=4.92e-155, tolerance=2.47e-324; premature zero
315.75 s > range boundary: sech d0: 308 failures; first z=(-3.5600000e2 0), re: got 0, expected 4.922598761629717e-155, error=-4.92e-155, tolerance=2.47e-324; premature zero
315.75 s > range boundary: sinh d0: 58 failures; first z=(-7.1100000e2 0), im: got NaN, expected 0, error=NaN, tolerance=9.88e-324; unexpected nonfinite result
315.75 s > range boundary: tanh d0: 268 failures; first z=(-3.5600000e2 0), re: got NaN, expected -1.000000000000000e0, error=NaN, tolerance=2.84e-14; unexpected nonfinite result
315.75 s > tiny: coth d0: 68 failures; first z=(-2.4099199e-181 0), re: got -inf, expected -4.149515568880993e180, error=-inf, tolerance=1.18e167; unexpected nonfinite result
315.75 s > tiny: csch d0: 68 failures; first z=(-2.4099199e-181 0), re: got -inf, expected -4.149515568880993e180, error=-inf, tolerance=1.18e167; unexpected nonfinite result
315.75 s > unequal components: cosh d0: 8 failures; first z=(7.1100000e2 1.0000000e-300), im: got inf, expected 3.036313688864996e8, error=inf, tolerance=8.63e-6; unexpected nonfinite result
315.75 s > unequal components: coth d0: 24 failures; first z=(3.5600000e2 1.0000000e-300), re: got NaN, expected 1.000000000000000e0, error=NaN, tolerance=2.84e-14; unexpected nonfinite result
315.75 s > unequal components: csch d0: 8 failures; first z=(3.5600000e2 1.0000000e-300), re: got 0, expected 4.922598761629437e-155, error=-4.92e-155, tolerance=2.47e-324; premature zero
315.75 s > unequal components: sech d0: 8 failures; first z=(3.5600000e2 1.0000000e-300), re: got 0, expected 4.922598761629437e-155, error=-4.92e-155, tolerance=2.47e-324; premature zero
315.75 s > unequal components: sinh d0: 8 failures; first z=(7.1100000e2 1.0000000e-300), im: got inf, expected 3.036313688864996e8, error=inf, tolerance=8.63e-6; unexpected nonfinite result
315.75 s > unequal components: tanh d0: 12 failures; first z=(3.5600000e2 1.0000000e-300), re: got NaN, expected 1.000000000000000e0, error=NaN, tolerance=2.84e-14; unexpected nonfinite result
315.75 s > Symbolic derivative failures (composed expressions; cancellation may reduce accuracy):
315.75 s > UV: cosh d1: 8 failures; first z=(-1.0000000e3 0), im: got NaN, expected 0, error=NaN, tolerance=9.88e-324; unexpected nonfinite result
315.75 s > UV: cosh d2: 8 failures; first z=(-1.0000000e3 0), im: got NaN, expected -0, error=NaN, tolerance=9.88e-324; unexpected nonfinite result
315.75 s > UV: coth d2: 32 failures; first z=(-1.0000000e3 0), re: got NaN, expected -0, error=NaN, tolerance=9.88e-324; unexpected nonfinite result
315.75 s > UV: csch d1: 32 failures; first z=(-1.0000000e3 0), re: got NaN, expected -0, error=NaN, tolerance=9.88e-324; unexpected nonfinite result
315.75 s > UV: csch d2: 32 failures; first z=(-1.0000000e3 0), re: got NaN, expected -0, error=NaN, tolerance=9.88e-324; unexpected nonfinite result
315.75 s > UV: sech d1: 32 failures; first z=(-1.0000000e3 0), re: got NaN, expected 0, error=NaN, tolerance=9.88e-324; unexpected nonfinite result
315.75 s > UV: sech d2: 32 failures; first z=(-1.0000000e3 0), re: got NaN, expected 0, error=NaN, tolerance=9.88e-324; unexpected nonfinite result
315.75 s > UV: sinh d1: 8 failures; first z=(-1.0000000e3 0), im: got NaN, expected -0, error=NaN, tolerance=9.88e-324; unexpected nonfinite result
315.75 s > UV: sinh d2: 8 failures; first z=(-1.0000000e3 0), im: got NaN, expected 0, error=NaN, tolerance=9.88e-324; unexpected nonfinite result
315.75 s > UV: tanh d2: 32 failures; first z=(-1.0000000e3 0), re: got NaN, expected 0, error=NaN, tolerance=9.88e-324; unexpected nonfinite result
315.75 s > near poles: coth d1: 8 failures; first z=(-9.3326362e-302 0), re: got NaN, expected -inf, error=NaN, tolerance=inf; expected signed infinity
315.75 s > near poles: coth d2: 160 failures; first z=(-9.7656250e-4 -4.7123890e0), re: got 1.953122516550860e-3, expected 1.953122516475148e-3, error=7.57e-14, tolerance=5.55e-17; component accuracy
315.75 s > near poles: csch d1: 160 failures; first z=(-9.7656250e-4 -4.7123890e0), re: got -1.836965819118240e-16, expected -1.836965819047030e-16, error=-7.12e-27, tolerance=5.22e-30; component accuracy
315.75 s > near poles: csch d2: 112 failures; first z=(-9.7656250e-4 -4.7123890e0), re: got -8.969563655486067e-19, expected -8.969563655207907e-19, error=-2.78e-29, tolerance=2.55e-32; component accuracy
315.75 s > near poles: sech d1: 152 failures; first z=(-9.7656250e-4 -4.7123890e0), re: got -3.944863463464010e-7, expected -3.944863463616931e-7, error=1.53e-17, tolerance=1.12e-20; component accuracy
315.75 s > near poles: sech d2: 152 failures; first z=(-9.7656250e-4 -4.7123890e0), re: got -1.211862055976059e-3, expected -1.211862056023036e-3, error=4.70e-14, tolerance=3.44e-17; component accuracy
315.75 s > near poles: tanh d2: 152 failures; first z=(-9.7656250e-4 -4.7123890e0), re: got -2.147483647916624e9, expected -2.147483647999870e9, error=8.32e-2, tolerance=6.10e-5; component accuracy
315.75 s > pole neighbors: coth d1: 4 failures; first z=(0 -4.9406565e-324), re: got NaN, expected inf, error=NaN, tolerance=inf; expected signed infinity
315.75 s > pole neighbors: coth d2: 28 failures; first z=(0 -4.7123890e0), re: got NaN, expected -0, error=NaN, tolerance=9.88e-324; unexpected nonfinite result
315.75 s > pole neighbors: csch d1: 28 failures; first z=(0 -4.7123890e0), re: got NaN, expected 7.044813998280222e-16, error=NaN, tolerance=2.00e-29; unexpected nonfinite result
315.75 s > pole neighbors: csch d2: 28 failures; first z=(0 -4.7123890e0), re: got NaN, expected -0, error=NaN, tolerance=9.88e-324; unexpected nonfinite result
315.75 s > pole neighbors: sech d1: 24 failures; first z=(0 -4.7123890e0), re: got NaN, expected 0, error=NaN, tolerance=9.88e-324; unexpected nonfinite result
315.75 s > pole neighbors: sech d2: 24 failures; first z=(0 -4.7123890e0), re: got NaN, expected -5.720334200684975e45, error=NaN, tolerance=1.63e32; unexpected nonfinite result
315.75 s > pole neighbors: tanh d2: 24 failures; first z=(0 -4.7123890e0), re: got NaN, expected -0, error=NaN, tolerance=9.88e-324; unexpected nonfinite result
315.75 s > range boundary: cosh d1: 58 failures; first z=(-7.1100000e2 0), im: got NaN, expected 0, error=NaN, tolerance=9.88e-324; unexpected nonfinite result
315.75 s > range boundary: cosh d2: 58 failures; first z=(-7.1100000e2 0), im: got NaN, expected -0, error=NaN, tolerance=9.88e-324; unexpected nonfinite result
315.75 s > range boundary: coth d1: 40 failures; first z=(-3.5600000e2 0), re: got -0, expected -2.423197856799843e-309, error=2.42e-309, tolerance=2.47e-324; premature zero
315.75 s > range boundary: coth d2: 480 failures; first z=(-3.5600000e2 0), re: got NaN, expected -4.846395713599686e-309, error=NaN, tolerance=1.48e-322; unexpected nonfinite result
315.75 s > range boundary: csch d1: 480 failures; first z=(-3.5600000e2 0), re: got NaN, expected -4.922598761629717e-155, error=NaN, tolerance=1.40e-168; unexpected nonfinite result
315.75 s > range boundary: csch d2: 480 failures; first z=(-3.5600000e2 0), re: got NaN, expected -4.922598761629717e-155, error=NaN, tolerance=1.40e-168; unexpected nonfinite result
315.75 s > range boundary: sech d1: 480 failures; first z=(-3.5600000e2 0), re: got NaN, expected 4.922598761629717e-155, error=NaN, tolerance=1.40e-168; unexpected nonfinite result
315.75 s > range boundary: sech d2: 480 failures; first z=(-3.5600000e2 0), re: got NaN, expected 4.922598761629717e-155, error=NaN, tolerance=1.40e-168; unexpected nonfinite result
315.75 s > range boundary: sinh d1: 58 failures; first z=(-7.1100000e2 0), im: got NaN, expected -0, error=NaN, tolerance=9.88e-324; unexpected nonfinite result
315.75 s > range boundary: sinh d2: 58 failures; first z=(-7.1100000e2 0), im: got NaN, expected 0, error=NaN, tolerance=9.88e-324; unexpected nonfinite result
315.75 s > range boundary: tanh d1: 40 failures; first z=(-3.5600000e2 0), re: got 0, expected 2.423197856799843e-309, error=-2.42e-309, tolerance=2.47e-324; premature zero
315.75 s > range boundary: tanh d2: 480 failures; first z=(-3.5600000e2 0), re: got NaN, expected 4.846395713599686e-309, error=NaN, tolerance=1.48e-322; unexpected nonfinite result
315.75 s > tiny: coth d1: 88 failures; first z=(-9.3132257e-10 -9.3132257e-10), re: got 0, expected 3.333333333333333e-1, error=-3.33e-1, tolerance=2.47e-324; premature zero
315.75 s > tiny: coth d2: 80 failures; first z=(-2.4099199e-181 0), re: got NaN, expected -inf, error=NaN, tolerance=inf; expected signed infinity
315.75 s > tiny: csch d1: 88 failures; first z=(-9.3132257e-10 -9.3132257e-10), re: got 0, expected -1.666666666666667e-1, error=1.67e-1, tolerance=2.47e-324; premature zero
315.75 s > tiny: csch d2: 80 failures; first z=(-2.4099199e-181 0), re: got NaN, expected -inf, error=NaN, tolerance=inf; expected signed infinity
315.75 s > unequal components: cosh d1: 8 failures; first z=(7.1100000e2 1.0000000e-300), im: got inf, expected 3.036313688864996e8, error=inf, tolerance=8.63e-6; unexpected nonfinite result
315.75 s > unequal components: cosh d2: 8 failures; first z=(7.1100000e2 1.0000000e-300), im: got inf, expected 3.036313688864996e8, error=inf, tolerance=8.63e-6; unexpected nonfinite result
315.75 s > unequal components: coth d1: 4 failures; first z=(3.5600000e2 1.0000000e-300), re: got 0, expected -2.423197856799566e-309, error=2.42e-309, tolerance=2.47e-324; premature zero
315.75 s > unequal components: coth d2: 24 failures; first z=(3.5600000e2 1.0000000e-300), re: got NaN, expected 4.846395713599132e-309, error=NaN, tolerance=1.48e-322; unexpected nonfinite result
315.75 s > unequal components: csch d1: 24 failures; first z=(3.5600000e2 1.0000000e-300), re: got NaN, expected -4.922598761629437e-155, error=NaN, tolerance=1.40e-168; unexpected nonfinite result
315.75 s > unequal components: csch d2: 24 failures; first z=(3.5600000e2 1.0000000e-300), re: got NaN, expected 4.922598761629437e-155, error=NaN, tolerance=1.40e-168; unexpected nonfinite result
315.75 s > unequal components: sech d1: 24 failures; first z=(3.5600000e2 1.0000000e-300), re: got NaN, expected -4.922598761629437e-155, error=NaN, tolerance=1.40e-168; unexpected nonfinite result
315.75 s > unequal components: sech d2: 28 failures; first z=(3.5600000e2 1.0000000e-300), re: got NaN, expected 4.922598761629437e-155, error=NaN, tolerance=1.40e-168; unexpected nonfinite result
315.75 s > unequal components: sinh d1: 8 failures; first z=(7.1100000e2 1.0000000e-300), im: got inf, expected 3.036313688864996e8, error=inf, tolerance=8.63e-6; unexpected nonfinite result
315.75 s > unequal components: sinh d2: 8 failures; first z=(7.1100000e2 1.0000000e-300), im: got inf, expected 3.036313688864996e8, error=inf, tolerance=8.63e-6; unexpected nonfinite result
315.75 s > unequal components: tanh d1: 4 failures; first z=(3.5600000e2 1.0000000e-300), re: got 0, expected 2.423197856799566e-309, error=-2.42e-309, tolerance=2.47e-324; premature zero
315.75 s > unequal components: tanh d2: 24 failures; first z=(3.5600000e2 1.0000000e-300), re: got NaN, expected -4.846395713599132e-309, error=NaN, tolerance=1.48e-322; unexpected nonfinite result
315.75 s > Location: crates/gammalooprs/src/integrands/process/evaluators/hyperbolic_tests.rs:312
315.75 s > ━━━━━━━━━━━━━━━━━━━━━━━━━━━━━━━━━━ BACKTRACE ━━━━━━━━━━━━━━━━━━━━━━━━━━━━━━━━━━━
315.75 s > 1: <color_eyre[51793ea62743adbd]::config::PanicHook>::panic_report<unknown>
315.75 s > at <unknown source file>:<unknown line>
315.75 s > 2: <color_eyre[51793ea62743adbd]::config::PanicHook>::into_panic_hook::{closure#0}<unknown>
315.75 s > at <unknown source file>:<unknown line>
315.75 s > 3: std[bcb96dfbba0ab899]::panicking::panic_with_hook<unknown>
315.75 s > at <unknown source file>:<unknown line>
315.75 s > 4: std[bcb96dfbba0ab899]::panicking::panic_handler::{closure#0}<unknown>
315.75 s > at <unknown source file>:<unknown line>
315.75 s > 5: std[bcb96dfbba0ab899]::sys::backtrace::__rust_end_short_backtrace::<std[bcb96dfbba0ab899]::panicking::panic_handler::{closure#0}, !><unknown>
315.75 s > at <unknown source file>:<unknown line>
315.75 s > 6: __rustc[6c289b9f9c454d21]::rust_begin_unwind<unknown>
315.75 s > at <unknown source file>:<unknown line>
315.75 s > 7: core[940e698046960fd5]::panicking::panic_fmt<unknown>
315.75 s > at <unknown source file>:<unknown line>
315.75 s > 8: <gammalooprs[e669b34b0f7bca9e]::integrands::process::evaluators::hyperbolic_tests::Checks>::finish<unknown>
315.75 s > at <unknown source file>:<unknown line>
315.75 s > 9: gammalooprs[e669b34b0f7bca9e]::integrands::process::evaluators::hyperbolic_tests::check_backend::<f64, gammalooprs[e669b34b0f7bca9e]::integrands::process::evaluators::hyperbolic_tests::hyperbolic_symjit_o0::{closure#0}><unknown>
315.75 s > at <unknown source file>:<unknown line>
315.75 s > 10: gammalooprs[e669b34b0f7bca9e]::integrands::process::evaluators::hyperbolic_tests::hyperbolic_symjit_o0<unknown>
315.75 s > at <unknown source file>:<unknown line>
315.75 s > 11: <gammalooprs[e669b34b0f7bca9e]::integrands::process::evaluators::hyperbolic_tests::hyperbolic_symjit_o0::{closure#0} as core[940e698046960fd5]::ops::function::FnOnce<()>>::call_once<unknown>
315.75 s > at <unknown source file>:<unknown line>
315.75 s > 12: test[75d6903177b1d7e9]::__rust_begin_short_backtrace::<core[940e698046960fd5]::result::Result<(), alloc[2ea6bcb46fca0c42]::string::String>, fn() -> core[940e698046960fd5]::result::Result<(), alloc[2ea6bcb46fca0c42]::string::String>><unknown>
315.75 s > at <unknown source file>:<unknown line>
315.75 s > 13: test[75d6903177b1d7e9]::run_test::{closure#0}<unknown>
315.75 s > at <unknown source file>:<unknown line>
315.75 s > 14: std[bcb96dfbba0ab899]::sys::backtrace::__rust_begin_short_backtrace::<test[75d6903177b1d7e9]::run_test::{closure#1}, ()><unknown>
315.75 s > at <unknown source file>:<unknown line>
315.75 s > 15: <std[bcb96dfbba0ab899]::thread::lifecycle::spawn_unchecked<test[75d6903177b1d7e9]::run_test::{closure#1}, ()>::{closure#1} as core[940e698046960fd5]::ops::function::FnOnce<()>>::call_once::{shim:vtable#0}<unknown>
315.75 s > at <unknown source file>:<unknown line>
315.75 s > 16: <std[bcb96dfbba0ab899]::sys::thread::unix::Thread>::new::thread_start<unknown>
315.75 s > at <unknown source file>:<unknown line>
315.75 s > infinite real part: coth d0: 8 failures; first z=(inf 0), re: got NaN, expected 1.000000000000000e0, error=NaN, tolerance=2.84e-14; unexpected nonfinite result
315.75 s > infinite real part: csch d0: 8 failures; first z=(inf 0), re: got NaN, expected 0, error=NaN, tolerance=9.88e-324; unexpected nonfinite result
315.75 s > infinite real part: sech d0: 8 failures; first z=(inf 0), re: got NaN, expected 0, error=NaN, tolerance=9.88e-324; unexpected nonfinite result
315.75 s > infinite real part: tanh d0: 4 failures; first z=(inf 0), re: got NaN, expected 1.000000000000000e0, error=NaN, tolerance=2.84e-14; unexpected nonfinite result
315.75 s > near poles: coth d0: 152 failures; first z=(-9.7656250e-4 -4.7123890e0), re: got -9.765621895780896e-4, expected -9.765621895592603e-4, error=-1.88e-14, tolerance=2.78e-17; component accuracy
315.75 s > near poles: tanh d0: 152 failures; first z=(-9.7656250e-4 -4.7123890e0), re: got -1.024000325500965e3, expected -1.024000325520813e3, error=1.98e-8, tolerance=2.91e-11; component accuracy
315.75 s > pole neighbors: coth d0: 24 failures; first z=(0 -4.7123890e0), re: got NaN, expected 0, error=NaN, tolerance=9.88e-324; unexpected nonfinite result
315.75 s > pole neighbors: tanh d0: 24 failures; first z=(0 -4.7123890e0), re: got NaN, expected 0, error=NaN, tolerance=9.88e-324; unexpected nonfinite result
315.75 s > Symbolic derivative failures (composed expressions; cancellation may reduce accuracy):
315.75 s > UV: cosh d1: 6 failures; first z=(-1.0000000e12 0), im: got NaN, expected 0, error=NaN, tolerance=9.88e-324; unexpected nonfinite result
315.75 s > UV: cosh d2: 6 failures; first z=(-1.0000000e12 0), im: got NaN, expected -0, error=NaN, tolerance=9.88e-324; unexpected nonfinite result
315.75 s > UV: coth d1: 24 failures; first z=(-1.0000000e12 0), re: got NaN, expected -0, error=NaN, tolerance=9.88e-324; unexpected nonfinite result
315.75 s > UV: coth d2: 24 failures; first z=(-1.0000000e12 0), re: got NaN, expected 0, error=NaN, tolerance=9.88e-324; unexpected nonfinite result
315.75 s > UV: csch d1: 24 failures; first z=(-1.0000000e12 0), re: got NaN, expected 0, error=NaN, tolerance=9.88e-324; unexpected nonfinite result
315.75 s > UV: csch d2: 24 failures; first z=(-1.0000000e12 0), re: got NaN, expected 0, error=NaN, tolerance=9.88e-324; unexpected nonfinite result
315.75 s > UV: sech d1: 24 failures; first z=(-1.0000000e12 0), re: got NaN, expected 0, error=NaN, tolerance=9.88e-324; unexpected nonfinite result
315.75 s > UV: sech d2: 24 failures; first z=(-1.0000000e12 0), re: got NaN, expected 0, error=NaN, tolerance=9.88e-324; unexpected nonfinite result
315.75 s > UV: sinh d1: 6 failures; first z=(-1.0000000e12 0), im: got NaN, expected -0, error=NaN, tolerance=9.88e-324; unexpected nonfinite result
315.75 s > UV: sinh d2: 6 failures; first z=(-1.0000000e12 0), im: got NaN, expected 0, error=NaN, tolerance=9.88e-324; unexpected nonfinite result
315.75 s > UV: tanh d1: 24 failures; first z=(-1.0000000e12 0), re: got NaN, expected 0, error=NaN, tolerance=9.88e-324; unexpected nonfinite result
315.75 s > UV: tanh d2: 24 failures; first z=(-1.0000000e12 0), re: got NaN, expected 0, error=NaN, tolerance=9.88e-324; unexpected nonfinite result
315.75 s > near poles: coth d1: 4 failures; first z=(-9.3326362e-302 0), im: got NaN, expected -0, error=NaN, tolerance=9.88e-324; unexpected nonfinite result
315.75 s > near poles: coth d2: 156 failures; first z=(-9.7656250e-4 -4.7123890e0), re: got 1.953122516512806e-3, expected 1.953122516475148e-3, error=3.77e-14, tolerance=5.55e-17; component accuracy
315.75 s > near poles: csch d1: 152 failures; first z=(-9.7656250e-4 -4.7123890e0), re: got -1.836965819127374e-16, expected -1.836965819047030e-16, error=-8.03e-27, tolerance=5.22e-30; component accuracy
315.75 s > near poles: csch d2: 140 failures; first z=(-9.7656250e-4 -4.7123890e0), re: got -8.969563655434003e-19, expected -8.969563655207907e-19, error=-2.26e-29, tolerance=2.55e-32; component accuracy
315.75 s > near poles: sech d1: 152 failures; first z=(-9.7656250e-4 -4.7123890e0), re: got -3.944863463555240e-7, expected -3.944863463616931e-7, error=6.17e-18, tolerance=1.12e-20; component accuracy
315.75 s > near poles: sech d2: 152 failures; first z=(-9.7656250e-4 -4.7123890e0), re: got -1.211862056002572e-3, expected -1.211862056023036e-3, error=2.05e-14, tolerance=3.44e-17; component accuracy
315.75 s > near poles: tanh d2: 152 failures; first z=(-9.7656250e-4 -4.7123890e0), re: got -2.147483647958246e9, expected -2.147483647999870e9, error=4.16e-2, tolerance=6.10e-5; component accuracy
315.75 s > pole neighbors: coth d1: 4 failures; first z=(0 -4.9406565e-324), re: got NaN, expected inf, error=NaN, tolerance=inf; expected signed infinity
315.75 s > pole neighbors: coth d2: 28 failures; first z=(0 -4.7123890e0), re: got NaN, expected -0, error=NaN, tolerance=9.88e-324; unexpected nonfinite result
315.75 s > pole neighbors: csch d1: 28 failures; first z=(0 -4.7123890e0), re: got NaN, expected 7.044813998280222e-16, error=NaN, tolerance=2.00e-29; unexpected nonfinite result
315.75 s > pole neighbors: csch d2: 28 failures; first z=(0 -4.7123890e0), re: got NaN, expected -0, error=NaN, tolerance=9.88e-324; unexpected nonfinite result
315.75 s > pole neighbors: sech d1: 24 failures; first z=(0 -4.7123890e0), re: got NaN, expected 0, error=NaN, tolerance=9.88e-324; unexpected nonfinite result
315.75 s > pole neighbors: sech d2: 24 failures; first z=(0 -4.7123890e0), re: got NaN, expected -5.720334200684975e45, error=NaN, tolerance=1.63e32; unexpected nonfinite result
315.75 s > pole neighbors: tanh d2: 24 failures; first z=(0 -4.7123890e0), re: got NaN, expected -0, error=NaN, tolerance=9.88e-324; unexpected nonfinite result
315.75 s > tiny: coth d1: 72 failures; first z=(-9.3132257e-10 -9.3132257e-10), re: got 0, expected 3.333333333333333e-1, error=-3.33e-1, tolerance=2.47e-324; premature zero
315.75 s > tiny: coth d2: 64 failures; first z=(-2.4099199e-181 0), im: got NaN, expected -0, error=NaN, tolerance=9.88e-324; unexpected nonfinite result
315.75 s > tiny: csch d1: 40 failures; first z=(-9.3132257e-10 -9.3132257e-10), re: got 0, expected -1.666666666666667e-1, error=1.67e-1, tolerance=2.47e-324; premature zero
315.75 s > tiny: csch d2: 64 failures; first z=(-2.4099199e-181 0), im: got NaN, expected -0, error=NaN, tolerance=9.88e-324; unexpected nonfinite result
315.75 s > unequal components: sech d2: 4 failures; first z=(4.9406565e-324 3.5600000e2), im: got -2.914987310463355e-322, expected -2.766767616710981e-322, error=-1.48e-323, tolerance=9.88e-324; component accuracy
315.75 s > Location: crates/gammalooprs/src/integrands/process/evaluators/hyperbolic_tests.rs:312
315.75 s > ━━━━━━━━━━━━━━━━━━━━━━━━━━━━━━━━━━ BACKTRACE ━━━━━━━━━━━━━━━━━━━━━━━━━━━━━━━━━━━
315.75 s > 1: <color_eyre[51793ea62743adbd]::config::PanicHook>::panic_report<unknown>
315.75 s > at <unknown source file>:<unknown line>
315.75 s > 2: <color_eyre[51793ea62743adbd]::config::PanicHook>::into_panic_hook::{closure#0}<unknown>
315.75 s > at <unknown source file>:<unknown line>
315.75 s > 3: std[bcb96dfbba0ab899]::panicking::panic_with_hook<unknown>
315.75 s > at <unknown source file>:<unknown line>
315.75 s > 4: std[bcb96dfbba0ab899]::panicking::panic_handler::{closure#0}<unknown>
315.75 s > at <unknown source file>:<unknown line>
315.75 s > 5: std[bcb96dfbba0ab899]::sys::backtrace::__rust_end_short_backtrace::<std[bcb96dfbba0ab899]::panicking::panic_handler::{closure#0}, !><unknown>
315.75 s > at <unknown source file>:<unknown line>
315.75 s > 6: __rustc[6c289b9f9c454d21]::rust_begin_unwind<unknown>
315.75 s > at <unknown source file>:<unknown line>
315.75 s > 7: core[940e698046960fd5]::panicking::panic_fmt<unknown>
315.75 s > at <unknown source file>:<unknown line>
315.75 s > 8: <gammalooprs[e669b34b0f7bca9e]::integrands::process::evaluators::hyperbolic_tests::Checks>::finish<unknown>
315.75 s > at <unknown source file>:<unknown line>
315.75 s > 9: gammalooprs[e669b34b0f7bca9e]::integrands::process::evaluators::hyperbolic_tests::check_backend::<f64, gammalooprs[e669b34b0f7bca9e]::integrands::process::evaluators::hyperbolic_tests::hyperbolic_eager_f64::{closure#0}><unknown>
315.75 s > at <unknown source file>:<unknown line>
315.75 s > 10: <gammalooprs[e669b34b0f7bca9e]::integrands::process::evaluators::hyperbolic_tests::hyperbolic_eager_f64::{closure#0} as core[940e698046960fd5]::ops::function::FnOnce<()>>::call_once<unknown>
315.75 s > at <unknown source file>:<unknown line>
315.75 s > 11: test[75d6903177b1d7e9]::__rust_begin_short_backtrace::<core[940e698046960fd5]::result::Result<(), alloc[2ea6bcb46fca0c42]::string::String>, fn() -> core[940e698046960fd5]::result::Result<(), alloc[2ea6bcb46fca0c42]::string::String>><unknown>
315.75 s > at <unknown source file>:<unknown line>
315.75 s > 12: test[75d6903177b1d7e9]::run_test::{closure#0}<unknown>
315.75 s > at <unknown source file>:<unknown line>
315.75 s > 13: std[bcb96dfbba0ab899]::sys::backtrace::__rust_begin_short_backtrace::<test[75d6903177b1d7e9]::run_test::{closure#1}, ()><unknown>
315.75 s > at <unknown source file>:<unknown line>
315.75 s > 14: <std[bcb96dfbba0ab899]::thread::lifecycle::spawn_unchecked<test[75d6903177b1d7e9]::run_test::{closure#1}, ()>::{closure#1} as core[940e698046960fd5]::ops::function::FnOnce<()>>::call_once::{shim:vtable#0}<unknown>
315.75 s > at <unknown source file>:<unknown line>
315.75 s > 15: <std[bcb96dfbba0ab899]::sys::thread::unix::Thread>::new::thread_start<unknown>
315.75 s > at <unknown source file>:<unknown line>
315.75 s > infinite real part: coth d0: 8 failures; first z=(inf 0), re: got NaN, expected 1.000000000000000e0, error=NaN, tolerance=2.84e-14; unexpected nonfinite result
315.75 s > infinite real part: tanh d0: 4 failures; first z=(inf 0), re: got NaN, expected 1.000000000000000e0, error=NaN, tolerance=2.84e-14; unexpected nonfinite result
315.75 s > near poles: coth d0: 160 failures; first z=(-9.7656250e-4 -4.7123890e0), re: got -9.765621895971165e-4, expected -9.765621895592603e-4, error=-3.79e-14, tolerance=2.78e-17; component accuracy
315.75 s > near poles: csch d0: 8 failures; first z=(-9.3326362e-302 0), re: got -inf, expected -1.071508607186267e301, error=-inf, tolerance=3.05e287; unexpected nonfinite result
315.75 s > near poles: tanh d0: 152 failures; first z=(-9.7656250e-4 -4.7123890e0), re: got -1.024000325481117e3, expected -1.024000325520813e3, error=3.97e-8, tolerance=2.91e-11; component accuracy
315.75 s > pole neighbors: coth d0: 26 failures; first z=(0 -4.7123890e0), re: got NaN, expected 0, error=NaN, tolerance=9.88e-324; unexpected nonfinite result
315.75 s > pole neighbors: csch d0: 2 failures; first z=(0 -4.9406565e-324), re: got NaN, expected 0, error=NaN, tolerance=9.88e-324; unexpected nonfinite result
315.75 s > pole neighbors: tanh d0: 24 failures; first z=(0 -4.7123890e0), re: got NaN, expected 0, error=NaN, tolerance=9.88e-324; unexpected nonfinite result
315.75 s > range boundary: cosh d0: 58 failures; first z=(-7.1100000e2 0), im: got NaN, expected -0, error=NaN, tolerance=9.88e-324; unexpected nonfinite result
315.75 s > range boundary: coth d0: 480 failures; first z=(-3.5600000e2 0), re: got NaN, expected -1.000000000000000e0, error=NaN, tolerance=2.84e-14; unexpected nonfinite result
315.75 s > range boundary: csch d0: 308 failures; first z=(-3.5600000e2 0), re: got -0, expected -4.922598761629717e-155, error=4.92e-155, tolerance=2.47e-324; premature zero
315.75 s > range boundary: sech d0: 308 failures; first z=(-3.5600000e2 0), re: got 0, expected 4.922598761629717e-155, error=-4.92e-155, tolerance=2.47e-324; premature zero
315.75 s > range boundary: sinh d0: 58 failures; first z=(-7.1100000e2 0), im: got NaN, expected 0, error=NaN, tolerance=9.88e-324; unexpected nonfinite result
315.75 s > range boundary: tanh d0: 268 failures; first z=(-3.5600000e2 0), re: got NaN, expected -1.000000000000000e0, error=NaN, tolerance=2.84e-14; unexpected nonfinite result
315.75 s > tiny: coth d0: 68 failures; first z=(-2.4099199e-181 0), re: got -inf, expected -4.149515568880993e180, error=-inf, tolerance=1.18e167; unexpected nonfinite result
315.75 s > tiny: csch d0: 68 failures; first z=(-2.4099199e-181 0), re: got -inf, expected -4.149515568880993e180, error=-inf, tolerance=1.18e167; unexpected nonfinite result
315.75 s > unequal components: cosh d0: 8 failures; first z=(7.1100000e2 1.0000000e-300), im: got inf, expected 3.036313688864996e8, error=inf, tolerance=8.63e-6; unexpected nonfinite result
315.75 s > unequal components: coth d0: 24 failures; first z=(3.5600000e2 1.0000000e-300), re: got NaN, expected 1.000000000000000e0, error=NaN, tolerance=2.84e-14; unexpected nonfinite result
315.75 s > unequal components: csch d0: 8 failures; first z=(3.5600000e2 1.0000000e-300), re: got 0, expected 4.922598761629437e-155, error=-4.92e-155, tolerance=2.47e-324; premature zero
315.75 s > unequal components: sech d0: 8 failures; first z=(3.5600000e2 1.0000000e-300), re: got 0, expected 4.922598761629437e-155, error=-4.92e-155, tolerance=2.47e-324; premature zero
315.75 s > unequal components: sinh d0: 8 failures; first z=(7.1100000e2 1.0000000e-300), im: got inf, expected 3.036313688864996e8, error=inf, tolerance=8.63e-6; unexpected nonfinite result
315.75 s > unequal components: tanh d0: 12 failures; first z=(3.5600000e2 1.0000000e-300), re: got NaN, expected 1.000000000000000e0, error=NaN, tolerance=2.84e-14; unexpected nonfinite result
315.75 s > Symbolic derivative failures (composed expressions; cancellation may reduce accuracy):
315.75 s > UV: cosh d1: 8 failures; first z=(-1.0000000e3 0), im: got NaN, expected 0, error=NaN, tolerance=9.88e-324; unexpected nonfinite result
315.75 s > UV: cosh d2: 8 failures; first z=(-1.0000000e3 0), im: got NaN, expected -0, error=NaN, tolerance=9.88e-324; unexpected nonfinite result
315.75 s > UV: coth d2: 32 failures; first z=(-1.0000000e3 0), re: got NaN, expected -0, error=NaN, tolerance=9.88e-324; unexpected nonfinite result
315.75 s > UV: csch d1: 32 failures; first z=(-1.0000000e3 0), re: got NaN, expected -0, error=NaN, tolerance=9.88e-324; unexpected nonfinite result
315.75 s > UV: csch d2: 32 failures; first z=(-1.0000000e3 0), re: got NaN, expected -0, error=NaN, tolerance=9.88e-324; unexpected nonfinite result
315.75 s > UV: sech d1: 32 failures; first z=(-1.0000000e3 0), re: got NaN, expected 0, error=NaN, tolerance=9.88e-324; unexpected nonfinite result
315.75 s > UV: sech d2: 32 failures; first z=(-1.0000000e3 0), re: got NaN, expected 0, error=NaN, tolerance=9.88e-324; unexpected nonfinite result
315.75 s > UV: sinh d1: 8 failures; first z=(-1.0000000e3 0), im: got NaN, expected -0, error=NaN, tolerance=9.88e-324; unexpected nonfinite result
315.75 s > UV: sinh d2: 8 failures; first z=(-1.0000000e3 0), im: got NaN, expected 0, error=NaN, tolerance=9.88e-324; unexpected nonfinite result
315.75 s > UV: tanh d2: 32 failures; first z=(-1.0000000e3 0), re: got NaN, expected 0, error=NaN, tolerance=9.88e-324; unexpected nonfinite result
315.75 s > near poles: coth d1: 8 failures; first z=(-9.3326362e-302 0), re: got NaN, expected -inf, error=NaN, tolerance=inf; expected signed infinity
315.75 s > near poles: coth d2: 160 failures; first z=(-9.7656250e-4 -4.7123890e0), re: got 1.953122516550860e-3, expected 1.953122516475148e-3, error=7.57e-14, tolerance=5.55e-17; component accuracy
315.75 s > near poles: csch d1: 160 failures; first z=(-9.7656250e-4 -4.7123890e0), re: got -1.836965819118240e-16, expected -1.836965819047030e-16, error=-7.12e-27, tolerance=5.22e-30; component accuracy
315.75 s > near poles: csch d2: 112 failures; first z=(-9.7656250e-4 -4.7123890e0), re: got -8.969563655486067e-19, expected -8.969563655207907e-19, error=-2.78e-29, tolerance=2.55e-32; component accuracy
315.75 s > near poles: sech d1: 152 failures; first z=(-9.7656250e-4 -4.7123890e0), re: got -3.944863463464010e-7, expected -3.944863463616931e-7, error=1.53e-17, tolerance=1.12e-20; component accuracy
315.75 s > near poles: sech d2: 152 failures; first z=(-9.7656250e-4 -4.7123890e0), re: got -1.211862055976059e-3, expected -1.211862056023036e-3, error=4.70e-14, tolerance=3.44e-17; component accuracy
315.75 s > near poles: tanh d2: 152 failures; first z=(-9.7656250e-4 -4.7123890e0), re: got -2.147483647916624e9, expected -2.147483647999870e9, error=8.32e-2, tolerance=6.10e-5; component accuracy
315.75 s > pole neighbors: coth d1: 4 failures; first z=(0 -4.9406565e-324), re: got NaN, expected inf, error=NaN, tolerance=inf; expected signed infinity
315.75 s > pole neighbors: coth d2: 28 failures; first z=(0 -4.7123890e0), re: got NaN, expected -0, error=NaN, tolerance=9.88e-324; unexpected nonfinite result
315.75 s > pole neighbors: csch d1: 28 failures; first z=(0 -4.7123890e0), re: got NaN, expected 7.044813998280222e-16, error=NaN, tolerance=2.00e-29; unexpected nonfinite result
315.75 s > pole neighbors: csch d2: 28 failures; first z=(0 -4.7123890e0), re: got NaN, expected -0, error=NaN, tolerance=9.88e-324; unexpected nonfinite result
315.75 s > pole neighbors: sech d1: 24 failures; first z=(0 -4.7123890e0), re: got NaN, expected 0, error=NaN, tolerance=9.88e-324; unexpected nonfinite result
315.75 s > pole neighbors: sech d2: 24 failures; first z=(0 -4.7123890e0), re: got NaN, expected -5.720334200684975e45, error=NaN, tolerance=1.63e32; unexpected nonfinite result
315.75 s > pole neighbors: tanh d2: 24 failures; first z=(0 -4.7123890e0), re: got NaN, expected -0, error=NaN, tolerance=9.88e-324; unexpected nonfinite result
315.75 s > range boundary: cosh d1: 58 failures; first z=(-7.1100000e2 0), im: got NaN, expected 0, error=NaN, tolerance=9.88e-324; unexpected nonfinite result
315.75 s > range boundary: cosh d2: 58 failures; first z=(-7.1100000e2 0), im: got NaN, expected -0, error=NaN, tolerance=9.88e-324; unexpected nonfinite result
315.75 s > range boundary: coth d1: 40 failures; first z=(-3.5600000e2 0), re: got -0, expected -2.423197856799843e-309, error=2.42e-309, tolerance=2.47e-324; premature zero
315.75 s > range boundary: coth d2: 480 failures; first z=(-3.5600000e2 0), re: got NaN, expected -4.846395713599686e-309, error=NaN, tolerance=1.48e-322; unexpected nonfinite result
315.75 s > range boundary: csch d1: 480 failures; first z=(-3.5600000e2 0), re: got NaN, expected -4.922598761629717e-155, error=NaN, tolerance=1.40e-168; unexpected nonfinite result
315.75 s > range boundary: csch d2: 480 failures; first z=(-3.5600000e2 0), re: got NaN, expected -4.922598761629717e-155, error=NaN, tolerance=1.40e-168; unexpected nonfinite result
315.75 s > range boundary: sech d1: 480 failures; first z=(-3.5600000e2 0), re: got NaN, expected 4.922598761629717e-155, error=NaN, tolerance=1.40e-168; unexpected nonfinite result
315.75 s > range boundary: sech d2: 480 failures; first z=(-3.5600000e2 0), re: got NaN, expected 4.922598761629717e-155, error=NaN, tolerance=1.40e-168; unexpected nonfinite result
315.75 s > range boundary: sinh d1: 58 failures; first z=(-7.1100000e2 0), im: got NaN, expected -0, error=NaN, tolerance=9.88e-324; unexpected nonfinite result
315.75 s > range boundary: sinh d2: 58 failures; first z=(-7.1100000e2 0), im: got NaN, expected 0, error=NaN, tolerance=9.88e-324; unexpected nonfinite result
315.75 s > range boundary: tanh d1: 40 failures; first z=(-3.5600000e2 0), re: got 0, expected 2.423197856799843e-309, error=-2.42e-309, tolerance=2.47e-324; premature zero
315.75 s > range boundary: tanh d2: 480 failures; first z=(-3.5600000e2 0), re: got NaN, expected 4.846395713599686e-309, error=NaN, tolerance=1.48e-322; unexpected nonfinite result
315.75 s > tiny: coth d1: 88 failures; first z=(-9.3132257e-10 -9.3132257e-10), re: got 0, expected 3.333333333333333e-1, error=-3.33e-1, tolerance=2.47e-324; premature zero
315.75 s > tiny: coth d2: 80 failures; first z=(-2.4099199e-181 0), re: got NaN, expected -inf, error=NaN, tolerance=inf; expected signed infinity
315.75 s > tiny: csch d1: 88 failures; first z=(-9.3132257e-10 -9.3132257e-10), re: got 0, expected -1.666666666666667e-1, error=1.67e-1, tolerance=2.47e-324; premature zero
315.75 s > tiny: csch d2: 80 failures; first z=(-2.4099199e-181 0), re: got NaN, expected -inf, error=NaN, tolerance=inf; expected signed infinity
315.75 s > unequal components: cosh d1: 8 failures; first z=(7.1100000e2 1.0000000e-300), im: got inf, expected 3.036313688864996e8, error=inf, tolerance=8.63e-6; unexpected nonfinite result
315.75 s > unequal components: cosh d2: 8 failures; first z=(7.1100000e2 1.0000000e-300), im: got inf, expected 3.036313688864996e8, error=inf, tolerance=8.63e-6; unexpected nonfinite result
315.75 s > unequal components: coth d1: 4 failures; first z=(3.5600000e2 1.0000000e-300), re: got 0, expected -2.423197856799566e-309, error=2.42e-309, tolerance=2.47e-324; premature zero
315.75 s > unequal components: coth d2: 24 failures; first z=(3.5600000e2 1.0000000e-300), re: got NaN, expected 4.846395713599132e-309, error=NaN, tolerance=1.48e-322; unexpected nonfinite result
315.75 s > unequal components: csch d1: 24 failures; first z=(3.5600000e2 1.0000000e-300), re: got NaN, expected -4.922598761629437e-155, error=NaN, tolerance=1.40e-168; unexpected nonfinite result
315.75 s > unequal components: csch d2: 24 failures; first z=(3.5600000e2 1.0000000e-300), re: got NaN, expected 4.922598761629437e-155, error=NaN, tolerance=1.40e-168; unexpected nonfinite result
315.75 s > unequal components: sech d1: 24 failures; first z=(3.5600000e2 1.0000000e-300), re: got NaN, expected -4.922598761629437e-155, error=NaN, tolerance=1.40e-168; unexpected nonfinite result
315.75 s > unequal components: sech d2: 28 failures; first z=(3.5600000e2 1.0000000e-300), re: got NaN, expected 4.922598761629437e-155, error=NaN, tolerance=1.40e-168; unexpected nonfinite result
315.75 s > unequal components: sinh d1: 8 failures; first z=(7.1100000e2 1.0000000e-300), im: got inf, expected 3.036313688864996e8, error=inf, tolerance=8.63e-6; unexpected nonfinite result
315.75 s > unequal components: sinh d2: 8 failures; first z=(7.1100000e2 1.0000000e-300), im: got inf, expected 3.036313688864996e8, error=inf, tolerance=8.63e-6; unexpected nonfinite result
315.75 s > unequal components: tanh d1: 4 failures; first z=(3.5600000e2 1.0000000e-300), re: got 0, expected 2.423197856799566e-309, error=-2.42e-309, tolerance=2.47e-324; premature zero
315.75 s > unequal components: tanh d2: 24 failures; first z=(3.5600000e2 1.0000000e-300), re: got NaN, expected -4.846395713599132e-309, error=NaN, tolerance=1.48e-322; unexpected nonfinite result
315.75 s > Location: crates/gammalooprs/src/integrands/process/evaluators/hyperbolic_tests.rs:312
315.75 s > ━━━━━━━━━━━━━━━━━━━━━━━━━━━━━━━━━━ BACKTRACE ━━━━━━━━━━━━━━━━━━━━━━━━━━━━━━━━━━━
315.75 s > 1: <color_eyre[51793ea62743adbd]::config::PanicHook>::panic_report<unknown>
315.75 s > at <unknown source file>:<unknown line>
315.75 s > 2: <color_eyre[51793ea62743adbd]::config::PanicHook>::into_panic_hook::{closure#0}<unknown>
315.75 s > at <unknown source file>:<unknown line>
315.75 s > 3: std[bcb96dfbba0ab899]::panicking::panic_with_hook<unknown>
315.75 s > at <unknown source file>:<unknown line>
315.75 s > 4: std[bcb96dfbba0ab899]::panicking::panic_handler::{closure#0}<unknown>
315.75 s > at <unknown source file>:<unknown line>
315.75 s > 5: std[bcb96dfbba0ab899]::sys::backtrace::__rust_end_short_backtrace::<std[bcb96dfbba0ab899]::panicking::panic_handler::{closure#0}, !><unknown>
315.75 s > at <unknown source file>:<unknown line>
315.75 s > 6: __rustc[6c289b9f9c454d21]::rust_begin_unwind<unknown>
315.75 s > at <unknown source file>:<unknown line>
315.75 s > 7: core[940e698046960fd5]::panicking::panic_fmt<unknown>
315.75 s > at <unknown source file>:<unknown line>
315.75 s > 8: <gammalooprs[e669b34b0f7bca9e]::integrands::process::evaluators::hyperbolic_tests::Checks>::finish<unknown>
315.75 s > at <unknown source file>:<unknown line>
315.75 s > 9: gammalooprs[e669b34b0f7bca9e]::integrands::process::evaluators::hyperbolic_tests::check_backend::<f64, gammalooprs[e669b34b0f7bca9e]::integrands::process::evaluators::hyperbolic_tests::hyperbolic_symjit_o2::{closure#0}><unknown>
315.75 s > at <unknown source file>:<unknown line>
315.75 s > 10: gammalooprs[e669b34b0f7bca9e]::integrands::process::evaluators::hyperbolic_tests::hyperbolic_symjit_o2<unknown>
315.75 s > at <unknown source file>:<unknown line>
315.75 s > 11: <gammalooprs[e669b34b0f7bca9e]::integrands::process::evaluators::hyperbolic_tests::hyperbolic_symjit_o2::{closure#0} as core[940e698046960fd5]::ops::function::FnOnce<()>>::call_once<unknown>
315.75 s > at <unknown source file>:<unknown line>
315.75 s > 12: test[75d6903177b1d7e9]::__rust_begin_short_backtrace::<core[940e698046960fd5]::result::Result<(), alloc[2ea6bcb46fca0c42]::string::String>, fn() -> core[940e698046960fd5]::result::Result<(), alloc[2ea6bcb46fca0c42]::string::String>><unknown>
315.75 s > at <unknown source file>:<unknown line>
315.75 s > 13: test[75d6903177b1d7e9]::run_test::{closure#0}<unknown>
315.75 s > at <unknown source file>:<unknown line>
315.75 s > 14: std[bcb96dfbba0ab899]::sys::backtrace::__rust_begin_short_backtrace::<test[75d6903177b1d7e9]::run_test::{closure#1}, ()><unknown>
315.75 s > at <unknown source file>:<unknown line>
315.75 s > 15: <std[bcb96dfbba0ab899]::thread::lifecycle::spawn_unchecked<test[75d6903177b1d7e9]::run_test::{closure#1}, ()>::{closure#1} as core[940e698046960fd5]::ops::function::FnOnce<()>>::call_once::{shim:vtable#0}<unknown>
315.75 s > at <unknown source file>:<unknown line>
315.75 s > 16: <std[bcb96dfbba0ab899]::sys::thread::unix::Thread>::new::thread_start<unknown>
315.75 s > at <unknown source file>:<unknown line>
315.75 s > infinite real part: coth d0: 8 failures; first z=(inf 0), re: got NaN, expected 1.000000000000000e0, error=NaN, tolerance=3.16e-30; unexpected nonfinite result
315.75 s > infinite real part: csch d0: 8 failures; first z=(inf 0), re: got NaN, expected 0, error=NaN, tolerance=9.88e-324; unexpected nonfinite result
315.75 s > infinite real part: sech d0: 8 failures; first z=(inf 0), re: got NaN, expected 0, error=NaN, tolerance=9.88e-324; unexpected nonfinite result
315.75 s > infinite real part: tanh d0: 4 failures; first z=(inf 0), re: got NaN, expected 1.000000000000000e0, error=NaN, tolerance=3.16e-30; unexpected nonfinite result
315.75 s > near poles: coth d0: 144 failures; first z=(-9.7656250e-4 -4.7123890e0), re: got -9.765621895592602e-4, expected -9.765621895592602e-4, error=1.69e-30, tolerance=3.08e-33; component accuracy
315.75 s > near poles: tanh d0: 144 failures; first z=(-9.7656250e-4 -4.7123890e0), re: got -1.024000325520813e3, expected -1.024000325520813e3, error=-1.24e-24, tolerance=3.23e-27; component accuracy
315.75 s > pole neighbors: coth d0: 12 failures; first z=(0 -4.7123890e0), im: got -7.008282842946301e-16, expected -7.044813998280223e-16, error=3.65e-18, tolerance=2.22e-45; component accuracy
315.75 s > pole neighbors: tanh d0: 12 failures; first z=(0 -4.7123890e0), im: got 1.424967069597696e15, expected 1.419483893036948e15, error=5.48e12, tolerance=4.48e-15; component accuracy
315.75 s > Symbolic derivative failures (composed expressions; cancellation may reduce accuracy):
315.75 s > UV: cosh d1: 6 failures; first z=(-1.0000000e12 0), im: got NaN, expected 0, error=NaN, tolerance=9.88e-324; unexpected nonfinite result
315.75 s > UV: cosh d2: 6 failures; first z=(-1.0000000e12 0), im: got NaN, expected -0, error=NaN, tolerance=9.88e-324; unexpected nonfinite result
315.75 s > UV: coth d1: 24 failures; first z=(-1.0000000e12 0), re: got NaN, expected -0, error=NaN, tolerance=9.88e-324; unexpected nonfinite result
315.75 s > UV: coth d2: 24 failures; first z=(-1.0000000e12 0), re: got NaN, expected 0, error=NaN, tolerance=9.88e-324; unexpected nonfinite result
315.75 s > UV: csch d1: 24 failures; first z=(-1.0000000e12 0), re: got NaN, expected 0, error=NaN, tolerance=9.88e-324; unexpected nonfinite result
315.75 s > UV: csch d2: 24 failures; first z=(-1.0000000e12 0), re: got NaN, expected 0, error=NaN, tolerance=9.88e-324; unexpected nonfinite result
315.75 s > UV: sech d1: 24 failures; first z=(-1.0000000e12 0), re: got NaN, expected 0, error=NaN, tolerance=9.88e-324; unexpected nonfinite result
315.75 s > UV: sech d2: 24 failures; first z=(-1.0000000e12 0), re: got NaN, expected 0, error=NaN, tolerance=9.88e-324; unexpected nonfinite result
315.75 s > UV: sinh d1: 6 failures; first z=(-1.0000000e12 0), im: got NaN, expected -0, error=NaN, tolerance=9.88e-324; unexpected nonfinite result
315.75 s > UV: sinh d2: 6 failures; first z=(-1.0000000e12 0), im: got NaN, expected 0, error=NaN, tolerance=9.88e-324; unexpected nonfinite result
315.75 s > UV: tanh d1: 24 failures; first z=(-1.0000000e12 0), re: got NaN, expected 0, error=NaN, tolerance=9.88e-324; unexpected nonfinite result
315.75 s > UV: tanh d2: 24 failures; first z=(-1.0000000e12 0), re: got NaN, expected 0, error=NaN, tolerance=9.88e-324; unexpected nonfinite result
315.75 s > ━━━━━━━━━━━━━━━━━━━━━━━━━━━━━━━━━━ BACKTRACE ━━━━━━━━━━━━━━━━━━━━━━━━━━━━━━━━━━━
315.75 s > 1: <color_eyre[51793ea62743adbd]::config::PanicHook>::panic_report<unknown>
315.75 s > at <unknown source file>:<unknown line>
315.75 s > 2: <color_eyre[51793ea62743adbd]::config::PanicHook>::into_panic_hook::{closure#0}<unknown>
315.75 s > at <unknown source file>:<unknown line>
315.75 s > 3: std[bcb96dfbba0ab899]::panicking::panic_with_hook<unknown>
315.75 s > at <unknown source file>:<unknown line>
315.75 s > 4: std[bcb96dfbba0ab899]::panicking::panic_handler::{closure#0}<unknown>
315.75 s > at <unknown source file>:<unknown line>
315.75 s > 5: std[bcb96dfbba0ab899]::sys::backtrace::__rust_end_short_backtrace::<std[bcb96dfbba0ab899]::panicking::panic_handler::{closure#0}, !><unknown>
315.75 s > at <unknown source file>:<unknown line>
315.75 s > 6: __rustc[6c289b9f9c454d21]::rust_begin_unwind<unknown>
315.75 s > at <unknown source file>:<unknown line>
315.75 s > 7: core[940e698046960fd5]::panicking::panic_fmt<unknown>
315.75 s > at <unknown source file>:<unknown line>
315.75 s > 8: <gammalooprs[e669b34b0f7bca9e]::integrands::process::evaluators::hyperbolic_tests::Checks>::finish<unknown>
315.75 s > at <unknown source file>:<unknown line>
315.75 s > 9: gammalooprs[e669b34b0f7bca9e]::integrands::process::evaluators::hyperbolic_tests::check_backend::<gammalooprs[e669b34b0f7bca9e]::utils::QuadFloat, gammalooprs[e669b34b0f7bca9e]::integrands::process::evaluators::hyperbolic_tests::hyperbolic_eager_quad::{closure#0}><unknown>
315.75 s > at <unknown source file>:<unknown line>
315.75 s > 10: <gammalooprs[e669b34b0f7bca9e]::integrands::process::evaluators::hyperbolic_tests::hyperbolic_eager_quad::{closure#0} as core[940e698046960fd5]::ops::function::FnOnce<()>>::call_once<unknown>
315.75 s > at <unknown source file>:<unknown line>
315.75 s > 11: test[75d6903177b1d7e9]::__rust_begin_short_backtrace::<core[940e698046960fd5]::result::Result<(), alloc[2ea6bcb46fca0c42]::string::String>, fn() -> core[940e698046960fd5]::result::Result<(), alloc[2ea6bcb46fca0c42]::string::String>><unknown>
315.75 s > at <unknown source file>:<unknown line>
315.75 s > 12: test[75d6903177b1d7e9]::run_test::{closure#0}<unknown>
315.75 s > at <unknown source file>:<unknown line>
315.75 s > 13: std[bcb96dfbba0ab899]::sys::backtrace::__rust_begin_short_backtrace::<test[75d6903177b1d7e9]::run_test::{closure#1}, ()><unknown>
315.75 s > at <unknown source file>:<unknown line>
315.75 s > 14: <std[bcb96dfbba0ab899]::thread::lifecycle::spawn_unchecked<test[75d6903177b1d7e9]::run_test::{closure#1}, ()>::{closure#1} as core[940e698046960fd5]::ops::function::FnOnce<()>>::call_once::{shim:vtable#0}<unknown>
315.75 s > at <unknown source file>:<unknown line>
315.75 s > 15: <std[bcb96dfbba0ab899]::sys::thread::unix::Thread>::new::thread_start<unknown>
315.75 s > at <unknown source file>:<unknown line>
315.75 s > infinite real part: coth d0: 8 failures; first z=(inf 0), re: got NaN, expected 1.000000000000000e0, error=NaN, tolerance=2.39e-299; unexpected nonfinite result
315.75 s > infinite real part: csch d0: 8 failures; first z=(inf 0), re: got NaN, expected 0, error=NaN, tolerance=4.77e-323228497; unexpected nonfinite result
315.75 s > infinite real part: sech d0: 8 failures; first z=(inf 0), re: got NaN, expected 0, error=NaN, tolerance=4.77e-323228497; unexpected nonfinite result
315.75 s > infinite real part: tanh d0: 4 failures; first z=(inf 0), re: got NaN, expected 1.000000000000000e0, error=NaN, tolerance=2.39e-299; unexpected nonfinite result
315.75 s > near poles: coth d0: 120 failures; first z=(-9.7656250e-4 -4.7123890e0), re: got -9.765621895592602e-4, expected -9.765621895592602e-4, error=-8.06e-300, tolerance=2.33e-302; component accuracy
315.75 s > near poles: tanh d0: 120 failures; first z=(-9.7656250e-4 -4.7123890e0), re: got -1.024000325520813e3, expected -1.024000325520813e3, error=7.35e-294, tolerance=2.45e-296; component accuracy
315.75 s > pole neighbors: coth d0: 12 failures; first z=(0 -4.7123890e0), im: got -7.044813998280223e-16, expected -7.044813998280223e-16, error=-2.08e-287, tolerance=1.68e-314; component accuracy
315.75 s > pole neighbors: tanh d0: 12 failures; first z=(0 -4.7123890e0), im: got 1.419483893036948e15, expected 1.419483893036948e15, error=6.37e-258, tolerance=3.39e-284; component accuracy
315.75 s > Symbolic derivative failures (composed expressions; cancellation may reduce accuracy):
315.75 s > UV: cosh d1: 6 failures; first z=(-1.0000000e12 0), im: got NaN, expected 0, error=NaN, tolerance=4.77e-323228497; unexpected nonfinite result
315.75 s > UV: cosh d2: 6 failures; first z=(-1.0000000e12 0), im: got -NaN, expected -0, error=NaN, tolerance=4.77e-323228497; unexpected nonfinite result
315.75 s > UV: coth d1: 24 failures; first z=(-1.0000000e12 0), re: got NaN, expected -0, error=NaN, tolerance=4.77e-323228497; unexpected nonfinite result
315.75 s > UV: coth d2: 24 failures; first z=(-1.0000000e12 0), re: got NaN, expected 0, error=NaN, tolerance=4.77e-323228497; unexpected nonfinite result
315.75 s > UV: csch d1: 24 failures; first z=(-1.0000000e12 0), re: got NaN, expected 0, error=NaN, tolerance=4.77e-323228497; unexpected nonfinite result
315.75 s > UV: csch d2: 24 failures; first z=(-1.0000000e12 0), re: got NaN, expected 0, error=NaN, tolerance=4.77e-323228497; unexpected nonfinite result
315.75 s > UV: sech d1: 24 failures; first z=(-1.0000000e12 0), re: got NaN, expected 0, error=NaN, tolerance=4.77e-323228497; unexpected nonfinite result
315.75 s > UV: sech d2: 24 failures; first z=(-1.0000000e12 0), re: got NaN, expected 0, error=NaN, tolerance=4.77e-323228497; unexpected nonfinite result
315.75 s > UV: sinh d1: 6 failures; first z=(-1.0000000e12 0), im: got -NaN, expected -0, error=NaN, tolerance=4.77e-323228497; unexpected nonfinite result
315.75 s > UV: sinh d2: 6 failures; first z=(-1.0000000e12 0), im: got NaN, expected 0, error=NaN, tolerance=4.77e-323228497; unexpected nonfinite result
315.75 s > UV: tanh d1: 24 failures; first z=(-1.0000000e12 0), re: got NaN, expected 0, error=NaN, tolerance=4.77e-323228497; unexpected nonfinite result
315.75 s > UV: tanh d2: 24 failures; first z=(-1.0000000e12 0), re: got NaN, expected 0, error=NaN, tolerance=4.77e-323228497; unexpected nonfinite result
315.75 s > ━━━━━━━━━━━━━━━━━━━━━━━━━━━━━━━━━━ BACKTRACE ━━━━━━━━━━━━━━━━━━━━━━━━━━━━━━━━━━━
315.75 s > 1: <color_eyre[51793ea62743adbd]::config::PanicHook>::panic_report<unknown>
315.75 s > at <unknown source file>:<unknown line>
315.75 s > 2: <color_eyre[51793ea62743adbd]::config::PanicHook>::into_panic_hook::{closure#0}<unknown>
315.75 s > at <unknown source file>:<unknown line>
315.75 s > 3: std[bcb96dfbba0ab899]::panicking::panic_with_hook<unknown>
315.75 s > at <unknown source file>:<unknown line>
315.75 s > 4: std[bcb96dfbba0ab899]::panicking::panic_handler::{closure#0}<unknown>
315.75 s > at <unknown source file>:<unknown line>
315.75 s > 5: std[bcb96dfbba0ab899]::sys::backtrace::__rust_end_short_backtrace::<std[bcb96dfbba0ab899]::panicking::panic_handler::{closure#0}, !><unknown>
315.75 s > at <unknown source file>:<unknown line>
315.75 s > 6: __rustc[6c289b9f9c454d21]::rust_begin_unwind<unknown>
315.75 s > at <unknown source file>:<unknown line>
315.75 s > 7: core[940e698046960fd5]::panicking::panic_fmt<unknown>
315.75 s > at <unknown source file>:<unknown line>
315.75 s > 8: <gammalooprs[e669b34b0f7bca9e]::integrands::process::evaluators::hyperbolic_tests::Checks>::finish<unknown>
315.75 s > at <unknown source file>:<unknown line>
315.75 s > 9: gammalooprs[e669b34b0f7bca9e]::integrands::process::evaluators::hyperbolic_tests::check_backend::<gammalooprs[e669b34b0f7bca9e]::utils::VarFloat<1000u32>, gammalooprs[e669b34b0f7bca9e]::integrands::process::evaluators::hyperbolic_tests::hyperbolic_eager_arb::{closure#0}><unknown>
315.75 s > at <unknown source file>:<unknown line>
315.75 s > 10: <gammalooprs[e669b34b0f7bca9e]::integrands::process::evaluators::hyperbolic_tests::hyperbolic_eager_arb::{closure#0} as core[940e698046960fd5]::ops::function::FnOnce<()>>::call_once<unknown>
315.75 s > at <unknown source file>:<unknown line>
315.75 s > 11: test[75d6903177b1d7e9]::__rust_begin_short_backtrace::<core[940e698046960fd5]::result::Result<(), alloc[2ea6bcb46fca0c42]::string::String>, fn() -> core[940e698046960fd5]::result::Result<(), alloc[2ea6bcb46fca0c42]::string::String>><unknown>
315.75 s > at <unknown source file>:<unknown line>
315.75 s > 12: test[75d6903177b1d7e9]::run_test::{closure#0}<unknown>
315.75 s > at <unknown source file>:<unknown line>
315.75 s > 13: std[bcb96dfbba0ab899]::sys::backtrace::__rust_begin_short_backtrace::<test[75d6903177b1d7e9]::run_test::{closure#1}, ()><unknown>
315.75 s > at <unknown source file>:<unknown line>
315.75 s > 14: <std[bcb96dfbba0ab899]::thread::lifecycle::spawn_unchecked<test[75d6903177b1d7e9]::run_test::{closure#1}, ()>::{closure#1} as core[940e698046960fd5]::ops::function::FnOnce<()>>::call_once::{shim:vtable#0}<unknown>
315.75 s > at <unknown source file>:<unknown line>
315.75 s > 15: <std[bcb96dfbba0ab899]::sys::thread::unix::Thread>::new::thread_start<unknown>
315.75 s > at <unknown source file>:<unknown line>
315.75 s > Message: called `Result::unwrap()` on an `Err` value: Custom { kind: Other, error: "Could not compile code: g++ -shared -O3 -fPIC -ffast-math -funsafe-math-optimizations -march=native -o /build/gammaloop-native-thermal-1616/thermal_0_0.so /build/gammaloop-native-thermal-1616/thermal_0_0.cpp\nwarning: Skipping impure flag -march=native because NIX_ENFORCE_NO_NATIVE is set\n/build/gammaloop-native-thermal-1616/thermal_0_0.cpp: In function 'void thermal_realf64(const double*, double*, double*)':\n/build/gammaloop-native-thermal-1616/thermal_0_0.cpp:27:16: error: 'symbolica_tanh' was not declared in this scope\n 27 | Z[6] = symbolica_tanh(Z[6]);\n | ^~~~~~~~~~~~~~\n" }
315.75 s > Location: crates/gammalooprs/src/graph/feynman_graph.rs:1213
315.75 s > ━━━━━━━━━━━━━━━━━━━━━━━━━━━━━━━━━━ BACKTRACE ━━━━━━━━━━━━━━━━━━━━━━━━━━━━━━━━━━━
315.75 s > 1: <color_eyre[51793ea62743adbd]::config::PanicHook>::panic_report<unknown>
315.75 s > at <unknown source file>:<unknown line>
315.75 s > 2: <color_eyre[51793ea62743adbd]::config::PanicHook>::into_panic_hook::{closure#0}<unknown>
315.75 s > at <unknown source file>:<unknown line>
315.75 s > 3: std[bcb96dfbba0ab899]::panicking::panic_with_hook<unknown>
315.75 s > at <unknown source file>:<unknown line>
315.75 s > 4: std[bcb96dfbba0ab899]::panicking::panic_handler::{closure#0}<unknown>
315.75 s > at <unknown source file>:<unknown line>
315.75 s > 5: std[bcb96dfbba0ab899]::sys::backtrace::__rust_end_short_backtrace::<std[bcb96dfbba0ab899]::panicking::panic_handler::{closure#0}, !><unknown>
315.75 s > at <unknown source file>:<unknown line>
315.75 s > 6: __rustc[6c289b9f9c454d21]::rust_begin_unwind<unknown>
315.75 s > at <unknown source file>:<unknown line>
315.75 s > 7: core[940e698046960fd5]::panicking::panic_fmt<unknown>
315.75 s > at <unknown source file>:<unknown line>
315.75 s > 8: core[940e698046960fd5]::result::unwrap_failed<unknown>
315.75 s > at <unknown source file>:<unknown line>
315.75 s > 9: gammalooprs[e669b34b0f7bca9e]::graph::feynman_graph::tests::native_thermal_distributions<unknown>
315.75 s > at <unknown source file>:<unknown line>
315.75 s > 10: <gammalooprs[e669b34b0f7bca9e]::graph::feynman_graph::tests::native_thermal_distributions::{closure#0} as core[940e698046960fd5]::ops::function::FnOnce<()>>::call_once<unknown>
315.75 s > at <unknown source file>:<unknown line>
315.75 s > 11: test[75d6903177b1d7e9]::__rust_begin_short_backtrace::<core[940e698046960fd5]::result::Result<(), alloc[2ea6bcb46fca0c42]::string::String>, fn() -> core[940e698046960fd5]::result::Result<(), alloc[2ea6bcb46fca0c42]::string::String>><unknown>
315.75 s > at <unknown source file>:<unknown line>
315.75 s > 12: test[75d6903177b1d7e9]::run_test::{closure#0}<unknown>
315.75 s > at <unknown source file>:<unknown line>
315.75 s > 13: std[bcb96dfbba0ab899]::sys::backtrace::__rust_begin_short_backtrace::<test[75d6903177b1d7e9]::run_test::{closure#1}, ()><unknown>
315.75 s > at <unknown source file>:<unknown line>
315.75 s > 14: <std[bcb96dfbba0ab899]::thread::lifecycle::spawn_unchecked<test[75d6903177b1d7e9]::run_test::{closure#1}, ()>::{closure#1} as core[940e698046960fd5]::ops::function::FnOnce<()>>::call_once::{shim:vtable#0}<unknown>
315.75 s > at <unknown source file>:<unknown line>
315.75 s > 15: <std[bcb96dfbba0ab899]::sys::thread::unix::Thread>::new::thread_start<unknown>
315.75 s > at <unknown source file>:<unknown line>
315.75 s > ━━━━━━━━━━━━━━━━━━━━━━━━━━━━━━━━━━ BACKTRACE ━━━━━━━━━━━━━━━━━━━━━━━━━━━━━━━━━━━
315.75 s > 1: <color_eyre[51793ea62743adbd]::config::PanicHook>::panic_report<unknown>
315.75 s > at <unknown source file>:<unknown line>
315.75 s > 2: <color_eyre[51793ea62743adbd]::config::PanicHook>::into_panic_hook::{closure#0}<unknown>
315.75 s > at <unknown source file>:<unknown line>
315.75 s > 3: std[bcb96dfbba0ab899]::panicking::panic_with_hook<unknown>
315.75 s > at <unknown source file>:<unknown line>
315.75 s > 4: std[bcb96dfbba0ab899]::panicking::panic_handler::{closure#0}<unknown>
315.75 s > at <unknown source file>:<unknown line>
315.75 s > 5: std[bcb96dfbba0ab899]::sys::backtrace::__rust_end_short_backtrace::<std[bcb96dfbba0ab899]::panicking::panic_handler::{closure#0}, !><unknown>
315.75 s > at <unknown source file>:<unknown line>
315.75 s > 6: __rustc[6c289b9f9c454d21]::rust_begin_unwind<unknown>
315.75 s > at <unknown source file>:<unknown line>
315.75 s > 7: core[940e698046960fd5]::panicking::panic_fmt<unknown>
315.75 s > at <unknown source file>:<unknown line>
315.75 s > 8: core[940e698046960fd5]::panicking::assert_failed_inner<unknown>
315.75 s > at <unknown source file>:<unknown line>
315.75 s > 9: core[940e698046960fd5]::panicking::assert_failed::<f64, f64><unknown>
315.75 s > at <unknown source file>:<unknown line>
315.75 s > 10: gammalooprs[e669b34b0f7bca9e]::integrands::process::param_builder::tests::thermal_tanh_remains_finite_at_uv_scales_and_preserves_derivatives<unknown>
315.75 s > at <unknown source file>:<unknown line>
315.75 s > 11: <gammalooprs[e669b34b0f7bca9e]::integrands::process::param_builder::tests::thermal_tanh_remains_finite_at_uv_scales_and_preserves_derivatives::{closure#0} as core[940e698046960fd5]::ops::function::FnOnce<()>>::call_once<unknown>
315.75 s > at <unknown source file>:<unknown line>
315.75 s > 12: test[75d6903177b1d7e9]::__rust_begin_short_backtrace::<core[940e698046960fd5]::result::Result<(), alloc[2ea6bcb46fca0c42]::string::String>, fn() -> core[940e698046960fd5]::result::Result<(), alloc[2ea6bcb46fca0c42]::string::String>><unknown>
315.75 s > at <unknown source file>:<unknown line>
315.75 s > 13: test[75d6903177b1d7e9]::run_test::{closure#0}<unknown>
315.75 s > at <unknown source file>:<unknown line>
315.75 s > 14: std[bcb96dfbba0ab899]::sys::backtrace::__rust_begin_short_backtrace::<test[75d6903177b1d7e9]::run_test::{closure#1}, ()><unknown>
315.75 s > at <unknown source file>:<unknown line>
315.75 s > 15: <std[bcb96dfbba0ab899]::thread::lifecycle::spawn_unchecked<test[75d6903177b1d7e9]::run_test::{closure#1}, ()>::{closure#1} as core[940e698046960fd5]::ops::function::FnOnce<()>>::call_once::{shim:vtable#0}<unknown>
315.75 s > at <unknown source file>:<unknown line>
315.75 s > 16: <std[bcb96dfbba0ab899]::sys::thread::unix::Thread>::new::thread_start<unknown>
315.75 s > at <unknown source file>:<unknown line>
315.75 s > Message: called `Result::unwrap()` on an `Err` value:
315.75 s > 0: Could not compile code: g++ -shared -O2 -fPIC -march=native -o /build/gammaloop-hyperbolic-c++-53-false-1957/hyperbolic.so /build/gammaloop-hyperbolic-c++-53-false-1957/hyperbolic.cpp
315.75 s > warning: Skipping impure flag -march=native because NIX_ENFORCE_NO_NATIVE is set
315.75 s > /build/gammaloop-hyperbolic-c++-53-false-1957/hyperbolic.cpp: In instantiation of 'void hyperbolic_complexf64_gen(T*, T*, T*) [with T = std::complex<double>]':
315.75 s > /build/gammaloop-hyperbolic-c++-53-false-1957/hyperbolic.cpp:60:28: required from here
315.75 s > 60 | hyperbolic_complexf64_gen(params, buffer, out);
315.75 s > | ~~~~~~~~~~~~~~~~~~~~~~~~~^~~~~~~~~~~~~~~~~~~~~
315.75 s > /build/gammaloop-hyperbolic-c++-53-false-1957/hyperbolic.cpp:17:30: error: 'symbolica_sinh' was not declared in this scope
315.75 s > ━━━━━━━━━━━━━━━━━━━━━━━━━━━━━━━━━━ BACKTRACE ━━━━━━━━━━━━━━━━━━━━━━━━━━━━━━━━━━━
315.75 s > 1: <color_eyre[51793ea62743adbd]::config::EyreHook>::into_eyre_hook::{closure#0}<unknown>
315.75 s > at <unknown source file>:<unknown line>
315.75 s > 2: eyre[cb2fd339c0c40fca]::capture_handler<unknown>
315.75 s > at <unknown source file>:<unknown line>
315.75 s > 3: <eyre[cb2fd339c0c40fca]::Report>::from_std::<std[bcb96dfbba0ab899]::io::error::Error><unknown>
315.75 s > at <unknown source file>:<unknown line>
315.75 s > 4: <gammalooprs[e669b34b0f7bca9e]::integrands::process::evaluators::GenericEvaluator>::compile_external::<std[bcb96dfbba0ab899]::path::PathBuf, &str, std[bcb96dfbba0ab899]::path::PathBuf><unknown>
315.75 s > at <unknown source file>:<unknown line>
315.75 s > 5: gammalooprs[e669b34b0f7bca9e]::integrands::process::evaluators::hyperbolic_tests::check_backend::<f64, gammalooprs[e669b34b0f7bca9e]::integrands::process::evaluators::hyperbolic_tests::hyperbolic_cpp_strict::{closure#0}><unknown>
315.75 s > at <unknown source file>:<unknown line>
315.75 s > 6: gammalooprs[e669b34b0f7bca9e]::integrands::process::evaluators::hyperbolic_tests::hyperbolic_cpp_strict<unknown>
315.75 s > at <unknown source file>:<unknown line>
315.75 s > 7: <gammalooprs[e669b34b0f7bca9e]::integrands::process::evaluators::hyperbolic_tests::hyperbolic_cpp_strict::{closure#0} as core[940e698046960fd5]::ops::function::FnOnce<()>>::call_once<unknown>
315.75 s > at <unknown source file>:<unknown line>
315.75 s > 8: test[75d6903177b1d7e9]::__rust_begin_short_backtrace::<core[940e698046960fd5]::result::Result<(), alloc[2ea6bcb46fca0c42]::string::String>, fn() -> core[940e698046960fd5]::result::Result<(), alloc[2ea6bcb46fca0c42]::string::String>><unknown>
315.75 s > at <unknown source file>:<unknown line>
315.75 s > 9: test[75d6903177b1d7e9]::run_test::{closure#0}<unknown>
315.75 s > at <unknown source file>:<unknown line>
315.75 s > 10: std[bcb96dfbba0ab899]::sys::backtrace::__rust_begin_short_backtrace::<test[75d6903177b1d7e9]::run_test::{closure#1}, ()><unknown>
315.75 s > at <unknown source file>:<unknown line>
315.75 s > 11: <std[bcb96dfbba0ab899]::thread::lifecycle::spawn_unchecked<test[75d6903177b1d7e9]::run_test::{closure#1}, ()>::{closure#1} as core[940e698046960fd5]::ops::function::FnOnce<()>>::call_once::{shim:vtable#0}<unknown>
315.75 s > at <unknown source file>:<unknown line>
315.75 s > 12: <std[bcb96dfbba0ab899]::sys::thread::unix::Thread>::new::thread_start<unknown>
315.75 s > at <unknown source file>:<unknown line>
315.75 s > ━━━━━━━━━━━━━━━━━━━━━━━━━━━━━━━━━━ BACKTRACE ━━━━━━━━━━━━━━━━━━━━━━━━━━━━━━━━━━━
315.75 s > 1: <color_eyre[51793ea62743adbd]::config::PanicHook>::panic_report<unknown>
315.75 s > at <unknown source file>:<unknown line>
315.75 s > 2: <color_eyre[51793ea62743adbd]::config::PanicHook>::into_panic_hook::{closure#0}<unknown>
315.75 s > at <unknown source file>:<unknown line>
315.75 s > 3: std[bcb96dfbba0ab899]::panicking::panic_with_hook<unknown>
315.75 s > at <unknown source file>:<unknown line>
315.75 s > 4: std[bcb96dfbba0ab899]::panicking::panic_handler::{closure#0}<unknown>
315.75 s > at <unknown source file>:<unknown line>
315.75 s > 5: std[bcb96dfbba0ab899]::sys::backtrace::__rust_end_short_backtrace::<std[bcb96dfbba0ab899]::panicking::panic_handler::{closure#0}, !><unknown>
315.75 s > at <unknown source file>:<unknown line>
315.75 s > 6: __rustc[6c289b9f9c454d21]::rust_begin_unwind<unknown>
315.75 s > at <unknown source file>:<unknown line>
315.75 s > 7: core[940e698046960fd5]::panicking::panic_fmt<unknown>
315.75 s > at <unknown source file>:<unknown line>
315.75 s > 8: core[940e698046960fd5]::result::unwrap_failed<unknown>
315.75 s > at <unknown source file>:<unknown line>
315.75 s > 9: gammalooprs[e669b34b0f7bca9e]::integrands::process::evaluators::hyperbolic_tests::check_backend::<f64, gammalooprs[e669b34b0f7bca9e]::integrands::process::evaluators::hyperbolic_tests::hyperbolic_cpp_strict::{closure#0}><unknown>
315.75 s > at <unknown source file>:<unknown line>
315.75 s > 10: gammalooprs[e669b34b0f7bca9e]::integrands::process::evaluators::hyperbolic_tests::hyperbolic_cpp_strict<unknown>
315.75 s > at <unknown source file>:<unknown line>
315.75 s > 11: <gammalooprs[e669b34b0f7bca9e]::integrands::process::evaluators::hyperbolic_tests::hyperbolic_cpp_strict::{closure#0} as core[940e698046960fd5]::ops::function::FnOnce<()>>::call_once<unknown>
315.75 s > at <unknown source file>:<unknown line>
315.75 s > 12: test[75d6903177b1d7e9]::__rust_begin_short_backtrace::<core[940e698046960fd5]::result::Result<(), alloc[2ea6bcb46fca0c42]::string::String>, fn() -> core[940e698046960fd5]::result::Result<(), alloc[2ea6bcb46fca0c42]::string::String>><unknown>
315.75 s > at <unknown source file>:<unknown line>
315.75 s > 13: test[75d6903177b1d7e9]::run_test::{closure#0}<unknown>
315.75 s > at <unknown source file>:<unknown line>
315.75 s > 14: std[bcb96dfbba0ab899]::sys::backtrace::__rust_begin_short_backtrace::<test[75d6903177b1d7e9]::run_test::{closure#1}, ()><unknown>
315.75 s > at <unknown source file>:<unknown line>
315.75 s > 15: <std[bcb96dfbba0ab899]::thread::lifecycle::spawn_unchecked<test[75d6903177b1d7e9]::run_test::{closure#1}, ()>::{closure#1} as core[940e698046960fd5]::ops::function::FnOnce<()>>::call_once::{shim:vtable#0}<unknown>
315.75 s > at <unknown source file>:<unknown line>
315.75 s > 16: <std[bcb96dfbba0ab899]::sys::thread::unix::Thread>::new::thread_start<unknown>
315.75 s > at <unknown source file>:<unknown line>
315.75 s > Message: called `Result::unwrap()` on an `Err` value:
315.75 s > 0: Could not compile code: g++ -shared -O2 -fPIC -ffast-math -funsafe-math-optimizations -march=native -o /build/gammaloop-hyperbolic-c++-53-true-1950/hyperbolic.so /build/gammaloop-hyperbolic-c++-53-true-1950/hyperbolic.cpp
315.75 s > warning: Skipping impure flag -march=native because NIX_ENFORCE_NO_NATIVE is set
315.75 s > /build/gammaloop-hyperbolic-c++-53-true-1950/hyperbolic.cpp: In instantiation of 'void hyperbolic_complexf64_gen(T*, T*, T*) [with T = std::complex<double>]':
315.75 s > /build/gammaloop-hyperbolic-c++-53-true-1950/hyperbolic.cpp:60:28: required from here
315.75 s > 60 | hyperbolic_complexf64_gen(params, buffer, out);
315.75 s > | ~~~~~~~~~~~~~~~~~~~~~~~~~^~~~~~~~~~~~~~~~~~~~~
315.75 s > /build/gammaloop-hyperbolic-c++-53-true-1950/hyperbolic.cpp:17:30: error: 'symbolica_sinh' was not declared in this scope
315.75 s > ━━━━━━━━━━━━━━━━━━━━━━━━━━━━━━━━━━ BACKTRACE ━━━━━━━━━━━━━━━━━━━━━━━━━━━━━━━━━━━
315.75 s > 1: <color_eyre[51793ea62743adbd]::config::EyreHook>::into_eyre_hook::{closure#0}<unknown>
315.75 s > at <unknown source file>:<unknown line>
315.75 s > 2: eyre[cb2fd339c0c40fca]::capture_handler<unknown>
315.75 s > at <unknown source file>:<unknown line>
315.75 s > 3: <eyre[cb2fd339c0c40fca]::Report>::from_std::<std[bcb96dfbba0ab899]::io::error::Error><unknown>
315.75 s > at <unknown source file>:<unknown line>
315.75 s > 4: <gammalooprs[e669b34b0f7bca9e]::integrands::process::evaluators::GenericEvaluator>::compile_external::<std[bcb96dfbba0ab899]::path::PathBuf, &str, std[bcb96dfbba0ab899]::path::PathBuf><unknown>
315.75 s > at <unknown source file>:<unknown line>
315.75 s > 5: gammalooprs[e669b34b0f7bca9e]::integrands::process::evaluators::hyperbolic_tests::check_backend::<f64, gammalooprs[e669b34b0f7bca9e]::integrands::process::evaluators::hyperbolic_tests::hyperbolic_cpp_production::{closure#0}><unknown>
315.75 s > at <unknown source file>:<unknown line>
315.75 s > 6: gammalooprs[e669b34b0f7bca9e]::integrands::process::evaluators::hyperbolic_tests::hyperbolic_cpp_production<unknown>
315.75 s > at <unknown source file>:<unknown line>
315.75 s > 7: <gammalooprs[e669b34b0f7bca9e]::integrands::process::evaluators::hyperbolic_tests::hyperbolic_cpp_production::{closure#0} as core[940e698046960fd5]::ops::function::FnOnce<()>>::call_once<unknown>
315.75 s > at <unknown source file>:<unknown line>
315.75 s > 8: test[75d6903177b1d7e9]::__rust_begin_short_backtrace::<core[940e698046960fd5]::result::Result<(), alloc[2ea6bcb46fca0c42]::string::String>, fn() -> core[940e698046960fd5]::result::Result<(), alloc[2ea6bcb46fca0c42]::string::String>><unknown>
315.75 s > at <unknown source file>:<unknown line>
315.75 s > 9: test[75d6903177b1d7e9]::run_test::{closure#0}<unknown>
315.75 s > at <unknown source file>:<unknown line>
315.75 s > 10: std[bcb96dfbba0ab899]::sys::backtrace::__rust_begin_short_backtrace::<test[75d6903177b1d7e9]::run_test::{closure#1}, ()><unknown>
315.75 s > at <unknown source file>:<unknown line>
315.75 s > 11: <std[bcb96dfbba0ab899]::thread::lifecycle::spawn_unchecked<test[75d6903177b1d7e9]::run_test::{closure#1}, ()>::{closure#1} as core[940e698046960fd5]::ops::function::FnOnce<()>>::call_once::{shim:vtable#0}<unknown>
315.75 s > at <unknown source file>:<unknown line>
315.75 s > 12: <std[bcb96dfbba0ab899]::sys::thread::unix::Thread>::new::thread_start<unknown>
315.75 s > at <unknown source file>:<unknown line>
315.75 s > ━━━━━━━━━━━━━━━━━━━━━━━━━━━━━━━━━━ BACKTRACE ━━━━━━━━━━━━━━━━━━━━━━━━━━━━━━━━━━━
315.75 s > 1: <color_eyre[51793ea62743adbd]::config::PanicHook>::panic_report<unknown>
315.75 s > at <unknown source file>:<unknown line>
315.75 s > 2: <color_eyre[51793ea62743adbd]::config::PanicHook>::into_panic_hook::{closure#0}<unknown>
315.75 s > at <unknown source file>:<unknown line>
315.75 s > 3: std[bcb96dfbba0ab899]::panicking::panic_with_hook<unknown>
315.75 s > at <unknown source file>:<unknown line>
315.75 s > 4: std[bcb96dfbba0ab899]::panicking::panic_handler::{closure#0}<unknown>
315.75 s > at <unknown source file>:<unknown line>
315.75 s > 5: std[bcb96dfbba0ab899]::sys::backtrace::__rust_end_short_backtrace::<std[bcb96dfbba0ab899]::panicking::panic_handler::{closure#0}, !><unknown>
315.75 s > at <unknown source file>:<unknown line>
315.75 s > 6: __rustc[6c289b9f9c454d21]::rust_begin_unwind<unknown>
315.75 s > at <unknown source file>:<unknown line>
315.75 s > 7: core[940e698046960fd5]::panicking::panic_fmt<unknown>
315.75 s > at <unknown source file>:<unknown line>
315.75 s > 8: core[940e698046960fd5]::result::unwrap_failed<unknown>
315.75 s > at <unknown source file>:<unknown line>
315.75 s > 9: gammalooprs[e669b34b0f7bca9e]::integrands::process::evaluators::hyperbolic_tests::check_backend::<f64, gammalooprs[e669b34b0f7bca9e]::integrands::process::evaluators::hyperbolic_tests::hyperbolic_cpp_production::{closure#0}><unknown>
315.75 s > at <unknown source file>:<unknown line>
315.75 s > 10: gammalooprs[e669b34b0f7bca9e]::integrands::process::evaluators::hyperbolic_tests::hyperbolic_cpp_production<unknown>
315.75 s > at <unknown source file>:<unknown line>
315.75 s > 11: <gammalooprs[e669b34b0f7bca9e]::integrands::process::evaluators::hyperbolic_tests::hyperbolic_cpp_production::{closure#0} as core[940e698046960fd5]::ops::function::FnOnce<()>>::call_once<unknown>
315.75 s > at <unknown source file>:<unknown line>
315.75 s > 12: test[75d6903177b1d7e9]::__rust_begin_short_backtrace::<core[940e698046960fd5]::result::Result<(), alloc[2ea6bcb46fca0c42]::string::String>, fn() -> core[940e698046960fd5]::result::Result<(), alloc[2ea6bcb46fca0c42]::string::String>><unknown>
315.75 s > at <unknown source file>:<unknown line>
315.75 s > 13: test[75d6903177b1d7e9]::run_test::{closure#0}<unknown>
315.75 s > at <unknown source file>:<unknown line>
315.75 s > 14: std[bcb96dfbba0ab899]::sys::backtrace::__rust_begin_short_backtrace::<test[75d6903177b1d7e9]::run_test::{closure#1}, ()><unknown>
315.75 s > at <unknown source file>:<unknown line>
315.75 s > 15: <std[bcb96dfbba0ab899]::thread::lifecycle::spawn_unchecked<test[75d6903177b1d7e9]::run_test::{closure#1}, ()>::{closure#1} as core[940e698046960fd5]::ops::function::FnOnce<()>>::call_once::{shim:vtable#0}<unknown>
315.75 s > at <unknown source file>:<unknown line>
315.75 s > 16: <std[bcb96dfbba0ab899]::sys::thread::unix::Thread>::new::thread_start<unknown>
315.75 s > at <unknown source file>:<unknown line>
315.75 s > infinite real part: coth d0: 8 failures; first z=(inf 0), re: got NaN, expected 1.000000000000000e0, error=NaN, tolerance=2.84e-14; unexpected nonfinite result
315.75 s > infinite real part: tanh d0: 4 failures; first z=(inf 0), re: got NaN, expected 1.000000000000000e0, error=NaN, tolerance=2.84e-14; unexpected nonfinite result
315.75 s > near poles: coth d0: 160 failures; first z=(-9.7656250e-4 -4.7123890e0), re: got -9.765621895971165e-4, expected -9.765621895592603e-4, error=-3.79e-14, tolerance=2.78e-17; component accuracy
315.75 s > near poles: csch d0: 8 failures; first z=(-9.3326362e-302 0), re: got -inf, expected -1.071508607186267e301, error=-inf, tolerance=3.05e287; unexpected nonfinite result
315.75 s > near poles: tanh d0: 152 failures; first z=(-9.7656250e-4 -4.7123890e0), re: got -1.024000325481117e3, expected -1.024000325520813e3, error=3.97e-8, tolerance=2.91e-11; component accuracy
315.75 s > pole neighbors: coth d0: 26 failures; first z=(0 -4.7123890e0), re: got NaN, expected 0, error=NaN, tolerance=9.88e-324; unexpected nonfinite result
315.75 s > pole neighbors: csch d0: 2 failures; first z=(0 -4.9406565e-324), re: got NaN, expected 0, error=NaN, tolerance=9.88e-324; unexpected nonfinite result
315.75 s > pole neighbors: tanh d0: 24 failures; first z=(0 -4.7123890e0), re: got NaN, expected 0, error=NaN, tolerance=9.88e-324; unexpected nonfinite result
315.75 s > range boundary: cosh d0: 58 failures; first z=(-7.1100000e2 0), im: got NaN, expected -0, error=NaN, tolerance=9.88e-324; unexpected nonfinite result
315.75 s > range boundary: coth d0: 480 failures; first z=(-3.5600000e2 0), re: got NaN, expected -1.000000000000000e0, error=NaN, tolerance=2.84e-14; unexpected nonfinite result
315.75 s > range boundary: csch d0: 308 failures; first z=(-3.5600000e2 0), re: got -0, expected -4.922598761629717e-155, error=4.92e-155, tolerance=2.47e-324; premature zero
315.75 s > range boundary: sech d0: 308 failures; first z=(-3.5600000e2 0), re: got 0, expected 4.922598761629717e-155, error=-4.92e-155, tolerance=2.47e-324; premature zero
315.75 s > range boundary: sinh d0: 58 failures; first z=(-7.1100000e2 0), im: got NaN, expected 0, error=NaN, tolerance=9.88e-324; unexpected nonfinite result
315.75 s > range boundary: tanh d0: 268 failures; first z=(-3.5600000e2 0), re: got NaN, expected -1.000000000000000e0, error=NaN, tolerance=2.84e-14; unexpected nonfinite result
315.75 s > tiny: coth d0: 68 failures; first z=(-2.4099199e-181 0), re: got -inf, expected -4.149515568880993e180, error=-inf, tolerance=1.18e167; unexpected nonfinite result
315.75 s > tiny: csch d0: 68 failures; first z=(-2.4099199e-181 0), re: got -inf, expected -4.149515568880993e180, error=-inf, tolerance=1.18e167; unexpected nonfinite result
315.75 s > unequal components: cosh d0: 8 failures; first z=(7.1100000e2 1.0000000e-300), im: got inf, expected 3.036313688864996e8, error=inf, tolerance=8.63e-6; unexpected nonfinite result
315.75 s > unequal components: coth d0: 24 failures; first z=(3.5600000e2 1.0000000e-300), re: got NaN, expected 1.000000000000000e0, error=NaN, tolerance=2.84e-14; unexpected nonfinite result
315.75 s > unequal components: csch d0: 8 failures; first z=(3.5600000e2 1.0000000e-300), re: got 0, expected 4.922598761629437e-155, error=-4.92e-155, tolerance=2.47e-324; premature zero
315.75 s > unequal components: sech d0: 8 failures; first z=(3.5600000e2 1.0000000e-300), re: got 0, expected 4.922598761629437e-155, error=-4.92e-155, tolerance=2.47e-324; premature zero
315.75 s > unequal components: sinh d0: 8 failures; first z=(7.1100000e2 1.0000000e-300), im: got inf, expected 3.036313688864996e8, error=inf, tolerance=8.63e-6; unexpected nonfinite result
315.75 s > unequal components: tanh d0: 12 failures; first z=(3.5600000e2 1.0000000e-300), re: got NaN, expected 1.000000000000000e0, error=NaN, tolerance=2.84e-14; unexpected nonfinite result
315.75 s > Symbolic derivative failures (composed expressions; cancellation may reduce accuracy):
315.75 s > UV: cosh d1: 8 failures; first z=(-1.0000000e3 0), im: got NaN, expected 0, error=NaN, tolerance=9.88e-324; unexpected nonfinite result
315.75 s > UV: cosh d2: 8 failures; first z=(-1.0000000e3 0), im: got NaN, expected -0, error=NaN, tolerance=9.88e-324; unexpected nonfinite result
315.75 s > UV: coth d2: 32 failures; first z=(-1.0000000e3 0), re: got NaN, expected -0, error=NaN, tolerance=9.88e-324; unexpected nonfinite result
315.75 s > UV: csch d1: 32 failures; first z=(-1.0000000e3 0), re: got NaN, expected -0, error=NaN, tolerance=9.88e-324; unexpected nonfinite result
315.75 s > UV: csch d2: 32 failures; first z=(-1.0000000e3 0), re: got NaN, expected -0, error=NaN, tolerance=9.88e-324; unexpected nonfinite result
315.75 s > UV: sech d1: 32 failures; first z=(-1.0000000e3 0), re: got NaN, expected 0, error=NaN, tolerance=9.88e-324; unexpected nonfinite result
315.75 s > UV: sech d2: 32 failures; first z=(-1.0000000e3 0), re: got NaN, expected 0, error=NaN, tolerance=9.88e-324; unexpected nonfinite result
315.75 s > UV: sinh d1: 8 failures; first z=(-1.0000000e3 0), im: got NaN, expected -0, error=NaN, tolerance=9.88e-324; unexpected nonfinite result
315.75 s > UV: sinh d2: 8 failures; first z=(-1.0000000e3 0), im: got NaN, expected 0, error=NaN, tolerance=9.88e-324; unexpected nonfinite result
315.75 s > UV: tanh d2: 32 failures; first z=(-1.0000000e3 0), re: got NaN, expected 0, error=NaN, tolerance=9.88e-324; unexpected nonfinite result
315.75 s > near poles: coth d1: 8 failures; first z=(-9.3326362e-302 0), re: got NaN, expected -inf, error=NaN, tolerance=inf; expected signed infinity
315.75 s > near poles: coth d2: 160 failures; first z=(-9.7656250e-4 -4.7123890e0), re: got 1.953122516550860e-3, expected 1.953122516475148e-3, error=7.57e-14, tolerance=5.55e-17; component accuracy
315.75 s > near poles: csch d1: 160 failures; first z=(-9.7656250e-4 -4.7123890e0), re: got -1.836965819118240e-16, expected -1.836965819047030e-16, error=-7.12e-27, tolerance=5.22e-30; component accuracy
315.75 s > near poles: csch d2: 112 failures; first z=(-9.7656250e-4 -4.7123890e0), re: got -8.969563655486067e-19, expected -8.969563655207907e-19, error=-2.78e-29, tolerance=2.55e-32; component accuracy
315.75 s > near poles: sech d1: 152 failures; first z=(-9.7656250e-4 -4.7123890e0), re: got -3.944863463464010e-7, expected -3.944863463616931e-7, error=1.53e-17, tolerance=1.12e-20; component accuracy
315.75 s > near poles: sech d2: 152 failures; first z=(-9.7656250e-4 -4.7123890e0), re: got -1.211862055976059e-3, expected -1.211862056023036e-3, error=4.70e-14, tolerance=3.44e-17; component accuracy
315.75 s > near poles: tanh d2: 152 failures; first z=(-9.7656250e-4 -4.7123890e0), re: got -2.147483647916624e9, expected -2.147483647999870e9, error=8.32e-2, tolerance=6.10e-5; component accuracy
315.75 s > pole neighbors: coth d1: 4 failures; first z=(0 -4.9406565e-324), re: got NaN, expected inf, error=NaN, tolerance=inf; expected signed infinity
315.75 s > pole neighbors: coth d2: 28 failures; first z=(0 -4.7123890e0), re: got NaN, expected -0, error=NaN, tolerance=9.88e-324; unexpected nonfinite result
315.75 s > pole neighbors: csch d1: 28 failures; first z=(0 -4.7123890e0), re: got NaN, expected 7.044813998280222e-16, error=NaN, tolerance=2.00e-29; unexpected nonfinite result
315.75 s > pole neighbors: csch d2: 28 failures; first z=(0 -4.7123890e0), re: got NaN, expected -0, error=NaN, tolerance=9.88e-324; unexpected nonfinite result
315.75 s > pole neighbors: sech d1: 24 failures; first z=(0 -4.7123890e0), re: got NaN, expected 0, error=NaN, tolerance=9.88e-324; unexpected nonfinite result
315.75 s > pole neighbors: sech d2: 24 failures; first z=(0 -4.7123890e0), re: got NaN, expected -5.720334200684975e45, error=NaN, tolerance=1.63e32; unexpected nonfinite result
315.75 s > pole neighbors: tanh d2: 24 failures; first z=(0 -4.7123890e0), re: got NaN, expected -0, error=NaN, tolerance=9.88e-324; unexpected nonfinite result
315.75 s > range boundary: cosh d1: 58 failures; first z=(-7.1100000e2 0), im: got NaN, expected 0, error=NaN, tolerance=9.88e-324; unexpected nonfinite result
315.75 s > range boundary: cosh d2: 58 failures; first z=(-7.1100000e2 0), im: got NaN, expected -0, error=NaN, tolerance=9.88e-324; unexpected nonfinite result
315.75 s > range boundary: coth d1: 40 failures; first z=(-3.5600000e2 0), re: got -0, expected -2.423197856799843e-309, error=2.42e-309, tolerance=2.47e-324; premature zero
315.75 s > range boundary: coth d2: 480 failures; first z=(-3.5600000e2 0), re: got NaN, expected -4.846395713599686e-309, error=NaN, tolerance=1.48e-322; unexpected nonfinite result
315.75 s > range boundary: csch d1: 480 failures; first z=(-3.5600000e2 0), re: got NaN, expected -4.922598761629717e-155, error=NaN, tolerance=1.40e-168; unexpected nonfinite result
315.75 s > range boundary: csch d2: 480 failures; first z=(-3.5600000e2 0), re: got NaN, expected -4.922598761629717e-155, error=NaN, tolerance=1.40e-168; unexpected nonfinite result
315.75 s > range boundary: sech d1: 480 failures; first z=(-3.5600000e2 0), re: got NaN, expected 4.922598761629717e-155, error=NaN, tolerance=1.40e-168; unexpected nonfinite result
315.75 s > range boundary: sech d2: 480 failures; first z=(-3.5600000e2 0), re: got NaN, expected 4.922598761629717e-155, error=NaN, tolerance=1.40e-168; unexpected nonfinite result
315.75 s > range boundary: sinh d1: 58 failures; first z=(-7.1100000e2 0), im: got NaN, expected -0, error=NaN, tolerance=9.88e-324; unexpected nonfinite result
315.75 s > range boundary: sinh d2: 58 failures; first z=(-7.1100000e2 0), im: got NaN, expected 0, error=NaN, tolerance=9.88e-324; unexpected nonfinite result
315.75 s > range boundary: tanh d1: 40 failures; first z=(-3.5600000e2 0), re: got 0, expected 2.423197856799843e-309, error=-2.42e-309, tolerance=2.47e-324; premature zero
315.75 s > range boundary: tanh d2: 480 failures; first z=(-3.5600000e2 0), re: got NaN, expected 4.846395713599686e-309, error=NaN, tolerance=1.48e-322; unexpected nonfinite result
315.75 s > tiny: coth d1: 88 failures; first z=(-9.3132257e-10 -9.3132257e-10), re: got 0, expected 3.333333333333333e-1, error=-3.33e-1, tolerance=2.47e-324; premature zero
315.75 s > tiny: coth d2: 80 failures; first z=(-2.4099199e-181 0), re: got NaN, expected -inf, error=NaN, tolerance=inf; expected signed infinity
315.75 s > tiny: csch d1: 88 failures; first z=(-9.3132257e-10 -9.3132257e-10), re: got 0, expected -1.666666666666667e-1, error=1.67e-1, tolerance=2.47e-324; premature zero
315.75 s > tiny: csch d2: 80 failures; first z=(-2.4099199e-181 0), re: got NaN, expected -inf, error=NaN, tolerance=inf; expected signed infinity
315.75 s > unequal components: cosh d1: 8 failures; first z=(7.1100000e2 1.0000000e-300), im: got inf, expected 3.036313688864996e8, error=inf, tolerance=8.63e-6; unexpected nonfinite result
315.75 s > unequal components: cosh d2: 8 failures; first z=(7.1100000e2 1.0000000e-300), im: got inf, expected 3.036313688864996e8, error=inf, tolerance=8.63e-6; unexpected nonfinite result
315.75 s > unequal components: coth d1: 4 failures; first z=(3.5600000e2 1.0000000e-300), re: got 0, expected -2.423197856799566e-309, error=2.42e-309, tolerance=2.47e-324; premature zero
315.75 s > unequal components: coth d2: 24 failures; first z=(3.5600000e2 1.0000000e-300), re: got NaN, expected 4.846395713599132e-309, error=NaN, tolerance=1.48e-322; unexpected nonfinite result
315.75 s > unequal components: csch d1: 24 failures; first z=(3.5600000e2 1.0000000e-300), re: got NaN, expected -4.922598761629437e-155, error=NaN, tolerance=1.40e-168; unexpected nonfinite result
315.75 s > unequal components: csch d2: 24 failures; first z=(3.5600000e2 1.0000000e-300), re: got NaN, expected 4.922598761629437e-155, error=NaN, tolerance=1.40e-168; unexpected nonfinite result
315.75 s > unequal components: sech d1: 24 failures; first z=(3.5600000e2 1.0000000e-300), re: got NaN, expected -4.922598761629437e-155, error=NaN, tolerance=1.40e-168; unexpected nonfinite result
315.75 s > unequal components: sech d2: 28 failures; first z=(3.5600000e2 1.0000000e-300), re: got NaN, expected 4.922598761629437e-155, error=NaN, tolerance=1.40e-168; unexpected nonfinite result
315.75 s > unequal components: sinh d1: 8 failures; first z=(7.1100000e2 1.0000000e-300), im: got inf, expected 3.036313688864996e8, error=inf, tolerance=8.63e-6; unexpected nonfinite result
315.75 s > unequal components: sinh d2: 8 failures; first z=(7.1100000e2 1.0000000e-300), im: got inf, expected 3.036313688864996e8, error=inf, tolerance=8.63e-6; unexpected nonfinite result
315.75 s > unequal components: tanh d1: 4 failures; first z=(3.5600000e2 1.0000000e-300), re: got 0, expected 2.423197856799566e-309, error=-2.42e-309, tolerance=2.47e-324; premature zero
315.75 s > unequal components: tanh d2: 24 failures; first z=(3.5600000e2 1.0000000e-300), re: got NaN, expected -4.846395713599132e-309, error=NaN, tolerance=1.48e-322; unexpected nonfinite result
315.75 s > Location: crates/gammalooprs/src/integrands/process/evaluators/hyperbolic_tests.rs:312
315.75 s > ━━━━━━━━━━━━━━━━━━━━━━━━━━━━━━━━━━ BACKTRACE ━━━━━━━━━━━━━━━━━━━━━━━━━━━━━━━━━━━
315.75 s > 1: <color_eyre[51793ea62743adbd]::config::PanicHook>::panic_report<unknown>
315.75 s > at <unknown source file>:<unknown line>
315.75 s > 2: <color_eyre[51793ea62743adbd]::config::PanicHook>::into_panic_hook::{closure#0}<unknown>
315.75 s > at <unknown source file>:<unknown line>
315.75 s > 3: std[bcb96dfbba0ab899]::panicking::panic_with_hook<unknown>
315.75 s > at <unknown source file>:<unknown line>
315.75 s > 4: std[bcb96dfbba0ab899]::panicking::panic_handler::{closure#0}<unknown>
315.75 s > at <unknown source file>:<unknown line>
315.75 s > 5: std[bcb96dfbba0ab899]::sys::backtrace::__rust_end_short_backtrace::<std[bcb96dfbba0ab899]::panicking::panic_handler::{closure#0}, !><unknown>
315.75 s > at <unknown source file>:<unknown line>
315.75 s > 6: __rustc[6c289b9f9c454d21]::rust_begin_unwind<unknown>
315.75 s > at <unknown source file>:<unknown line>
315.75 s > 7: core[940e698046960fd5]::panicking::panic_fmt<unknown>
315.75 s > at <unknown source file>:<unknown line>
315.75 s > 8: <gammalooprs[e669b34b0f7bca9e]::integrands::process::evaluators::hyperbolic_tests::Checks>::finish<unknown>
315.75 s > at <unknown source file>:<unknown line>
315.75 s > 9: gammalooprs[e669b34b0f7bca9e]::integrands::process::evaluators::hyperbolic_tests::check_backend::<f64, gammalooprs[e669b34b0f7bca9e]::integrands::process::evaluators::hyperbolic_tests::hyperbolic_symjit_o0::{closure#0}><unknown>
315.75 s > at <unknown source file>:<unknown line>
315.75 s > 10: gammalooprs[e669b34b0f7bca9e]::integrands::process::evaluators::hyperbolic_tests::hyperbolic_symjit_o0<unknown>
315.75 s > at <unknown source file>:<unknown line>
315.75 s > 11: <gammalooprs[e669b34b0f7bca9e]::integrands::process::evaluators::hyperbolic_tests::hyperbolic_symjit_o0::{closure#0} as core[940e698046960fd5]::ops::function::FnOnce<()>>::call_once<unknown>
315.75 s > at <unknown source file>:<unknown line>
315.75 s > 12: test[75d6903177b1d7e9]::__rust_begin_short_backtrace::<core[940e698046960fd5]::result::Result<(), alloc[2ea6bcb46fca0c42]::string::String>, fn() -> core[940e698046960fd5]::result::Result<(), alloc[2ea6bcb46fca0c42]::string::String>><unknown>
315.75 s > at <unknown source file>:<unknown line>
315.75 s > 13: test[75d6903177b1d7e9]::run_test::{closure#0}<unknown>
315.75 s > at <unknown source file>:<unknown line>
315.75 s > ... omitted 13 more lines; see full nextest output above
315.75 s > infinite real part: coth d0: 8 failures; first z=(inf 0), re: got NaN, expected 1.000000000000000e0, error=NaN, tolerance=2.84e-14; unexpected nonfinite result
315.75 s > infinite real part: csch d0: 8 failures; first z=(inf 0), re: got NaN, expected 0, error=NaN, tolerance=9.88e-324; unexpected nonfinite result
315.75 s > infinite real part: sech d0: 8 failures; first z=(inf 0), re: got NaN, expected 0, error=NaN, tolerance=9.88e-324; unexpected nonfinite result
315.75 s > infinite real part: tanh d0: 4 failures; first z=(inf 0), re: got NaN, expected 1.000000000000000e0, error=NaN, tolerance=2.84e-14; unexpected nonfinite result
315.75 s > near poles: coth d0: 152 failures; first z=(-9.7656250e-4 -4.7123890e0), re: got -9.765621895780896e-4, expected -9.765621895592603e-4, error=-1.88e-14, tolerance=2.78e-17; component accuracy
315.75 s > near poles: tanh d0: 152 failures; first z=(-9.7656250e-4 -4.7123890e0), re: got -1.024000325500965e3, expected -1.024000325520813e3, error=1.98e-8, tolerance=2.91e-11; component accuracy
315.75 s > pole neighbors: coth d0: 24 failures; first z=(0 -4.7123890e0), re: got NaN, expected 0, error=NaN, tolerance=9.88e-324; unexpected nonfinite result
315.75 s > pole neighbors: tanh d0: 24 failures; first z=(0 -4.7123890e0), re: got NaN, expected 0, error=NaN, tolerance=9.88e-324; unexpected nonfinite result
315.75 s > Symbolic derivative failures (composed expressions; cancellation may reduce accuracy):
315.75 s > UV: cosh d1: 6 failures; first z=(-1.0000000e12 0), im: got NaN, expected 0, error=NaN, tolerance=9.88e-324; unexpected nonfinite result
315.75 s > UV: cosh d2: 6 failures; first z=(-1.0000000e12 0), im: got NaN, expected -0, error=NaN, tolerance=9.88e-324; unexpected nonfinite result
315.75 s > UV: coth d1: 24 failures; first z=(-1.0000000e12 0), re: got NaN, expected -0, error=NaN, tolerance=9.88e-324; unexpected nonfinite result
315.75 s > UV: coth d2: 24 failures; first z=(-1.0000000e12 0), re: got NaN, expected 0, error=NaN, tolerance=9.88e-324; unexpected nonfinite result
315.75 s > UV: csch d1: 24 failures; first z=(-1.0000000e12 0), re: got NaN, expected 0, error=NaN, tolerance=9.88e-324; unexpected nonfinite result
315.75 s > UV: csch d2: 24 failures; first z=(-1.0000000e12 0), re: got NaN, expected 0, error=NaN, tolerance=9.88e-324; unexpected nonfinite result
315.75 s > UV: sech d1: 24 failures; first z=(-1.0000000e12 0), re: got NaN, expected 0, error=NaN, tolerance=9.88e-324; unexpected nonfinite result
315.75 s > UV: sech d2: 24 failures; first z=(-1.0000000e12 0), re: got NaN, expected 0, error=NaN, tolerance=9.88e-324; unexpected nonfinite result
315.75 s > UV: sinh d1: 6 failures; first z=(-1.0000000e12 0), im: got NaN, expected -0, error=NaN, tolerance=9.88e-324; unexpected nonfinite result
315.75 s > UV: sinh d2: 6 failures; first z=(-1.0000000e12 0), im: got NaN, expected 0, error=NaN, tolerance=9.88e-324; unexpected nonfinite result
315.75 s > UV: tanh d1: 24 failures; first z=(-1.0000000e12 0), re: got NaN, expected 0, error=NaN, tolerance=9.88e-324; unexpected nonfinite result
315.75 s > UV: tanh d2: 24 failures; first z=(-1.0000000e12 0), re: got NaN, expected 0, error=NaN, tolerance=9.88e-324; unexpected nonfinite result
315.75 s > near poles: coth d1: 4 failures; first z=(-9.3326362e-302 0), im: got NaN, expected -0, error=NaN, tolerance=9.88e-324; unexpected nonfinite result
315.75 s > near poles: coth d2: 156 failures; first z=(-9.7656250e-4 -4.7123890e0), re: got 1.953122516512806e-3, expected 1.953122516475148e-3, error=3.77e-14, tolerance=5.55e-17; component accuracy
315.75 s > near poles: csch d1: 152 failures; first z=(-9.7656250e-4 -4.7123890e0), re: got -1.836965819127374e-16, expected -1.836965819047030e-16, error=-8.03e-27, tolerance=5.22e-30; component accuracy
315.75 s > near poles: csch d2: 140 failures; first z=(-9.7656250e-4 -4.7123890e0), re: got -8.969563655434003e-19, expected -8.969563655207907e-19, error=-2.26e-29, tolerance=2.55e-32; component accuracy
315.75 s > near poles: sech d1: 152 failures; first z=(-9.7656250e-4 -4.7123890e0), re: got -3.944863463555240e-7, expected -3.944863463616931e-7, error=6.17e-18, tolerance=1.12e-20; component accuracy
315.75 s > near poles: sech d2: 152 failures; first z=(-9.7656250e-4 -4.7123890e0), re: got -1.211862056002572e-3, expected -1.211862056023036e-3, error=2.05e-14, tolerance=3.44e-17; component accuracy
315.75 s > near poles: tanh d2: 152 failures; first z=(-9.7656250e-4 -4.7123890e0), re: got -2.147483647958246e9, expected -2.147483647999870e9, error=4.16e-2, tolerance=6.10e-5; component accuracy
315.75 s > pole neighbors: coth d1: 4 failures; first z=(0 -4.9406565e-324), re: got NaN, expected inf, error=NaN, tolerance=inf; expected signed infinity
315.75 s > pole neighbors: coth d2: 28 failures; first z=(0 -4.7123890e0), re: got NaN, expected -0, error=NaN, tolerance=9.88e-324; unexpected nonfinite result
315.75 s > pole neighbors: csch d1: 28 failures; first z=(0 -4.7123890e0), re: got NaN, expected 7.044813998280222e-16, error=NaN, tolerance=2.00e-29; unexpected nonfinite result
315.75 s > pole neighbors: csch d2: 28 failures; first z=(0 -4.7123890e0), re: got NaN, expected -0, error=NaN, tolerance=9.88e-324; unexpected nonfinite result
315.75 s > pole neighbors: sech d1: 24 failures; first z=(0 -4.7123890e0), re: got NaN, expected 0, error=NaN, tolerance=9.88e-324; unexpected nonfinite result
315.75 s > pole neighbors: sech d2: 24 failures; first z=(0 -4.7123890e0), re: got NaN, expected -5.720334200684975e45, error=NaN, tolerance=1.63e32; unexpected nonfinite result
315.75 s > pole neighbors: tanh d2: 24 failures; first z=(0 -4.7123890e0), re: got NaN, expected -0, error=NaN, tolerance=9.88e-324; unexpected nonfinite result
315.75 s > tiny: coth d1: 72 failures; first z=(-9.3132257e-10 -9.3132257e-10), re: got 0, expected 3.333333333333333e-1, error=-3.33e-1, tolerance=2.47e-324; premature zero
315.75 s > tiny: coth d2: 64 failures; first z=(-2.4099199e-181 0), im: got NaN, expected -0, error=NaN, tolerance=9.88e-324; unexpected nonfinite result
315.75 s > tiny: csch d1: 40 failures; first z=(-9.3132257e-10 -9.3132257e-10), re: got 0, expected -1.666666666666667e-1, error=1.67e-1, tolerance=2.47e-324; premature zero
315.75 s > tiny: csch d2: 64 failures; first z=(-2.4099199e-181 0), im: got NaN, expected -0, error=NaN, tolerance=9.88e-324; unexpected nonfinite result
315.75 s > unequal components: sech d2: 4 failures; first z=(4.9406565e-324 3.5600000e2), im: got -2.914987310463355e-322, expected -2.766767616710981e-322, error=-1.48e-323, tolerance=9.88e-324; component accuracy
315.75 s > Location: crates/gammalooprs/src/integrands/process/evaluators/hyperbolic_tests.rs:312
315.75 s > ━━━━━━━━━━━━━━━━━━━━━━━━━━━━━━━━━━ BACKTRACE ━━━━━━━━━━━━━━━━━━━━━━━━━━━━━━━━━━━
315.75 s > 1: <color_eyre[51793ea62743adbd]::config::PanicHook>::panic_report<unknown>
315.75 s > at <unknown source file>:<unknown line>
315.75 s > 2: <color_eyre[51793ea62743adbd]::config::PanicHook>::into_panic_hook::{closure#0}<unknown>
315.75 s > at <unknown source file>:<unknown line>
315.75 s > 3: std[bcb96dfbba0ab899]::panicking::panic_with_hook<unknown>
315.75 s > at <unknown source file>:<unknown line>
315.75 s > 4: std[bcb96dfbba0ab899]::panicking::panic_handler::{closure#0}<unknown>
315.75 s > at <unknown source file>:<unknown line>
315.75 s > 5: std[bcb96dfbba0ab899]::sys::backtrace::__rust_end_short_backtrace::<std[bcb96dfbba0ab899]::panicking::panic_handler::{closure#0}, !><unknown>
315.75 s > at <unknown source file>:<unknown line>
315.75 s > 6: __rustc[6c289b9f9c454d21]::rust_begin_unwind<unknown>
315.75 s > at <unknown source file>:<unknown line>
315.75 s > 7: core[940e698046960fd5]::panicking::panic_fmt<unknown>
315.75 s > at <unknown source file>:<unknown line>
315.75 s > 8: <gammalooprs[e669b34b0f7bca9e]::integrands::process::evaluators::hyperbolic_tests::Checks>::finish<unknown>
315.75 s > at <unknown source file>:<unknown line>
315.75 s > 9: gammalooprs[e669b34b0f7bca9e]::integrands::process::evaluators::hyperbolic_tests::check_backend::<f64, gammalooprs[e669b34b0f7bca9e]::integrands::process::evaluators::hyperbolic_tests::hyperbolic_eager_f64::{closure#0}><unknown>
315.75 s > at <unknown source file>:<unknown line>
315.75 s > 10: <gammalooprs[e669b34b0f7bca9e]::integrands::process::evaluators::hyperbolic_tests::hyperbolic_eager_f64::{closure#0} as core[940e698046960fd5]::ops::function::FnOnce<()>>::call_once<unknown>
315.75 s > at <unknown source file>:<unknown line>
315.75 s > 11: test[75d6903177b1d7e9]::__rust_begin_short_backtrace::<core[940e698046960fd5]::result::Result<(), alloc[2ea6bcb46fca0c42]::string::String>, fn() -> core[940e698046960fd5]::result::Result<(), alloc[2ea6bcb46fca0c42]::string::String>><unknown>
315.75 s > at <unknown source file>:<unknown line>
315.75 s > 12: test[75d6903177b1d7e9]::run_test::{closure#0}<unknown>
315.75 s > at <unknown source file>:<unknown line>
315.75 s > 13: std[bcb96dfbba0ab899]::sys::backtrace::__rust_begin_short_backtrace::<test[75d6903177b1d7e9]::run_test::{closure#1}, ()><unknown>
315.75 s > at <unknown source file>:<unknown line>
315.75 s > 14: <std[bcb96dfbba0ab899]::thread::lifecycle::spawn_unchecked<test[75d6903177b1d7e9]::run_test::{closure#1}, ()>::{closure#1} as core[940e698046960fd5]::ops::function::FnOnce<()>>::call_once::{shim:vtable#0}<unknown>
315.75 s > at <unknown source file>:<unknown line>
315.75 s > 15: <std[bcb96dfbba0ab899]::sys::thread::unix::Thread>::new::thread_start<unknown>
315.75 s > at <unknown source file>:<unknown line>
315.75 s > infinite real part: coth d0: 8 failures; first z=(inf 0), re: got NaN, expected 1.000000000000000e0, error=NaN, tolerance=2.84e-14; unexpected nonfinite result
315.75 s > infinite real part: tanh d0: 4 failures; first z=(inf 0), re: got NaN, expected 1.000000000000000e0, error=NaN, tolerance=2.84e-14; unexpected nonfinite result
315.75 s > near poles: coth d0: 160 failures; first z=(-9.7656250e-4 -4.7123890e0), re: got -9.765621895971165e-4, expected -9.765621895592603e-4, error=-3.79e-14, tolerance=2.78e-17; component accuracy
315.75 s > near poles: csch d0: 8 failures; first z=(-9.3326362e-302 0), re: got -inf, expected -1.071508607186267e301, error=-inf, tolerance=3.05e287; unexpected nonfinite result
315.75 s > near poles: tanh d0: 152 failures; first z=(-9.7656250e-4 -4.7123890e0), re: got -1.024000325481117e3, expected -1.024000325520813e3, error=3.97e-8, tolerance=2.91e-11; component accuracy
315.75 s > pole neighbors: coth d0: 26 failures; first z=(0 -4.7123890e0), re: got NaN, expected 0, error=NaN, tolerance=9.88e-324; unexpected nonfinite result
315.75 s > pole neighbors: csch d0: 2 failures; first z=(0 -4.9406565e-324), re: got NaN, expected 0, error=NaN, tolerance=9.88e-324; unexpected nonfinite result
315.75 s > pole neighbors: tanh d0: 24 failures; first z=(0 -4.7123890e0), re: got NaN, expected 0, error=NaN, tolerance=9.88e-324; unexpected nonfinite result
315.75 s > range boundary: cosh d0: 58 failures; first z=(-7.1100000e2 0), im: got NaN, expected -0, error=NaN, tolerance=9.88e-324; unexpected nonfinite result
315.75 s > range boundary: coth d0: 480 failures; first z=(-3.5600000e2 0), re: got NaN, expected -1.000000000000000e0, error=NaN, tolerance=2.84e-14; unexpected nonfinite result
315.75 s > range boundary: csch d0: 308 failures; first z=(-3.5600000e2 0), re: got -0, expected -4.922598761629717e-155, error=4.92e-155, tolerance=2.47e-324; premature zero
315.75 s > range boundary: sech d0: 308 failures; first z=(-3.5600000e2 0), re: got 0, expected 4.922598761629717e-155, error=-4.92e-155, tolerance=2.47e-324; premature zero
315.75 s > range boundary: sinh d0: 58 failures; first z=(-7.1100000e2 0), im: got NaN, expected 0, error=NaN, tolerance=9.88e-324; unexpected nonfinite result
315.75 s > range boundary: tanh d0: 268 failures; first z=(-3.5600000e2 0), re: got NaN, expected -1.000000000000000e0, error=NaN, tolerance=2.84e-14; unexpected nonfinite result
315.75 s > tiny: coth d0: 68 failures; first z=(-2.4099199e-181 0), re: got -inf, expected -4.149515568880993e180, error=-inf, tolerance=1.18e167; unexpected nonfinite result
315.75 s > tiny: csch d0: 68 failures; first z=(-2.4099199e-181 0), re: got -inf, expected -4.149515568880993e180, error=-inf, tolerance=1.18e167; unexpected nonfinite result
315.75 s > unequal components: cosh d0: 8 failures; first z=(7.1100000e2 1.0000000e-300), im: got inf, expected 3.036313688864996e8, error=inf, tolerance=8.63e-6; unexpected nonfinite result
315.75 s > unequal components: coth d0: 24 failures; first z=(3.5600000e2 1.0000000e-300), re: got NaN, expected 1.000000000000000e0, error=NaN, tolerance=2.84e-14; unexpected nonfinite result
315.75 s > unequal components: csch d0: 8 failures; first z=(3.5600000e2 1.0000000e-300), re: got 0, expected 4.922598761629437e-155, error=-4.92e-155, tolerance=2.47e-324; premature zero
315.75 s > unequal components: sech d0: 8 failures; first z=(3.5600000e2 1.0000000e-300), re: got 0, expected 4.922598761629437e-155, error=-4.92e-155, tolerance=2.47e-324; premature zero
315.75 s > unequal components: sinh d0: 8 failures; first z=(7.1100000e2 1.0000000e-300), im: got inf, expected 3.036313688864996e8, error=inf, tolerance=8.63e-6; unexpected nonfinite result
315.75 s > unequal components: tanh d0: 12 failures; first z=(3.5600000e2 1.0000000e-300), re: got NaN, expected 1.000000000000000e0, error=NaN, tolerance=2.84e-14; unexpected nonfinite result
315.75 s > Symbolic derivative failures (composed expressions; cancellation may reduce accuracy):
315.75 s > UV: cosh d1: 8 failures; first z=(-1.0000000e3 0), im: got NaN, expected 0, error=NaN, tolerance=9.88e-324; unexpected nonfinite result
315.75 s > UV: cosh d2: 8 failures; first z=(-1.0000000e3 0), im: got NaN, expected -0, error=NaN, tolerance=9.88e-324; unexpected nonfinite result
315.75 s > UV: coth d2: 32 failures; first z=(-1.0000000e3 0), re: got NaN, expected -0, error=NaN, tolerance=9.88e-324; unexpected nonfinite result
315.75 s > UV: csch d1: 32 failures; first z=(-1.0000000e3 0), re: got NaN, expected -0, error=NaN, tolerance=9.88e-324; unexpected nonfinite result
315.75 s > UV: csch d2: 32 failures; first z=(-1.0000000e3 0), re: got NaN, expected -0, error=NaN, tolerance=9.88e-324; unexpected nonfinite result
315.75 s > UV: sech d1: 32 failures; first z=(-1.0000000e3 0), re: got NaN, expected 0, error=NaN, tolerance=9.88e-324; unexpected nonfinite result
315.75 s > UV: sech d2: 32 failures; first z=(-1.0000000e3 0), re: got NaN, expected 0, error=NaN, tolerance=9.88e-324; unexpected nonfinite result
315.75 s > UV: sinh d1: 8 failures; first z=(-1.0000000e3 0), im: got NaN, expected -0, error=NaN, tolerance=9.88e-324; unexpected nonfinite result
315.75 s > UV: sinh d2: 8 failures; first z=(-1.0000000e3 0), im: got NaN, expected 0, error=NaN, tolerance=9.88e-324; unexpected nonfinite result
315.75 s > UV: tanh d2: 32 failures; first z=(-1.0000000e3 0), re: got NaN, expected 0, error=NaN, tolerance=9.88e-324; unexpected nonfinite result
315.75 s > near poles: coth d1: 8 failures; first z=(-9.3326362e-302 0), re: got NaN, expected -inf, error=NaN, tolerance=inf; expected signed infinity
315.75 s > near poles: coth d2: 160 failures; first z=(-9.7656250e-4 -4.7123890e0), re: got 1.953122516550860e-3, expected 1.953122516475148e-3, error=7.57e-14, tolerance=5.55e-17; component accuracy
315.75 s > near poles: csch d1: 160 failures; first z=(-9.7656250e-4 -4.7123890e0), re: got -1.836965819118240e-16, expected -1.836965819047030e-16, error=-7.12e-27, tolerance=5.22e-30; component accuracy
315.75 s > near poles: csch d2: 112 failures; first z=(-9.7656250e-4 -4.7123890e0), re: got -8.969563655486067e-19, expected -8.969563655207907e-19, error=-2.78e-29, tolerance=2.55e-32; component accuracy
315.75 s > near poles: sech d1: 152 failures; first z=(-9.7656250e-4 -4.7123890e0), re: got -3.944863463464010e-7, expected -3.944863463616931e-7, error=1.53e-17, tolerance=1.12e-20; component accuracy
315.75 s > near poles: sech d2: 152 failures; first z=(-9.7656250e-4 -4.7123890e0), re: got -1.211862055976059e-3, expected -1.211862056023036e-3, error=4.70e-14, tolerance=3.44e-17; component accuracy
315.75 s > near poles: tanh d2: 152 failures; first z=(-9.7656250e-4 -4.7123890e0), re: got -2.147483647916624e9, expected -2.147483647999870e9, error=8.32e-2, tolerance=6.10e-5; component accuracy
315.75 s > pole neighbors: coth d1: 4 failures; first z=(0 -4.9406565e-324), re: got NaN, expected inf, error=NaN, tolerance=inf; expected signed infinity
315.75 s > pole neighbors: coth d2: 28 failures; first z=(0 -4.7123890e0), re: got NaN, expected -0, error=NaN, tolerance=9.88e-324; unexpected nonfinite result
315.75 s > pole neighbors: csch d1: 28 failures; first z=(0 -4.7123890e0), re: got NaN, expected 7.044813998280222e-16, error=NaN, tolerance=2.00e-29; unexpected nonfinite result
315.75 s > pole neighbors: csch d2: 28 failures; first z=(0 -4.7123890e0), re: got NaN, expected -0, error=NaN, tolerance=9.88e-324; unexpected nonfinite result
315.75 s > pole neighbors: sech d1: 24 failures; first z=(0 -4.7123890e0), re: got NaN, expected 0, error=NaN, tolerance=9.88e-324; unexpected nonfinite result
315.75 s > pole neighbors: sech d2: 24 failures; first z=(0 -4.7123890e0), re: got NaN, expected -5.720334200684975e45, error=NaN, tolerance=1.63e32; unexpected nonfinite result
315.75 s > pole neighbors: tanh d2: 24 failures; first z=(0 -4.7123890e0), re: got NaN, expected -0, error=NaN, tolerance=9.88e-324; unexpected nonfinite result
315.75 s > range boundary: cosh d1: 58 failures; first z=(-7.1100000e2 0), im: got NaN, expected 0, error=NaN, tolerance=9.88e-324; unexpected nonfinite result
315.75 s > range boundary: cosh d2: 58 failures; first z=(-7.1100000e2 0), im: got NaN, expected -0, error=NaN, tolerance=9.88e-324; unexpected nonfinite result
315.75 s > range boundary: coth d1: 40 failures; first z=(-3.5600000e2 0), re: got -0, expected -2.423197856799843e-309, error=2.42e-309, tolerance=2.47e-324; premature zero
315.75 s > range boundary: coth d2: 480 failures; first z=(-3.5600000e2 0), re: got NaN, expected -4.846395713599686e-309, error=NaN, tolerance=1.48e-322; unexpected nonfinite result
315.75 s > range boundary: csch d1: 480 failures; first z=(-3.5600000e2 0), re: got NaN, expected -4.922598761629717e-155, error=NaN, tolerance=1.40e-168; unexpected nonfinite result
315.75 s > range boundary: csch d2: 480 failures; first z=(-3.5600000e2 0), re: got NaN, expected -4.922598761629717e-155, error=NaN, tolerance=1.40e-168; unexpected nonfinite result
315.75 s > range boundary: sech d1: 480 failures; first z=(-3.5600000e2 0), re: got NaN, expected 4.922598761629717e-155, error=NaN, tolerance=1.40e-168; unexpected nonfinite result
315.75 s > range boundary: sech d2: 480 failures; first z=(-3.5600000e2 0), re: got NaN, expected 4.922598761629717e-155, error=NaN, tolerance=1.40e-168; unexpected nonfinite result
315.75 s > range boundary: sinh d1: 58 failures; first z=(-7.1100000e2 0), im: got NaN, expected -0, error=NaN, tolerance=9.88e-324; unexpected nonfinite result
315.75 s > range boundary: sinh d2: 58 failures; first z=(-7.1100000e2 0), im: got NaN, expected 0, error=NaN, tolerance=9.88e-324; unexpected nonfinite result
315.75 s > range boundary: tanh d1: 40 failures; first z=(-3.5600000e2 0), re: got 0, expected 2.423197856799843e-309, error=-2.42e-309, tolerance=2.47e-324; premature zero
315.75 s > range boundary: tanh d2: 480 failures; first z=(-3.5600000e2 0), re: got NaN, expected 4.846395713599686e-309, error=NaN, tolerance=1.48e-322; unexpected nonfinite result
315.75 s > tiny: coth d1: 88 failures; first z=(-9.3132257e-10 -9.3132257e-10), re: got 0, expected 3.333333333333333e-1, error=-3.33e-1, tolerance=2.47e-324; premature zero
315.75 s > tiny: coth d2: 80 failures; first z=(-2.4099199e-181 0), re: got NaN, expected -inf, error=NaN, tolerance=inf; expected signed infinity
315.75 s > tiny: csch d1: 88 failures; first z=(-9.3132257e-10 -9.3132257e-10), re: got 0, expected -1.666666666666667e-1, error=1.67e-1, tolerance=2.47e-324; premature zero
315.75 s > tiny: csch d2: 80 failures; first z=(-2.4099199e-181 0), re: got NaN, expected -inf, error=NaN, tolerance=inf; expected signed infinity
315.75 s > unequal components: cosh d1: 8 failures; first z=(7.1100000e2 1.0000000e-300), im: got inf, expected 3.036313688864996e8, error=inf, tolerance=8.63e-6; unexpected nonfinite result
315.75 s > unequal components: cosh d2: 8 failures; first z=(7.1100000e2 1.0000000e-300), im: got inf, expected 3.036313688864996e8, error=inf, tolerance=8.63e-6; unexpected nonfinite result
315.75 s > unequal components: coth d1: 4 failures; first z=(3.5600000e2 1.0000000e-300), re: got 0, expected -2.423197856799566e-309, error=2.42e-309, tolerance=2.47e-324; premature zero
315.75 s > unequal components: coth d2: 24 failures; first z=(3.5600000e2 1.0000000e-300), re: got NaN, expected 4.846395713599132e-309, error=NaN, tolerance=1.48e-322; unexpected nonfinite result
315.75 s > unequal components: csch d1: 24 failures; first z=(3.5600000e2 1.0000000e-300), re: got NaN, expected -4.922598761629437e-155, error=NaN, tolerance=1.40e-168; unexpected nonfinite result
315.75 s > unequal components: csch d2: 24 failures; first z=(3.5600000e2 1.0000000e-300), re: got NaN, expected 4.922598761629437e-155, error=NaN, tolerance=1.40e-168; unexpected nonfinite result
315.75 s > unequal components: sech d1: 24 failures; first z=(3.5600000e2 1.0000000e-300), re: got NaN, expected -4.922598761629437e-155, error=NaN, tolerance=1.40e-168; unexpected nonfinite result
315.75 s > unequal components: sech d2: 28 failures; first z=(3.5600000e2 1.0000000e-300), re: got NaN, expected 4.922598761629437e-155, error=NaN, tolerance=1.40e-168; unexpected nonfinite result
315.75 s > unequal components: sinh d1: 8 failures; first z=(7.1100000e2 1.0000000e-300), im: got inf, expected 3.036313688864996e8, error=inf, tolerance=8.63e-6; unexpected nonfinite result
315.75 s > unequal components: sinh d2: 8 failures; first z=(7.1100000e2 1.0000000e-300), im: got inf, expected 3.036313688864996e8, error=inf, tolerance=8.63e-6; unexpected nonfinite result
315.75 s > unequal components: tanh d1: 4 failures; first z=(3.5600000e2 1.0000000e-300), re: got 0, expected 2.423197856799566e-309, error=-2.42e-309, tolerance=2.47e-324; premature zero
315.75 s > unequal components: tanh d2: 24 failures; first z=(3.5600000e2 1.0000000e-300), re: got NaN, expected -4.846395713599132e-309, error=NaN, tolerance=1.48e-322; unexpected nonfinite result
315.75 s > Location: crates/gammalooprs/src/integrands/process/evaluators/hyperbolic_tests.rs:312
315.75 s > ━━━━━━━━━━━━━━━━━━━━━━━━━━━━━━━━━━ BACKTRACE ━━━━━━━━━━━━━━━━━━━━━━━━━━━━━━━━━━━
315.75 s > 1: <color_eyre[51793ea62743adbd]::config::PanicHook>::panic_report<unknown>
315.75 s > at <unknown source file>:<unknown line>
315.75 s > 2: <color_eyre[51793ea62743adbd]::config::PanicHook>::into_panic_hook::{closure#0}<unknown>
315.75 s > at <unknown source file>:<unknown line>
315.75 s > 3: std[bcb96dfbba0ab899]::panicking::panic_with_hook<unknown>
315.75 s > at <unknown source file>:<unknown line>
315.75 s > 4: std[bcb96dfbba0ab899]::panicking::panic_handler::{closure#0}<unknown>
315.75 s > at <unknown source file>:<unknown line>
315.75 s > 5: std[bcb96dfbba0ab899]::sys::backtrace::__rust_end_short_backtrace::<std[bcb96dfbba0ab899]::panicking::panic_handler::{closure#0}, !><unknown>
315.75 s > at <unknown source file>:<unknown line>
315.75 s > 6: __rustc[6c289b9f9c454d21]::rust_begin_unwind<unknown>
315.75 s > at <unknown source file>:<unknown line>
315.75 s > 7: core[940e698046960fd5]::panicking::panic_fmt<unknown>
315.75 s > at <unknown source file>:<unknown line>
315.75 s > 8: <gammalooprs[e669b34b0f7bca9e]::integrands::process::evaluators::hyperbolic_tests::Checks>::finish<unknown>
315.75 s > at <unknown source file>:<unknown line>
315.75 s > 9: gammalooprs[e669b34b0f7bca9e]::integrands::process::evaluators::hyperbolic_tests::check_backend::<f64, gammalooprs[e669b34b0f7bca9e]::integrands::process::evaluators::hyperbolic_tests::hyperbolic_symjit_o2::{closure#0}><unknown>
315.75 s > at <unknown source file>:<unknown line>
315.75 s > 10: gammalooprs[e669b34b0f7bca9e]::integrands::process::evaluators::hyperbolic_tests::hyperbolic_symjit_o2<unknown>
315.75 s > at <unknown source file>:<unknown line>
315.75 s > 11: <gammalooprs[e669b34b0f7bca9e]::integrands::process::evaluators::hyperbolic_tests::hyperbolic_symjit_o2::{closure#0} as core[940e698046960fd5]::ops::function::FnOnce<()>>::call_once<unknown>
315.75 s > at <unknown source file>:<unknown line>
315.75 s > 12: test[75d6903177b1d7e9]::__rust_begin_short_backtrace::<core[940e698046960fd5]::result::Result<(), alloc[2ea6bcb46fca0c42]::string::String>, fn() -> core[940e698046960fd5]::result::Result<(), alloc[2ea6bcb46fca0c42]::string::String>><unknown>
315.75 s > at <unknown source file>:<unknown line>
315.75 s > 13: test[75d6903177b1d7e9]::run_test::{closure#0}<unknown>
315.75 s > at <unknown source file>:<unknown line>
315.75 s > ... omitted 13 more lines; see full nextest output above
315.75 s > infinite real part: coth d0: 8 failures; first z=(inf 0), re: got NaN, expected 1.000000000000000e0, error=NaN, tolerance=3.16e-30; unexpected nonfinite result
315.75 s > infinite real part: csch d0: 8 failures; first z=(inf 0), re: got NaN, expected 0, error=NaN, tolerance=9.88e-324; unexpected nonfinite result
315.75 s > infinite real part: sech d0: 8 failures; first z=(inf 0), re: got NaN, expected 0, error=NaN, tolerance=9.88e-324; unexpected nonfinite result
315.75 s > infinite real part: tanh d0: 4 failures; first z=(inf 0), re: got NaN, expected 1.000000000000000e0, error=NaN, tolerance=3.16e-30; unexpected nonfinite result
315.75 s > near poles: coth d0: 144 failures; first z=(-9.7656250e-4 -4.7123890e0), re: got -9.765621895592602e-4, expected -9.765621895592602e-4, error=1.69e-30, tolerance=3.08e-33; component accuracy
315.75 s > near poles: tanh d0: 144 failures; first z=(-9.7656250e-4 -4.7123890e0), re: got -1.024000325520813e3, expected -1.024000325520813e3, error=-1.24e-24, tolerance=3.23e-27; component accuracy
315.75 s > pole neighbors: coth d0: 12 failures; first z=(0 -4.7123890e0), im: got -7.008282842946301e-16, expected -7.044813998280223e-16, error=3.65e-18, tolerance=2.22e-45; component accuracy
315.75 s > pole neighbors: tanh d0: 12 failures; first z=(0 -4.7123890e0), im: got 1.424967069597696e15, expected 1.419483893036948e15, error=5.48e12, tolerance=4.48e-15; component accuracy
315.75 s > Symbolic derivative failures (composed expressions; cancellation may reduce accuracy):
315.75 s > UV: cosh d1: 6 failures; first z=(-1.0000000e12 0), im: got NaN, expected 0, error=NaN, tolerance=9.88e-324; unexpected nonfinite result
315.75 s > UV: cosh d2: 6 failures; first z=(-1.0000000e12 0), im: got NaN, expected -0, error=NaN, tolerance=9.88e-324; unexpected nonfinite result
315.75 s > UV: coth d1: 24 failures; first z=(-1.0000000e12 0), re: got NaN, expected -0, error=NaN, tolerance=9.88e-324; unexpected nonfinite result
315.75 s > UV: coth d2: 24 failures; first z=(-1.0000000e12 0), re: got NaN, expected 0, error=NaN, tolerance=9.88e-324; unexpected nonfinite result
315.75 s > UV: csch d1: 24 failures; first z=(-1.0000000e12 0), re: got NaN, expected 0, error=NaN, tolerance=9.88e-324; unexpected nonfinite result
315.75 s > UV: csch d2: 24 failures; first z=(-1.0000000e12 0), re: got NaN, expected 0, error=NaN, tolerance=9.88e-324; unexpected nonfinite result
315.75 s > UV: sech d1: 24 failures; first z=(-1.0000000e12 0), re: got NaN, expected 0, error=NaN, tolerance=9.88e-324; unexpected nonfinite result
315.75 s > UV: sech d2: 24 failures; first z=(-1.0000000e12 0), re: got NaN, expected 0, error=NaN, tolerance=9.88e-324; unexpected nonfinite result
315.75 s > UV: sinh d1: 6 failures; first z=(-1.0000000e12 0), im: got NaN, expected -0, error=NaN, tolerance=9.88e-324; unexpected nonfinite result
315.75 s > UV: sinh d2: 6 failures; first z=(-1.0000000e12 0), im: got NaN, expected 0, error=NaN, tolerance=9.88e-324; unexpected nonfinite result
315.75 s > UV: tanh d1: 24 failures; first z=(-1.0000000e12 0), re: got NaN, expected 0, error=NaN, tolerance=9.88e-324; unexpected nonfinite result
315.75 s > UV: tanh d2: 24 failures; first z=(-1.0000000e12 0), re: got NaN, expected 0, error=NaN, tolerance=9.88e-324; unexpected nonfinite result
315.75 s > ━━━━━━━━━━━━━━━━━━━━━━━━━━━━━━━━━━ BACKTRACE ━━━━━━━━━━━━━━━━━━━━━━━━━━━━━━━━━━━
315.75 s > 1: <color_eyre[51793ea62743adbd]::config::PanicHook>::panic_report<unknown>
315.75 s > at <unknown source file>:<unknown line>
315.75 s > 2: <color_eyre[51793ea62743adbd]::config::PanicHook>::into_panic_hook::{closure#0}<unknown>
315.75 s > at <unknown source file>:<unknown line>
315.75 s > 3: std[bcb96dfbba0ab899]::panicking::panic_with_hook<unknown>
315.75 s > at <unknown source file>:<unknown line>
315.75 s > 4: std[bcb96dfbba0ab899]::panicking::panic_handler::{closure#0}<unknown>
315.75 s > at <unknown source file>:<unknown line>
315.75 s > 5: std[bcb96dfbba0ab899]::sys::backtrace::__rust_end_short_backtrace::<std[bcb96dfbba0ab899]::panicking::panic_handler::{closure#0}, !><unknown>
315.75 s > at <unknown source file>:<unknown line>
315.75 s > 6: __rustc[6c289b9f9c454d21]::rust_begin_unwind<unknown>
315.75 s > at <unknown source file>:<unknown line>
315.75 s > 7: core[940e698046960fd5]::panicking::panic_fmt<unknown>
315.75 s > at <unknown source file>:<unknown line>
315.75 s > 8: <gammalooprs[e669b34b0f7bca9e]::integrands::process::evaluators::hyperbolic_tests::Checks>::finish<unknown>
315.75 s > at <unknown source file>:<unknown line>
315.75 s > 9: gammalooprs[e669b34b0f7bca9e]::integrands::process::evaluators::hyperbolic_tests::check_backend::<gammalooprs[e669b34b0f7bca9e]::utils::QuadFloat, gammalooprs[e669b34b0f7bca9e]::integrands::process::evaluators::hyperbolic_tests::hyperbolic_eager_quad::{closure#0}><unknown>
315.75 s > at <unknown source file>:<unknown line>
315.75 s > 10: <gammalooprs[e669b34b0f7bca9e]::integrands::process::evaluators::hyperbolic_tests::hyperbolic_eager_quad::{closure#0} as core[940e698046960fd5]::ops::function::FnOnce<()>>::call_once<unknown>
315.75 s > at <unknown source file>:<unknown line>
315.75 s > 11: test[75d6903177b1d7e9]::__rust_begin_short_backtrace::<core[940e698046960fd5]::result::Result<(), alloc[2ea6bcb46fca0c42]::string::String>, fn() -> core[940e698046960fd5]::result::Result<(), alloc[2ea6bcb46fca0c42]::string::String>><unknown>
315.75 s > at <unknown source file>:<unknown line>
315.75 s > 12: test[75d6903177b1d7e9]::run_test::{closure#0}<unknown>
315.75 s > at <unknown source file>:<unknown line>
315.75 s > 13: std[bcb96dfbba0ab899]::sys::backtrace::__rust_begin_short_backtrace::<test[75d6903177b1d7e9]::run_test::{closure#1}, ()><unknown>
315.75 s > at <unknown source file>:<unknown line>
315.75 s > 14: <std[bcb96dfbba0ab899]::thread::lifecycle::spawn_unchecked<test[75d6903177b1d7e9]::run_test::{closure#1}, ()>::{closure#1} as core[940e698046960fd5]::ops::function::FnOnce<()>>::call_once::{shim:vtable#0}<unknown>
315.75 s > at <unknown source file>:<unknown line>
315.75 s > 15: <std[bcb96dfbba0ab899]::sys::thread::unix::Thread>::new::thread_start<unknown>
315.75 s > at <unknown source file>:<unknown line>
315.75 s > infinite real part: coth d0: 8 failures; first z=(inf 0), re: got NaN, expected 1.000000000000000e0, error=NaN, tolerance=2.39e-299; unexpected nonfinite result
315.75 s > infinite real part: csch d0: 8 failures; first z=(inf 0), re: got NaN, expected 0, error=NaN, tolerance=4.77e-323228497; unexpected nonfinite result
315.75 s > infinite real part: sech d0: 8 failures; first z=(inf 0), re: got NaN, expected 0, error=NaN, tolerance=4.77e-323228497; unexpected nonfinite result
315.75 s > infinite real part: tanh d0: 4 failures; first z=(inf 0), re: got NaN, expected 1.000000000000000e0, error=NaN, tolerance=2.39e-299; unexpected nonfinite result
315.75 s > near poles: coth d0: 120 failures; first z=(-9.7656250e-4 -4.7123890e0), re: got -9.765621895592602e-4, expected -9.765621895592602e-4, error=-8.06e-300, tolerance=2.33e-302; component accuracy
315.75 s > near poles: tanh d0: 120 failures; first z=(-9.7656250e-4 -4.7123890e0), re: got -1.024000325520813e3, expected -1.024000325520813e3, error=7.35e-294, tolerance=2.45e-296; component accuracy
315.75 s > pole neighbors: coth d0: 12 failures; first z=(0 -4.7123890e0), im: got -7.044813998280223e-16, expected -7.044813998280223e-16, error=-2.08e-287, tolerance=1.68e-314; component accuracy
315.75 s > pole neighbors: tanh d0: 12 failures; first z=(0 -4.7123890e0), im: got 1.419483893036948e15, expected 1.419483893036948e15, error=6.37e-258, tolerance=3.39e-284; component accuracy
315.75 s > Symbolic derivative failures (composed expressions; cancellation may reduce accuracy):
315.75 s > UV: cosh d1: 6 failures; first z=(-1.0000000e12 0), im: got NaN, expected 0, error=NaN, tolerance=4.77e-323228497; unexpected nonfinite result
315.75 s > UV: cosh d2: 6 failures; first z=(-1.0000000e12 0), im: got -NaN, expected -0, error=NaN, tolerance=4.77e-323228497; unexpected nonfinite result
315.75 s > UV: coth d1: 24 failures; first z=(-1.0000000e12 0), re: got NaN, expected -0, error=NaN, tolerance=4.77e-323228497; unexpected nonfinite result
315.75 s > UV: coth d2: 24 failures; first z=(-1.0000000e12 0), re: got NaN, expected 0, error=NaN, tolerance=4.77e-323228497; unexpected nonfinite result
315.75 s > UV: csch d1: 24 failures; first z=(-1.0000000e12 0), re: got NaN, expected 0, error=NaN, tolerance=4.77e-323228497; unexpected nonfinite result
315.75 s > UV: csch d2: 24 failures; first z=(-1.0000000e12 0), re: got NaN, expected 0, error=NaN, tolerance=4.77e-323228497; unexpected nonfinite result
315.75 s > UV: sech d1: 24 failures; first z=(-1.0000000e12 0), re: got NaN, expected 0, error=NaN, tolerance=4.77e-323228497; unexpected nonfinite result
315.75 s > UV: sech d2: 24 failures; first z=(-1.0000000e12 0), re: got NaN, expected 0, error=NaN, tolerance=4.77e-323228497; unexpected nonfinite result
315.75 s > UV: sinh d1: 6 failures; first z=(-1.0000000e12 0), im: got -NaN, expected -0, error=NaN, tolerance=4.77e-323228497; unexpected nonfinite result
315.75 s > UV: sinh d2: 6 failures; first z=(-1.0000000e12 0), im: got NaN, expected 0, error=NaN, tolerance=4.77e-323228497; unexpected nonfinite result
315.75 s > UV: tanh d1: 24 failures; first z=(-1.0000000e12 0), re: got NaN, expected 0, error=NaN, tolerance=4.77e-323228497; unexpected nonfinite result
315.75 s > UV: tanh d2: 24 failures; first z=(-1.0000000e12 0), re: got NaN, expected 0, error=NaN, tolerance=4.77e-323228497; unexpected nonfinite result
315.75 s > ━━━━━━━━━━━━━━━━━━━━━━━━━━━━━━━━━━ BACKTRACE ━━━━━━━━━━━━━━━━━━━━━━━━━━━━━━━━━━━
315.75 s > 1: <color_eyre[51793ea62743adbd]::config::PanicHook>::panic_report<unknown>
315.75 s > at <unknown source file>:<unknown line>
315.75 s > 2: <color_eyre[51793ea62743adbd]::config::PanicHook>::into_panic_hook::{closure#0}<unknown>
315.75 s > at <unknown source file>:<unknown line>
315.75 s > 3: std[bcb96dfbba0ab899]::panicking::panic_with_hook<unknown>
315.75 s > at <unknown source file>:<unknown line>
315.75 s > 4: std[bcb96dfbba0ab899]::panicking::panic_handler::{closure#0}<unknown>
315.75 s > at <unknown source file>:<unknown line>
315.75 s > 5: std[bcb96dfbba0ab899]::sys::backtrace::__rust_end_short_backtrace::<std[bcb96dfbba0ab899]::panicking::panic_handler::{closure#0}, !><unknown>
315.75 s > at <unknown source file>:<unknown line>
315.75 s > 6: __rustc[6c289b9f9c454d21]::rust_begin_unwind<unknown>
315.75 s > at <unknown source file>:<unknown line>
315.75 s > 7: core[940e698046960fd5]::panicking::panic_fmt<unknown>
315.75 s > at <unknown source file>:<unknown line>
315.75 s > 8: <gammalooprs[e669b34b0f7bca9e]::integrands::process::evaluators::hyperbolic_tests::Checks>::finish<unknown>
315.75 s > at <unknown source file>:<unknown line>
315.75 s > 9: gammalooprs[e669b34b0f7bca9e]::integrands::process::evaluators::hyperbolic_tests::check_backend::<gammalooprs[e669b34b0f7bca9e]::utils::VarFloat<1000u32>, gammalooprs[e669b34b0f7bca9e]::integrands::process::evaluators::hyperbolic_tests::hyperbolic_eager_arb::{closure#0}><unknown>
315.75 s > at <unknown source file>:<unknown line>
315.75 s > 10: <gammalooprs[e669b34b0f7bca9e]::integrands::process::evaluators::hyperbolic_tests::hyperbolic_eager_arb::{closure#0} as core[940e698046960fd5]::ops::function::FnOnce<()>>::call_once<unknown>
315.75 s > at <unknown source file>:<unknown line>
315.75 s > 11: test[75d6903177b1d7e9]::__rust_begin_short_backtrace::<core[940e698046960fd5]::result::Result<(), alloc[2ea6bcb46fca0c42]::string::String>, fn() -> core[940e698046960fd5]::result::Result<(), alloc[2ea6bcb46fca0c42]::string::String>><unknown>
315.75 s > at <unknown source file>:<unknown line>
315.75 s > 12: test[75d6903177b1d7e9]::run_test::{closure#0}<unknown>
315.75 s > at <unknown source file>:<unknown line>
315.75 s > 13: std[bcb96dfbba0ab899]::sys::backtrace::__rust_begin_short_backtrace::<test[75d6903177b1d7e9]::run_test::{closure#1}, ()><unknown>
315.75 s > at <unknown source file>:<unknown line>
315.75 s > 14: <std[bcb96dfbba0ab899]::thread::lifecycle::spawn_unchecked<test[75d6903177b1d7e9]::run_test::{closure#1}, ()>::{closure#1} as core[940e698046960fd5]::ops::function::FnOnce<()>>::call_once::{shim:vtable#0}<unknown>
315.75 s > at <unknown source file>:<unknown line>
315.75 s > 15: <std[bcb96dfbba0ab899]::sys::thread::unix::Thread>::new::thread_start<unknown>
315.75 s > at <unknown source file>:<unknown line>