test packages.x86_64-linux.nix-ci-check-gammaloop-nextest-python-api

Reproduce this run
Retry Run
  1. 0.19 s $ /nix/store/9ypz3flqsrl5xl495mm8h645gadjsxi1-coreutils-9.11/bin/timeout --kill-after=15s 7200s /nix/store/23zk8sgzamrbmj1fday15szf7f2279s8-nix-2.34.7/bin/nix --extra-experimental-features nix-command --extra-experimental-features flakes flake clone git+https://github.com/alphal00p/gammaloop --dest /tmp/nix-ci-worker/stable-pwd/repo/
  2. 0.24 s Cloning into '/tmp/nix-ci-worker/stable-pwd/repo'...
  3. 1.91 s remote: Enumerating objects: 57328 remote: Enumerating objects: 66329, done.
  4. 2.03 s remote: Counting objects: 0% (1/9001) remote: Counting objects: 1% (91/9001) remote: Counting objects: 2% (181/9001) remote: Counting objects: 3% (271/9001) remote: Counting objects: 4% (361/9001) remote: Counting objects: 5% (451/9001) remote: Counting objects: 6% (541/9001) remote: Counting objects: 7% (631/9001) remote: Counting objects: 8% (721/9001) remote: Counting objects: 9% (811/9001) remote: Counting objects: 10% (901/9001) remote: Counting objects: 11% (991/9001) remote: Counting objects: 12% (1081/9001) remote: Counting objects: 13% (1171/9001) remote: Counting objects: 14% (1261/9001) remote: Counting objects: 15% (1351/9001) remote: Counting objects: 16% (1441/9001) remote: Counting objects: 17% (1531/9001) remote: Counting objects: 18% (1621/9001) remote: Counting objects: 19% (1711/9001) remote: Counting objects: 20% (1801/9001) remote: Counting objects: 21% (1891/9001) remote: Counting objects: 22% (1981/9001) remote: Counting objects: 23% (2071/9001) remote: Counting objects: 24% (2161/9001) remote: Counting objects: 25% (2251/9001) remote: Counting objects: 26% (2341/9001) remote: Counting objects: 27% (2431/9001) remote: Counting objects: 28% (2521/9001) remote: Counting objects: 29% (2611/9001) remote: Counting objects: 30% (2701/9001) remote: Counting objects: 31% (2791/9001) remote: Counting objects: 32% (2881/9001) remote: Counting objects: 33% (2971/9001) remote: Counting objects: 34% (3061/9001) remote: Counting objects: 35% (3151/9001) remote: Counting objects: 36% (3241/9001) remote: Counting objects: 37% (3331/9001) remote: Counting objects: 38% (3421/9001) remote: Counting objects: 39% (3511/9001) remote: Counting objects: 40% (3601/9001) remote: Counting objects: 41% (3691/9001) remote: Counting objects: 42% (3781/9001) remote: Counting objects: 43% (3871/9001) remote: Counting objects: 44% (3961/9001) remote: Counting objects: 45% (4051/9001) remote: Counting objects: 46% (4141/9001) remote: Counting objects: 47% (4231/9001) remote: Counting objects: 48% (4321/9001) remote: Counting objects: 49% (4411/9001) remote: Counting objects: 50% (4501/9001) remote: Counting objects: 51% (4591/9001) remote: Counting objects: 52% (4681/9001) remote: Counting objects: 53% (4771/9001) remote: Counting objects: 54% (4861/9001) remote: Counting objects: 55% (4951/9001) remote: Counting objects: 56% (5041/9001) remote: Counting objects: 57% (5131/9001) remote: Counting objects: 58% (5221/9001) remote: Counting objects: 59% (5311/9001) remote: Counting objects: 60% (5401/9001) remote: Counting objects: 61% (5491/9001) remote: Counting objects: 62% (5581/9001) remote: Counting objects: 63% (5671/9001) remote: Counting objects: 64% (5761/9001) remote: Counting objects: 65% (5851/9001) remote: Counting objects: 66% (5941/9001) remote: Counting objects: 67% (6031/9001) remote: Counting objects: 68% (6121/9001) remote: Counting objects: 69% (6211/9001) remote: Counting objects: 70% (6301/9001) remote: Counting objects: 71% (6391/9001) remote: Counting objects: 72% (6481/9001) remote: Counting objects: 73% (6571/9001) remote: Counting objects: 74% (6661/9001) remote: Counting objects: 75% (6751/9001) remote: Counting objects: 76% (6841/9001) remote: Counting objects: 77% (6931/9001) remote: Counting objects: 78% (7021/9001) remote: Counting objects: 79% (7111/9001) remote: Counting objects: 80% (7201/9001) remote: Counting objects: 81% (7291/9001) remote: Counting objects: 82% (7381/9001) remote: Counting objects: 83% (7471/9001) remote: Counting objects: 84% (7561/9001) remote: Counting objects: 85% (7651/9001) remote: Counting objects: 86% (7741/9001) remote: Counting objects: 87% (7831/9001) remote: Counting objects: 88% (7921/9001) remote: Counting objects: 89% (8011/9001) remote: Counting objects: 90% (8101/9001) remote: Counting objects: 91% (8191/9001) remote: Counting objects: 92% (8281/9001) remote: Counting objects: 93% (8371/9001) remote: Counting objects: 94% (8461/9001) remote: Counting objects: 95% (8551/9001) remote: Counting objects: 96% (8641/9001) remote: Counting objects: 97% (8731/9001) remote: Counting objects: 98% (8821/9001) remote: Counting objects: 99% (8911/9001) remote: Counting objects: 100% (9001/9001) remote: Counting objects: 100% (9001/9001), done.
  5. 4.54 s remote: Compressing objects: 0% (1/2111) remote: Compressing objects: 1% (22/2111) remote: Compressing objects: 2% (43/2111) remote: Compressing objects: 3% (64/2111) remote: Compressing objects: 4% (85/2111) remote: Compressing objects: 5% (106/2111) remote: Compressing objects: 6% (127/2111) remote: Compressing objects: 7% (148/2111) remote: Compressing objects: 8% (169/2111) remote: Compressing objects: 9% (190/2111) remote: Compressing objects: 10% (212/2111) remote: Compressing objects: 11% (233/2111) remote: Compressing objects: 12% (254/2111) remote: Compressing objects: 13% (275/2111) remote: Compressing objects: 14% (296/2111) remote: Compressing objects: 15% (317/2111) remote: Compressing objects: 16% (338/2111) remote: Compressing objects: 17% (359/2111) remote: Compressing objects: 18% (380/2111) remote: Compressing objects: 19% (402/2111) remote: Compressing objects: 20% (423/2111) remote: Compressing objects: 20% (435/2111) remote: Compressing objects: 21% (444/2111) remote: Compressing objects: 22% (465/2111) remote: Compressing objects: 23% (486/2111) remote: Compressing objects: 24% (507/2111) remote: Compressing objects: 25% (528/2111) remote: Compressing objects: 26% (549/2111) remote: Compressing objects: 27% (570/2111) remote: Compressing objects: 27% (582/2111) remote: Compressing objects: 28% (592/2111) remote: Compressing objects: 29% (613/2111) remote: Compressing objects: 30% (634/2111) remote: Compressing objects: 31% (655/2111) remote: Compressing objects: 32% (676/2111) remote: Compressing objects: 33% (697/2111) remote: Compressing objects: 34% (718/2111) remote: Compressing objects: 35% (739/2111) remote: Compressing objects: 36% (760/2111) remote: Compressing objects: 37% (782/2111) remote: Compressing objects: 38% (803/2111) remote: Compressing objects: 39% (824/2111) remote: Compressing objects: 40% (845/2111) remote: Compressing objects: 41% (866/2111) remote: Compressing objects: 42% (887/2111) remote: Compressing objects: 43% (908/2111) remote: Compressing objects: 44% (929/2111) remote: Compressing objects: 45% (950/2111) remote: Compressing objects: 46% (972/2111) remote: Compressing objects: 47% (993/2111) remote: Compressing objects: 48% (1014/2111) remote: Compressing objects: 49% (1035/2111) remote: Compressing objects: 50% (1056/2111) remote: Compressing objects: 51% (1077/2111) remote: Compressing objects: 52% (1098/2111) remote: Compressing objects: 53% (1119/2111) remote: Compressing objects: 54% (1140/2111) remote: Compressing objects: 55% (1162/2111) remote: Compressing objects: 56% (1183/2111) remote: Compressing objects: 57% (1204/2111) remote: Compressing objects: 58% (1225/2111) remote: Compressing objects: 59% (1246/2111) remote: Compressing objects: 60% (1267/2111) remote: Compressing objects: 61% (1288/2111) remote: Compressing objects: 62% (1309/2111) remote: Compressing objects: 63% (1330/2111) remote: Compressing objects: 64% (1352/2111) remote: Compressing objects: 65% (1373/2111) remote: Compressing objects: 66% (1394/2111) remote: Compressing objects: 67% (1415/2111) remote: Compressing objects: 68% (1436/2111) remote: Compressing objects: 69% (1457/2111) remote: Compressing objects: 70% (1478/2111) remote: Compressing objects: 71% (1499/2111) remote: Compressing objects: 72% (1520/2111) remote: Compressing objects: 73% (1542/2111) remote: Compressing objects: 74% (1563/2111) remote: Compressing objects: 75% (1584/2111) remote: Compressing objects: 76% (1605/2111) remote: Compressing objects: 77% (1626/2111) remote: Compressing objects: 78% (1647/2111) remote: Compressing objects: 79% (1668/2111) remote: Compressing objects: 80% (1689/2111) remote: Compressing objects: 81% (1710/2111) remote: Compressing objects: 82% (1732/2111) remote: Compressing objects: 83% (1753/2111) remote: Compressing objects: 84% (1774/2111) remote: Compressing objects: 85% (1795/2111) remote: Compressing objects: 86% (1816/2111) remote: Compressing objects: 87% (1837/2111) remote: Compressing objects: 88% (1858/2111) remote: Compressing objects: 89% (1879/2111) remote: Compressing objects: 90% (1900/2111) remote: Compressing objects: 91% (1922/2111) remote: Compressing objects: 92% (1943/2111) remote: Compressing objects: 93% (1964/2111) remote: Compressing objects: 94% (1985/2111) remote: Compressing objects: 95% (2006/2111) remote: Compressing objects: 96% (2027/2111) remote: Compressing objects: 97% (2048/2111) remote: Compressing objects: 98% (2069/2111) remote: Compressing objects: 99% (2090/2111) remote: Compressing objects: 100% (2111/2111) remote: Compressing objects: 100% (2111/2111), done.
  6. 7.72 s Receiving objects: 0% (1/66329) Receiving objects: 1% (664/66329) Receiving objects: 2% (1327/66329) Receiving objects: 3% (1990/66329) Receiving objects: 4% (2654/66329) Receiving objects: 5% (3317/66329) Receiving objects: 6% (3980/66329) Receiving objects: 7% (4644/66329) Receiving objects: 8% (5307/66329), 9.20 MiB | 18.38 MiB/s Receiving objects: 9% (5970/66329), 9.20 MiB | 18.38 MiB/s Receiving objects: 10% (6633/66329), 9.20 MiB | 18.38 MiB/s Receiving objects: 11% (7297/66329), 9.20 MiB | 18.38 MiB/s Receiving objects: 12% (7960/66329), 9.20 MiB | 18.38 MiB/s Receiving objects: 13% (8623/66329), 9.20 MiB | 18.38 MiB/s Receiving objects: 14% (9287/66329), 9.20 MiB | 18.38 MiB/s Receiving objects: 15% (9950/66329), 9.20 MiB | 18.38 MiB/s Receiving objects: 16% (10613/66329), 9.20 MiB | 18.38 MiB/s Receiving objects: 17% (11276/66329), 9.20 MiB | 18.38 MiB/s Receiving objects: 18% (11940/66329), 9.20 MiB | 18.38 MiB/s Receiving objects: 19% (12603/66329), 9.20 MiB | 18.38 MiB/s Receiving objects: 20% (13266/66329), 9.20 MiB | 18.38 MiB/s Receiving objects: 21% (13930/66329), 9.20 MiB | 18.38 MiB/s Receiving objects: 22% (14593/66329), 9.20 MiB | 18.38 MiB/s Receiving objects: 23% (15256/66329), 9.20 MiB | 18.38 MiB/s Receiving objects: 24% (15919/66329), 9.20 MiB | 18.38 MiB/s Receiving objects: 25% (16583/66329), 9.20 MiB | 18.38 MiB/s Receiving objects: 26% (17246/66329), 9.20 MiB | 18.38 MiB/s Receiving objects: 27% (17909/66329), 9.20 MiB | 18.38 MiB/s Receiving objects: 28% (18573/66329), 9.20 MiB | 18.38 MiB/s Receiving objects: 29% (19236/66329), 9.20 MiB | 18.38 MiB/s Receiving objects: 30% (19899/66329), 9.20 MiB | 18.38 MiB/s Receiving objects: 31% (20562/66329), 9.20 MiB | 18.38 MiB/s Receiving objects: 32% (21226/66329), 9.20 MiB | 18.38 MiB/s Receiving objects: 33% (21889/66329), 9.20 MiB | 18.38 MiB/s Receiving objects: 34% (22552/66329), 9.20 MiB | 18.38 MiB/s Receiving objects: 34% (22752/66329), 25.27 MiB | 25.26 MiB/s Receiving objects: 35% (23216/66329), 25.27 MiB | 25.26 MiB/s Receiving objects: 36% (23879/66329), 25.27 MiB | 25.26 MiB/s Receiving objects: 37% (24542/66329), 25.27 MiB | 25.26 MiB/s Receiving objects: 38% (25206/66329), 25.27 MiB | 25.26 MiB/s Receiving objects: 39% (25869/66329), 25.27 MiB | 25.26 MiB/s Receiving objects: 40% (26532/66329), 25.27 MiB | 25.26 MiB/s Receiving objects: 41% (27195/66329), 25.27 MiB | 25.26 MiB/s Receiving objects: 42% (27859/66329), 25.27 MiB | 25.26 MiB/s Receiving objects: 43% (28522/66329), 25.27 MiB | 25.26 MiB/s Receiving objects: 44% (29185/66329), 25.27 MiB | 25.26 MiB/s Receiving objects: 45% (29849/66329), 25.27 MiB | 25.26 MiB/s Receiving objects: 46% (30512/66329), 25.27 MiB | 25.26 MiB/s Receiving objects: 47% (31175/66329), 25.27 MiB | 25.26 MiB/s Receiving objects: 48% (31838/66329), 25.27 MiB | 25.26 MiB/s Receiving objects: 49% (32502/66329), 25.27 MiB | 25.26 MiB/s Receiving objects: 50% (33165/66329), 25.27 MiB | 25.26 MiB/s Receiving objects: 51% (33828/66329), 25.27 MiB | 25.26 MiB/s Receiving objects: 52% (34492/66329), 25.27 MiB | 25.26 MiB/s Receiving objects: 53% (35155/66329), 25.27 MiB | 25.26 MiB/s Receiving objects: 54% (35818/66329), 25.27 MiB | 25.26 MiB/s Receiving objects: 55% (36481/66329), 25.27 MiB | 25.26 MiB/s Receiving objects: 56% (37145/66329), 25.27 MiB | 25.26 MiB/s Receiving objects: 57% (37808/66329), 25.27 MiB | 25.26 MiB/s Receiving objects: 58% (38471/66329), 25.27 MiB | 25.26 MiB/s Receiving objects: 59% (39135/66329), 25.27 MiB | 25.26 MiB/s Receiving objects: 60% (39798/66329), 45.11 MiB | 29.95 MiB/s Receiving objects: 61% (40461/66329), 45.11 MiB | 29.95 MiB/s Receiving objects: 62% (41124/66329), 45.11 MiB | 29.95 MiB/s Receiving objects: 63% (41788/66329), 45.11 MiB | 29.95 MiB/s Receiving objects: 64% (42451/66329), 45.11 MiB | 29.95 MiB/s Receiving objects: 65% (43114/66329), 45.11 MiB | 29.95 MiB/s Receiving objects: 66% (43778/66329), 45.11 MiB | 29.95 MiB/s Receiving objects: 67% (44441/66329), 45.11 MiB | 29.95 MiB/s Receiving objects: 68% (45104/66329), 45.11 MiB | 29.95 MiB/s Receiving objects: 69% (45768/66329), 45.11 MiB | 29.95 MiB/s Receiving objects: 70% (46431/66329), 45.11 MiB | 29.95 MiB/s Receiving objects: 71% (47094/66329), 45.11 MiB | 29.95 MiB/s Receiving objects: 71% (47642/66329), 45.11 MiB | 29.95 MiB/s Receiving objects: 72% (47757/66329), 45.11 MiB | 29.95 MiB/s Receiving objects: 73% (48421/66329), 60.58 MiB | 30.20 MiB/s Receiving objects: 74% (49084/66329), 60.58 MiB | 30.20 MiB/s Receiving objects: 75% (49747/66329), 60.58 MiB | 30.20 MiB/s Receiving objects: 76% (50411/66329), 60.58 MiB | 30.20 MiB/s Receiving objects: 77% (51074/66329), 60.58 MiB | 30.20 MiB/s Receiving objects: 78% (51737/66329), 60.58 MiB | 30.20 MiB/s Receiving objects: 79% (52400/66329), 60.58 MiB | 30.20 MiB/s Receiving objects: 80% (53064/66329), 60.58 MiB | 30.20 MiB/s Receiving objects: 81% (53727/66329), 60.58 MiB | 30.20 MiB/s Receiving objects: 82% (54390/66329), 77.69 MiB | 31.00 MiB/s Receiving objects: 83% (55054/66329), 77.69 MiB | 31.00 MiB/s Receiving objects: 84% (55717/66329), 77.69 MiB | 31.00 MiB/s Receiving objects: 85% (56380/66329), 77.69 MiB | 31.00 MiB/s Receiving objects: 86% (57043/66329), 77.69 MiB | 31.00 MiB/s Receiving objects: 87% (57707/66329), 77.69 MiB | 31.00 MiB/s Receiving objects: 88% (58370/66329), 77.69 MiB | 31.00 MiB/s Receiving objects: 89% (59033/66329), 77.69 MiB | 31.00 MiB/s Receiving objects: 90% (59697/66329), 77.69 MiB | 31.00 MiB/s Receiving objects: 91% (60360/66329), 77.69 MiB | 31.00 MiB/s Receiving objects: 92% (61023/66329), 77.69 MiB | 31.00 MiB/s Receiving objects: 93% (61686/66329), 77.69 MiB | 31.00 MiB/s Receiving objects: 94% (62350/66329), 77.69 MiB | 31.00 MiB/s Receiving objects: 95% (63013/66329), 77.69 MiB | 31.00 MiB/s Receiving objects: 96% (63676/66329), 77.69 MiB | 31.00 MiB/s Receiving objects: 97% (64340/66329), 77.69 MiB | 31.00 MiB/s Receiving objects: 98% (65003/66329), 77.69 MiB | 31.00 MiB/s Receiving objects: 99% (65666/66329), 77.69 MiB | 31.00 MiB/s Receiving objects: 99% (65892/66329), 77.69 MiB | 31.00 MiB/s remote: Total 66329 (delta 7283), reused 7248 (delta 6605), pack-reused 57328 (from 1)
  7. 7.80 s Receiving objects: 100% (66329/66329), 94.29 MiB | 31.08 MiB/s Receiving objects: 100% (66329/66329), 98.63 MiB | 30.98 MiB/s, done.
  8. 8.70 s Resolving deltas: 0% (0/46380) Resolving deltas: 1% (464/46380) Resolving deltas: 2% (928/46380) Resolving deltas: 3% (1393/46380) Resolving deltas: 4% (1856/46380) Resolving deltas: 5% (2319/46380) Resolving deltas: 6% (2783/46380) Resolving deltas: 7% (3247/46380) Resolving deltas: 8% (3711/46380) Resolving deltas: 9% (4175/46380) Resolving deltas: 10% (4639/46380) Resolving deltas: 11% (5102/46380) Resolving deltas: 12% (5568/46380) Resolving deltas: 13% (6031/46380) Resolving deltas: 14% (6494/46380) Resolving deltas: 15% (6957/46380) Resolving deltas: 16% (7421/46380) Resolving deltas: 17% (7885/46380) Resolving deltas: 18% (8349/46380) Resolving deltas: 19% (8813/46380) Resolving deltas: 20% (9276/46380) Resolving deltas: 21% (9741/46380) Resolving deltas: 22% (10204/46380) Resolving deltas: 23% (10668/46380) Resolving deltas: 24% (11133/46380) Resolving deltas: 25% (11595/46380) Resolving deltas: 26% (12059/46380) Resolving deltas: 27% (12523/46380) Resolving deltas: 28% (12988/46380) Resolving deltas: 29% (13452/46380) Resolving deltas: 30% (13914/46380) Resolving deltas: 31% (14378/46380) Resolving deltas: 32% (14842/46380) Resolving deltas: 33% (15306/46380) Resolving deltas: 34% (15770/46380) Resolving deltas: 35% (16233/46380) Resolving deltas: 36% (16697/46380) Resolving deltas: 37% (17161/46380) Resolving deltas: 38% (17625/46380) Resolving deltas: 39% (18089/46380) Resolving deltas: 40% (18552/46380) Resolving deltas: 41% (19016/46380) Resolving deltas: 42% (19480/46380) Resolving deltas: 43% (19944/46380) Resolving deltas: 44% (20408/46380) Resolving deltas: 45% (20871/46380) Resolving deltas: 46% (21336/46380) Resolving deltas: 47% (21799/46380) Resolving deltas: 48% (22263/46380) Resolving deltas: 49% (22727/46380) Resolving deltas: 50% (23190/46380) Resolving deltas: 51% (23654/46380) Resolving deltas: 52% (24118/46380) Resolving deltas: 53% (24582/46380) Resolving deltas: 54% (25046/46380) Resolving deltas: 55% (25509/46380) Resolving deltas: 56% (25973/46380) Resolving deltas: 57% (26437/46380) Resolving deltas: 58% (26901/46380) Resolving deltas: 59% (27365/46380) Resolving deltas: 60% (27828/46380) Resolving deltas: 61% (28292/46380) Resolving deltas: 62% (28758/46380) Resolving deltas: 63% (29220/46380) Resolving deltas: 64% (29684/46380) Resolving deltas: 65% (30147/46380) Resolving deltas: 66% (30611/46380) Resolving deltas: 67% (31077/46380) Resolving deltas: 68% (31539/46380) Resolving deltas: 69% (32003/46380) Resolving deltas: 70% (32466/46380) Resolving deltas: 71% (32930/46380) Resolving deltas: 72% (33394/46380) Resolving deltas: 73% (33859/46380) Resolving deltas: 74% (34322/46380) Resolving deltas: 75% (34788/46380) Resolving deltas: 76% (35249/46380) Resolving deltas: 77% (35713/46380) Resolving deltas: 78% (36177/46380) Resolving deltas: 79% (36641/46380) Resolving deltas: 80% (37108/46380) Resolving deltas: 81% (37569/46380) Resolving deltas: 82% (38032/46380) Resolving deltas: 83% (38499/46380) Resolving deltas: 84% (38960/46380) Resolving deltas: 85% (39423/46380) Resolving deltas: 86% (39887/46380) Resolving deltas: 87% (40351/46380) Resolving deltas: 88% (40815/46380) Resolving deltas: 89% (41279/46380) Resolving deltas: 90% (41742/46380) Resolving deltas: 91% (42206/46380) Resolving deltas: 92% (42670/46380) Resolving deltas: 93% (43134/46380) Resolving deltas: 94% (43598/46380) Resolving deltas: 95% (44061/46380) Resolving deltas: 96% (44525/46380) Resolving deltas: 97% (44989/46380) Resolving deltas: 98% (45453/46380) Resolving deltas: 99% (45918/46380) Resolving deltas: 100% (46380/46380) Resolving deltas: 100% (46380/46380), done.
  9. 9.09 s Fetching commit 01539e7ee446a74d841b7fdf6f14190bf7c317ab for tydenso-in-gammaloop ...
  10. 9.09 s $ /nix/store/bcnisk3ydfgv26v2gw3zlky24g00yww2-git-2.54.0/bin/git fetch origin 01539e7ee446a74d841b7fdf6f14190bf7c317ab
  11. 9.62 s From https://github.com/alphal00p/gammaloop
  12. 9.62 s * branch 01539e7ee446a74d841b7fdf6f14190bf7c317ab -> FETCH_HEAD
  13. 9.63 s $ /nix/store/9ypz3flqsrl5xl495mm8h645gadjsxi1-coreutils-9.11/bin/timeout --kill-after=15s 7200s /nix/store/bcnisk3ydfgv26v2gw3zlky24g00yww2-git-2.54.0/bin/git -c advice.detachedHead=false checkout 01539e7ee446a74d841b7fdf6f14190bf7c317ab
  14. 9.91 s HEAD is now at 01539e7ee fix portable Spenso Typst display
  15. 9.92 s $ /nix/store/9ypz3flqsrl5xl495mm8h645gadjsxi1-coreutils-9.11/bin/timeout --kill-after=15s 7200s /nix/store/23zk8sgzamrbmj1fday15szf7f2279s8-nix-2.34.7/bin/nix --extra-experimental-features nix-command --extra-experimental-features flakes --log-format internal-json run .#packages.x86_64-linux.nix-ci-check-gammaloop-nextest-python-api --print-build-logs
  16. 22.94 s
  17. 23.86 s Downloading cached gammaloop-nextest-binaries-python-api-gammaloop-integration-tests from https://cache.nix-ci.com
  18. 23.91 s Downloading cached gammaloop-python-module from https://cache.nix-ci.com
  19. 25.92 s Downloaded cached gammaloop-nextest-binaries-python-api-gammaloop-integration-tests (8.6 MiB) in 2.0s
  20. 25.92 s Progress: 0 of 1 built, 1 of 4 downloaded from cache (1 downloading)
  21. 25.92 s Downloading cached gammaloop-nextest-binaries-python-api from https://cache.nix-ci.com
  22. 26.20 s Downloaded cached gammaloop-nextest-binaries-python-api (520 B) in 284ms
  23. 26.20 s Progress: 0 of 1 built, 2 of 4 downloaded from cache (1 downloading)
  24. 28.43 s Downloaded cached gammaloop-python-module (141.3 MiB) in 4.5s
  25. 28.43 s Progress: 0 of 1 built, 3 of 4 downloaded from cache
  26. 28.43 s Downloading cached nix-ci-check-gammaloop-nextest-python-api from https://cache.nix-ci.com
  27. 28.59 s Downloaded cached nix-ci-check-gammaloop-nextest-python-api (1104 B) in 159ms
  28. 28.59 s Progress: 0 of 1 built, 4 of 4 downloaded from cache
  29. 45.84 s evaluating derivation 'g copying '/nix/store/wy5l evaluating derivation 'g copying '/nix/store/wy5l evaluating derivation 'g copying '/nix/store/wy5l evaluating derivation 'g copying '/nix/store/wy5l evaluating derivation 'g copying '/nix/store/wy5l evaluating derivation 'g copying '/nix/store/wy5l evaluating derivation 'g copying '/nix/store/wy5l evaluating derivation 'g copying '/nix/store/wy5l evaluating derivation 'g copying '/nix/store/wy5l evaluating derivation 'g copying '/nix/store/wy5l evaluating derivation 'g copying '/nix/store/wy5l evaluating derivation 'g copying '/nix/store/wy5l evaluating derivation 'g copying '/nix/store/wy5l evaluating derivation 'g copying '/nix/store/wy5l evaluating derivation 'g copying '/nix/store/wy5l evaluating derivation 'g copying '/nix/store/wy5l evaluating derivation 'g querying gammaloop-nexte querying info about miss querying gammaloop-nexte [0.0 KiB DL] querying bi [1.7 KiB DL] querying om [3.1 KiB DL] querying la [4.4 KiB DL] querying op [6.0 KiB DL] [0/4 built, 3/0/8 copied [0/3 built, 1/2/8 copied [0/3 built, 2/3/8 copied [0/3 built, 2/4/8 copied [0/3 built, 2/5/8 copied [0/3 built, 1/7/8 copied [0/2 built, 8 copied (21python3> structuredAttrs is enabled
  30. 45.96 s [1/0/2 built, 8 copied (python3> created 227 symlinks in user environment
  31. 47.19 s python3 (post)> Uploading to the NixCI cache: /nix/store/3gi2x25n327sf3xma8b08jd57aqv69x5-python3-3.13.14-env
  32. 47.25 s python3 (post)> warning: 'warn-short-path-literals' is deprecated, use 'lint-short-path-literals = ignore' instead
  33. 47.67 s python3 (post)> copying 0 paths...
  34. 47.74 s python3 (post)> warning: 'warn-short-path-literals' is deprecated, use 'lint-short-path-literals = ignore' instead
  35. 48.11 s python3 (post)> copying 0 paths...
  36. 48.50 s [1/3 built, 8 copied (21 [1/1/2 built, 8 copied (gammaloop-nextest-python-api> Extracting 1 binary, 1 build script output directory, and 3 linked paths to /build/nextest-archive-pMC1di
  37. 48.61 s gammaloop-nextest-python-api> Extracted 18 files to /build/nextest-archive-pMC1di in 0.11s
  38. 48.63 s gammaloop-nextest-python-api> ------------
  39. 48.63 s gammaloop-nextest-python-api> Nextest run ID d9f04182-e980-4b06-a6d3-ce42376ee411 with nextest profile: ci_gammaloop
  40. 48.63 s gammaloop-nextest-python-api> Starting 5 tests across 1 binary
  41. 48.79 s gammaloop-nextest-python-api> FAIL [ 0.157s] (1/5) gammaloop-integration-tests::test_python_api python_evaluate_sample_preserves_graph_grouping_and_incoming_pdgs
  42. 48.79 s gammaloop-nextest-python-api> stdout ---
  43. 48.79 s gammaloop-nextest-python-api>
  44. 48.79 s gammaloop-nextest-python-api> running 1 test
  45. 48.79 s gammaloop-nextest-python-api> test python_evaluate_sample_preserves_graph_grouping_and_incoming_pdgs ... FAILED
  46. 48.79 s gammaloop-nextest-python-api>
  47. 48.79 s gammaloop-nextest-python-api> failures:
  48. 48.79 s gammaloop-nextest-python-api>
  49. 48.79 s gammaloop-nextest-python-api> failures:
  50. 48.79 s gammaloop-nextest-python-api> python_evaluate_sample_preserves_graph_grouping_and_incoming_pdgs
  51. 48.79 s gammaloop-nextest-python-api>
  52. 48.79 s gammaloop-nextest-python-api> test result: FAILED. 0 passed; 1 failed; 0 ignored; 0 measured; 4 filtered out; finished in 0.15s
  53. 48.79 s gammaloop-nextest-python-api>
  54. 48.79 s gammaloop-nextest-python-api> stderr ---
  55. 48.79 s gammaloop-nextest-python-api> Error: Python API test subprocess failed.
  56. 48.79 s gammaloop-nextest-python-api> stdout:
  57. 48.79 s gammaloop-nextest-python-api> ┌────────────────────────────────────────────────────────┐
  58. 48.79 s gammaloop-nextest-python-api> │ You are running a restricted Symbolica instance. │
  59. 48.79 s gammaloop-nextest-python-api> │ │
  60. 48.79 s gammaloop-nextest-python-api> │ This mode is only permitted for non-commercial use and │
  61. 48.79 s gammaloop-nextest-python-api> │ is limited to one instance and core per machine. │
  62. 48.79 s gammaloop-nextest-python-api> │ │
  63. 48.79 s gammaloop-nextest-python-api> │ Hobbyists can easily acquire a free license key │
  64. 48.79 s gammaloop-nextest-python-api> │ that unlocks all cores and removes this banner: │
  65. 48.79 s gammaloop-nextest-python-api> │ │
  66. 48.79 s gammaloop-nextest-python-api> │ from symbolica import * │
  67. 48.79 s gammaloop-nextest-python-api> │ request_hobbyist_license('YOUR_NAME', 'YOUR_EMAIL') │
  68. 48.79 s gammaloop-nextest-python-api> │ │
  69. 48.79 s gammaloop-nextest-python-api> │ All other users can obtain a free 30-day trial key: │
  70. 48.79 s gammaloop-nextest-python-api> │ │
  71. 48.79 s gammaloop-nextest-python-api> │ from symbolica import * │
  72. 48.79 s gammaloop-nextest-python-api> │ request_trial_license('NAME', 'EMAIL', 'EMPLOYER') │
  73. 48.79 s gammaloop-nextest-python-api> │ │
  74. 48.79 s gammaloop-nextest-python-api> │ See https://symbolica.io/docs/get_started.html#license │
  75. 48.79 s gammaloop-nextest-python-api> └────────────────────────────────────────────────────────┘
  76. 48.79 s gammaloop-nextest-python-api> ┌───────────────────────────────────────────────────────────────────────────────────────────────────────────┐
  77. 48.79 s gammaloop-nextest-python-api> │ Cannot start new unlicensed Symbolica instance since there is already another one running on the machine. │
  78. 48.79 s gammaloop-nextest-python-api> └───────────────────────────────────────────────────────────────────────────────────────────────────────────┘
  79. 48.79 s gammaloop-nextest-python-api>
  80. 48.79 s gammaloop-nextest-python-api> stderr:
  81. 48.79 s gammaloop-nextest-python-api> ┌───────────────────────────────────┐
  82. 48.79 s gammaloop-nextest-python-api> │ The Symbolica license has expired │
  83. 48.79 s gammaloop-nextest-python-api> └───────────────────────────────────┘
  84. 48.79 s gammaloop-nextest-python-api>
  85. 48.79 s gammaloop-nextest-python-api>
  86. 48.79 s gammaloop-nextest-python-api> Location:
  87. 48.79 s gammaloop-nextest-python-api> tests/tests/test_python_api.rs:156:20
  88. 48.79 s gammaloop-nextest-python-api>
  89. 48.80 s gammaloop-nextest-python-api> FAIL [ 0.170s] (2/5) gammaloop-integration-tests::test_python_api python_evaluate_sample_honors_generate_events_and_observable_snapshots
  90. 48.80 s gammaloop-nextest-python-api> stdout ---
  91. 48.80 s gammaloop-nextest-python-api>
  92. 48.80 s gammaloop-nextest-python-api> running 1 test
  93. 48.80 s gammaloop-nextest-python-api> test python_evaluate_sample_honors_generate_events_and_observable_snapshots ... FAILED
  94. 48.80 s gammaloop-nextest-python-api>
  95. 48.80 s gammaloop-nextest-python-api> failures:
  96. 48.80 s gammaloop-nextest-python-api>
  97. 48.80 s gammaloop-nextest-python-api> failures:
  98. 48.80 s gammaloop-nextest-python-api> python_evaluate_sample_honors_generate_events_and_observable_snapshots
  99. 48.80 s gammaloop-nextest-python-api>
  100. 48.80 s gammaloop-nextest-python-api> test result: FAILED. 0 passed; 1 failed; 0 ignored; 0 measured; 4 filtered out; finished in 0.16s
  101. 48.80 s gammaloop-nextest-python-api>
  102. 48.80 s gammaloop-nextest-python-api> stderr ---
  103. 48.80 s gammaloop-nextest-python-api> Error: Python API test subprocess failed.
  104. 48.80 s gammaloop-nextest-python-api> stdout:
  105. 48.80 s gammaloop-nextest-python-api> ┌────────────────────────────────────────────────────────┐
  106. 48.80 s gammaloop-nextest-python-api> │ You are running a restricted Symbolica instance. │
  107. 48.80 s gammaloop-nextest-python-api> │ │
  108. 48.80 s gammaloop-nextest-python-api> │ This mode is only permitted for non-commercial use and │
  109. 48.80 s gammaloop-nextest-python-api> │ is limited to one instance and core per machine. │
  110. 48.80 s gammaloop-nextest-python-api> │ │
  111. 48.80 s gammaloop-nextest-python-api> │ Hobbyists can easily acquire a free license key │
  112. 48.80 s gammaloop-nextest-python-api> │ that unlocks all cores and removes this banner: │
  113. 48.80 s gammaloop-nextest-python-api> │ │
  114. 48.80 s gammaloop-nextest-python-api> │ from symbolica import * │
  115. 48.80 s gammaloop-nextest-python-api> │ request_hobbyist_license('YOUR_NAME', 'YOUR_EMAIL') │
  116. 48.80 s gammaloop-nextest-python-api> │ │
  117. 48.80 s gammaloop-nextest-python-api> │ All other users can obtain a free 30-day trial key: │
  118. 48.80 s gammaloop-nextest-python-api> │ │
  119. 48.80 s gammaloop-nextest-python-api> │ from symbolica import * │
  120. 48.80 s gammaloop-nextest-python-api> │ request_trial_license('NAME', 'EMAIL', 'EMPLOYER') │
  121. 48.80 s gammaloop-nextest-python-api> │ │
  122. 48.80 s gammaloop-nextest-python-api> │ See https://symbolica.io/docs/get_started.html#license │
  123. 48.80 s gammaloop-nextest-python-api> └────────────────────────────────────────────────────────┘
  124. 48.80 s gammaloop-nextest-python-api> ┌───────────────────────────────────────────────────────────────────────────────────────────────────────────┐
  125. 48.80 s gammaloop-nextest-python-api> │ Cannot start new unlicensed Symbolica instance since there is already another one running on the machine. │
  126. 48.80 s gammaloop-nextest-python-api> └───────────────────────────────────────────────────────────────────────────────────────────────────────────┘
  127. 48.80 s gammaloop-nextest-python-api>
  128. 48.80 s gammaloop-nextest-python-api> stderr:
  129. 48.80 s gammaloop-nextest-python-api> ┌───────────────────────────────────┐
  130. 48.80 s gammaloop-nextest-python-api> │ The Symbolica license has expired │
  131. 48.80 s gammaloop-nextest-python-api> └───────────────────────────────────┘
  132. 48.80 s gammaloop-nextest-python-api>
  133. 48.80 s gammaloop-nextest-python-api>
  134. 48.80 s gammaloop-nextest-python-api> Location:
  135. 48.80 s gammaloop-nextest-python-api> tests/tests/test_python_api.rs:156:20
  136. 48.80 s gammaloop-nextest-python-api>
  137. 48.80 s gammaloop-nextest-python-api> FAIL [ 0.171s] (3/5) gammaloop-integration-tests::test_python_api python_session_getters_return_live_toml_and_command_blocks
  138. 48.80 s gammaloop-nextest-python-api> stdout ---
  139. 48.80 s gammaloop-nextest-python-api>
  140. 48.80 s gammaloop-nextest-python-api> running 1 test
  141. 48.80 s gammaloop-nextest-python-api> test python_session_getters_return_live_toml_and_command_blocks ... FAILED
  142. 48.80 s gammaloop-nextest-python-api>
  143. 48.80 s gammaloop-nextest-python-api> failures:
  144. 48.80 s gammaloop-nextest-python-api>
  145. 48.80 s gammaloop-nextest-python-api> failures:
  146. 48.80 s gammaloop-nextest-python-api> python_session_getters_return_live_toml_and_command_blocks
  147. 48.80 s gammaloop-nextest-python-api>
  148. 48.80 s gammaloop-nextest-python-api> test result: FAILED. 0 passed; 1 failed; 0 ignored; 0 measured; 4 filtered out; finished in 0.16s
  149. 48.80 s gammaloop-nextest-python-api>
  150. 48.80 s gammaloop-nextest-python-api> stderr ---
  151. 48.80 s gammaloop-nextest-python-api> Error: Python API test subprocess failed.
  152. 48.80 s gammaloop-nextest-python-api> stdout:
  153. 48.80 s gammaloop-nextest-python-api> ┌────────────────────────────────────────────────────────┐
  154. 48.80 s gammaloop-nextest-python-api> │ You are running a restricted Symbolica instance. │
  155. 48.80 s gammaloop-nextest-python-api> │ │
  156. 48.80 s gammaloop-nextest-python-api> │ This mode is only permitted for non-commercial use and │
  157. 48.80 s gammaloop-nextest-python-api> │ is limited to one instance and core per machine. │
  158. 48.80 s gammaloop-nextest-python-api> │ │
  159. 48.80 s gammaloop-nextest-python-api> │ Hobbyists can easily acquire a free license key │
  160. 48.80 s gammaloop-nextest-python-api> │ that unlocks all cores and removes this banner: │
  161. 48.80 s gammaloop-nextest-python-api> │ │
  162. 48.80 s gammaloop-nextest-python-api> │ from symbolica import * │
  163. 48.80 s gammaloop-nextest-python-api> │ request_hobbyist_license('YOUR_NAME', 'YOUR_EMAIL') │
  164. 48.80 s gammaloop-nextest-python-api> │ │
  165. 48.80 s gammaloop-nextest-python-api> │ All other users can obtain a free 30-day trial key: │
  166. 48.80 s gammaloop-nextest-python-api> │ │
  167. 48.80 s gammaloop-nextest-python-api> │ from symbolica import * │
  168. 48.80 s gammaloop-nextest-python-api> │ request_trial_license('NAME', 'EMAIL', 'EMPLOYER') │
  169. 48.80 s gammaloop-nextest-python-api> │ │
  170. 48.80 s gammaloop-nextest-python-api> │ See https://symbolica.io/docs/get_started.html#license │
  171. 48.80 s gammaloop-nextest-python-api> └────────────────────────────────────────────────────────┘
  172. 48.80 s gammaloop-nextest-python-api> ┌───────────────────────────────────────────────────────────────────────────────────────────────────────────┐
  173. 48.80 s gammaloop-nextest-python-api> │ Cannot start new unlicensed Symbolica instance since there is already another one running on the machine. │
  174. 48.80 s gammaloop-nextest-python-api> └───────────────────────────────────────────────────────────────────────────────────────────────────────────┘
  175. 48.80 s gammaloop-nextest-python-api>
  176. 48.80 s gammaloop-nextest-python-api> stderr:
  177. 48.80 s gammaloop-nextest-python-api> ┌───────────────────────────────────┐
  178. 48.80 s gammaloop-nextest-python-api> │ The Symbolica license has expired │
  179. 48.80 s gammaloop-nextest-python-api> └───────────────────────────────────┘
  180. 48.80 s gammaloop-nextest-python-api>
  181. 48.80 s gammaloop-nextest-python-api>
  182. 48.80 s gammaloop-nextest-python-api> Location:
  183. 48.80 s gammaloop-nextest-python-api> tests/tests/test_python_api.rs:156:20
  184. 48.80 s gammaloop-nextest-python-api>
  185. 48.91 s gammaloop-nextest-python-api> FAIL [ 0.281s] (4/5) gammaloop-integration-tests::test_python_api python_evaluate_samples_batch_and_momentum_space_have_expected_shape
  186. 48.91 s gammaloop-nextest-python-api> stdout ---
  187. 48.91 s gammaloop-nextest-python-api>
  188. 48.91 s gammaloop-nextest-python-api> running 1 test
  189. 48.91 s gammaloop-nextest-python-api> test python_evaluate_samples_batch_and_momentum_space_have_expected_shape ... FAILED
  190. 48.91 s gammaloop-nextest-python-api>
  191. 48.91 s gammaloop-nextest-python-api> failures:
  192. 48.91 s gammaloop-nextest-python-api>
  193. 48.91 s gammaloop-nextest-python-api> failures:
  194. 48.91 s gammaloop-nextest-python-api> python_evaluate_samples_batch_and_momentum_space_have_expected_shape
  195. 48.91 s gammaloop-nextest-python-api>
  196. 48.91 s gammaloop-nextest-python-api> test result: FAILED. 0 passed; 1 failed; 0 ignored; 0 measured; 4 filtered out; finished in 0.27s
  197. 48.91 s gammaloop-nextest-python-api>
  198. 48.91 s gammaloop-nextest-python-api> stderr ---
  199. 48.91 s gammaloop-nextest-python-api> Error: Python API test subprocess failed.
  200. 48.91 s gammaloop-nextest-python-api> stdout:
  201. 48.91 s gammaloop-nextest-python-api> ┌────────────────────────────────────────────────────────┐
  202. 48.91 s gammaloop-nextest-python-api> │ You are running a restricted Symbolica instance. │
  203. 48.91 s gammaloop-nextest-python-api> │ │
  204. 48.91 s gammaloop-nextest-python-api> │ This mode is only permitted for non-commercial use and │
  205. 48.91 s gammaloop-nextest-python-api> │ is limited to one instance and core per machine. │
  206. 48.91 s gammaloop-nextest-python-api> │ │
  207. 48.91 s gammaloop-nextest-python-api> │ Hobbyists can easily acquire a free license key │
  208. 48.91 s gammaloop-nextest-python-api> │ that unlocks all cores and removes this banner: │
  209. 48.91 s gammaloop-nextest-python-api> │ │
  210. 48.91 s gammaloop-nextest-python-api> │ from symbolica import * │
  211. 48.91 s gammaloop-nextest-python-api> │ request_hobbyist_license('YOUR_NAME', 'YOUR_EMAIL') │
  212. 48.91 s gammaloop-nextest-python-api> │ │
  213. 48.91 s gammaloop-nextest-python-api> │ All other users can obtain a free 30-day trial key: │
  214. 48.91 s gammaloop-nextest-python-api> │ │
  215. 48.91 s gammaloop-nextest-python-api> │ from symbolica import * │
  216. 48.91 s gammaloop-nextest-python-api> │ request_trial_license('NAME', 'EMAIL', 'EMPLOYER') │
  217. 48.91 s gammaloop-nextest-python-api> │ │
  218. 48.91 s gammaloop-nextest-python-api> │ See https://symbolica.io/docs/get_started.html#license │
  219. 48.91 s gammaloop-nextest-python-api> └────────────────────────────────────────────────────────┘
  220. 48.91 s gammaloop-nextest-python-api> ┌───────────────────────────────────────────────────────────────────────────────────────────────────────────┐
  221. 48.91 s gammaloop-nextest-python-api> │ Cannot start new unlicensed Symbolica instance since there is already another one running on the machine. │
  222. 48.91 s gammaloop-nextest-python-api> └───────────────────────────────────────────────────────────────────────────────────────────────────────────┘
  223. 48.91 s gammaloop-nextest-python-api>
  224. 48.91 s gammaloop-nextest-python-api> stderr:
  225. 48.91 s gammaloop-nextest-python-api> ┌───────────────────────────────────┐
  226. 48.91 s gammaloop-nextest-python-api> │ The Symbolica license has expired │
  227. 48.91 s gammaloop-nextest-python-api> └───────────────────────────────────┘
  228. 48.91 s gammaloop-nextest-python-api> [2026-09-01 16:00:11.325] @gammaloop_api::se... INFO : Running command import model sm-default
  229. 48.91 s gammaloop-nextest-python-api> [2026-09-01 16:00:11.325] @import::model INFO : Loading built-in JSON model sm-default
  230. 48.91 s gammaloop-nextest-python-api> [2026-09-01 16:00:11.373] @gammalooprs::model INFO : The following 11 external parameters were forced to zero by the restriction card:
  231. 48.91 s gammaloop-nextest-python-api> lamWS, AWS, rhoWS, etaWS, ymc, yme, ymm, MC, Me, MM, WTau
  232. 48.91 s gammaloop-nextest-python-api> [2026-09-01 16:00:11.373] @gammalooprs::model INFO : The following 34 vertex rules were removed by the restriction card:
  233. 48.91 s gammaloop-nextest-python-api> V_82 -> (c~, d, G+) | V_83 -> (t~, d, G+) | V_84 -> (c~, s, G+) | V_85 -> (t~, s, G+) | V_86 -> (u~, b, G+) | V_87 -> (c~, b, G+) | V_90 -> (c~, d, W+) | V_91 -> (t~, d, W+) | V_92 -> (u~, s, W+) | V_94 -> (t~, s, W+) | V_95 -> (u~, b, W+) | V_96 -> (c~, b, W+) | V_101 -> (e+, e-, G0) | V_102 -> (mu+, mu-, G0) | V_104 -> (e+, e-, H) | V_105 -> (mu+, mu-, H) | V_110 -> (ve~, e-, G+) | V_111 -> (vm~, mu-, G+) | V_116 -> (b~, u, G-) | V_117 -> (d~, c, G-) | V_118 -> (s~, c, G-) | V_119 -> (b~, c, G-) | V_120 -> (d~, t, G-) | V_121 -> (s~, t, G-) | V_124 -> (s~, u, W-) | V_125 -> (b~, u, W-) | V_126 -> (d~, c, W-) | V_128 -> (b~, c, W-) | V_129 -> (d~, t, W-) | V_130 -> (s~, t, W-) | V_138 -> (c~, c, G0) | V_140 -> (c~, c, H) | V_145 -> (e+, ve, G-) | V_146 -> (mu+, vm, G-)
  234. 48.91 s gammaloop-nextest-python-api> [2026-09-01 16:00:11.373] @gammalooprs::model INFO : The following 36 couplings were removed by the restriction card:
  235. 48.91 s gammaloop-nextest-python-api> GC_13, GC_14, GC_16, GC_17, GC_18, GC_19, GC_20, GC_22, GC_23, GC_24, GC_25, GC_26, GC_28, GC_29, GC_42, GC_43, GC_44, GC_46, GC_47, GC_48, GC_84, GC_85, GC_86, GC_87, GC_88, GC_89, GC_90, GC_91, GC_92, GC_93, GC_101, GC_102, GC_103, GC_105, GC_106, GC_107
  236. 48.91 s gammaloop-nextest-python-api> [2026-09-01 16:00:11.374] @gammaloop_api::se... INFO : Running command set default-runtime kv kinematics.externals='{"type":"constant","data":{"momenta":[[32.0,0.0,0.0,32.0],[32.0,0.0,0.0,-32.0]],"helicities":[1,1]}}'
  237. 48.91 s gammaloop-nextest-python-api> [2026-09-01 16:00:11.375] @gammaloop_api::se... INFO : Running command set default-runtime kv subtraction.disable_threshold_subtraction=true
  238. 48.91 s gammaloop-nextest-python-api> [2026-09-01 16:00:11.376] @gammaloop_api::se... INFO : Running command generate xs e+ e- > d d~ g | e- a d g QED^2==4 [{{2}} QCD=0] --numerator-grouping group_identical_graphs_up_to_sign --clear-existing-processes --only-diagrams
  239. 48.91 s gammaloop-nextest-python-api> [2026-09-01 16:00:11.379] @feyngen::diagram_... INFO : 0s | Δ=0s | Starting Feynman graph generation with Symbolica...
  240. 48.91 s gammaloop-nextest-python-api> [2026-09-01 16:00:11.383] @feyngen::diagram_... INFO : 0s | Δ=0s | Number of graphs resulting from Symbolica generation: 246
  241. 48.91 s gammaloop-nextest-python-api> [2026-09-01 16:00:11.384] @feyngen::diagram_... INFO : 0s | Δ=0s | Number of graphs retained after enforcing supergraph particle content: 8
  242. 48.91 s gammaloop-nextest-python-api> [2026-09-01 16:00:11.384] @feyngen::diagram_... INFO : 0s | Δ=0s | Number of graphs retained after removal of vetoed topologies: 8
  243. 48.91 s gammaloop-nextest-python-api> [2026-09-01 16:00:11.384] @feyngen::diagram_... INFO : 0s | Δ=0s | Number of graphs after vertex info assignment: 8
  244. 48.91 s gammaloop-nextest-python-api> [2026-09-01 16:00:11.384] @feyngen::diagram_... INFO : 0s | Δ=0s | Number of graphs after all complete graphs filters are applied: 8
  245. 48.91 s gammaloop-nextest-python-api>
  246. 48.91 s gammaloop-nextest-python-api>
  247. 48.91 s gammaloop-nextest-python-api> Location:
  248. 48.91 s gammaloop-nextest-python-api> tests/tests/test_python_api.rs:156:20
  249. 48.91 s gammaloop-nextest-python-api>
  250. 48.93 s gammaloop-nextest-python-api> FAIL [ 0.305s] (5/5) gammaloop-integration-tests::test_python_api python_settings_wrappers_expose_nested_runtime_and_global_settings
  251. 48.93 s gammaloop-nextest-python-api> stdout ---
  252. 48.93 s gammaloop-nextest-python-api>
  253. 48.93 s gammaloop-nextest-python-api> running 1 test
  254. 48.93 s gammaloop-nextest-python-api> test python_settings_wrappers_expose_nested_runtime_and_global_settings ... FAILED
  255. 48.93 s gammaloop-nextest-python-api>
  256. 48.93 s gammaloop-nextest-python-api> failures:
  257. 48.93 s gammaloop-nextest-python-api>
  258. 48.93 s gammaloop-nextest-python-api> failures:
  259. 48.93 s gammaloop-nextest-python-api> python_settings_wrappers_expose_nested_runtime_and_global_settings
  260. 48.93 s gammaloop-nextest-python-api>
  261. 48.93 s gammaloop-nextest-python-api> test result: FAILED. 0 passed; 1 failed; 0 ignored; 0 measured; 4 filtered out; finished in 0.30s
  262. 48.93 s gammaloop-nextest-python-api>
  263. 48.93 s gammaloop-nextest-python-api> stderr ---
  264. 48.93 s gammaloop-nextest-python-api> Error: Python API test subprocess failed.
  265. 48.93 s gammaloop-nextest-python-api> stdout:
  266. 48.93 s gammaloop-nextest-python-api> ┌────────────────────────────────────────────────────────┐
  267. 48.93 s gammaloop-nextest-python-api> │ You are running a restricted Symbolica instance. │
  268. 48.93 s gammaloop-nextest-python-api> │ │
  269. 48.93 s gammaloop-nextest-python-api> │ This mode is only permitted for non-commercial use and │
  270. 48.93 s gammaloop-nextest-python-api> │ is limited to one instance and core per machine. │
  271. 48.93 s gammaloop-nextest-python-api> │ │
  272. 48.93 s gammaloop-nextest-python-api> │ Hobbyists can easily acquire a free license key │
  273. 48.93 s gammaloop-nextest-python-api> │ that unlocks all cores and removes this banner: │
  274. 48.93 s gammaloop-nextest-python-api> │ │
  275. 48.93 s gammaloop-nextest-python-api> │ from symbolica import * │
  276. 48.93 s gammaloop-nextest-python-api> │ request_hobbyist_license('YOUR_NAME', 'YOUR_EMAIL') │
  277. 48.93 s gammaloop-nextest-python-api> │ │
  278. 48.93 s gammaloop-nextest-python-api> │ All other users can obtain a free 30-day trial key: │
  279. 48.93 s gammaloop-nextest-python-api> │ │
  280. 48.93 s gammaloop-nextest-python-api> │ from symbolica import * │
  281. 48.93 s gammaloop-nextest-python-api> │ request_trial_license('NAME', 'EMAIL', 'EMPLOYER') │
  282. 48.93 s gammaloop-nextest-python-api> │ │
  283. 48.93 s gammaloop-nextest-python-api> │ See https://symbolica.io/docs/get_started.html#license │
  284. 48.93 s gammaloop-nextest-python-api> └────────────────────────────────────────────────────────┘
  285. 48.93 s gammaloop-nextest-python-api> ┌───────────────────────────────────────────────────────────────────────────────────────────────────────────┐
  286. 48.93 s gammaloop-nextest-python-api> │ Cannot start new unlicensed Symbolica instance since there is already another one running on the machine. │
  287. 48.93 s gammaloop-nextest-python-api> └───────────────────────────────────────────────────────────────────────────────────────────────────────────┘
  288. 48.93 s gammaloop-nextest-python-api>
  289. 48.93 s gammaloop-nextest-python-api> stderr:
  290. 48.93 s gammaloop-nextest-python-api> ┌───────────────────────────────────┐
  291. 48.93 s gammaloop-nextest-python-api> │ The Symbolica license has expired │
  292. 48.93 s gammaloop-nextest-python-api> └───────────────────────────────────┘
  293. 48.93 s gammaloop-nextest-python-api>
  294. 48.93 s gammaloop-nextest-python-api>
  295. 48.93 s gammaloop-nextest-python-api> Location:
  296. 48.93 s gammaloop-nextest-python-api> tests/tests/test_python_api.rs:156:20
  297. 48.93 s gammaloop-nextest-python-api>
  298. 48.93 s gammaloop-nextest-python-api> ------------
  299. 48.93 s gammaloop-nextest-python-api> Summary [ 0.306s] 5 tests run: 0 passed, 5 failed, 0 skipped
  300. 48.93 s gammaloop-nextest-python-api> FAIL [ 0.157s] (1/5) gammaloop-integration-tests::test_python_api python_evaluate_sample_preserves_graph_grouping_and_incoming_pdgs
  301. 48.93 s gammaloop-nextest-python-api> stdout ---
  302. 48.93 s gammaloop-nextest-python-api>
  303. 48.93 s gammaloop-nextest-python-api> running 1 test
  304. 48.93 s gammaloop-nextest-python-api> test python_evaluate_sample_preserves_graph_grouping_and_incoming_pdgs ... FAILED
  305. 48.93 s gammaloop-nextest-python-api>
  306. 48.93 s gammaloop-nextest-python-api> failures:
  307. 48.93 s gammaloop-nextest-python-api>
  308. 48.93 s gammaloop-nextest-python-api> failures:
  309. 48.93 s gammaloop-nextest-python-api> python_evaluate_sample_preserves_graph_grouping_and_incoming_pdgs
  310. 48.93 s gammaloop-nextest-python-api>
  311. 48.93 s gammaloop-nextest-python-api> test result: FAILED. 0 passed; 1 failed; 0 ignored; 0 measured; 4 filtered out; finished in 0.15s
  312. 48.93 s gammaloop-nextest-python-api>
  313. 48.93 s gammaloop-nextest-python-api> stderr ---
  314. 48.93 s gammaloop-nextest-python-api> Error: Python API test subprocess failed.
  315. 48.93 s gammaloop-nextest-python-api> stdout:
  316. 48.93 s gammaloop-nextest-python-api> ┌────────────────────────────────────────────────────────┐
  317. 48.93 s gammaloop-nextest-python-api> │ You are running a restricted Symbolica instance. │
  318. 48.93 s gammaloop-nextest-python-api> │ │
  319. 48.93 s gammaloop-nextest-python-api> │ This mode is only permitted for non-commercial use and │
  320. 48.93 s gammaloop-nextest-python-api> │ is limited to one instance and core per machine. │
  321. 48.93 s gammaloop-nextest-python-api> │ │
  322. 48.93 s gammaloop-nextest-python-api> │ Hobbyists can easily acquire a free license key │
  323. 48.93 s gammaloop-nextest-python-api> │ that unlocks all cores and removes this banner: │
  324. 48.93 s gammaloop-nextest-python-api> │ │
  325. 48.93 s gammaloop-nextest-python-api> │ from symbolica import * │
  326. 48.93 s gammaloop-nextest-python-api> │ request_hobbyist_license('YOUR_NAME', 'YOUR_EMAIL') │
  327. 48.93 s gammaloop-nextest-python-api> │ │
  328. 48.93 s gammaloop-nextest-python-api> │ All other users can obtain a free 30-day trial key: │
  329. 48.93 s gammaloop-nextest-python-api> │ │
  330. 48.93 s gammaloop-nextest-python-api> │ from symbolica import * │
  331. 48.93 s gammaloop-nextest-python-api> │ request_trial_license('NAME', 'EMAIL', 'EMPLOYER') │
  332. 48.93 s gammaloop-nextest-python-api> │ │
  333. 48.93 s gammaloop-nextest-python-api> │ See https://symbolica.io/docs/get_started.html#license │
  334. 48.93 s gammaloop-nextest-python-api> └────────────────────────────────────────────────────────┘
  335. 48.93 s gammaloop-nextest-python-api> ┌───────────────────────────────────────────────────────────────────────────────────────────────────────────┐
  336. 48.93 s gammaloop-nextest-python-api> │ Cannot start new unlicensed Symbolica instance since there is already another one running on the machine. │
  337. 48.93 s gammaloop-nextest-python-api> └───────────────────────────────────────────────────────────────────────────────────────────────────────────┘
  338. 48.93 s gammaloop-nextest-python-api>
  339. 48.93 s gammaloop-nextest-python-api> stderr:
  340. 48.93 s gammaloop-nextest-python-api> ┌───────────────────────────────────┐
  341. 48.93 s gammaloop-nextest-python-api> │ The Symbolica license has expired │
  342. 48.93 s gammaloop-nextest-python-api> └───────────────────────────────────┘
  343. 48.93 s gammaloop-nextest-python-api>
  344. 48.93 s gammaloop-nextest-python-api>
  345. 48.93 s gammaloop-nextest-python-api> Location:
  346. 48.93 s gammaloop-nextest-python-api> tests/tests/test_python_api.rs:156:20
  347. 48.93 s gammaloop-nextest-python-api>
  348. 48.93 s gammaloop-nextest-python-api> FAIL [ 0.170s] (2/5) gammaloop-integration-tests::test_python_api python_evaluate_sample_honors_generate_events_and_observable_snapshots
  349. 48.94 s gammaloop-nextest-python-api> stdout ---
  350. 48.94 s gammaloop-nextest-python-api>
  351. 48.94 s gammaloop-nextest-python-api> running 1 test
  352. 48.94 s gammaloop-nextest-python-api> test python_evaluate_sample_honors_generate_events_and_observable_snapshots ... FAILED
  353. 48.94 s gammaloop-nextest-python-api>
  354. 48.94 s gammaloop-nextest-python-api> failures:
  355. 48.94 s gammaloop-nextest-python-api>
  356. 48.94 s gammaloop-nextest-python-api> failures:
  357. 48.94 s gammaloop-nextest-python-api> python_evaluate_sample_honors_generate_events_and_observable_snapshots
  358. 48.94 s gammaloop-nextest-python-api>
  359. 48.94 s gammaloop-nextest-python-api> test result: FAILED. 0 passed; 1 failed; 0 ignored; 0 measured; 4 filtered out; finished in 0.16s
  360. 48.94 s gammaloop-nextest-python-api>
  361. 48.94 s gammaloop-nextest-python-api> stderr ---
  362. 48.94 s gammaloop-nextest-python-api> Error: Python API test subprocess failed.
  363. 48.94 s gammaloop-nextest-python-api> stdout:
  364. 48.94 s gammaloop-nextest-python-api> ┌────────────────────────────────────────────────────────┐
  365. 48.94 s gammaloop-nextest-python-api> │ You are running a restricted Symbolica instance. │
  366. 48.94 s gammaloop-nextest-python-api> │ │
  367. 48.94 s gammaloop-nextest-python-api> │ This mode is only permitted for non-commercial use and │
  368. 48.94 s gammaloop-nextest-python-api> │ is limited to one instance and core per machine. │
  369. 48.94 s gammaloop-nextest-python-api> │ │
  370. 48.94 s gammaloop-nextest-python-api> │ Hobbyists can easily acquire a free license key │
  371. 48.94 s gammaloop-nextest-python-api> │ that unlocks all cores and removes this banner: │
  372. 48.94 s gammaloop-nextest-python-api> │ │
  373. 48.94 s gammaloop-nextest-python-api> │ from symbolica import * │
  374. 48.94 s gammaloop-nextest-python-api> │ request_hobbyist_license('YOUR_NAME', 'YOUR_EMAIL') │
  375. 48.94 s gammaloop-nextest-python-api> │ │
  376. 48.94 s gammaloop-nextest-python-api> │ All other users can obtain a free 30-day trial key: │
  377. 48.94 s gammaloop-nextest-python-api> │ │
  378. 48.94 s gammaloop-nextest-python-api> │ from symbolica import * │
  379. 48.94 s gammaloop-nextest-python-api> │ request_trial_license('NAME', 'EMAIL', 'EMPLOYER') │
  380. 48.94 s gammaloop-nextest-python-api> │ │
  381. 48.94 s gammaloop-nextest-python-api> │ See https://symbolica.io/docs/get_started.html#license │
  382. 48.94 s gammaloop-nextest-python-api> └────────────────────────────────────────────────────────┘
  383. 48.94 s gammaloop-nextest-python-api> ┌───────────────────────────────────────────────────────────────────────────────────────────────────────────┐
  384. 48.94 s gammaloop-nextest-python-api> │ Cannot start new unlicensed Symbolica instance since there is already another one running on the machine. │
  385. 48.94 s gammaloop-nextest-python-api> └───────────────────────────────────────────────────────────────────────────────────────────────────────────┘
  386. 48.94 s gammaloop-nextest-python-api>
  387. 48.94 s gammaloop-nextest-python-api> stderr:
  388. 48.94 s gammaloop-nextest-python-api> ┌───────────────────────────────────┐
  389. 48.94 s gammaloop-nextest-python-api> │ The Symbolica license has expired │
  390. 48.94 s gammaloop-nextest-python-api> └───────────────────────────────────┘
  391. 48.94 s gammaloop-nextest-python-api>
  392. 48.94 s gammaloop-nextest-python-api>
  393. 48.94 s gammaloop-nextest-python-api> Location:
  394. 48.94 s gammaloop-nextest-python-api> tests/tests/test_python_api.rs:156:20
  395. 48.94 s gammaloop-nextest-python-api>
  396. 48.94 s gammaloop-nextest-python-api> FAIL [ 0.171s] (3/5) gammaloop-integration-tests::test_python_api python_session_getters_return_live_toml_and_command_blocks
  397. 48.94 s gammaloop-nextest-python-api> stdout ---
  398. 48.94 s gammaloop-nextest-python-api>
  399. 48.94 s gammaloop-nextest-python-api> running 1 test
  400. 48.94 s gammaloop-nextest-python-api> test python_session_getters_return_live_toml_and_command_blocks ... FAILED
  401. 48.94 s gammaloop-nextest-python-api>
  402. 48.94 s gammaloop-nextest-python-api> failures:
  403. 48.94 s gammaloop-nextest-python-api>
  404. 48.94 s gammaloop-nextest-python-api> failures:
  405. 48.94 s gammaloop-nextest-python-api> python_session_getters_return_live_toml_and_command_blocks
  406. 48.94 s gammaloop-nextest-python-api>
  407. 48.94 s gammaloop-nextest-python-api> test result: FAILED. 0 passed; 1 failed; 0 ignored; 0 measured; 4 filtered out; finished in 0.16s
  408. 48.94 s gammaloop-nextest-python-api>
  409. 48.94 s gammaloop-nextest-python-api> stderr ---
  410. 48.94 s gammaloop-nextest-python-api> Error: Python API test subprocess failed.
  411. 48.94 s gammaloop-nextest-python-api> stdout:
  412. 48.94 s gammaloop-nextest-python-api> ┌────────────────────────────────────────────────────────┐
  413. 48.94 s gammaloop-nextest-python-api> │ You are running a restricted Symbolica instance. │
  414. 48.94 s gammaloop-nextest-python-api> │ │
  415. 48.94 s gammaloop-nextest-python-api> │ This mode is only permitted for non-commercial use and │
  416. 48.94 s gammaloop-nextest-python-api> │ is limited to one instance and core per machine. │
  417. 48.94 s gammaloop-nextest-python-api> │ │
  418. 48.94 s gammaloop-nextest-python-api> │ Hobbyists can easily acquire a free license key │
  419. 48.94 s gammaloop-nextest-python-api> │ that unlocks all cores and removes this banner: │
  420. 48.94 s gammaloop-nextest-python-api> │ │
  421. 48.94 s gammaloop-nextest-python-api> │ from symbolica import * │
  422. 48.94 s gammaloop-nextest-python-api> │ request_hobbyist_license('YOUR_NAME', 'YOUR_EMAIL') │
  423. 48.94 s gammaloop-nextest-python-api> │ │
  424. 48.94 s gammaloop-nextest-python-api> │ All other users can obtain a free 30-day trial key: │
  425. 48.94 s gammaloop-nextest-python-api> │ │
  426. 48.94 s gammaloop-nextest-python-api> │ from symbolica import * │
  427. 48.94 s gammaloop-nextest-python-api> │ request_trial_license('NAME', 'EMAIL', 'EMPLOYER') │
  428. 48.94 s gammaloop-nextest-python-api> │ │
  429. 48.94 s gammaloop-nextest-python-api> │ See https://symbolica.io/docs/get_started.html#license │
  430. 48.94 s gammaloop-nextest-python-api> └────────────────────────────────────────────────────────┘
  431. 48.94 s gammaloop-nextest-python-api> ┌───────────────────────────────────────────────────────────────────────────────────────────────────────────┐
  432. 48.94 s gammaloop-nextest-python-api> │ Cannot start new unlicensed Symbolica instance since there is already another one running on the machine. │
  433. 48.94 s gammaloop-nextest-python-api> └───────────────────────────────────────────────────────────────────────────────────────────────────────────┘
  434. 48.94 s gammaloop-nextest-python-api>
  435. 48.94 s gammaloop-nextest-python-api> stderr:
  436. 48.94 s gammaloop-nextest-python-api> ┌───────────────────────────────────┐
  437. 48.94 s gammaloop-nextest-python-api> │ The Symbolica license has expired │
  438. 48.94 s gammaloop-nextest-python-api> └───────────────────────────────────┘
  439. 48.94 s gammaloop-nextest-python-api>
  440. 48.94 s gammaloop-nextest-python-api>
  441. 48.94 s gammaloop-nextest-python-api> Location:
  442. 48.94 s gammaloop-nextest-python-api> tests/tests/test_python_api.rs:156:20
  443. 48.94 s gammaloop-nextest-python-api>
  444. 48.94 s gammaloop-nextest-python-api> FAIL [ 0.281s] (4/5) gammaloop-integration-tests::test_python_api python_evaluate_samples_batch_and_momentum_space_have_expected_shape
  445. 48.94 s gammaloop-nextest-python-api> stdout ---
  446. 48.94 s gammaloop-nextest-python-api>
  447. 48.94 s gammaloop-nextest-python-api> running 1 test
  448. 48.94 s gammaloop-nextest-python-api> test python_evaluate_samples_batch_and_momentum_space_have_expected_shape ... FAILED
  449. 48.94 s gammaloop-nextest-python-api>
  450. 48.94 s gammaloop-nextest-python-api> failures:
  451. 48.94 s gammaloop-nextest-python-api>
  452. 48.94 s gammaloop-nextest-python-api> failures:
  453. 48.94 s gammaloop-nextest-python-api> python_evaluate_samples_batch_and_momentum_space_have_expected_shape
  454. 48.94 s gammaloop-nextest-python-api>
  455. 48.94 s gammaloop-nextest-python-api> test result: FAILED. 0 passed; 1 failed; 0 ignored; 0 measured; 4 filtered out; finished in 0.27s
  456. 48.94 s gammaloop-nextest-python-api>
  457. 48.94 s gammaloop-nextest-python-api> stderr ---
  458. 48.94 s gammaloop-nextest-python-api> Error: Python API test subprocess failed.
  459. 48.94 s gammaloop-nextest-python-api> stdout:
  460. 48.94 s gammaloop-nextest-python-api> ┌────────────────────────────────────────────────────────┐
  461. 48.94 s gammaloop-nextest-python-api> │ You are running a restricted Symbolica instance. │
  462. 48.94 s gammaloop-nextest-python-api> │ │
  463. 48.94 s gammaloop-nextest-python-api> │ This mode is only permitted for non-commercial use and │
  464. 48.94 s gammaloop-nextest-python-api> │ is limited to one instance and core per machine. │
  465. 48.94 s gammaloop-nextest-python-api> │ │
  466. 48.94 s gammaloop-nextest-python-api> │ Hobbyists can easily acquire a free license key │
  467. 48.94 s gammaloop-nextest-python-api> │ that unlocks all cores and removes this banner: │
  468. 48.94 s gammaloop-nextest-python-api> │ │
  469. 48.94 s gammaloop-nextest-python-api> │ from symbolica import * │
  470. 48.94 s gammaloop-nextest-python-api> │ request_hobbyist_license('YOUR_NAME', 'YOUR_EMAIL') │
  471. 48.94 s gammaloop-nextest-python-api> │ │
  472. 48.94 s gammaloop-nextest-python-api> │ All other users can obtain a free 30-day trial key: │
  473. 48.94 s gammaloop-nextest-python-api> │ │
  474. 48.94 s gammaloop-nextest-python-api> │ from symbolica import * │
  475. 48.94 s gammaloop-nextest-python-api> │ request_trial_license('NAME', 'EMAIL', 'EMPLOYER') │
  476. 48.94 s gammaloop-nextest-python-api> │ │
  477. 48.94 s gammaloop-nextest-python-api> │ See https://symbolica.io/docs/get_started.html#license │
  478. 48.94 s gammaloop-nextest-python-api> └────────────────────────────────────────────────────────┘
  479. 48.94 s gammaloop-nextest-python-api> ┌───────────────────────────────────────────────────────────────────────────────────────────────────────────┐
  480. 48.94 s gammaloop-nextest-python-api> │ Cannot start new unlicensed Symbolica instance since there is already another one running on the machine. │
  481. 48.94 s gammaloop-nextest-python-api> └───────────────────────────────────────────────────────────────────────────────────────────────────────────┘
  482. 48.94 s gammaloop-nextest-python-api>
  483. 48.94 s gammaloop-nextest-python-api> stderr:
  484. 48.94 s gammaloop-nextest-python-api> ┌───────────────────────────────────┐
  485. 48.94 s gammaloop-nextest-python-api> │ The Symbolica license has expired │
  486. 48.94 s gammaloop-nextest-python-api> └───────────────────────────────────┘
  487. 48.94 s gammaloop-nextest-python-api> [2026-09-01 16:00:11.325] @gammaloop_api::se... INFO : Running command import model sm-default
  488. 48.94 s gammaloop-nextest-python-api> [2026-09-01 16:00:11.325] @import::model INFO : Loading built-in JSON model sm-default
  489. 48.94 s gammaloop-nextest-python-api> [2026-09-01 16:00:11.373] @gammalooprs::model INFO : The following 11 external parameters were forced to zero by the restriction card:
  490. 48.94 s gammaloop-nextest-python-api> lamWS, AWS, rhoWS, etaWS, ymc, yme, ymm, MC, Me, MM, WTau
  491. 48.94 s gammaloop-nextest-python-api> [2026-09-01 16:00:11.373] @gammalooprs::model INFO : The following 34 vertex rules were removed by the restriction card:
  492. 48.94 s gammaloop-nextest-python-api> V_82 -> (c~, d, G+) | V_83 -> (t~, d, G+) | V_84 -> (c~, s, G+) | V_85 -> (t~, s, G+) | V_86 -> (u~, b, G+) | V_87 -> (c~, b, G+) | V_90 -> (c~, d, W+) | V_91 -> (t~, d, W+) | V_92 -> (u~, s, W+) | V_94 -> (t~, s, W+) | V_95 -> (u~, b, W+) | V_96 -> (c~, b, W+) | V_101 -> (e+, e-, G0) | V_102 -> (mu+, mu-, G0) | V_104 -> (e+, e-, H) | V_105 -> (mu+, mu-, H) | V_110 -> (ve~, e-, G+) | V_111 -> (vm~, mu-, G+) | V_116 -> (b~, u, G-) | V_117 -> (d~, c, G-) | V_118 -> (s~, c, G-) | V_119 -> (b~, c, G-) | V_120 -> (d~, t, G-) | V_121 -> (s~, t, G-) | V_124 -> (s~, u, W-) | V_125 -> (b~, u, W-) | V_126 -> (d~, c, W-) | V_128 -> (b~, c, W-) | V_129 -> (d~, t, W-) | V_130 -> (s~, t, W-) | V_138 -> (c~, c, G0) | V_140 -> (c~, c, H) | V_145 -> (e+, ve, G-) | V_146 -> (mu+, vm, G-)
  493. 48.94 s gammaloop-nextest-python-api> [2026-09-01 16:00:11.373] @gammalooprs::model INFO : The following 36 couplings were removed by the restriction card:
  494. 48.94 s gammaloop-nextest-python-api> GC_13, GC_14, GC_16, GC_17, GC_18, GC_19, GC_20, GC_22, GC_23, GC_24, GC_25, GC_26, GC_28, GC_29, GC_42, GC_43, GC_44, GC_46, GC_47, GC_48, GC_84, GC_85, GC_86, GC_87, GC_88, GC_89, GC_90, GC_91, GC_92, GC_93, GC_101, GC_102, GC_103, GC_105, GC_106, GC_107
  495. 48.94 s gammaloop-nextest-python-api> [2026-09-01 16:00:11.374] @gammaloop_api::se... INFO : Running command set default-runtime kv kinematics.externals='{"type":"constant","data":{"momenta":[[32.0,0.0,0.0,32.0],[32.0,0.0,0.0,-32.0]],"helicities":[1,1]}}'
  496. 48.94 s gammaloop-nextest-python-api> [2026-09-01 16:00:11.375] @gammaloop_api::se... INFO : Running command set default-runtime kv subtraction.disable_threshold_subtraction=true
  497. 48.94 s gammaloop-nextest-python-api> [2026-09-01 16:00:11.376] @gammaloop_api::se... INFO : Running command generate xs e+ e- > d d~ g | e- a d g QED^2==4 [{{2}} QCD=0] --numerator-grouping group_identical_graphs_up_to_sign --clear-existing-processes --only-diagrams
  498. 48.94 s gammaloop-nextest-python-api> [2026-09-01 16:00:11.379] @feyngen::diagram_... INFO : 0s | Δ=0s | Starting Feynman graph generation with Symbolica...
  499. 48.94 s gammaloop-nextest-python-api> [2026-09-01 16:00:11.383] @feyngen::diagram_... INFO : 0s | Δ=0s | Number of graphs resulting from Symbolica generation: 246
  500. 48.94 s gammaloop-nextest-python-api> [2026-09-01 16:00:11.384] @feyngen::diagram_... INFO : 0s | Δ=0s | Number of graphs retained after enforcing supergraph particle content: 8
  501. 48.94 s gammaloop-nextest-python-api> [2026-09-01 16:00:11.384] @feyngen::diagram_... INFO : 0s | Δ=0s | Number of graphs retained after removal of vetoed topologies: 8
  502. 48.94 s gammaloop-nextest-python-api> [2026-09-01 16:00:11.384] @feyngen::diagram_... INFO : 0s | Δ=0s | Number of graphs after vertex info assignment: 8
  503. 48.94 s gammaloop-nextest-python-api> [2026-09-01 16:00:11.384] @feyngen::diagram_... INFO : 0s | Δ=0s | Number of graphs after all complete graphs filters are applied: 8
  504. 48.94 s gammaloop-nextest-python-api>
  505. 48.94 s gammaloop-nextest-python-api>
  506. 48.94 s gammaloop-nextest-python-api> Location:
  507. 48.94 s gammaloop-nextest-python-api> tests/tests/test_python_api.rs:156:20
  508. 48.94 s gammaloop-nextest-python-api>
  509. 48.94 s gammaloop-nextest-python-api> FAIL [ 0.305s] (5/5) gammaloop-integration-tests::test_python_api python_settings_wrappers_expose_nested_runtime_and_global_settings
  510. 48.94 s gammaloop-nextest-python-api> stdout ---
  511. 48.94 s gammaloop-nextest-python-api>
  512. 48.94 s gammaloop-nextest-python-api> running 1 test
  513. 48.94 s gammaloop-nextest-python-api> test python_settings_wrappers_expose_nested_runtime_and_global_settings ... FAILED
  514. 48.94 s gammaloop-nextest-python-api>
  515. 48.94 s gammaloop-nextest-python-api> failures:
  516. 48.94 s gammaloop-nextest-python-api>
  517. 48.94 s gammaloop-nextest-python-api> failures:
  518. 48.94 s gammaloop-nextest-python-api> python_settings_wrappers_expose_nested_runtime_and_global_settings
  519. 48.94 s gammaloop-nextest-python-api>
  520. 48.94 s gammaloop-nextest-python-api> test result: FAILED. 0 passed; 1 failed; 0 ignored; 0 measured; 4 filtered out; finished in 0.30s
  521. 48.94 s gammaloop-nextest-python-api>
  522. 48.94 s gammaloop-nextest-python-api> stderr ---
  523. 48.94 s gammaloop-nextest-python-api> Error: Python API test subprocess failed.
  524. 48.94 s gammaloop-nextest-python-api> stdout:
  525. 48.94 s gammaloop-nextest-python-api> ┌────────────────────────────────────────────────────────┐
  526. 48.94 s gammaloop-nextest-python-api> │ You are running a restricted Symbolica instance. │
  527. 48.94 s gammaloop-nextest-python-api> │ │
  528. 48.94 s gammaloop-nextest-python-api> │ This mode is only permitted for non-commercial use and │
  529. 48.94 s gammaloop-nextest-python-api> │ is limited to one instance and core per machine. │
  530. 48.94 s gammaloop-nextest-python-api> │ │
  531. 48.94 s gammaloop-nextest-python-api> │ Hobbyists can easily acquire a free license key │
  532. 48.94 s gammaloop-nextest-python-api> │ that unlocks all cores and removes this banner: │
  533. 48.94 s gammaloop-nextest-python-api> │ │
  534. 48.94 s gammaloop-nextest-python-api> │ from symbolica import * │
  535. 48.94 s gammaloop-nextest-python-api> │ request_hobbyist_license('YOUR_NAME', 'YOUR_EMAIL') │
  536. 48.94 s gammaloop-nextest-python-api> │ │
  537. 48.94 s gammaloop-nextest-python-api> │ All other users can obtain a free 30-day trial key: │
  538. 48.94 s gammaloop-nextest-python-api> │ │
  539. 48.94 s gammaloop-nextest-python-api> │ from symbolica import * │
  540. 48.94 s gammaloop-nextest-python-api> │ request_trial_license('NAME', 'EMAIL', 'EMPLOYER') │
  541. 48.94 s gammaloop-nextest-python-api> │ │
  542. 48.94 s gammaloop-nextest-python-api> │ See https://symbolica.io/docs/get_started.html#license │
  543. 48.94 s gammaloop-nextest-python-api> └────────────────────────────────────────────────────────┘
  544. 48.94 s gammaloop-nextest-python-api> ┌───────────────────────────────────────────────────────────────────────────────────────────────────────────┐
  545. 48.94 s gammaloop-nextest-python-api> │ Cannot start new unlicensed Symbolica instance since there is already another one running on the machine. │
  546. 48.94 s gammaloop-nextest-python-api> └───────────────────────────────────────────────────────────────────────────────────────────────────────────┘
  547. 48.94 s gammaloop-nextest-python-api>
  548. 48.94 s gammaloop-nextest-python-api> stderr:
  549. 48.94 s gammaloop-nextest-python-api> ┌───────────────────────────────────┐
  550. 48.94 s gammaloop-nextest-python-api> │ The Symbolica license has expired │
  551. 48.94 s gammaloop-nextest-python-api> └───────────────────────────────────┘
  552. 48.94 s gammaloop-nextest-python-api>
  553. 48.94 s gammaloop-nextest-python-api>
  554. 48.94 s gammaloop-nextest-python-api> Location:
  555. 48.94 s gammaloop-nextest-python-api> tests/tests/test_python_api.rs:156:20
  556. 48.94 s gammaloop-nextest-python-api>
  557. 48.95 s gammaloop-nextest-python-api> error: test run failed
  558. 49.00 s gammaloop-nextest-python-api>
  559. 49.00 s gammaloop-nextest-python-api> ========== nextest test summary ==========
  560. 49.00 s gammaloop-nextest-python-api> report: target/nextest/ci_gammaloop/junit.xml
  561. 49.00 s gammaloop-nextest-python-api> tests: 5, failures: 5, errors: 0
  562. 49.00 s gammaloop-nextest-python-api>
  563. 49.00 s gammaloop-nextest-python-api> 1. gammaloop-integration-tests::test_python_api::python_evaluate_sample_preserves_graph_grouping_and_incoming_pdgs
  564. 49.00 s gammaloop-nextest-python-api> failure: test failure with exit code 101
  565. 49.00 s gammaloop-nextest-python-api> Error: Python API test subprocess failed.
  566. 49.00 s gammaloop-nextest-python-api> stdout:
  567. 49.00 s gammaloop-nextest-python-api> ┌────────────────────────────────────────────────────────┐
  568. 49.00 s gammaloop-nextest-python-api> │ You are running a restricted Symbolica instance. │
  569. 49.00 s gammaloop-nextest-python-api> │ │
  570. 49.00 s gammaloop-nextest-python-api> │ This mode is only permitted for non-commercial use and │
  571. 49.00 s gammaloop-nextest-python-api> │ is limited to one instance and core per machine. │
  572. 49.00 s gammaloop-nextest-python-api> │ │
  573. 49.00 s gammaloop-nextest-python-api> │ Hobbyists can easily acquire a free license key │
  574. 49.00 s gammaloop-nextest-python-api> │ that unlocks all cores and removes this banner: │
  575. 49.00 s gammaloop-nextest-python-api> │ │
  576. 49.00 s gammaloop-nextest-python-api> │ from symbolica import * │
  577. 49.00 s gammaloop-nextest-python-api> │ request_hobbyist_license('YOUR_NAME', 'YOUR_EMAIL') │
  578. 49.00 s gammaloop-nextest-python-api> │ │
  579. 49.00 s gammaloop-nextest-python-api> │ All other users can obtain a free 30-day trial key: │
  580. 49.00 s gammaloop-nextest-python-api> │ │
  581. 49.00 s gammaloop-nextest-python-api> │ from symbolica import * │
  582. 49.00 s gammaloop-nextest-python-api> │ request_trial_license('NAME', 'EMAIL', 'EMPLOYER') │
  583. 49.00 s gammaloop-nextest-python-api> │ │
  584. 49.00 s gammaloop-nextest-python-api> │ See https://symbolica.io/docs/get_started.html#license │
  585. 49.00 s gammaloop-nextest-python-api> └────────────────────────────────────────────────────────┘
  586. 49.00 s gammaloop-nextest-python-api> ┌───────────────────────────────────────────────────────────────────────────────────────────────────────────┐
  587. 49.00 s gammaloop-nextest-python-api> │ Cannot start new unlicensed Symbolica instance since there is already another one running on the machine. │
  588. 49.00 s gammaloop-nextest-python-api> └───────────────────────────────────────────────────────────────────────────────────────────────────────────┘
  589. 49.00 s gammaloop-nextest-python-api>
  590. 49.00 s gammaloop-nextest-python-api> stderr:
  591. 49.00 s gammaloop-nextest-python-api> ┌───────────────────────────────────┐
  592. 49.00 s gammaloop-nextest-python-api> │ The Symbolica license has expired │
  593. 49.00 s gammaloop-nextest-python-api> └───────────────────────────────────┘
  594. 49.00 s gammaloop-nextest-python-api>
  595. 49.00 s gammaloop-nextest-python-api>
  596. 49.00 s gammaloop-nextest-python-api> Location:
  597. 49.00 s gammaloop-nextest-python-api> tests/tests/test_python_api.rs:156:20
  598. 49.00 s gammaloop-nextest-python-api> system-out
  599. 49.00 s gammaloop-nextest-python-api> running 1 test
  600. 49.00 s gammaloop-nextest-python-api> test python_evaluate_sample_preserves_graph_grouping_and_incoming_pdgs ... FAILED
  601. 49.00 s gammaloop-nextest-python-api>
  602. 49.00 s gammaloop-nextest-python-api> failures:
  603. 49.00 s gammaloop-nextest-python-api>
  604. 49.00 s gammaloop-nextest-python-api> failures:
  605. 49.00 s gammaloop-nextest-python-api> python_evaluate_sample_preserves_graph_grouping_and_incoming_pdgs
  606. 49.00 s gammaloop-nextest-python-api>
  607. 49.00 s gammaloop-nextest-python-api> test result: FAILED. 0 passed; 1 failed; 0 ignored; 0 measured; 4 filtered out; finished in 0.15s
  608. 49.00 s gammaloop-nextest-python-api> system-err
  609. 49.00 s gammaloop-nextest-python-api> Error: Python API test subprocess failed.
  610. 49.00 s gammaloop-nextest-python-api> stdout:
  611. 49.00 s gammaloop-nextest-python-api> ┌────────────────────────────────────────────────────────┐
  612. 49.00 s gammaloop-nextest-python-api> │ You are running a restricted Symbolica instance. │
  613. 49.00 s gammaloop-nextest-python-api> │ │
  614. 49.00 s gammaloop-nextest-python-api> │ This mode is only permitted for non-commercial use and │
  615. 49.00 s gammaloop-nextest-python-api> │ is limited to one instance and core per machine. │
  616. 49.00 s gammaloop-nextest-python-api> │ │
  617. 49.00 s gammaloop-nextest-python-api> │ Hobbyists can easily acquire a free license key │
  618. 49.00 s gammaloop-nextest-python-api> │ that unlocks all cores and removes this banner: │
  619. 49.00 s gammaloop-nextest-python-api> │ │
  620. 49.00 s gammaloop-nextest-python-api> │ from symbolica import * │
  621. 49.00 s gammaloop-nextest-python-api> │ request_hobbyist_license('YOUR_NAME', 'YOUR_EMAIL') │
  622. 49.00 s gammaloop-nextest-python-api> │ │
  623. 49.00 s gammaloop-nextest-python-api> │ All other users can obtain a free 30-day trial key: │
  624. 49.00 s gammaloop-nextest-python-api> │ │
  625. 49.00 s gammaloop-nextest-python-api> │ from symbolica import * │
  626. 49.00 s gammaloop-nextest-python-api> │ request_trial_license('NAME', 'EMAIL', 'EMPLOYER') │
  627. 49.00 s gammaloop-nextest-python-api> │ │
  628. 49.00 s gammaloop-nextest-python-api> │ See https://symbolica.io/docs/get_started.html#license │
  629. 49.00 s gammaloop-nextest-python-api> └────────────────────────────────────────────────────────┘
  630. 49.00 s gammaloop-nextest-python-api> ┌───────────────────────────────────────────────────────────────────────────────────────────────────────────┐
  631. 49.00 s gammaloop-nextest-python-api> │ Cannot start new unlicensed Symbolica instance since there is already another one running on the machine. │
  632. 49.00 s gammaloop-nextest-python-api> └───────────────────────────────────────────────────────────────────────────────────────────────────────────┘
  633. 49.00 s gammaloop-nextest-python-api>
  634. 49.00 s gammaloop-nextest-python-api> stderr:
  635. 49.00 s gammaloop-nextest-python-api> ┌───────────────────────────────────┐
  636. 49.00 s gammaloop-nextest-python-api> │ The Symbolica license has expired │
  637. 49.00 s gammaloop-nextest-python-api> └───────────────────────────────────┘
  638. 49.00 s gammaloop-nextest-python-api>
  639. 49.00 s gammaloop-nextest-python-api>
  640. 49.00 s gammaloop-nextest-python-api> Location:
  641. 49.00 s gammaloop-nextest-python-api> tests/tests/test_python_api.rs:156:20
  642. 49.00 s gammaloop-nextest-python-api>
  643. 49.00 s gammaloop-nextest-python-api> 2. gammaloop-integration-tests::test_python_api::python_evaluate_sample_honors_generate_events_and_observable_snapshots
  644. 49.00 s gammaloop-nextest-python-api> failure: test failure with exit code 101
  645. 49.00 s gammaloop-nextest-python-api> Error: Python API test subprocess failed.
  646. 49.00 s gammaloop-nextest-python-api> stdout:
  647. 49.00 s gammaloop-nextest-python-api> ┌────────────────────────────────────────────────────────┐
  648. 49.00 s gammaloop-nextest-python-api> │ You are running a restricted Symbolica instance. │
  649. 49.00 s gammaloop-nextest-python-api> │ │
  650. 49.00 s gammaloop-nextest-python-api> │ This mode is only permitted for non-commercial use and │
  651. 49.00 s gammaloop-nextest-python-api> │ is limited to one instance and core per machine. │
  652. 49.00 s gammaloop-nextest-python-api> │ │
  653. 49.00 s gammaloop-nextest-python-api> │ Hobbyists can easily acquire a free license key │
  654. 49.00 s gammaloop-nextest-python-api> │ that unlocks all cores and removes this banner: │
  655. 49.00 s gammaloop-nextest-python-api> │ │
  656. 49.00 s gammaloop-nextest-python-api> │ from symbolica import * │
  657. 49.00 s gammaloop-nextest-python-api> │ request_hobbyist_license('YOUR_NAME', 'YOUR_EMAIL') │
  658. 49.00 s gammaloop-nextest-python-api> │ │
  659. 49.00 s gammaloop-nextest-python-api> │ All other users can obtain a free 30-day trial key: │
  660. 49.00 s gammaloop-nextest-python-api> │ │
  661. 49.00 s gammaloop-nextest-python-api> │ from symbolica import * │
  662. 49.00 s gammaloop-nextest-python-api> │ request_trial_license('NAME', 'EMAIL', 'EMPLOYER') │
  663. 49.00 s gammaloop-nextest-python-api> │ │
  664. 49.00 s gammaloop-nextest-python-api> │ See https://symbolica.io/docs/get_started.html#license │
  665. 49.00 s gammaloop-nextest-python-api> └────────────────────────────────────────────────────────┘
  666. 49.00 s gammaloop-nextest-python-api> ┌───────────────────────────────────────────────────────────────────────────────────────────────────────────┐
  667. 49.00 s gammaloop-nextest-python-api> │ Cannot start new unlicensed Symbolica instance since there is already another one running on the machine. │
  668. 49.00 s gammaloop-nextest-python-api> └───────────────────────────────────────────────────────────────────────────────────────────────────────────┘
  669. 49.00 s gammaloop-nextest-python-api>
  670. 49.00 s gammaloop-nextest-python-api> stderr:
  671. 49.00 s gammaloop-nextest-python-api> ┌───────────────────────────────────┐
  672. 49.00 s gammaloop-nextest-python-api> │ The Symbolica license has expired │
  673. 49.00 s gammaloop-nextest-python-api> └───────────────────────────────────┘
  674. 49.00 s gammaloop-nextest-python-api>
  675. 49.00 s gammaloop-nextest-python-api>
  676. 49.00 s gammaloop-nextest-python-api> Location:
  677. 49.00 s gammaloop-nextest-python-api> tests/tests/test_python_api.rs:156:20
  678. 49.00 s gammaloop-nextest-python-api> system-out
  679. 49.00 s gammaloop-nextest-python-api> running 1 test
  680. 49.00 s gammaloop-nextest-python-api> test python_evaluate_sample_honors_generate_events_and_observable_snapshots ... FAILED
  681. 49.00 s gammaloop-nextest-python-api>
  682. 49.00 s gammaloop-nextest-python-api> failures:
  683. 49.00 s gammaloop-nextest-python-api>
  684. 49.00 s gammaloop-nextest-python-api> failures:
  685. 49.00 s gammaloop-nextest-python-api> python_evaluate_sample_honors_generate_events_and_observable_snapshots
  686. 49.00 s gammaloop-nextest-python-api>
  687. 49.00 s gammaloop-nextest-python-api> test result: FAILED. 0 passed; 1 failed; 0 ignored; 0 measured; 4 filtered out; finished in 0.16s
  688. 49.00 s gammaloop-nextest-python-api> system-err
  689. 49.00 s gammaloop-nextest-python-api> Error: Python API test subprocess failed.
  690. 49.00 s gammaloop-nextest-python-api> stdout:
  691. 49.00 s gammaloop-nextest-python-api> ┌────────────────────────────────────────────────────────┐
  692. 49.00 s gammaloop-nextest-python-api> │ You are running a restricted Symbolica instance. │
  693. 49.00 s gammaloop-nextest-python-api> │ │
  694. 49.00 s gammaloop-nextest-python-api> │ This mode is only permitted for non-commercial use and │
  695. 49.00 s gammaloop-nextest-python-api> │ is limited to one instance and core per machine. │
  696. 49.00 s gammaloop-nextest-python-api> │ │
  697. 49.00 s gammaloop-nextest-python-api> │ Hobbyists can easily acquire a free license key │
  698. 49.00 s gammaloop-nextest-python-api> │ that unlocks all cores and removes this banner: │
  699. 49.00 s gammaloop-nextest-python-api> │ │
  700. 49.00 s gammaloop-nextest-python-api> │ from symbolica import * │
  701. 49.00 s gammaloop-nextest-python-api> │ request_hobbyist_license('YOUR_NAME', 'YOUR_EMAIL') │
  702. 49.00 s gammaloop-nextest-python-api> │ │
  703. 49.00 s gammaloop-nextest-python-api> │ All other users can obtain a free 30-day trial key: │
  704. 49.00 s gammaloop-nextest-python-api> │ │
  705. 49.00 s gammaloop-nextest-python-api> │ from symbolica import * │
  706. 49.00 s gammaloop-nextest-python-api> │ request_trial_license('NAME', 'EMAIL', 'EMPLOYER') │
  707. 49.00 s gammaloop-nextest-python-api> │ │
  708. 49.00 s gammaloop-nextest-python-api> │ See https://symbolica.io/docs/get_started.html#license │
  709. 49.00 s gammaloop-nextest-python-api> └────────────────────────────────────────────────────────┘
  710. 49.00 s gammaloop-nextest-python-api> ┌───────────────────────────────────────────────────────────────────────────────────────────────────────────┐
  711. 49.00 s gammaloop-nextest-python-api> │ Cannot start new unlicensed Symbolica instance since there is already another one running on the machine. │
  712. 49.00 s gammaloop-nextest-python-api> └───────────────────────────────────────────────────────────────────────────────────────────────────────────┘
  713. 49.00 s gammaloop-nextest-python-api>
  714. 49.00 s gammaloop-nextest-python-api> stderr:
  715. 49.00 s gammaloop-nextest-python-api> ┌───────────────────────────────────┐
  716. 49.00 s gammaloop-nextest-python-api> │ The Symbolica license has expired │
  717. 49.00 s gammaloop-nextest-python-api> └───────────────────────────────────┘
  718. 49.00 s gammaloop-nextest-python-api>
  719. 49.00 s gammaloop-nextest-python-api>
  720. 49.00 s gammaloop-nextest-python-api> Location:
  721. 49.00 s gammaloop-nextest-python-api> tests/tests/test_python_api.rs:156:20
  722. 49.00 s gammaloop-nextest-python-api>
  723. 49.00 s gammaloop-nextest-python-api> 3. gammaloop-integration-tests::test_python_api::python_session_getters_return_live_toml_and_command_blocks
  724. 49.00 s gammaloop-nextest-python-api> failure: test failure with exit code 101
  725. 49.00 s gammaloop-nextest-python-api> Error: Python API test subprocess failed.
  726. 49.00 s gammaloop-nextest-python-api> stdout:
  727. 49.00 s gammaloop-nextest-python-api> ┌────────────────────────────────────────────────────────┐
  728. 49.00 s gammaloop-nextest-python-api> │ You are running a restricted Symbolica instance. │
  729. 49.00 s gammaloop-nextest-python-api> │ │
  730. 49.00 s gammaloop-nextest-python-api> │ This mode is only permitted for non-commercial use and │
  731. 49.00 s gammaloop-nextest-python-api> │ is limited to one instance and core per machine. │
  732. 49.00 s gammaloop-nextest-python-api> │ │
  733. 49.00 s gammaloop-nextest-python-api> │ Hobbyists can easily acquire a free license key │
  734. 49.00 s gammaloop-nextest-python-api> │ that unlocks all cores and removes this banner: │
  735. 49.00 s gammaloop-nextest-python-api> │ │
  736. 49.00 s gammaloop-nextest-python-api> │ from symbolica import * │
  737. 49.00 s gammaloop-nextest-python-api> │ request_hobbyist_license('YOUR_NAME', 'YOUR_EMAIL') │
  738. 49.00 s gammaloop-nextest-python-api> │ │
  739. 49.00 s gammaloop-nextest-python-api> │ All other users can obtain a free 30-day trial key: │
  740. 49.00 s gammaloop-nextest-python-api> │ │
  741. 49.00 s gammaloop-nextest-python-api> │ from symbolica import * │
  742. 49.00 s gammaloop-nextest-python-api> │ request_trial_license('NAME', 'EMAIL', 'EMPLOYER') │
  743. 49.00 s gammaloop-nextest-python-api> │ │
  744. 49.00 s gammaloop-nextest-python-api> │ See https://symbolica.io/docs/get_started.html#license │
  745. 49.00 s gammaloop-nextest-python-api> └────────────────────────────────────────────────────────┘
  746. 49.00 s gammaloop-nextest-python-api> ┌───────────────────────────────────────────────────────────────────────────────────────────────────────────┐
  747. 49.00 s gammaloop-nextest-python-api> │ Cannot start new unlicensed Symbolica instance since there is already another one running on the machine. │
  748. 49.00 s gammaloop-nextest-python-api> └───────────────────────────────────────────────────────────────────────────────────────────────────────────┘
  749. 49.00 s gammaloop-nextest-python-api>
  750. 49.00 s gammaloop-nextest-python-api> stderr:
  751. 49.00 s gammaloop-nextest-python-api> ┌───────────────────────────────────┐
  752. 49.00 s gammaloop-nextest-python-api> │ The Symbolica license has expired │
  753. 49.00 s gammaloop-nextest-python-api> └───────────────────────────────────┘
  754. 49.00 s gammaloop-nextest-python-api>
  755. 49.00 s gammaloop-nextest-python-api>
  756. 49.00 s gammaloop-nextest-python-api> Location:
  757. 49.00 s gammaloop-nextest-python-api> tests/tests/test_python_api.rs:156:20
  758. 49.00 s gammaloop-nextest-python-api> system-out
  759. 49.00 s gammaloop-nextest-python-api> running 1 test
  760. 49.00 s gammaloop-nextest-python-api> test python_session_getters_return_live_toml_and_command_blocks ... FAILED
  761. 49.00 s gammaloop-nextest-python-api>
  762. 49.00 s gammaloop-nextest-python-api> failures:
  763. 49.00 s gammaloop-nextest-python-api>
  764. 49.00 s gammaloop-nextest-python-api> failures:
  765. 49.00 s gammaloop-nextest-python-api> python_session_getters_return_live_toml_and_command_blocks
  766. 49.00 s gammaloop-nextest-python-api>
  767. 49.00 s gammaloop-nextest-python-api> test result: FAILED. 0 passed; 1 failed; 0 ignored; 0 measured; 4 filtered out; finished in 0.16s
  768. 49.00 s gammaloop-nextest-python-api> system-err
  769. 49.00 s gammaloop-nextest-python-api> Error: Python API test subprocess failed.
  770. 49.00 s gammaloop-nextest-python-api> stdout:
  771. 49.00 s gammaloop-nextest-python-api> ┌────────────────────────────────────────────────────────┐
  772. 49.00 s gammaloop-nextest-python-api> │ You are running a restricted Symbolica instance. │
  773. 49.00 s gammaloop-nextest-python-api> │ │
  774. 49.00 s gammaloop-nextest-python-api> │ This mode is only permitted for non-commercial use and │
  775. 49.00 s gammaloop-nextest-python-api> │ is limited to one instance and core per machine. │
  776. 49.00 s gammaloop-nextest-python-api> │ │
  777. 49.00 s gammaloop-nextest-python-api> │ Hobbyists can easily acquire a free license key │
  778. 49.00 s gammaloop-nextest-python-api> │ that unlocks all cores and removes this banner: │
  779. 49.00 s gammaloop-nextest-python-api> │ │
  780. 49.00 s gammaloop-nextest-python-api> │ from symbolica import * │
  781. 49.00 s gammaloop-nextest-python-api> │ request_hobbyist_license('YOUR_NAME', 'YOUR_EMAIL') │
  782. 49.00 s gammaloop-nextest-python-api> │ │
  783. 49.00 s gammaloop-nextest-python-api> │ All other users can obtain a free 30-day trial key: │
  784. 49.00 s gammaloop-nextest-python-api> │ │
  785. 49.00 s gammaloop-nextest-python-api> │ from symbolica import * │
  786. 49.00 s gammaloop-nextest-python-api> │ request_trial_license('NAME', 'EMAIL', 'EMPLOYER') │
  787. 49.00 s gammaloop-nextest-python-api> │ │
  788. 49.00 s gammaloop-nextest-python-api> │ See https://symbolica.io/docs/get_started.html#license │
  789. 49.00 s gammaloop-nextest-python-api> └────────────────────────────────────────────────────────┘
  790. 49.00 s gammaloop-nextest-python-api> ┌───────────────────────────────────────────────────────────────────────────────────────────────────────────┐
  791. 49.00 s gammaloop-nextest-python-api> │ Cannot start new unlicensed Symbolica instance since there is already another one running on the machine. │
  792. 49.00 s gammaloop-nextest-python-api> └───────────────────────────────────────────────────────────────────────────────────────────────────────────┘
  793. 49.00 s gammaloop-nextest-python-api>
  794. 49.00 s gammaloop-nextest-python-api> stderr:
  795. 49.00 s gammaloop-nextest-python-api> ┌───────────────────────────────────┐
  796. 49.00 s gammaloop-nextest-python-api> │ The Symbolica license has expired │
  797. 49.00 s gammaloop-nextest-python-api> └───────────────────────────────────┘
  798. 49.00 s gammaloop-nextest-python-api>
  799. 49.00 s gammaloop-nextest-python-api>
  800. 49.00 s gammaloop-nextest-python-api> Location:
  801. 49.00 s gammaloop-nextest-python-api> tests/tests/test_python_api.rs:156:20
  802. 49.00 s gammaloop-nextest-python-api>
  803. 49.00 s gammaloop-nextest-python-api> 4. gammaloop-integration-tests::test_python_api::python_evaluate_samples_batch_and_momentum_space_have_expected_shape
  804. 49.00 s gammaloop-nextest-python-api> failure: test failure with exit code 101
  805. 49.00 s gammaloop-nextest-python-api> Error: Python API test subprocess failed.
  806. 49.00 s gammaloop-nextest-python-api> stdout:
  807. 49.00 s gammaloop-nextest-python-api> ┌────────────────────────────────────────────────────────┐
  808. 49.00 s gammaloop-nextest-python-api> │ You are running a restricted Symbolica instance. │
  809. 49.00 s gammaloop-nextest-python-api> │ │
  810. 49.00 s gammaloop-nextest-python-api> │ This mode is only permitted for non-commercial use and │
  811. 49.00 s gammaloop-nextest-python-api> │ is limited to one instance and core per machine. │
  812. 49.00 s gammaloop-nextest-python-api> │ │
  813. 49.00 s gammaloop-nextest-python-api> │ Hobbyists can easily acquire a free license key │
  814. 49.00 s gammaloop-nextest-python-api> │ that unlocks all cores and removes this banner: │
  815. 49.00 s gammaloop-nextest-python-api> │ │
  816. 49.00 s gammaloop-nextest-python-api> │ from symbolica import * │
  817. 49.00 s gammaloop-nextest-python-api> │ request_hobbyist_license('YOUR_NAME', 'YOUR_EMAIL') │
  818. 49.00 s gammaloop-nextest-python-api> │ │
  819. 49.00 s gammaloop-nextest-python-api> │ All other users can obtain a free 30-day trial key: │
  820. 49.00 s gammaloop-nextest-python-api> │ │
  821. 49.00 s gammaloop-nextest-python-api> │ from symbolica import * │
  822. 49.00 s gammaloop-nextest-python-api> │ request_trial_license('NAME', 'EMAIL', 'EMPLOYER') │
  823. 49.00 s gammaloop-nextest-python-api> │ │
  824. 49.00 s gammaloop-nextest-python-api> │ See https://symbolica.io/docs/get_started.html#license │
  825. 49.00 s gammaloop-nextest-python-api> └────────────────────────────────────────────────────────┘
  826. 49.00 s gammaloop-nextest-python-api> ┌───────────────────────────────────────────────────────────────────────────────────────────────────────────┐
  827. 49.00 s gammaloop-nextest-python-api> │ Cannot start new unlicensed Symbolica instance since there is already another one running on the machine. │
  828. 49.00 s gammaloop-nextest-python-api> └───────────────────────────────────────────────────────────────────────────────────────────────────────────┘
  829. 49.00 s gammaloop-nextest-python-api>
  830. 49.00 s gammaloop-nextest-python-api> stderr:
  831. 49.00 s gammaloop-nextest-python-api> ┌───────────────────────────────────┐
  832. 49.00 s gammaloop-nextest-python-api> │ The Symbolica license has expired │
  833. 49.00 s gammaloop-nextest-python-api> └───────────────────────────────────┘
  834. 49.00 s gammaloop-nextest-python-api> [2026-09-01 16:00:11.325] @gammaloop_api::se... INFO : Running command import model sm-default
  835. 49.00 s gammaloop-nextest-python-api> [2026-09-01 16:00:11.325] @import::model INFO : Loading built-in JSON model sm-default
  836. 49.00 s gammaloop-nextest-python-api> [2026-09-01 16:00:11.373] @gammalooprs::model INFO : The following 11 external parameters were forced to zero by the restriction card:
  837. 49.00 s gammaloop-nextest-python-api> lamWS, AWS, rhoWS, etaWS, ymc, yme, ymm, MC, Me, MM, WTau
  838. 49.00 s gammaloop-nextest-python-api> [2026-09-01 16:00:11.373] @gammalooprs::model INFO : The following 34 vertex rules were removed by the restriction card:
  839. 49.00 s gammaloop-nextest-python-api> V_82 -> (c~, d, G+) | V_83 -> (t~, d, G+) | V_84 -> (c~, s, G+) | V_85 -> (t~, s, G+) | V_86 -> (u~, b, G+) | V_87 -> (c~, b, G+) | V_90 -> (c~, d, W+) | V_91 -> (t~, d, W+) | V_92 -> (u~, s, W+) | V_94 -> (t~, s, W+) | V_95 -> (u~, b, W+) | V_96 -> (c~, b, W+) | V_101 -> (e+, e-, G0) | V_102 -> (mu+, mu-, G0) | V_104 -> (e+, e-, H) | V_105 -> (mu+, mu-, H) | V_110 -> (ve~, e-, G+) | V_111 -> (vm~, mu-, G+) | V_116 -> (b~, u, G-) | V_117 -> (d~, c, G-) | V_118 -> (s~, c, G-) | V_119 -> (b~, c, G-) | V_120 -> (d~, t, G-) | V_121 -> (s~, t, G-) | V_124 -> (s~, u, W-) | V_125 -> (b~, u, W-) | V_126 -> (d~, c, W-) | V_128 -> (b~, c, W-) | V_129 -> (d~, t, W-) | V_130 -> (s~, t, W-) | V_138 -> (c~, c, G0) | V_140 -> (c~, c, H) | V_145 -> (e+, ve, G-) | V_146 -> (mu+, vm, G-)
  840. 49.00 s gammaloop-nextest-python-api> [2026-09-01 16:00:11.373] @gammalooprs::model INFO : The following 36 couplings were removed by the restriction card:
  841. 49.00 s gammaloop-nextest-python-api> GC_13, GC_14, GC_16, GC_17, GC_18, GC_19, GC_20, GC_22, GC_23, GC_24, GC_25, GC_26, GC_28, GC_29, GC_42, GC_43, GC_44, GC_46, GC_47, GC_48, GC_84, GC_85, GC_86, GC_87, GC_88, GC_89, GC_90, GC_91, GC_92, GC_93, GC_101, GC_102, GC_103, GC_105, GC_106, GC_107
  842. 49.00 s gammaloop-nextest-python-api> [2026-09-01 16:00:11.374] @gammaloop_api::se... INFO : Running command set default-runtime kv kinematics.externals='{"type":"constant","data":{"momenta":[[32.0,0.0,0.0,32.0],[32.0,0.0,0.0,-32.0]],"helicities":[1,1]}}'
  843. 49.00 s gammaloop-nextest-python-api> [2026-09-01 16:00:11.375] @gammaloop_api::se... INFO : Running command set default-runtime kv subtraction.disable_threshold_subtraction=true
  844. 49.00 s gammaloop-nextest-python-api> [2026-09-01 16:00:11.376] @gammaloop_api::se... INFO : Running command generate xs e+ e- > d d~ g | e- a d g QED^2==4 [{{2}} QCD=0] --numerator-grouping group_identical_graphs_up_to_sign --clear-existing-processes --only-diagrams
  845. 49.00 s gammaloop-nextest-python-api> [2026-09-01 16:00:11.379] @feyngen::diagram_... INFO : 0s | Δ=0s | Starting Feynman graph generation with Symbolica...
  846. 49.00 s gammaloop-nextest-python-api> [2026-09-01 16:00:11.383] @feyngen::diagram_... INFO : 0s | Δ=0s | Number of graphs resulting from Symbolica generation: 246
  847. 49.00 s gammaloop-nextest-python-api> [2026-09-01 16:00:11.384] @feyngen::diagram_... INFO : 0s | Δ=0s | Number of graphs retained after enforcing supergraph particle content: 8
  848. 49.00 s gammaloop-nextest-python-api> [2026-09-01 16:00:11.384] @feyngen::diagram_... INFO : 0s | Δ=0s | Number of graphs retained after removal of vetoed topologies: 8
  849. 49.00 s gammaloop-nextest-python-api> [2026-09-01 16:00:11.384] @feyngen::diagram_... INFO : 0s | Δ=0s | Number of graphs after vertex info assignment: 8
  850. 49.00 s gammaloop-nextest-python-api> [2026-09-01 16:00:11.384] @feyngen::diagram_... INFO : 0s | Δ=0s | Number of graphs after all complete graphs filters are applied: 8
  851. 49.00 s gammaloop-nextest-python-api>
  852. 49.00 s gammaloop-nextest-python-api>
  853. 49.00 s gammaloop-nextest-python-api> Location:
  854. 49.00 s gammaloop-nextest-python-api> tests/tests/test_python_api.rs:156:20
  855. 49.00 s gammaloop-nextest-python-api> system-out
  856. 49.01 s gammaloop-nextest-python-api> running 1 test
  857. 49.01 s gammaloop-nextest-python-api> test python_evaluate_samples_batch_and_momentum_space_have_expected_shape ... FAILED
  858. 49.01 s gammaloop-nextest-python-api>
  859. 49.01 s gammaloop-nextest-python-api> failures:
  860. 49.01 s gammaloop-nextest-python-api>
  861. 49.01 s gammaloop-nextest-python-api> failures:
  862. 49.01 s gammaloop-nextest-python-api> python_evaluate_samples_batch_and_momentum_space_have_expected_shape
  863. 49.01 s gammaloop-nextest-python-api>
  864. 49.01 s gammaloop-nextest-python-api> test result: FAILED. 0 passed; 1 failed; 0 ignored; 0 measured; 4 filtered out; finished in 0.27s
  865. 49.01 s gammaloop-nextest-python-api> system-err
  866. 49.01 s gammaloop-nextest-python-api> Error: Python API test subprocess failed.
  867. 49.01 s gammaloop-nextest-python-api> stdout:
  868. 49.01 s gammaloop-nextest-python-api> ┌────────────────────────────────────────────────────────┐
  869. 49.01 s gammaloop-nextest-python-api> │ You are running a restricted Symbolica instance. │
  870. 49.01 s gammaloop-nextest-python-api> │ │
  871. 49.01 s gammaloop-nextest-python-api> │ This mode is only permitted for non-commercial use and │
  872. 49.01 s gammaloop-nextest-python-api> │ is limited to one instance and core per machine. │
  873. 49.01 s gammaloop-nextest-python-api> │ │
  874. 49.01 s gammaloop-nextest-python-api> │ Hobbyists can easily acquire a free license key │
  875. 49.01 s gammaloop-nextest-python-api> │ that unlocks all cores and removes this banner: │
  876. 49.01 s gammaloop-nextest-python-api> │ │
  877. 49.01 s gammaloop-nextest-python-api> │ from symbolica import * │
  878. 49.01 s gammaloop-nextest-python-api> │ request_hobbyist_license('YOUR_NAME', 'YOUR_EMAIL') │
  879. 49.01 s gammaloop-nextest-python-api> │ │
  880. 49.01 s gammaloop-nextest-python-api> │ All other users can obtain a free 30-day trial key: │
  881. 49.01 s gammaloop-nextest-python-api> │ │
  882. 49.01 s gammaloop-nextest-python-api> │ from symbolica import * │
  883. 49.01 s gammaloop-nextest-python-api> │ request_trial_license('NAME', 'EMAIL', 'EMPLOYER') │
  884. 49.01 s gammaloop-nextest-python-api> │ │
  885. 49.01 s gammaloop-nextest-python-api> │ See https://symbolica.io/docs/get_started.html#license │
  886. 49.01 s gammaloop-nextest-python-api> └────────────────────────────────────────────────────────┘
  887. 49.01 s gammaloop-nextest-python-api> ┌───────────────────────────────────────────────────────────────────────────────────────────────────────────┐
  888. 49.01 s gammaloop-nextest-python-api> │ Cannot start new unlicensed Symbolica instance since there is already another one running on the machine. │
  889. 49.01 s gammaloop-nextest-python-api> └───────────────────────────────────────────────────────────────────────────────────────────────────────────┘
  890. 49.01 s gammaloop-nextest-python-api>
  891. 49.01 s gammaloop-nextest-python-api> stderr:
  892. 49.01 s gammaloop-nextest-python-api> ┌───────────────────────────────────┐
  893. 49.01 s gammaloop-nextest-python-api> │ The Symbolica license has expired │
  894. 49.01 s gammaloop-nextest-python-api> └───────────────────────────────────┘
  895. 49.01 s gammaloop-nextest-python-api> [2026-09-01 16:00:11.325] @gammaloop_api::se... INFO : Running command import model sm-default
  896. 49.01 s gammaloop-nextest-python-api> [2026-09-01 16:00:11.325] @import::model INFO : Loading built-in JSON model sm-default
  897. 49.01 s gammaloop-nextest-python-api> [2026-09-01 16:00:11.373] @gammalooprs::model INFO : The following 11 external parameters were forced to zero by the restriction card:
  898. 49.01 s gammaloop-nextest-python-api> lamWS, AWS, rhoWS, etaWS, ymc, yme, ymm, MC, Me, MM, WTau
  899. 49.01 s gammaloop-nextest-python-api> [2026-09-01 16:00:11.373] @gammalooprs::model INFO : The following 34 vertex rules were removed by the restriction card:
  900. 49.01 s gammaloop-nextest-python-api> V_82 -> (c~, d, G+) | V_83 -> (t~, d, G+) | V_84 -> (c~, s, G+) | V_85 -> (t~, s, G+) | V_86 -> (u~, b, G+) | V_87 -> (c~, b, G+) | V_90 -> (c~, d, W+) | V_91 -> (t~, d, W+) | V_92 -> (u~, s, W+) | V_94 -> (t~, s, W+) | V_95 -> (u~, b, W+) | V_96 -> (c~, b, W+) | V_101 -> (e+, e-, G0) | V_102 -> (mu+, mu-, G0) | V_104 -> (e+, e-, H) | V_105 -> (mu+, mu-, H) | V_110 -> (ve~, e-, G+) | V_111 -> (vm~, mu-, G+) | V_116 -> (b~, u, G-) | V_117 -> (d~, c, G-) | V_118 -> (s~, c, G-) | V_119 -> (b~, c, G-) | V_120 -> (d~, t, G-) | V_121 -> (s~, t, G-) | V_124 -> (s~, u, W-) | V_125 -> (b~, u, W-) | V_126 -> (d~, c, W-) | V_128 -> (b~, c, W-) | V_129 -> (d~, t, W-) | V_130 -> (s~, t, W-) | V_138 -> (c~, c, G0) | V_140 -> (c~, c, H) | V_145 -> (e+, ve, G-) | V_146 -> (mu+, vm, G-)
  901. 49.01 s gammaloop-nextest-python-api> [2026-09-01 16:00:11.373] @gammalooprs::model INFO : The following 36 couplings were removed by the restriction card:
  902. 49.01 s gammaloop-nextest-python-api> GC_13, GC_14, GC_16, GC_17, GC_18, GC_19, GC_20, GC_22, GC_23, GC_24, GC_25, GC_26, GC_28, GC_29, GC_42, GC_43, GC_44, GC_46, GC_47, GC_48, GC_84, GC_85, GC_86, GC_87, GC_88, GC_89, GC_90, GC_91, GC_92, GC_93, GC_101, GC_102, GC_103, GC_105, GC_106, GC_107
  903. 49.01 s gammaloop-nextest-python-api> [2026-09-01 16:00:11.374] @gammaloop_api::se... INFO : Running command set default-runtime kv kinematics.externals='{"type":"constant","data":{"momenta":[[32.0,0.0,0.0,32.0],[32.0,0.0,0.0,-32.0]],"helicities":[1,1]}}'
  904. 49.01 s gammaloop-nextest-python-api> [2026-09-01 16:00:11.375] @gammaloop_api::se... INFO : Running command set default-runtime kv subtraction.disable_threshold_subtraction=true
  905. 49.01 s gammaloop-nextest-python-api> [2026-09-01 16:00:11.376] @gammaloop_api::se... INFO : Running command generate xs e+ e- > d d~ g | e- a d g QED^2==4 [{{2}} QCD=0] --numerator-grouping group_identical_graphs_up_to_sign --clear-existing-processes --only-diagrams
  906. 49.01 s gammaloop-nextest-python-api> [2026-09-01 16:00:11.379] @feyngen::diagram_... INFO : 0s | Δ=0s | Starting Feynman graph generation with Symbolica...
  907. 49.01 s gammaloop-nextest-python-api> [2026-09-01 16:00:11.383] @feyngen::diagram_... INFO : 0s | Δ=0s | Number of graphs resulting from Symbolica generation: 246
  908. 49.01 s gammaloop-nextest-python-api> [2026-09-01 16:00:11.384] @feyngen::diagram_... INFO : 0s | Δ=0s | Number of graphs retained after enforcing supergraph particle content: 8
  909. 49.01 s gammaloop-nextest-python-api> [2026-09-01 16:00:11.384] @feyngen::diagram_... INFO : 0s | Δ=0s | Number of graphs retained after removal of vetoed topologies: 8
  910. 49.01 s gammaloop-nextest-python-api> [2026-09-01 16:00:11.384] @feyngen::diagram_... INFO : 0s | Δ=0s | Number of graphs after vertex info assignment: 8
  911. 49.01 s gammaloop-nextest-python-api> [2026-09-01 16:00:11.384] @feyngen::diagram_... INFO : 0s | Δ=0s | Number of graphs after all complete graphs filters are applied: 8
  912. 49.01 s gammaloop-nextest-python-api>
  913. 49.01 s gammaloop-nextest-python-api>
  914. 49.01 s gammaloop-nextest-python-api> Location:
  915. 49.01 s gammaloop-nextest-python-api> tests/tests/test_python_api.rs:156:20
  916. 49.01 s gammaloop-nextest-python-api>
  917. 49.01 s gammaloop-nextest-python-api> 5. gammaloop-integration-tests::test_python_api::python_settings_wrappers_expose_nested_runtime_and_global_settings
  918. 49.01 s gammaloop-nextest-python-api> failure: test failure with exit code 101
  919. 49.01 s gammaloop-nextest-python-api> Error: Python API test subprocess failed.
  920. 49.01 s gammaloop-nextest-python-api> stdout:
  921. 49.01 s gammaloop-nextest-python-api> ┌────────────────────────────────────────────────────────┐
  922. 49.01 s gammaloop-nextest-python-api> │ You are running a restricted Symbolica instance. │
  923. 49.01 s gammaloop-nextest-python-api> │ │
  924. 49.01 s gammaloop-nextest-python-api> │ This mode is only permitted for non-commercial use and │
  925. 49.01 s gammaloop-nextest-python-api> │ is limited to one instance and core per machine. │
  926. 49.01 s gammaloop-nextest-python-api> │ │
  927. 49.01 s gammaloop-nextest-python-api> │ Hobbyists can easily acquire a free license key │
  928. 49.01 s gammaloop-nextest-python-api> │ that unlocks all cores and removes this banner: │
  929. 49.01 s gammaloop-nextest-python-api> │ │
  930. 49.01 s gammaloop-nextest-python-api> │ from symbolica import * │
  931. 49.01 s gammaloop-nextest-python-api> │ request_hobbyist_license('YOUR_NAME', 'YOUR_EMAIL') │
  932. 49.01 s gammaloop-nextest-python-api> │ │
  933. 49.01 s gammaloop-nextest-python-api> │ All other users can obtain a free 30-day trial key: │
  934. 49.01 s gammaloop-nextest-python-api> │ │
  935. 49.01 s gammaloop-nextest-python-api> │ from symbolica import * │
  936. 49.01 s gammaloop-nextest-python-api> │ request_trial_license('NAME', 'EMAIL', 'EMPLOYER') │
  937. 49.01 s gammaloop-nextest-python-api> │ │
  938. 49.01 s gammaloop-nextest-python-api> │ See https://symbolica.io/docs/get_started.html#license │
  939. 49.01 s gammaloop-nextest-python-api> └────────────────────────────────────────────────────────┘
  940. 49.01 s gammaloop-nextest-python-api> ┌───────────────────────────────────────────────────────────────────────────────────────────────────────────┐
  941. 49.01 s gammaloop-nextest-python-api> │ Cannot start new unlicensed Symbolica instance since there is already another one running on the machine. │
  942. 49.01 s gammaloop-nextest-python-api> └───────────────────────────────────────────────────────────────────────────────────────────────────────────┘
  943. 49.01 s gammaloop-nextest-python-api>
  944. 49.01 s gammaloop-nextest-python-api> stderr:
  945. 49.01 s gammaloop-nextest-python-api> ┌───────────────────────────────────┐
  946. 49.01 s gammaloop-nextest-python-api> │ The Symbolica license has expired │
  947. 49.01 s gammaloop-nextest-python-api> └───────────────────────────────────┘
  948. 49.01 s gammaloop-nextest-python-api>
  949. 49.01 s gammaloop-nextest-python-api>
  950. 49.01 s gammaloop-nextest-python-api> Location:
  951. 49.01 s gammaloop-nextest-python-api> tests/tests/test_python_api.rs:156:20
  952. 49.01 s gammaloop-nextest-python-api> system-out
  953. 49.01 s gammaloop-nextest-python-api> running 1 test
  954. 49.01 s gammaloop-nextest-python-api> test python_settings_wrappers_expose_nested_runtime_and_global_settings ... FAILED
  955. 49.01 s gammaloop-nextest-python-api>
  956. 49.01 s gammaloop-nextest-python-api> failures:
  957. 49.01 s gammaloop-nextest-python-api>
  958. 49.01 s gammaloop-nextest-python-api> failures:
  959. 49.01 s gammaloop-nextest-python-api> python_settings_wrappers_expose_nested_runtime_and_global_settings
  960. 49.01 s gammaloop-nextest-python-api>
  961. 49.01 s gammaloop-nextest-python-api> test result: FAILED. 0 passed; 1 failed; 0 ignored; 0 measured; 4 filtered out; finished in 0.30s
  962. 49.01 s gammaloop-nextest-python-api> system-err
  963. 49.01 s gammaloop-nextest-python-api> Error: Python API test subprocess failed.
  964. 49.01 s gammaloop-nextest-python-api> stdout:
  965. 49.01 s gammaloop-nextest-python-api> ┌────────────────────────────────────────────────────────┐
  966. 49.01 s gammaloop-nextest-python-api> │ You are running a restricted Symbolica instance. │
  967. 49.01 s gammaloop-nextest-python-api> │ │
  968. 49.01 s gammaloop-nextest-python-api> │ This mode is only permitted for non-commercial use and │
  969. 49.01 s gammaloop-nextest-python-api> │ is limited to one instance and core per machine. │
  970. 49.01 s gammaloop-nextest-python-api> │ │
  971. 49.01 s gammaloop-nextest-python-api> │ Hobbyists can easily acquire a free license key │
  972. 49.01 s gammaloop-nextest-python-api> │ that unlocks all cores and removes this banner: │
  973. 49.01 s gammaloop-nextest-python-api> │ │
  974. 49.01 s gammaloop-nextest-python-api> │ from symbolica import * │
  975. 49.01 s gammaloop-nextest-python-api> │ request_hobbyist_license('YOUR_NAME', 'YOUR_EMAIL') │
  976. 49.01 s gammaloop-nextest-python-api> │ │
  977. 49.01 s gammaloop-nextest-python-api> │ All other users can obtain a free 30-day trial key: │
  978. 49.01 s gammaloop-nextest-python-api> │ │
  979. 49.01 s gammaloop-nextest-python-api> │ from symbolica import * │
  980. 49.01 s gammaloop-nextest-python-api> │ request_trial_license('NAME', 'EMAIL', 'EMPLOYER') │
  981. 49.01 s gammaloop-nextest-python-api> │ │
  982. 49.01 s gammaloop-nextest-python-api> │ See https://symbolica.io/docs/get_started.html#license │
  983. 49.01 s gammaloop-nextest-python-api> └────────────────────────────────────────────────────────┘
  984. 49.01 s gammaloop-nextest-python-api> ┌───────────────────────────────────────────────────────────────────────────────────────────────────────────┐
  985. 49.01 s gammaloop-nextest-python-api> │ Cannot start new unlicensed Symbolica instance since there is already another one running on the machine. │
  986. 49.01 s gammaloop-nextest-python-api> └───────────────────────────────────────────────────────────────────────────────────────────────────────────┘
  987. 49.01 s gammaloop-nextest-python-api>
  988. 49.01 s gammaloop-nextest-python-api> stderr:
  989. 49.01 s gammaloop-nextest-python-api> ┌───────────────────────────────────┐
  990. 49.01 s gammaloop-nextest-python-api> │ The Symbolica license has expired │
  991. 49.01 s gammaloop-nextest-python-api> └───────────────────────────────────┘
  992. 49.01 s gammaloop-nextest-python-api>
  993. 49.01 s gammaloop-nextest-python-api>
  994. 49.01 s gammaloop-nextest-python-api> Location:
  995. 49.01 s gammaloop-nextest-python-api> tests/tests/test_python_api.rs:156:20
  996. 49.01 s gammaloop-nextest-python-api> =========================================
  997. 49.07 s [1 built (1 failed), 8 cerror: Cannot build '/nix/store/bsvj9vr3w2p8wi7qh7xmxqps4i34mbmv-gammaloop-nextest-python-api.drv'.
  998. 49.07 s Reason: builder failed with exit code 100.
  999. 49.07 s Output paths:
  1000. 49.07 s /nix/store/q4wjk6rqx4jm4x90px3akqlw3vc5kv10-gammaloop-nextest-python-api
  1001. 49.07 s Last 961 log lines:
  1002. 49.07 s > Extracting 1 binary, 1 build script output directory, and 3 linked paths to /build/nextest-archive-pMC1di
  1003. 49.07 s > Extracted 18 files to /build/nextest-archive-pMC1di in 0.11s
  1004. 49.07 s > ------------
  1005. 49.07 s > Nextest run ID d9f04182-e980-4b06-a6d3-ce42376ee411 with nextest profile: ci_gammaloop
  1006. 49.07 s > Starting 5 tests across 1 binary
  1007. 49.07 s > FAIL [ 0.157s] (1/5) gammaloop-integration-tests::test_python_api python_evaluate_sample_preserves_graph_grouping_and_incoming_pdgs
  1008. 49.07 s > stdout ---
  1009. 49.07 s >
  1010. 49.07 s > running 1 test
  1011. 49.07 s > test python_evaluate_sample_preserves_graph_grouping_and_incoming_pdgs ... FAILED
  1012. 49.07 s >
  1013. 49.07 s > failures:
  1014. 49.07 s >
  1015. 49.07 s > failures:
  1016. 49.07 s > python_evaluate_sample_preserves_graph_grouping_and_incoming_pdgs
  1017. 49.07 s >
  1018. 49.07 s > test result: FAILED. 0 passed; 1 failed; 0 ignored; 0 measured; 4 filtered out; finished in 0.15s
  1019. 49.07 s >
  1020. 49.07 s > stderr ---
  1021. 49.07 s > Error: Python API test subprocess failed.
  1022. 49.07 s > stdout:
  1023. 49.07 s > ┌────────────────────────────────────────────────────────┐
  1024. 49.07 s > │ You are running a restricted Symbolica instance. │
  1025. 49.07 s > │ │
  1026. 49.07 s > │ This mode is only permitted for non-commercial use and │
  1027. 49.07 s > │ is limited to one instance and core per machine. │
  1028. 49.07 s > │ │
  1029. 49.07 s > │ Hobbyists can easily acquire a free license key │
  1030. 49.07 s > │ that unlocks all cores and removes this banner: │
  1031. 49.07 s > │ │
  1032. 49.07 s > │ from symbolica import * │
  1033. 49.07 s > │ request_hobbyist_license('YOUR_NAME', 'YOUR_EMAIL') │
  1034. 49.07 s > │ │
  1035. 49.07 s > │ All other users can obtain a free 30-day trial key: │
  1036. 49.07 s > │ │
  1037. 49.07 s > │ from symbolica import * │
  1038. 49.07 s > │ request_trial_license('NAME', 'EMAIL', 'EMPLOYER') │
  1039. 49.07 s > │ │
  1040. 49.07 s > │ See https://symbolica.io/docs/get_started.html#license │
  1041. 49.07 s > └────────────────────────────────────────────────────────┘
  1042. 49.07 s > ┌───────────────────────────────────────────────────────────────────────────────────────────────────────────┐
  1043. 49.07 s > │ Cannot start new unlicensed Symbolica instance since there is already another one running on the machine. │
  1044. 49.07 s > └───────────────────────────────────────────────────────────────────────────────────────────────────────────┘
  1045. 49.07 s >
  1046. 49.07 s > stderr:
  1047. 49.07 s > ┌───────────────────────────────────┐
  1048. 49.07 s > │ The Symbolica license has expired │
  1049. 49.07 s > └───────────────────────────────────┘
  1050. 49.07 s >
  1051. 49.07 s >
  1052. 49.07 s > Location:
  1053. 49.07 s > tests/tests/test_python_api.rs:156:20
  1054. 49.07 s >
  1055. 49.07 s > FAIL [ 0.170s] (2/5) gammaloop-integration-tests::test_python_api python_evaluate_sample_honors_generate_events_and_observable_snapshots
  1056. 49.07 s > stdout ---
  1057. 49.07 s >
  1058. 49.07 s > running 1 test
  1059. 49.07 s > test python_evaluate_sample_honors_generate_events_and_observable_snapshots ... FAILED
  1060. 49.07 s >
  1061. 49.07 s > failures:
  1062. 49.07 s >
  1063. 49.07 s > failures:
  1064. 49.07 s > python_evaluate_sample_honors_generate_events_and_observable_snapshots
  1065. 49.07 s >
  1066. 49.07 s > test result: FAILED. 0 passed; 1 failed; 0 ignored; 0 measured; 4 filtered out; finished in 0.16s
  1067. 49.07 s >
  1068. 49.07 s > stderr ---
  1069. 49.07 s > Error: Python API test subprocess failed.
  1070. 49.07 s > stdout:
  1071. 49.07 s > ┌────────────────────────────────────────────────────────┐
  1072. 49.07 s > │ You are running a restricted Symbolica instance. │
  1073. 49.07 s > │ │
  1074. 49.07 s > │ This mode is only permitted for non-commercial use and │
  1075. 49.07 s > │ is limited to one instance and core per machine. │
  1076. 49.07 s > │ │
  1077. 49.07 s > │ Hobbyists can easily acquire a free license key │
  1078. 49.07 s > │ that unlocks all cores and removes this banner: │
  1079. 49.07 s > │ │
  1080. 49.07 s > │ from symbolica import * │
  1081. 49.07 s > │ request_hobbyist_license('YOUR_NAME', 'YOUR_EMAIL') │
  1082. 49.07 s > │ │
  1083. 49.07 s > │ All other users can obtain a free 30-day trial key: │
  1084. 49.07 s > │ │
  1085. 49.07 s > │ from symbolica import * │
  1086. 49.07 s > │ request_trial_license('NAME', 'EMAIL', 'EMPLOYER') │
  1087. 49.07 s > │ │
  1088. 49.07 s > │ See https://symbolica.io/docs/get_started.html#license │
  1089. 49.07 s > └────────────────────────────────────────────────────────┘
  1090. 49.07 s > ┌───────────────────────────────────────────────────────────────────────────────────────────────────────────┐
  1091. 49.07 s > │ Cannot start new unlicensed Symbolica instance since there is already another one running on the machine. │
  1092. 49.07 s > └───────────────────────────────────────────────────────────────────────────────────────────────────────────┘
  1093. 49.07 s >
  1094. 49.07 s > stderr:
  1095. 49.07 s > ┌───────────────────────────────────┐
  1096. 49.07 s > │ The Symbolica license has expired │
  1097. 49.07 s > └───────────────────────────────────┘
  1098. 49.07 s >
  1099. 49.07 s >
  1100. 49.07 s > Location:
  1101. 49.07 s > tests/tests/test_python_api.rs:156:20
  1102. 49.07 s >
  1103. 49.07 s > FAIL [ 0.171s] (3/5) gammaloop-integration-tests::test_python_api python_session_getters_return_live_toml_and_command_blocks
  1104. 49.07 s > stdout ---
  1105. 49.07 s >
  1106. 49.07 s > running 1 test
  1107. 49.07 s > test python_session_getters_return_live_toml_and_command_blocks ... FAILED
  1108. 49.07 s >
  1109. 49.07 s > failures:
  1110. 49.07 s >
  1111. 49.07 s > failures:
  1112. 49.07 s > python_session_getters_return_live_toml_and_command_blocks
  1113. 49.07 s >
  1114. 49.07 s > test result: FAILED. 0 passed; 1 failed; 0 ignored; 0 measured; 4 filtered out; finished in 0.16s
  1115. 49.07 s >
  1116. 49.07 s > stderr ---
  1117. 49.07 s > Error: Python API test subprocess failed.
  1118. 49.07 s > stdout:
  1119. 49.07 s > ┌────────────────────────────────────────────────────────┐
  1120. 49.07 s > │ You are running a restricted Symbolica instance. │
  1121. 49.07 s > │ │
  1122. 49.07 s > │ This mode is only permitted for non-commercial use and │
  1123. 49.07 s > │ is limited to one instance and core per machine. │
  1124. 49.07 s > │ │
  1125. 49.07 s > │ Hobbyists can easily acquire a free license key │
  1126. 49.07 s > │ that unlocks all cores and removes this banner: │
  1127. 49.07 s > │ │
  1128. 49.07 s > │ from symbolica import * │
  1129. 49.07 s > │ request_hobbyist_license('YOUR_NAME', 'YOUR_EMAIL') │
  1130. 49.07 s > │ │
  1131. 49.07 s > │ All other users can obtain a free 30-day trial key: │
  1132. 49.07 s > │ │
  1133. 49.07 s > │ from symbolica import * │
  1134. 49.07 s > │ request_trial_license('NAME', 'EMAIL', 'EMPLOYER') │
  1135. 49.07 s > │ │
  1136. 49.07 s > │ See https://symbolica.io/docs/get_started.html#license │
  1137. 49.07 s > └────────────────────────────────────────────────────────┘
  1138. 49.07 s > ┌───────────────────────────────────────────────────────────────────────────────────────────────────────────┐
  1139. 49.07 s > │ Cannot start new unlicensed Symbolica instance since there is already another one running on the machine. │
  1140. 49.07 s > └───────────────────────────────────────────────────────────────────────────────────────────────────────────┘
  1141. 49.07 s >
  1142. 49.07 s > stderr:
  1143. 49.07 s > ┌───────────────────────────────────┐
  1144. 49.07 s > │ The Symbolica license has expired │
  1145. 49.07 s > └───────────────────────────────────┘
  1146. 49.07 s >
  1147. 49.07 s >
  1148. 49.07 s > Location:
  1149. 49.07 s > tests/tests/test_python_api.rs:156:20
  1150. 49.07 s >
  1151. 49.07 s > FAIL [ 0.281s] (4/5) gammaloop-integration-tests::test_python_api python_evaluate_samples_batch_and_momentum_space_have_expected_shape
  1152. 49.07 s > stdout ---
  1153. 49.07 s >
  1154. 49.07 s > running 1 test
  1155. 49.07 s > test python_evaluate_samples_batch_and_momentum_space_have_expected_shape ... FAILED
  1156. 49.07 s >
  1157. 49.07 s > failures:
  1158. 49.07 s >
  1159. 49.07 s > failures:
  1160. 49.07 s > python_evaluate_samples_batch_and_momentum_space_have_expected_shape
  1161. 49.07 s >
  1162. 49.07 s > test result: FAILED. 0 passed; 1 failed; 0 ignored; 0 measured; 4 filtered out; finished in 0.27s
  1163. 49.07 s >
  1164. 49.07 s > stderr ---
  1165. 49.07 s > Error: Python API test subprocess failed.
  1166. 49.07 s > stdout:
  1167. 49.07 s > ┌────────────────────────────────────────────────────────┐
  1168. 49.07 s > │ You are running a restricted Symbolica instance. │
  1169. 49.07 s > │ │
  1170. 49.07 s > │ This mode is only permitted for non-commercial use and │
  1171. 49.07 s > │ is limited to one instance and core per machine. │
  1172. 49.07 s > │ │
  1173. 49.07 s > │ Hobbyists can easily acquire a free license key │
  1174. 49.07 s > │ that unlocks all cores and removes this banner: │
  1175. 49.07 s > │ │
  1176. 49.07 s > │ from symbolica import * │
  1177. 49.07 s > │ request_hobbyist_license('YOUR_NAME', 'YOUR_EMAIL') │
  1178. 49.07 s > │ │
  1179. 49.07 s > │ All other users can obtain a free 30-day trial key: │
  1180. 49.07 s > │ │
  1181. 49.07 s > │ from symbolica import * │
  1182. 49.07 s > │ request_trial_license('NAME', 'EMAIL', 'EMPLOYER') │
  1183. 49.07 s > │ │
  1184. 49.07 s > │ See https://symbolica.io/docs/get_started.html#license │
  1185. 49.07 s > └────────────────────────────────────────────────────────┘
  1186. 49.07 s > ┌───────────────────────────────────────────────────────────────────────────────────────────────────────────┐
  1187. 49.07 s > │ Cannot start new unlicensed Symbolica instance since there is already another one running on the machine. │
  1188. 49.07 s > └───────────────────────────────────────────────────────────────────────────────────────────────────────────┘
  1189. 49.07 s >
  1190. 49.07 s > stderr:
  1191. 49.07 s > ┌───────────────────────────────────┐
  1192. 49.07 s > │ The Symbolica license has expired │
  1193. 49.07 s > └───────────────────────────────────┘
  1194. 49.07 s > [2026-09-01 16:00:11.325] @gammaloop_api::se... INFO : Running command import model sm-default
  1195. 49.07 s > [2026-09-01 16:00:11.325] @import::model INFO : Loading built-in JSON model sm-default
  1196. 49.07 s > [2026-09-01 16:00:11.373] @gammalooprs::model INFO : The following 11 external parameters were forced to zero by the restriction card:
  1197. 49.07 s > lamWS, AWS, rhoWS, etaWS, ymc, yme, ymm, MC, Me, MM, WTau
  1198. 49.07 s > [2026-09-01 16:00:11.373] @gammalooprs::model INFO : The following 34 vertex rules were removed by the restriction card:
  1199. 49.07 s > V_82 -> (c~, d, G+) | V_83 -> (t~, d, G+) | V_84 -> (c~, s, G+) | V_85 -> (t~, s, G+) | V_86 -> (u~, b, G+) | V_87 -> (c~, b, G+) | V_90 -> (c~, d, W+) | V_91 -> (t~, d, W+) | V_92 -> (u~, s, W+) | V_94 -> (t~, s, W+) | V_95 -> (u~, b, W+) | V_96 -> (c~, b, W+) | V_101 -> (e+, e-, G0) | V_102 -> (mu+, mu-, G0) | V_104 -> (e+, e-, H) | V_105 -> (mu+, mu-, H) | V_110 -> (ve~, e-, G+) | V_111 -> (vm~, mu-, G+) | V_116 -> (b~, u, G-) | V_117 -> (d~, c, G-) | V_118 -> (s~, c, G-) | V_119 -> (b~, c, G-) | V_120 -> (d~, t, G-) | V_121 -> (s~, t, G-) | V_124 -> (s~, u, W-) | V_125 -> (b~, u, W-) | V_126 -> (d~, c, W-) | V_128 -> (b~, c, W-) | V_129 -> (d~, t, W-) | V_130 -> (s~, t, W-) | V_138 -> (c~, c, G0) | V_140 -> (c~, c, H) | V_145 -> (e+, ve, G-) | V_146 -> (mu+, vm, G-)
  1200. 49.07 s > [2026-09-01 16:00:11.373] @gammalooprs::model INFO : The following 36 couplings were removed by the restriction card:
  1201. 49.07 s > GC_13, GC_14, GC_16, GC_17, GC_18, GC_19, GC_20, GC_22, GC_23, GC_24, GC_25, GC_26, GC_28, GC_29, GC_42, GC_43, GC_44, GC_46, GC_47, GC_48, GC_84, GC_85, GC_86, GC_87, GC_88, GC_89, GC_90, GC_91, GC_92, GC_93, GC_101, GC_102, GC_103, GC_105, GC_106, GC_107
  1202. 49.07 s > [2026-09-01 16:00:11.374] @gammaloop_api::se... INFO : Running command set default-runtime kv kinematics.externals='{"type":"constant","data":{"momenta":[[32.0,0.0,0.0,32.0],[32.0,0.0,0.0,-32.0]],"helicities":[1,1]}}'
  1203. 49.07 s > [2026-09-01 16:00:11.375] @gammaloop_api::se... INFO : Running command set default-runtime kv subtraction.disable_threshold_subtraction=true
  1204. 49.07 s > [2026-09-01 16:00:11.376] @gammaloop_api::se... INFO : Running command generate xs e+ e- > d d~ g | e- a d g QED^2==4 [{{2}} QCD=0] --numerator-grouping group_identical_graphs_up_to_sign --clear-existing-processes --only-diagrams
  1205. 49.07 s > [2026-09-01 16:00:11.379] @feyngen::diagram_... INFO : 0s | Δ=0s | Starting Feynman graph generation with Symbolica...
  1206. 49.07 s > [2026-09-01 16:00:11.383] @feyngen::diagram_... INFO : 0s | Δ=0s | Number of graphs resulting from Symbolica generation: 246
  1207. 49.07 s > [2026-09-01 16:00:11.384] @feyngen::diagram_... INFO : 0s | Δ=0s | Number of graphs retained after enforcing supergraph particle content: 8
  1208. 49.07 s > [2026-09-01 16:00:11.384] @feyngen::diagram_... INFO : 0s | Δ=0s | Number of graphs retained after removal of vetoed topologies: 8
  1209. 49.07 s > [2026-09-01 16:00:11.384] @feyngen::diagram_... INFO : 0s | Δ=0s | Number of graphs after vertex info assignment: 8
  1210. 49.07 s > [2026-09-01 16:00:11.384] @feyngen::diagram_... INFO : 0s | Δ=0s | Number of graphs after all complete graphs filters are applied: 8
  1211. 49.07 s >
  1212. 49.07 s >
  1213. 49.07 s > Location:
  1214. 49.07 s > tests/tests/test_python_api.rs:156:20
  1215. 49.07 s >
  1216. 49.07 s > FAIL [ 0.305s] (5/5) gammaloop-integration-tests::test_python_api python_settings_wrappers_expose_nested_runtime_and_global_settings
  1217. 49.07 s > stdout ---
  1218. 49.07 s >
  1219. 49.07 s > running 1 test
  1220. 49.07 s > test python_settings_wrappers_expose_nested_runtime_and_global_settings ... FAILED
  1221. 49.07 s >
  1222. 49.07 s > failures:
  1223. 49.07 s >
  1224. 49.07 s > failures:
  1225. 49.07 s > python_settings_wrappers_expose_nested_runtime_and_global_settings
  1226. 49.07 s >
  1227. 49.07 s > test result: FAILED. 0 passed; 1 failed; 0 ignored; 0 measured; 4 filtered out; finished in 0.30s
  1228. 49.07 s >
  1229. 49.07 s > stderr ---
  1230. 49.07 s > Error: Python API test subprocess failed.
  1231. 49.07 s > stdout:
  1232. 49.07 s > ┌────────────────────────────────────────────────────────┐
  1233. 49.07 s > │ You are running a restricted Symbolica instance. │
  1234. 49.07 s > │ │
  1235. 49.07 s > │ This mode is only permitted for non-commercial use and │
  1236. 49.07 s > │ is limited to one instance and core per machine. │
  1237. 49.07 s > │ │
  1238. 49.07 s > │ Hobbyists can easily acquire a free license key │
  1239. 49.07 s > │ that unlocks all cores and removes this banner: │
  1240. 49.07 s > │ │
  1241. 49.07 s > │ from symbolica import * │
  1242. 49.07 s > │ request_hobbyist_license('YOUR_NAME', 'YOUR_EMAIL') │
  1243. 49.07 s > │ │
  1244. 49.07 s > │ All other users can obtain a free 30-day trial key: │
  1245. 49.07 s > │ │
  1246. 49.07 s > │ from symbolica import * │
  1247. 49.07 s > │ request_trial_license('NAME', 'EMAIL', 'EMPLOYER') │
  1248. 49.07 s > │ │
  1249. 49.07 s > │ See https://symbolica.io/docs/get_started.html#license │
  1250. 49.07 s > └────────────────────────────────────────────────────────┘
  1251. 49.07 s > ┌───────────────────────────────────────────────────────────────────────────────────────────────────────────┐
  1252. 49.07 s > │ Cannot start new unlicensed Symbolica instance since there is already another one running on the machine. │
  1253. 49.07 s > └───────────────────────────────────────────────────────────────────────────────────────────────────────────┘
  1254. 49.07 s >
  1255. 49.07 s > stderr:
  1256. 49.07 s > ┌───────────────────────────────────┐
  1257. 49.07 s > │ The Symbolica license has expired │
  1258. 49.07 s > └───────────────────────────────────┘
  1259. 49.07 s >
  1260. 49.07 s >
  1261. 49.07 s > Location:
  1262. 49.07 s > tests/tests/test_python_api.rs:156:20
  1263. 49.07 s >
  1264. 49.07 s > ------------
  1265. 49.07 s > Summary [ 0.306s] 5 tests run: 0 passed, 5 failed, 0 skipped
  1266. 49.07 s > FAIL [ 0.157s] (1/5) gammaloop-integration-tests::test_python_api python_evaluate_sample_preserves_graph_grouping_and_incoming_pdgs
  1267. 49.07 s > stdout ---
  1268. 49.07 s >
  1269. 49.07 s > running 1 test
  1270. 49.07 s > test python_evaluate_sample_preserves_graph_grouping_and_incoming_pdgs ... FAILED
  1271. 49.07 s >
  1272. 49.07 s > failures:
  1273. 49.07 s >
  1274. 49.07 s > failures:
  1275. 49.07 s > python_evaluate_sample_preserves_graph_grouping_and_incoming_pdgs
  1276. 49.07 s >
  1277. 49.07 s > test result: FAILED. 0 passed; 1 failed; 0 ignored; 0 measured; 4 filtered out; finished in 0.15s
  1278. 49.07 s >
  1279. 49.07 s > stderr ---
  1280. 49.07 s > Error: Python API test subprocess failed.
  1281. 49.07 s > stdout:
  1282. 49.07 s > ┌────────────────────────────────────────────────────────┐
  1283. 49.07 s > │ You are running a restricted Symbolica instance. │
  1284. 49.07 s > │ │
  1285. 49.07 s > │ This mode is only permitted for non-commercial use and │
  1286. 49.07 s > │ is limited to one instance and core per machine. │
  1287. 49.07 s > │ │
  1288. 49.07 s > │ Hobbyists can easily acquire a free license key │
  1289. 49.07 s > │ that unlocks all cores and removes this banner: │
  1290. 49.07 s > │ │
  1291. 49.07 s > │ from symbolica import * │
  1292. 49.07 s > │ request_hobbyist_license('YOUR_NAME', 'YOUR_EMAIL') │
  1293. 49.07 s > │ │
  1294. 49.07 s > │ All other users can obtain a free 30-day trial key: │
  1295. 49.07 s > │ │
  1296. 49.07 s > │ from symbolica import * │
  1297. 49.07 s > │ request_trial_license('NAME', 'EMAIL', 'EMPLOYER') │
  1298. 49.07 s > │ │
  1299. 49.07 s > │ See https://symbolica.io/docs/get_started.html#license │
  1300. 49.07 s > └────────────────────────────────────────────────────────┘
  1301. 49.07 s > ┌───────────────────────────────────────────────────────────────────────────────────────────────────────────┐
  1302. 49.07 s > │ Cannot start new unlicensed Symbolica instance since there is already another one running on the machine. │
  1303. 49.07 s > └───────────────────────────────────────────────────────────────────────────────────────────────────────────┘
  1304. 49.07 s >
  1305. 49.07 s > stderr:
  1306. 49.07 s > ┌───────────────────────────────────┐
  1307. 49.07 s > │ The Symbolica license has expired │
  1308. 49.07 s > └───────────────────────────────────┘
  1309. 49.07 s >
  1310. 49.07 s >
  1311. 49.07 s > Location:
  1312. 49.07 s > tests/tests/test_python_api.rs:156:20
  1313. 49.07 s >
  1314. 49.07 s > FAIL [ 0.170s] (2/5) gammaloop-integration-tests::test_python_api python_evaluate_sample_honors_generate_events_and_observable_snapshots
  1315. 49.07 s > stdout ---
  1316. 49.07 s >
  1317. 49.07 s > running 1 test
  1318. 49.07 s > test python_evaluate_sample_honors_generate_events_and_observable_snapshots ... FAILED
  1319. 49.07 s >
  1320. 49.07 s > failures:
  1321. 49.07 s >
  1322. 49.07 s > failures:
  1323. 49.07 s > python_evaluate_sample_honors_generate_events_and_observable_snapshots
  1324. 49.07 s >
  1325. 49.07 s > test result: FAILED. 0 passed; 1 failed; 0 ignored; 0 measured; 4 filtered out; finished in 0.16s
  1326. 49.07 s >
  1327. 49.07 s > stderr ---
  1328. 49.07 s > Error: Python API test subprocess failed.
  1329. 49.07 s > stdout:
  1330. 49.07 s > ┌────────────────────────────────────────────────────────┐
  1331. 49.07 s > │ You are running a restricted Symbolica instance. │
  1332. 49.07 s > │ │
  1333. 49.07 s > │ This mode is only permitted for non-commercial use and │
  1334. 49.07 s > │ is limited to one instance and core per machine. │
  1335. 49.07 s > │ │
  1336. 49.07 s > │ Hobbyists can easily acquire a free license key │
  1337. 49.07 s > │ that unlocks all cores and removes this banner: │
  1338. 49.07 s > │ │
  1339. 49.07 s > │ from symbolica import * │
  1340. 49.07 s > │ request_hobbyist_license('YOUR_NAME', 'YOUR_EMAIL') │
  1341. 49.07 s > │ │
  1342. 49.07 s > │ All other users can obtain a free 30-day trial key: │
  1343. 49.07 s > │ │
  1344. 49.07 s > │ from symbolica import * │
  1345. 49.07 s > │ request_trial_license('NAME', 'EMAIL', 'EMPLOYER') │
  1346. 49.07 s > │ │
  1347. 49.07 s > │ See https://symbolica.io/docs/get_started.html#license │
  1348. 49.07 s > └────────────────────────────────────────────────────────┘
  1349. 49.07 s > ┌───────────────────────────────────────────────────────────────────────────────────────────────────────────┐
  1350. 49.07 s > │ Cannot start new unlicensed Symbolica instance since there is already another one running on the machine. │
  1351. 49.07 s > └───────────────────────────────────────────────────────────────────────────────────────────────────────────┘
  1352. 49.07 s >
  1353. 49.07 s > stderr:
  1354. 49.07 s > ┌───────────────────────────────────┐
  1355. 49.07 s > │ The Symbolica license has expired │
  1356. 49.07 s > └───────────────────────────────────┘
  1357. 49.07 s >
  1358. 49.07 s >
  1359. 49.07 s > Location:
  1360. 49.07 s > tests/tests/test_python_api.rs:156:20
  1361. 49.07 s >
  1362. 49.07 s > FAIL [ 0.171s] (3/5) gammaloop-integration-tests::test_python_api python_session_getters_return_live_toml_and_command_blocks
  1363. 49.07 s > stdout ---
  1364. 49.07 s >
  1365. 49.07 s > running 1 test
  1366. 49.07 s > test python_session_getters_return_live_toml_and_command_blocks ... FAILED
  1367. 49.07 s >
  1368. 49.07 s > failures:
  1369. 49.07 s >
  1370. 49.07 s > failures:
  1371. 49.07 s > python_session_getters_return_live_toml_and_command_blocks
  1372. 49.07 s >
  1373. 49.07 s > test result: FAILED. 0 passed; 1 failed; 0 ignored; 0 measured; 4 filtered out; finished in 0.16s
  1374. 49.07 s >
  1375. 49.07 s > stderr ---
  1376. 49.07 s > Error: Python API test subprocess failed.
  1377. 49.07 s > stdout:
  1378. 49.07 s > ┌────────────────────────────────────────────────────────┐
  1379. 49.07 s > │ You are running a restricted Symbolica instance. │
  1380. 49.07 s > │ │
  1381. 49.07 s > │ This mode is only permitted for non-commercial use and │
  1382. 49.07 s > │ is limited to one instance and core per machine. │
  1383. 49.07 s > │ │
  1384. 49.07 s > │ Hobbyists can easily acquire a free license key │
  1385. 49.07 s > │ that unlocks all cores and removes this banner: │
  1386. 49.07 s > │ │
  1387. 49.07 s > │ from symbolica import * │
  1388. 49.07 s > │ request_hobbyist_license('YOUR_NAME', 'YOUR_EMAIL') │
  1389. 49.07 s > │ │
  1390. 49.07 s > │ All other users can obtain a free 30-day trial key: │
  1391. 49.07 s > │ │
  1392. 49.07 s > │ from symbolica import * │
  1393. 49.07 s > │ request_trial_license('NAME', 'EMAIL', 'EMPLOYER') │
  1394. 49.07 s > │ │
  1395. 49.07 s > │ See https://symbolica.io/docs/get_started.html#license │
  1396. 49.07 s > └────────────────────────────────────────────────────────┘
  1397. 49.07 s > ┌───────────────────────────────────────────────────────────────────────────────────────────────────────────┐
  1398. 49.07 s > │ Cannot start new unlicensed Symbolica instance since there is already another one running on the machine. │
  1399. 49.07 s > └───────────────────────────────────────────────────────────────────────────────────────────────────────────┘
  1400. 49.07 s >
  1401. 49.07 s > stderr:
  1402. 49.07 s > ┌───────────────────────────────────┐
  1403. 49.07 s > │ The Symbolica license has expired │
  1404. 49.07 s > └───────────────────────────────────┘
  1405. 49.07 s >
  1406. 49.07 s >
  1407. 49.07 s > Location:
  1408. 49.07 s > tests/tests/test_python_api.rs:156:20
  1409. 49.07 s >
  1410. 49.07 s > FAIL [ 0.281s] (4/5) gammaloop-integration-tests::test_python_api python_evaluate_samples_batch_and_momentum_space_have_expected_shape
  1411. 49.07 s > stdout ---
  1412. 49.07 s >
  1413. 49.07 s > running 1 test
  1414. 49.07 s > test python_evaluate_samples_batch_and_momentum_space_have_expected_shape ... FAILED
  1415. 49.07 s >
  1416. 49.07 s > failures:
  1417. 49.07 s >
  1418. 49.07 s > failures:
  1419. 49.07 s > python_evaluate_samples_batch_and_momentum_space_have_expected_shape
  1420. 49.07 s >
  1421. 49.07 s > test result: FAILED. 0 passed; 1 failed; 0 ignored; 0 measured; 4 filtered out; finished in 0.27s
  1422. 49.07 s >
  1423. 49.07 s > stderr ---
  1424. 49.07 s > Error: Python API test subprocess failed.
  1425. 49.07 s > stdout:
  1426. 49.07 s > ┌────────────────────────────────────────────────────────┐
  1427. 49.07 s > │ You are running a restricted Symbolica instance. │
  1428. 49.07 s > │ │
  1429. 49.07 s > │ This mode is only permitted for non-commercial use and │
  1430. 49.07 s > │ is limited to one instance and core per machine. │
  1431. 49.07 s > │ │
  1432. 49.07 s > │ Hobbyists can easily acquire a free license key │
  1433. 49.07 s > │ that unlocks all cores and removes this banner: │
  1434. 49.07 s > │ │
  1435. 49.07 s > │ from symbolica import * │
  1436. 49.07 s > │ request_hobbyist_license('YOUR_NAME', 'YOUR_EMAIL') │
  1437. 49.07 s > │ │
  1438. 49.07 s > │ All other users can obtain a free 30-day trial key: │
  1439. 49.07 s > │ │
  1440. 49.07 s > │ from symbolica import * │
  1441. 49.07 s > │ request_trial_license('NAME', 'EMAIL', 'EMPLOYER') │
  1442. 49.07 s > │ │
  1443. 49.07 s > │ See https://symbolica.io/docs/get_started.html#license │
  1444. 49.07 s > └────────────────────────────────────────────────────────┘
  1445. 49.07 s > ┌───────────────────────────────────────────────────────────────────────────────────────────────────────────┐
  1446. 49.07 s > │ Cannot start new unlicensed Symbolica instance since there is already another one running on the machine. │
  1447. 49.07 s > └───────────────────────────────────────────────────────────────────────────────────────────────────────────┘
  1448. 49.07 s >
  1449. 49.07 s > stderr:
  1450. 49.07 s > ┌───────────────────────────────────┐
  1451. 49.07 s > │ The Symbolica license has expired │
  1452. 49.07 s > └───────────────────────────────────┘
  1453. 49.07 s > [2026-09-01 16:00:11.325] @gammaloop_api::se... INFO : Running command import model sm-default
  1454. 49.07 s > [2026-09-01 16:00:11.325] @import::model INFO : Loading built-in JSON model sm-default
  1455. 49.07 s > [2026-09-01 16:00:11.373] @gammalooprs::model INFO : The following 11 external parameters were forced to zero by the restriction card:
  1456. 49.07 s > lamWS, AWS, rhoWS, etaWS, ymc, yme, ymm, MC, Me, MM, WTau
  1457. 49.07 s > [2026-09-01 16:00:11.373] @gammalooprs::model INFO : The following 34 vertex rules were removed by the restriction card:
  1458. 49.07 s > V_82 -> (c~, d, G+) | V_83 -> (t~, d, G+) | V_84 -> (c~, s, G+) | V_85 -> (t~, s, G+) | V_86 -> (u~, b, G+) | V_87 -> (c~, b, G+) | V_90 -> (c~, d, W+) | V_91 -> (t~, d, W+) | V_92 -> (u~, s, W+) | V_94 -> (t~, s, W+) | V_95 -> (u~, b, W+) | V_96 -> (c~, b, W+) | V_101 -> (e+, e-, G0) | V_102 -> (mu+, mu-, G0) | V_104 -> (e+, e-, H) | V_105 -> (mu+, mu-, H) | V_110 -> (ve~, e-, G+) | V_111 -> (vm~, mu-, G+) | V_116 -> (b~, u, G-) | V_117 -> (d~, c, G-) | V_118 -> (s~, c, G-) | V_119 -> (b~, c, G-) | V_120 -> (d~, t, G-) | V_121 -> (s~, t, G-) | V_124 -> (s~, u, W-) | V_125 -> (b~, u, W-) | V_126 -> (d~, c, W-) | V_128 -> (b~, c, W-) | V_129 -> (d~, t, W-) | V_130 -> (s~, t, W-) | V_138 -> (c~, c, G0) | V_140 -> (c~, c, H) | V_145 -> (e+, ve, G-) | V_146 -> (mu+, vm, G-)
  1459. 49.07 s > [2026-09-01 16:00:11.373] @gammalooprs::model INFO : The following 36 couplings were removed by the restriction card:
  1460. 49.07 s > GC_13, GC_14, GC_16, GC_17, GC_18, GC_19, GC_20, GC_22, GC_23, GC_24, GC_25, GC_26, GC_28, GC_29, GC_42, GC_43, GC_44, GC_46, GC_47, GC_48, GC_84, GC_85, GC_86, GC_87, GC_88, GC_89, GC_90, GC_91, GC_92, GC_93, GC_101, GC_102, GC_103, GC_105, GC_106, GC_107
  1461. 49.07 s > [2026-09-01 16:00:11.374] @gammaloop_api::se... INFO : Running command set default-runtime kv kinematics.externals='{"type":"constant","data":{"momenta":[[32.0,0.0,0.0,32.0],[32.0,0.0,0.0,-32.0]],"helicities":[1,1]}}'
  1462. 49.07 s > [2026-09-01 16:00:11.375] @gammaloop_api::se... INFO : Running command set default-runtime kv subtraction.disable_threshold_subtraction=true
  1463. 49.07 s > [2026-09-01 16:00:11.376] @gammaloop_api::se... INFO : Running command generate xs e+ e- > d d~ g | e- a d g QED^2==4 [{{2}} QCD=0] --numerator-grouping group_identical_graphs_up_to_sign --clear-existing-processes --only-diagrams
  1464. 49.07 s > [2026-09-01 16:00:11.379] @feyngen::diagram_... INFO : 0s | Δ=0s | Starting Feynman graph generation with Symbolica...
  1465. 49.07 s > [2026-09-01 16:00:11.383] @feyngen::diagram_... INFO : 0s | Δ=0s | Number of graphs resulting from Symbolica generation: 246
  1466. 49.07 s > [2026-09-01 16:00:11.384] @feyngen::diagram_... INFO : 0s | Δ=0s | Number of graphs retained after enforcing supergraph particle content: 8
  1467. 49.07 s > [2026-09-01 16:00:11.384] @feyngen::diagram_... INFO : 0s | Δ=0s | Number of graphs retained after removal of vetoed topologies: 8
  1468. 49.07 s > [2026-09-01 16:00:11.384] @feyngen::diagram_... INFO : 0s | Δ=0s | Number of graphs after vertex info assignment: 8
  1469. 49.07 s > [2026-09-01 16:00:11.384] @feyngen::diagram_... INFO : 0s | Δ=0s | Number of graphs after all complete graphs filters are applied: 8
  1470. 49.07 s >
  1471. 49.07 s >
  1472. 49.07 s > Location:
  1473. 49.07 s > tests/tests/test_python_api.rs:156:20
  1474. 49.07 s >
  1475. 49.07 s > FAIL [ 0.305s] (5/5) gammaloop-integration-tests::test_python_api python_settings_wrappers_expose_nested_runtime_and_global_settings
  1476. 49.07 s > stdout ---
  1477. 49.07 s >
  1478. 49.07 s > running 1 test
  1479. 49.07 s > test python_settings_wrappers_expose_nested_runtime_and_global_settings ... FAILED
  1480. 49.07 s >
  1481. 49.07 s > failures:
  1482. 49.07 s >
  1483. 49.07 s > failures:
  1484. 49.07 s > python_settings_wrappers_expose_nested_runtime_and_global_settings
  1485. 49.07 s >
  1486. 49.07 s > test result: FAILED. 0 passed; 1 failed; 0 ignored; 0 measured; 4 filtered out; finished in 0.30s
  1487. 49.07 s >
  1488. 49.07 s > stderr ---
  1489. 49.07 s > Error: Python API test subprocess failed.
  1490. 49.07 s > stdout:
  1491. 49.07 s > ┌────────────────────────────────────────────────────────┐
  1492. 49.07 s > │ You are running a restricted Symbolica instance. │
  1493. 49.07 s > │ │
  1494. 49.07 s > │ This mode is only permitted for non-commercial use and │
  1495. 49.07 s > │ is limited to one instance and core per machine. │
  1496. 49.07 s > │ │
  1497. 49.07 s > │ Hobbyists can easily acquire a free license key │
  1498. 49.07 s > │ that unlocks all cores and removes this banner: │
  1499. 49.07 s > │ │
  1500. 49.07 s > │ from symbolica import * │
  1501. 49.07 s > │ request_hobbyist_license('YOUR_NAME', 'YOUR_EMAIL') │
  1502. 49.07 s > │ │
  1503. 49.07 s > │ All other users can obtain a free 30-day trial key: │
  1504. 49.07 s > │ │
  1505. 49.07 s > │ from symbolica import * │
  1506. 49.07 s > │ request_trial_license('NAME', 'EMAIL', 'EMPLOYER') │
  1507. 49.07 s > │ │
  1508. 49.07 s > │ See https://symbolica.io/docs/get_started.html#license │
  1509. 49.07 s > └────────────────────────────────────────────────────────┘
  1510. 49.07 s > ┌───────────────────────────────────────────────────────────────────────────────────────────────────────────┐
  1511. 49.07 s > │ Cannot start new unlicensed Symbolica instance since there is already another one running on the machine. │
  1512. 49.07 s > └───────────────────────────────────────────────────────────────────────────────────────────────────────────┘
  1513. 49.07 s >
  1514. 49.07 s > stderr:
  1515. 49.07 s > ┌───────────────────────────────────┐
  1516. 49.07 s > │ The Symbolica license has expired │
  1517. 49.07 s > └───────────────────────────────────┘
  1518. 49.07 s >
  1519. 49.07 s >
  1520. 49.07 s > Location:
  1521. 49.07 s > tests/tests/test_python_api.rs:156:20
  1522. 49.07 s >
  1523. 49.07 s > error: test run failed
  1524. 49.07 s >
  1525. 49.07 s > ========== nextest test summary ==========
  1526. 49.07 s > report: target/nextest/ci_gammaloop/junit.xml
  1527. 49.07 s > tests: 5, failures: 5, errors: 0
  1528. 49.07 s >
  1529. 49.07 s > 1. gammaloop-integration-tests::test_python_api::python_evaluate_sample_preserves_graph_grouping_and_incoming_pdgs
  1530. 49.07 s > failure: test failure with exit code 101
  1531. 49.07 s > Error: Python API test subprocess failed.
  1532. 49.07 s > stdout:
  1533. 49.07 s > ┌────────────────────────────────────────────────────────┐
  1534. 49.07 s > │ You are running a restricted Symbolica instance. │
  1535. 49.07 s > │ │
  1536. 49.07 s > │ This mode is only permitted for non-commercial use and │
  1537. 49.07 s > │ is limited to one instance and core per machine. │
  1538. 49.07 s > │ │
  1539. 49.07 s > │ Hobbyists can easily acquire a free license key │
  1540. 49.07 s > │ that unlocks all cores and removes this banner: │
  1541. 49.07 s > │ │
  1542. 49.07 s > │ from symbolica import * │
  1543. 49.07 s > │ request_hobbyist_license('YOUR_NAME', 'YOUR_EMAIL') │
  1544. 49.07 s > │ │
  1545. 49.07 s > │ All other users can obtain a free 30-day trial key: │
  1546. 49.07 s > │ │
  1547. 49.07 s > │ from symbolica import * │
  1548. 49.07 s > │ request_trial_license('NAME', 'EMAIL', 'EMPLOYER') │
  1549. 49.07 s > │ │
  1550. 49.07 s > │ See https://symbolica.io/docs/get_started.html#license │
  1551. 49.07 s > └────────────────────────────────────────────────────────┘
  1552. 49.07 s > ┌───────────────────────────────────────────────────────────────────────────────────────────────────────────┐
  1553. 49.07 s > │ Cannot start new unlicensed Symbolica instance since there is already another one running on the machine. │
  1554. 49.07 s > └───────────────────────────────────────────────────────────────────────────────────────────────────────────┘
  1555. 49.07 s >
  1556. 49.07 s > stderr:
  1557. 49.07 s > ┌───────────────────────────────────┐
  1558. 49.07 s > │ The Symbolica license has expired │
  1559. 49.07 s > └───────────────────────────────────┘
  1560. 49.07 s >
  1561. 49.07 s >
  1562. 49.07 s > Location:
  1563. 49.07 s > tests/tests/test_python_api.rs:156:20
  1564. 49.07 s > system-out
  1565. 49.07 s > running 1 test
  1566. 49.07 s > test python_evaluate_sample_preserves_graph_grouping_and_incoming_pdgs ... FAILED
  1567. 49.07 s >
  1568. 49.07 s > failures:
  1569. 49.07 s >
  1570. 49.07 s > failures:
  1571. 49.07 s > python_evaluate_sample_preserves_graph_grouping_and_incoming_pdgs
  1572. 49.07 s >
  1573. 49.07 s > test result: FAILED. 0 passed; 1 failed; 0 ignored; 0 measured; 4 filtered out; finished in 0.15s
  1574. 49.07 s > system-err
  1575. 49.07 s > Error: Python API test subprocess failed.
  1576. 49.07 s > stdout:
  1577. 49.07 s > ┌────────────────────────────────────────────────────────┐
  1578. 49.07 s > │ You are running a restricted Symbolica instance. │
  1579. 49.07 s > │ │
  1580. 49.07 s > │ This mode is only permitted for non-commercial use and │
  1581. 49.07 s > │ is limited to one instance and core per machine. │
  1582. 49.07 s > │ │
  1583. 49.07 s > │ Hobbyists can easily acquire a free license key │
  1584. 49.07 s > │ that unlocks all cores and removes this banner: │
  1585. 49.07 s > │ │
  1586. 49.07 s > │ from symbolica import * │
  1587. 49.07 s > │ request_hobbyist_license('YOUR_NAME', 'YOUR_EMAIL') │
  1588. 49.07 s > │ │
  1589. 49.07 s > │ All other users can obtain a free 30-day trial key: │
  1590. 49.07 s > │ │
  1591. 49.07 s > │ from symbolica import * │
  1592. 49.07 s > │ request_trial_license('NAME', 'EMAIL', 'EMPLOYER') │
  1593. 49.07 s > │ │
  1594. 49.07 s > │ See https://symbolica.io/docs/get_started.html#license │
  1595. 49.07 s > └────────────────────────────────────────────────────────┘
  1596. 49.07 s > ┌───────────────────────────────────────────────────────────────────────────────────────────────────────────┐
  1597. 49.07 s > │ Cannot start new unlicensed Symbolica instance since there is already another one running on the machine. │
  1598. 49.07 s > └───────────────────────────────────────────────────────────────────────────────────────────────────────────┘
  1599. 49.07 s >
  1600. 49.07 s > stderr:
  1601. 49.07 s > ┌───────────────────────────────────┐
  1602. 49.07 s > │ The Symbolica license has expired │
  1603. 49.07 s > └───────────────────────────────────┘
  1604. 49.07 s >
  1605. 49.07 s >
  1606. 49.07 s > Location:
  1607. 49.07 s > tests/tests/test_python_api.rs:156:20
  1608. 49.07 s >
  1609. 49.07 s > 2. gammaloop-integration-tests::test_python_api::python_evaluate_sample_honors_generate_events_and_observable_snapshots
  1610. 49.07 s > failure: test failure with exit code 101
  1611. 49.07 s > Error: Python API test subprocess failed.
  1612. 49.07 s > stdout:
  1613. 49.07 s > ┌────────────────────────────────────────────────────────┐
  1614. 49.07 s > │ You are running a restricted Symbolica instance. │
  1615. 49.07 s > │ │
  1616. 49.07 s > │ This mode is only permitted for non-commercial use and │
  1617. 49.07 s > │ is limited to one instance and core per machine. │
  1618. 49.07 s > │ │
  1619. 49.07 s > │ Hobbyists can easily acquire a free license key │
  1620. 49.07 s > │ that unlocks all cores and removes this banner: │
  1621. 49.07 s > │ │
  1622. 49.07 s > │ from symbolica import * │
  1623. 49.07 s > │ request_hobbyist_license('YOUR_NAME', 'YOUR_EMAIL') │
  1624. 49.07 s > │ │
  1625. 49.07 s > │ All other users can obtain a free 30-day trial key: │
  1626. 49.07 s > │ │
  1627. 49.07 s > │ from symbolica import * │
  1628. 49.07 s > │ request_trial_license('NAME', 'EMAIL', 'EMPLOYER') │
  1629. 49.07 s > │ │
  1630. 49.07 s > │ See https://symbolica.io/docs/get_started.html#license │
  1631. 49.07 s > └────────────────────────────────────────────────────────┘
  1632. 49.07 s > ┌───────────────────────────────────────────────────────────────────────────────────────────────────────────┐
  1633. 49.07 s > │ Cannot start new unlicensed Symbolica instance since there is already another one running on the machine. │
  1634. 49.07 s > └───────────────────────────────────────────────────────────────────────────────────────────────────────────┘
  1635. 49.07 s >
  1636. 49.07 s > stderr:
  1637. 49.07 s > ┌───────────────────────────────────┐
  1638. 49.07 s > │ The Symbolica license has expired │
  1639. 49.07 s > └───────────────────────────────────┘
  1640. 49.07 s >
  1641. 49.07 s >
  1642. 49.07 s > Location:
  1643. 49.07 s > tests/tests/test_python_api.rs:156:20
  1644. 49.07 s > system-out
  1645. 49.07 s > running 1 test
  1646. 49.07 s > test python_evaluate_sample_honors_generate_events_and_observable_snapshots ... FAILED
  1647. 49.07 s >
  1648. 49.07 s > failures:
  1649. 49.07 s >
  1650. 49.07 s > failures:
  1651. 49.07 s > python_evaluate_sample_honors_generate_events_and_observable_snapshots
  1652. 49.07 s >
  1653. 49.07 s > test result: FAILED. 0 passed; 1 failed; 0 ignored; 0 measured; 4 filtered out; finished in 0.16s
  1654. 49.07 s > system-err
  1655. 49.07 s > Error: Python API test subprocess failed.
  1656. 49.07 s > stdout:
  1657. 49.07 s > ┌────────────────────────────────────────────────────────┐
  1658. 49.07 s > │ You are running a restricted Symbolica instance. │
  1659. 49.07 s > │ │
  1660. 49.07 s > │ This mode is only permitted for non-commercial use and │
  1661. 49.07 s > │ is limited to one instance and core per machine. │
  1662. 49.07 s > │ │
  1663. 49.07 s > │ Hobbyists can easily acquire a free license key │
  1664. 49.07 s > │ that unlocks all cores and removes this banner: │
  1665. 49.07 s > │ │
  1666. 49.07 s > │ from symbolica import * │
  1667. 49.07 s > │ request_hobbyist_license('YOUR_NAME', 'YOUR_EMAIL') │
  1668. 49.07 s > │ │
  1669. 49.07 s > │ All other users can obtain a free 30-day trial key: │
  1670. 49.07 s > │ │
  1671. 49.07 s > │ from symbolica import * │
  1672. 49.07 s > │ request_trial_license('NAME', 'EMAIL', 'EMPLOYER') │
  1673. 49.07 s > │ │
  1674. 49.07 s > │ See https://symbolica.io/docs/get_started.html#license │
  1675. 49.07 s > └────────────────────────────────────────────────────────┘
  1676. 49.07 s > ┌───────────────────────────────────────────────────────────────────────────────────────────────────────────┐
  1677. 49.07 s > │ Cannot start new unlicensed Symbolica instance since there is already another one running on the machine. │
  1678. 49.07 s > └───────────────────────────────────────────────────────────────────────────────────────────────────────────┘
  1679. 49.07 s >
  1680. 49.07 s > stderr:
  1681. 49.07 s > ┌───────────────────────────────────┐
  1682. 49.07 s > │ The Symbolica license has expired │
  1683. 49.07 s > └───────────────────────────────────┘
  1684. 49.07 s >
  1685. 49.07 s >
  1686. 49.07 s > Location:
  1687. 49.07 s > tests/tests/test_python_api.rs:156:20
  1688. 49.07 s >
  1689. 49.07 s > 3. gammaloop-integration-tests::test_python_api::python_session_getters_return_live_toml_and_command_blocks
  1690. 49.07 s > failure: test failure with exit code 101
  1691. 49.07 s > Error: Python API test subprocess failed.
  1692. 49.07 s > stdout:
  1693. 49.07 s > ┌────────────────────────────────────────────────────────┐
  1694. 49.07 s > │ You are running a restricted Symbolica instance. │
  1695. 49.07 s > │ │
  1696. 49.07 s > │ This mode is only permitted for non-commercial use and │
  1697. 49.07 s > │ is limited to one instance and core per machine. │
  1698. 49.07 s > │ │
  1699. 49.07 s > │ Hobbyists can easily acquire a free license key │
  1700. 49.07 s > │ that unlocks all cores and removes this banner: │
  1701. 49.07 s > │ │
  1702. 49.07 s > │ from symbolica import * │
  1703. 49.07 s > │ request_hobbyist_license('YOUR_NAME', 'YOUR_EMAIL') │
  1704. 49.07 s > │ │
  1705. 49.07 s > │ All other users can obtain a free 30-day trial key: │
  1706. 49.07 s > │ │
  1707. 49.07 s > │ from symbolica import * │
  1708. 49.07 s > │ request_trial_license('NAME', 'EMAIL', 'EMPLOYER') │
  1709. 49.07 s > │ │
  1710. 49.07 s > │ See https://symbolica.io/docs/get_started.html#license │
  1711. 49.07 s > └────────────────────────────────────────────────────────┘
  1712. 49.07 s > ┌───────────────────────────────────────────────────────────────────────────────────────────────────────────┐
  1713. 49.07 s > │ Cannot start new unlicensed Symbolica instance since there is already another one running on the machine. │
  1714. 49.07 s > └───────────────────────────────────────────────────────────────────────────────────────────────────────────┘
  1715. 49.07 s >
  1716. 49.07 s > stderr:
  1717. 49.07 s > ┌───────────────────────────────────┐
  1718. 49.07 s > │ The Symbolica license has expired │
  1719. 49.07 s > └───────────────────────────────────┘
  1720. 49.07 s >
  1721. 49.07 s >
  1722. 49.07 s > Location:
  1723. 49.07 s > tests/tests/test_python_api.rs:156:20
  1724. 49.07 s > system-out
  1725. 49.07 s > running 1 test
  1726. 49.07 s > test python_session_getters_return_live_toml_and_command_blocks ... FAILED
  1727. 49.07 s >
  1728. 49.07 s > failures:
  1729. 49.07 s >
  1730. 49.07 s > failures:
  1731. 49.07 s > python_session_getters_return_live_toml_and_command_blocks
  1732. 49.07 s >
  1733. 49.07 s > test result: FAILED. 0 passed; 1 failed; 0 ignored; 0 measured; 4 filtered out; finished in 0.16s
  1734. 49.07 s > system-err
  1735. 49.07 s > Error: Python API test subprocess failed.
  1736. 49.07 s > stdout:
  1737. 49.07 s > ┌────────────────────────────────────────────────────────┐
  1738. 49.07 s > │ You are running a restricted Symbolica instance. │
  1739. 49.07 s > │ │
  1740. 49.07 s > │ This mode is only permitted for non-commercial use and │
  1741. 49.07 s > │ is limited to one instance and core per machine. │
  1742. 49.07 s > │ │
  1743. 49.07 s > │ Hobbyists can easily acquire a free license key │
  1744. 49.07 s > │ that unlocks all cores and removes this banner: │
  1745. 49.07 s > │ │
  1746. 49.07 s > │ from symbolica import * │
  1747. 49.07 s > │ request_hobbyist_license('YOUR_NAME', 'YOUR_EMAIL') │
  1748. 49.07 s > │ │
  1749. 49.07 s > │ All other users can obtain a free 30-day trial key: │
  1750. 49.07 s > │ │
  1751. 49.07 s > │ from symbolica import * │
  1752. 49.07 s > │ request_trial_license('NAME', 'EMAIL', 'EMPLOYER') │
  1753. 49.07 s > │ │
  1754. 49.07 s > │ See https://symbolica.io/docs/get_started.html#license │
  1755. 49.07 s > └────────────────────────────────────────────────────────┘
  1756. 49.07 s > ┌───────────────────────────────────────────────────────────────────────────────────────────────────────────┐
  1757. 49.07 s > │ Cannot start new unlicensed Symbolica instance since there is already another one running on the machine. │
  1758. 49.07 s > └───────────────────────────────────────────────────────────────────────────────────────────────────────────┘
  1759. 49.07 s >
  1760. 49.07 s > stderr:
  1761. 49.07 s > ┌───────────────────────────────────┐
  1762. 49.07 s > │ The Symbolica license has expired │
  1763. 49.07 s > └───────────────────────────────────┘
  1764. 49.07 s >
  1765. 49.07 s >
  1766. 49.07 s > Location:
  1767. 49.07 s > tests/tests/test_python_api.rs:156:20
  1768. 49.07 s >
  1769. 49.07 s > 4. gammaloop-integration-tests::test_python_api::python_evaluate_samples_batch_and_momentum_space_have_expected_shape
  1770. 49.07 s > failure: test failure with exit code 101
  1771. 49.07 s > Error: Python API test subprocess failed.
  1772. 49.07 s > stdout:
  1773. 49.07 s > ┌────────────────────────────────────────────────────────┐
  1774. 49.07 s > │ You are running a restricted Symbolica instance. │
  1775. 49.07 s > │ │
  1776. 49.07 s > │ This mode is only permitted for non-commercial use and │
  1777. 49.07 s > │ is limited to one instance and core per machine. │
  1778. 49.07 s > │ │
  1779. 49.07 s > │ Hobbyists can easily acquire a free license key │
  1780. 49.07 s > │ that unlocks all cores and removes this banner: │
  1781. 49.07 s > │ │
  1782. 49.07 s > │ from symbolica import * │
  1783. 49.07 s > │ request_hobbyist_license('YOUR_NAME', 'YOUR_EMAIL') │
  1784. 49.07 s > │ │
  1785. 49.07 s > │ All other users can obtain a free 30-day trial key: │
  1786. 49.07 s > │ │
  1787. 49.07 s > │ from symbolica import * │
  1788. 49.07 s > │ request_trial_license('NAME', 'EMAIL', 'EMPLOYER') │
  1789. 49.07 s > │ │
  1790. 49.07 s > │ See https://symbolica.io/docs/get_started.html#license │
  1791. 49.07 s > └────────────────────────────────────────────────────────┘
  1792. 49.07 s > ┌───────────────────────────────────────────────────────────────────────────────────────────────────────────┐
  1793. 49.07 s > │ Cannot start new unlicensed Symbolica instance since there is already another one running on the machine. │
  1794. 49.07 s > └───────────────────────────────────────────────────────────────────────────────────────────────────────────┘
  1795. 49.07 s >
  1796. 49.07 s > stderr:
  1797. 49.07 s > ┌───────────────────────────────────┐
  1798. 49.07 s > │ The Symbolica license has expired │
  1799. 49.07 s > └───────────────────────────────────┘
  1800. 49.07 s > [2026-09-01 16:00:11.325] @gammaloop_api::se... INFO : Running command import model sm-default
  1801. 49.07 s > [2026-09-01 16:00:11.325] @import::model INFO : Loading built-in JSON model sm-default
  1802. 49.07 s > [2026-09-01 16:00:11.373] @gammalooprs::model INFO : The following 11 external parameters were forced to zero by the restriction card:
  1803. 49.07 s > lamWS, AWS, rhoWS, etaWS, ymc, yme, ymm, MC, Me, MM, WTau
  1804. 49.07 s > [2026-09-01 16:00:11.373] @gammalooprs::model INFO : The following 34 vertex rules were removed by the restriction card:
  1805. 49.07 s > V_82 -> (c~, d, G+) | V_83 -> (t~, d, G+) | V_84 -> (c~, s, G+) | V_85 -> (t~, s, G+) | V_86 -> (u~, b, G+) | V_87 -> (c~, b, G+) | V_90 -> (c~, d, W+) | V_91 -> (t~, d, W+) | V_92 -> (u~, s, W+) | V_94 -> (t~, s, W+) | V_95 -> (u~, b, W+) | V_96 -> (c~, b, W+) | V_101 -> (e+, e-, G0) | V_102 -> (mu+, mu-, G0) | V_104 -> (e+, e-, H) | V_105 -> (mu+, mu-, H) | V_110 -> (ve~, e-, G+) | V_111 -> (vm~, mu-, G+) | V_116 -> (b~, u, G-) | V_117 -> (d~, c, G-) | V_118 -> (s~, c, G-) | V_119 -> (b~, c, G-) | V_120 -> (d~, t, G-) | V_121 -> (s~, t, G-) | V_124 -> (s~, u, W-) | V_125 -> (b~, u, W-) | V_126 -> (d~, c, W-) | V_128 -> (b~, c, W-) | V_129 -> (d~, t, W-) | V_130 -> (s~, t, W-) | V_138 -> (c~, c, G0) | V_140 -> (c~, c, H) | V_145 -> (e+, ve, G-) | V_146 -> (mu+, vm, G-)
  1806. 49.07 s > [2026-09-01 16:00:11.373] @gammalooprs::model INFO : The following 36 couplings were removed by the restriction card:
  1807. 49.07 s > GC_13, GC_14, GC_16, GC_17, GC_18, GC_19, GC_20, GC_22, GC_23, GC_24, GC_25, GC_26, GC_28, GC_29, GC_42, GC_43, GC_44, GC_46, GC_47, GC_48, GC_84, GC_85, GC_86, GC_87, GC_88, GC_89, GC_90, GC_91, GC_92, GC_93, GC_101, GC_102, GC_103, GC_105, GC_106, GC_107
  1808. 49.07 s > [2026-09-01 16:00:11.374] @gammaloop_api::se... INFO : Running command set default-runtime kv kinematics.externals='{"type":"constant","data":{"momenta":[[32.0,0.0,0.0,32.0],[32.0,0.0,0.0,-32.0]],"helicities":[1,1]}}'
  1809. 49.07 s > [2026-09-01 16:00:11.375] @gammaloop_api::se... INFO : Running command set default-runtime kv subtraction.disable_threshold_subtraction=true
  1810. 49.07 s > [2026-09-01 16:00:11.376] @gammaloop_api::se... INFO : Running command generate xs e+ e- > d d~ g | e- a d g QED^2==4 [{{2}} QCD=0] --numerator-grouping group_identical_graphs_up_to_sign --clear-existing-processes --only-diagrams
  1811. 49.07 s > [2026-09-01 16:00:11.379] @feyngen::diagram_... INFO : 0s | Δ=0s | Starting Feynman graph generation with Symbolica...
  1812. 49.07 s > [2026-09-01 16:00:11.383] @feyngen::diagram_... INFO : 0s | Δ=0s | Number of graphs resulting from Symbolica generation: 246
  1813. 49.07 s > [2026-09-01 16:00:11.384] @feyngen::diagram_... INFO : 0s | Δ=0s | Number of graphs retained after enforcing supergraph particle content: 8
  1814. 49.07 s > [2026-09-01 16:00:11.384] @feyngen::diagram_... INFO : 0s | Δ=0s | Number of graphs retained after removal of vetoed topologies: 8
  1815. 49.07 s > [2026-09-01 16:00:11.384] @feyngen::diagram_... INFO : 0s | Δ=0s | Number of graphs after vertex info assignment: 8
  1816. 49.07 s > [2026-09-01 16:00:11.384] @feyngen::diagram_... INFO : 0s | Δ=0s | Number of graphs after all complete graphs filters are applied: 8
  1817. 49.07 s >
  1818. 49.07 s >
  1819. 49.07 s > Location:
  1820. 49.07 s > tests/tests/test_python_api.rs:156:20
  1821. 49.08 s > system-out
  1822. 49.08 s > running 1 test
  1823. 49.08 s > test python_evaluate_samples_batch_and_momentum_space_have_expected_shape ... FAILED
  1824. 49.08 s >
  1825. 49.08 s > failures:
  1826. 49.08 s >
  1827. 49.08 s > failures:
  1828. 49.08 s > python_evaluate_samples_batch_and_momentum_space_have_expected_shape
  1829. 49.08 s >
  1830. 49.08 s > test result: FAILED. 0 passed; 1 failed; 0 ignored; 0 measured; 4 filtered out; finished in 0.27s
  1831. 49.08 s > system-err
  1832. 49.08 s > Error: Python API test subprocess failed.
  1833. 49.08 s > stdout:
  1834. 49.08 s > ┌────────────────────────────────────────────────────────┐
  1835. 49.08 s > │ You are running a restricted Symbolica instance. │
  1836. 49.08 s > │ │
  1837. 49.08 s > │ This mode is only permitted for non-commercial use and │
  1838. 49.08 s > │ is limited to one instance and core per machine. │
  1839. 49.08 s > │ │
  1840. 49.08 s > │ Hobbyists can easily acquire a free license key │
  1841. 49.08 s > │ that unlocks all cores and removes this banner: │
  1842. 49.08 s > │ │
  1843. 49.08 s > │ from symbolica import * │
  1844. 49.08 s > │ request_hobbyist_license('YOUR_NAME', 'YOUR_EMAIL') │
  1845. 49.08 s > │ │
  1846. 49.08 s > │ All other users can obtain a free 30-day trial key: │
  1847. 49.08 s > │ │
  1848. 49.08 s > │ from symbolica import * │
  1849. 49.08 s > │ request_trial_license('NAME', 'EMAIL', 'EMPLOYER') │
  1850. 49.08 s > │ │
  1851. 49.08 s > │ See https://symbolica.io/docs/get_started.html#license │
  1852. 49.08 s > └────────────────────────────────────────────────────────┘
  1853. 49.08 s > ┌───────────────────────────────────────────────────────────────────────────────────────────────────────────┐
  1854. 49.08 s > │ Cannot start new unlicensed Symbolica instance since there is already another one running on the machine. │
  1855. 49.08 s > └───────────────────────────────────────────────────────────────────────────────────────────────────────────┘
  1856. 49.08 s >
  1857. 49.08 s > stderr:
  1858. 49.08 s > ┌───────────────────────────────────┐
  1859. 49.08 s > │ The Symbolica license has expired │
  1860. 49.08 s > └───────────────────────────────────┘
  1861. 49.08 s > [2026-09-01 16:00:11.325] @gammaloop_api::se... INFO : Running command import model sm-default
  1862. 49.08 s > [2026-09-01 16:00:11.325] @import::model INFO : Loading built-in JSON model sm-default
  1863. 49.08 s > [2026-09-01 16:00:11.373] @gammalooprs::model INFO : The following 11 external parameters were forced to zero by the restriction card:
  1864. 49.08 s > lamWS, AWS, rhoWS, etaWS, ymc, yme, ymm, MC, Me, MM, WTau
  1865. 49.08 s > [2026-09-01 16:00:11.373] @gammalooprs::model INFO : The following 34 vertex rules were removed by the restriction card:
  1866. 49.08 s > V_82 -> (c~, d, G+) | V_83 -> (t~, d, G+) | V_84 -> (c~, s, G+) | V_85 -> (t~, s, G+) | V_86 -> (u~, b, G+) | V_87 -> (c~, b, G+) | V_90 -> (c~, d, W+) | V_91 -> (t~, d, W+) | V_92 -> (u~, s, W+) | V_94 -> (t~, s, W+) | V_95 -> (u~, b, W+) | V_96 -> (c~, b, W+) | V_101 -> (e+, e-, G0) | V_102 -> (mu+, mu-, G0) | V_104 -> (e+, e-, H) | V_105 -> (mu+, mu-, H) | V_110 -> (ve~, e-, G+) | V_111 -> (vm~, mu-, G+) | V_116 -> (b~, u, G-) | V_117 -> (d~, c, G-) | V_118 -> (s~, c, G-) | V_119 -> (b~, c, G-) | V_120 -> (d~, t, G-) | V_121 -> (s~, t, G-) | V_124 -> (s~, u, W-) | V_125 -> (b~, u, W-) | V_126 -> (d~, c, W-) | V_128 -> (b~, c, W-) | V_129 -> (d~, t, W-) | V_130 -> (s~, t, W-) | V_138 -> (c~, c, G0) | V_140 -> (c~, c, H) | V_145 -> (e+, ve, G-) | V_146 -> (mu+, vm, G-)
  1867. 49.08 s > [2026-09-01 16:00:11.373] @gammalooprs::model INFO : The following 36 couplings were removed by the restriction card:
  1868. 49.08 s > GC_13, GC_14, GC_16, GC_17, GC_18, GC_19, GC_20, GC_22, GC_23, GC_24, GC_25, GC_26, GC_28, GC_29, GC_42, GC_43, GC_44, GC_46, GC_47, GC_48, GC_84, GC_85, GC_86, GC_87, GC_88, GC_89, GC_90, GC_91, GC_92, GC_93, GC_101, GC_102, GC_103, GC_105, GC_106, GC_107
  1869. 49.08 s > [2026-09-01 16:00:11.374] @gammaloop_api::se... INFO : Running command set default-runtime kv kinematics.externals='{"type":"constant","data":{"momenta":[[32.0,0.0,0.0,32.0],[32.0,0.0,0.0,-32.0]],"helicities":[1,1]}}'
  1870. 49.08 s > [2026-09-01 16:00:11.375] @gammaloop_api::se... INFO : Running command set default-runtime kv subtraction.disable_threshold_subtraction=true
  1871. 49.08 s > [2026-09-01 16:00:11.376] @gammaloop_api::se... INFO : Running command generate xs e+ e- > d d~ g | e- a d g QED^2==4 [{{2}} QCD=0] --numerator-grouping group_identical_graphs_up_to_sign --clear-existing-processes --only-diagrams
  1872. 49.08 s > [2026-09-01 16:00:11.379] @feyngen::diagram_... INFO : 0s | Δ=0s | Starting Feynman graph generation with Symbolica...
  1873. 49.08 s > [2026-09-01 16:00:11.383] @feyngen::diagram_... INFO : 0s | Δ=0s | Number of graphs resulting from Symbolica generation: 246
  1874. 49.08 s > [2026-09-01 16:00:11.384] @feyngen::diagram_... INFO : 0s | Δ=0s | Number of graphs retained after enforcing supergraph particle content: 8
  1875. 49.08 s > [2026-09-01 16:00:11.384] @feyngen::diagram_... INFO : 0s | Δ=0s | Number of graphs retained after removal of vetoed topologies: 8
  1876. 49.08 s > [2026-09-01 16:00:11.384] @feyngen::diagram_... INFO : 0s | Δ=0s | Number of graphs after vertex info assignment: 8
  1877. 49.08 s > [2026-09-01 16:00:11.384] @feyngen::diagram_... INFO : 0s | Δ=0s | Number of graphs after all complete graphs filters are applied: 8
  1878. 49.08 s >
  1879. 49.08 s >
  1880. 49.08 s > Location:
  1881. 49.08 s > tests/tests/test_python_api.rs:156:20
  1882. 49.08 s >
  1883. 49.08 s > 5. gammaloop-integration-tests::test_python_api::python_settings_wrappers_expose_nested_runtime_and_global_settings
  1884. 49.08 s > failure: test failure with exit code 101
  1885. 49.08 s > Error: Python API test subprocess failed.
  1886. 49.08 s > stdout:
  1887. 49.08 s > ┌────────────────────────────────────────────────────────┐
  1888. 49.08 s > │ You are running a restricted Symbolica instance. │
  1889. 49.08 s > │ │
  1890. 49.08 s > │ This mode is only permitted for non-commercial use and │
  1891. 49.08 s > │ is limited to one instance and core per machine. │
  1892. 49.08 s > │ │
  1893. 49.08 s > │ Hobbyists can easily acquire a free license key │
  1894. 49.08 s > │ that unlocks all cores and removes this banner: │
  1895. 49.08 s > │ │
  1896. 49.08 s > │ from symbolica import * │
  1897. 49.08 s > │ request_hobbyist_license('YOUR_NAME', 'YOUR_EMAIL') │
  1898. 49.08 s > │ │
  1899. 49.08 s > │ All other users can obtain a free 30-day trial key: │
  1900. 49.08 s > │ │
  1901. 49.08 s > │ from symbolica import * │
  1902. 49.08 s > │ request_trial_license('NAME', 'EMAIL', 'EMPLOYER') │
  1903. 49.08 s > │ │
  1904. 49.08 s > │ See https://symbolica.io/docs/get_started.html#license │
  1905. 49.08 s > └────────────────────────────────────────────────────────┘
  1906. 49.08 s > ┌───────────────────────────────────────────────────────────────────────────────────────────────────────────┐
  1907. 49.08 s > │ Cannot start new unlicensed Symbolica instance since there is already another one running on the machine. │
  1908. 49.08 s > └───────────────────────────────────────────────────────────────────────────────────────────────────────────┘
  1909. 49.08 s >
  1910. 49.08 s > stderr:
  1911. 49.08 s > ┌───────────────────────────────────┐
  1912. 49.08 s > │ The Symbolica license has expired │
  1913. 49.08 s > └───────────────────────────────────┘
  1914. 49.08 s >
  1915. 49.08 s >
  1916. 49.08 s > Location:
  1917. 49.08 s > tests/tests/test_python_api.rs:156:20
  1918. 49.08 s > system-out
  1919. 49.08 s > running 1 test
  1920. 49.08 s > test python_settings_wrappers_expose_nested_runtime_and_global_settings ... FAILED
  1921. 49.08 s >
  1922. 49.08 s > failures:
  1923. 49.08 s >
  1924. 49.08 s > failures:
  1925. 49.08 s > python_settings_wrappers_expose_nested_runtime_and_global_settings
  1926. 49.08 s >
  1927. 49.08 s > test result: FAILED. 0 passed; 1 failed; 0 ignored; 0 measured; 4 filtered out; finished in 0.30s
  1928. 49.08 s > system-err
  1929. 49.08 s > Error: Python API test subprocess failed.
  1930. 49.08 s > stdout:
  1931. 49.08 s > ┌────────────────────────────────────────────────────────┐
  1932. 49.08 s > │ You are running a restricted Symbolica instance. │
  1933. 49.08 s > │ │
  1934. 49.08 s > │ This mode is only permitted for non-commercial use and │
  1935. 49.08 s > │ is limited to one instance and core per machine. │
  1936. 49.08 s > │ │
  1937. 49.08 s > │ Hobbyists can easily acquire a free license key │
  1938. 49.08 s > │ that unlocks all cores and removes this banner: │
  1939. 49.08 s > │ │
  1940. 49.08 s > │ from symbolica import * │
  1941. 49.08 s > │ request_hobbyist_license('YOUR_NAME', 'YOUR_EMAIL') │
  1942. 49.08 s > │ │
  1943. 49.08 s > │ All other users can obtain a free 30-day trial key: │
  1944. 49.08 s > │ │
  1945. 49.08 s > │ from symbolica import * │
  1946. 49.08 s > │ request_trial_license('NAME', 'EMAIL', 'EMPLOYER') │
  1947. 49.08 s > │ │
  1948. 49.08 s > │ See https://symbolica.io/docs/get_started.html#license │
  1949. 49.08 s > └────────────────────────────────────────────────────────┘
  1950. 49.08 s > ┌───────────────────────────────────────────────────────────────────────────────────────────────────────────┐
  1951. 49.08 s > │ Cannot start new unlicensed Symbolica instance since there is already another one running on the machine. │
  1952. 49.08 s > └───────────────────────────────────────────────────────────────────────────────────────────────────────────┘
  1953. 49.08 s >
  1954. 49.08 s > stderr:
  1955. 49.08 s > ┌───────────────────────────────────┐
  1956. 49.08 s > │ The Symbolica license has expired │
  1957. 49.08 s > └───────────────────────────────────┘
  1958. 49.08 s >
  1959. 49.08 s >
  1960. 49.08 s > Location:
  1961. 49.08 s > tests/tests/test_python_api.rs:156:20
  1962. 49.08 s > =========================================
  1963. 49.08 s For full logs, run:
  1964. 49.08 s nix log /nix/store/bsvj9vr3w2p8wi7qh7xmxqps4i34mbmv-gammaloop-nextest-python-api.drv
  1965. 49.25 s Run failed.