test packages.x86_64-linux.nix-ci-check-gammaloop-nextest-python-api

Reproduce this run
Original Run
  1. 0.79 s $ /nix/store/9ypz3flqsrl5xl495mm8h645gadjsxi1-coreutils-9.11/bin/timeout --kill-after=15s 7200s /nix/store/23zk8sgzamrbmj1fday15szf7f2279s8-nix-2.34.7/bin/nix --extra-experimental-features nix-command --extra-experimental-features flakes flake clone git+https://github.com/alphal00p/gammaloop --dest /tmp/nix-ci-worker/stable-pwd/repo/
  2. 0.88 s Cloning into '/tmp/nix-ci-worker/stable-pwd/repo'...
  3. 0.88 s remote: Enumerating objects: 66329, done.
  4. 0.92 s remote: Counting objects: 0% (1/9001) remote: Counting objects: 1% (91/9001) remote: Counting objects: 2% (181/9001) remote: Counting objects: 3% (271/9001) remote: Counting objects: 4% (361/9001) remote: Counting objects: 5% (451/9001) remote: Counting objects: 6% (541/9001) remote: Counting objects: 7% (631/9001) remote: Counting objects: 8% (721/9001) remote: Counting objects: 9% (811/9001) remote: Counting objects: 10% (901/9001) remote: Counting objects: 11% (991/9001) remote: Counting objects: 12% (1081/9001) remote: Counting objects: 13% (1171/9001) remote: Counting objects: 14% (1261/9001) remote: Counting objects: 15% (1351/9001) remote: Counting objects: 16% (1441/9001) remote: Counting objects: 17% (1531/9001) remote: Counting objects: 18% (1621/9001) remote: Counting objects: 19% (1711/9001) remote: Counting objects: 20% (1801/9001) remote: Counting objects: 21% (1891/9001) remote: Counting objects: 22% (1981/9001) remote: Counting objects: 23% (2071/9001) remote: Counting objects: 24% (2161/9001) remote: Counting objects: 25% (2251/9001) remote: Counting objects: 26% (2341/9001) remote: Counting objects: 27% (2431/9001) remote: Counting objects: 28% (2521/9001) remote: Counting objects: 29% (2611/9001) remote: Counting objects: 30% (2701/9001) remote: Counting objects: 31% (2791/9001) remote: Counting objects: 32% (2881/9001) remote: Counting objects: 33% (2971/9001) remote: Counting objects: 34% (3061/9001) remote: Counting objects: 35% (3151/9001) remote: Counting objects: 36% (3241/9001) remote: Counting objects: 37% (3331/9001) remote: Counting objects: 38% (3421/9001) remote: Counting objects: 39% (3511/9001) remote: Counting objects: 40% (3601/9001) remote: Counting objects: 41% (3691/9001) remote: Counting objects: 42% (3781/9001) remote: Counting objects: 43% (3871/9001) remote: Counting objects: 44% (3961/9001) remote: Counting objects: 45% (4051/9001) remote: Counting objects: 46% (4141/9001) remote: Counting objects: 47% (4231/9001) remote: Counting objects: 48% (4321/9001) remote: Counting objects: 49% (4411/9001) remote: Counting objects: 50% (4501/9001) remote: Counting objects: 51% (4591/9001) remote: Counting objects: 52% (4681/9001) remote: Counting objects: 53% (4771/9001) remote: Counting objects: 54% (4861/9001) remote: Counting objects: 55% (4951/9001) remote: Counting objects: 56% (5041/9001) remote: Counting objects: 57% (5131/9001) remote: Counting objects: 58% (5221/9001) remote: Counting objects: 59% (5311/9001) remote: Counting objects: 60% (5401/9001) remote: Counting objects: 61% (5491/9001) remote: Counting objects: 62% (5581/9001) remote: Counting objects: 63% (5671/9001) remote: Counting objects: 64% (5761/9001) remote: Counting objects: 65% (5851/9001) remote: Counting objects: 66% (5941/9001) remote: Counting objects: 67% (6031/9001) remote: Counting objects: 68% (6121/9001) remote: Counting objects: 69% (6211/9001) remote: Counting objects: 70% (6301/9001) remote: Counting objects: 71% (6391/9001) remote: Counting objects: 72% (6481/9001) remote: Counting objects: 73% (6571/9001) remote: Counting objects: 74% (6661/9001) remote: Counting objects: 75% (6751/9001) remote: Counting objects: 76% (6841/9001) remote: Counting objects: 77% (6931/9001) remote: Counting objects: 78% (7021/9001) remote: Counting objects: 79% (7111/9001) remote: Counting objects: 80% (7201/9001) remote: Counting objects: 81% (7291/9001) remote: Counting objects: 82% (7381/9001) remote: Counting objects: 83% (7471/9001) remote: Counting objects: 84% (7561/9001) remote: Counting objects: 85% (7651/9001) remote: Counting objects: 86% (7741/9001) remote: Counting objects: 87% (7831/9001) remote: Counting objects: 88% (7921/9001) remote: Counting objects: 89% (8011/9001) remote: Counting objects: 90% (8101/9001) remote: Counting objects: 91% (8191/9001) remote: Counting objects: 92% (8281/9001) remote: Counting objects: 93% (8371/9001) remote: Counting objects: 94% (8461/9001) remote: Counting objects: 95% (8551/9001) remote: Counting objects: 96% (8641/9001) remote: Counting objects: 97% (8731/9001) remote: Counting objects: 98% (8821/9001) remote: Counting objects: 99% (8911/9001) remote: Counting objects: 100% (9001/9001) remote: Counting objects: 100% (9001/9001), done.
  5. 3.25 s remote: Compressing objects: 0% (1/2111) remote: Compressing objects: 1% (22/2111) remote: Compressing objects: 2% (43/2111) remote: Compressing objects: 3% (64/2111) remote: Compressing objects: 4% (85/2111) remote: Compressing objects: 5% (106/2111) remote: Compressing objects: 6% (127/2111) remote: Compressing objects: 7% (148/2111) remote: Compressing objects: 8% (169/2111) remote: Compressing objects: 9% (190/2111) remote: Compressing objects: 10% (212/2111) remote: Compressing objects: 11% (233/2111) remote: Compressing objects: 12% (254/2111) remote: Compressing objects: 13% (275/2111) remote: Compressing objects: 14% (296/2111) remote: Compressing objects: 15% (317/2111) remote: Compressing objects: 16% (338/2111) remote: Compressing objects: 17% (359/2111) remote: Compressing objects: 18% (380/2111) remote: Compressing objects: 19% (402/2111) remote: Compressing objects: 20% (423/2111) remote: Compressing objects: 20% (438/2111) remote: Compressing objects: 21% (444/2111) remote: Compressing objects: 22% (465/2111) remote: Compressing objects: 23% (486/2111) remote: Compressing objects: 24% (507/2111) remote: Compressing objects: 25% (528/2111) remote: Compressing objects: 26% (549/2111) remote: Compressing objects: 27% (570/2111) remote: Compressing objects: 28% (592/2111) remote: Compressing objects: 29% (613/2111) remote: Compressing objects: 29% (617/2111) remote: Compressing objects: 30% (634/2111) remote: Compressing objects: 31% (655/2111) remote: Compressing objects: 32% (676/2111) remote: Compressing objects: 33% (697/2111) remote: Compressing objects: 34% (718/2111) remote: Compressing objects: 35% (739/2111) remote: Compressing objects: 36% (760/2111) remote: Compressing objects: 37% (782/2111) remote: Compressing objects: 38% (803/2111) remote: Compressing objects: 39% (824/2111) remote: Compressing objects: 40% (845/2111) remote: Compressing objects: 41% (866/2111) remote: Compressing objects: 42% (887/2111) remote: Compressing objects: 43% (908/2111) remote: Compressing objects: 44% (929/2111) remote: Compressing objects: 45% (950/2111) remote: Compressing objects: 46% (972/2111) remote: Compressing objects: 47% (993/2111) remote: Compressing objects: 48% (1014/2111) remote: Compressing objects: 49% (1035/2111) remote: Compressing objects: 50% (1056/2111) remote: Compressing objects: 51% (1077/2111) remote: Compressing objects: 52% (1098/2111) remote: Compressing objects: 53% (1119/2111) remote: Compressing objects: 54% (1140/2111) remote: Compressing objects: 55% (1162/2111) remote: Compressing objects: 56% (1183/2111) remote: Compressing objects: 57% (1204/2111) remote: Compressing objects: 58% (1225/2111) remote: Compressing objects: 59% (1246/2111) remote: Compressing objects: 60% (1267/2111) remote: Compressing objects: 61% (1288/2111) remote: Compressing objects: 62% (1309/2111) remote: Compressing objects: 63% (1330/2111) remote: Compressing objects: 64% (1352/2111) remote: Compressing objects: 65% (1373/2111) remote: Compressing objects: 66% (1394/2111) remote: Compressing objects: 67% (1415/2111) remote: Compressing objects: 68% (1436/2111) remote: Compressing objects: 69% (1457/2111) remote: Compressing objects: 70% (1478/2111) remote: Compressing objects: 71% (1499/2111) remote: Compressing objects: 72% (1520/2111) remote: Compressing objects: 73% (1542/2111) remote: Compressing objects: 74% (1563/2111) remote: Compressing objects: 75% (1584/2111) remote: Compressing objects: 76% (1605/2111) remote: Compressing objects: 77% (1626/2111) remote: Compressing objects: 78% (1647/2111) remote: Compressing objects: 79% (1668/2111) remote: Compressing objects: 80% (1689/2111) remote: Compressing objects: 81% (1710/2111) remote: Compressing objects: 82% (1732/2111) remote: Compressing objects: 83% (1753/2111) remote: Compressing objects: 84% (1774/2111) remote: Compressing objects: 85% (1795/2111) remote: Compressing objects: 86% (1816/2111) remote: Compressing objects: 87% (1837/2111) remote: Compressing objects: 88% (1858/2111) remote: Compressing objects: 89% (1879/2111) remote: Compressing objects: 90% (1900/2111) remote: Compressing objects: 91% (1922/2111) remote: Compressing objects: 92% (1943/2111) remote: Compressing objects: 93% (1964/2111) remote: Compressing objects: 94% (1985/2111) remote: Compressing objects: 95% (2006/2111) remote: Compressing objects: 96% (2027/2111) remote: Compressing objects: 97% (2048/2111) remote: Compressing objects: 98% (2069/2111) remote: Compressing objects: 99% (2090/2111) remote: Compressing objects: 100% (2111/2111) remote: Compressing objects: 100% (2111/2111), done.
  6. 6.18 s Receiving objects: 0% (1/66329) Receiving objects: 1% (664/66329) Receiving objects: 2% (1327/66329) Receiving objects: 3% (1990/66329) Receiving objects: 4% (2654/66329) Receiving objects: 5% (3317/66329) Receiving objects: 6% (3980/66329) Receiving objects: 7% (4644/66329) Receiving objects: 8% (5307/66329) Receiving objects: 9% (5970/66329), 9.85 MiB | 19.69 MiB/s Receiving objects: 10% (6633/66329), 9.85 MiB | 19.69 MiB/s Receiving objects: 11% (7297/66329), 9.85 MiB | 19.69 MiB/s Receiving objects: 12% (7960/66329), 9.85 MiB | 19.69 MiB/s Receiving objects: 13% (8623/66329), 9.85 MiB | 19.69 MiB/s Receiving objects: 14% (9287/66329), 9.85 MiB | 19.69 MiB/s Receiving objects: 15% (9950/66329), 9.85 MiB | 19.69 MiB/s Receiving objects: 16% (10613/66329), 9.85 MiB | 19.69 MiB/s Receiving objects: 17% (11276/66329), 9.85 MiB | 19.69 MiB/s Receiving objects: 18% (11940/66329), 9.85 MiB | 19.69 MiB/s Receiving objects: 19% (12603/66329), 9.85 MiB | 19.69 MiB/s Receiving objects: 20% (13266/66329), 9.85 MiB | 19.69 MiB/s Receiving objects: 21% (13930/66329), 9.85 MiB | 19.69 MiB/s Receiving objects: 22% (14593/66329), 9.85 MiB | 19.69 MiB/s Receiving objects: 23% (15256/66329), 9.85 MiB | 19.69 MiB/s Receiving objects: 24% (15919/66329), 9.85 MiB | 19.69 MiB/s Receiving objects: 25% (16583/66329), 9.85 MiB | 19.69 MiB/s Receiving objects: 26% (17246/66329), 9.85 MiB | 19.69 MiB/s Receiving objects: 27% (17909/66329), 9.85 MiB | 19.69 MiB/s Receiving objects: 28% (18573/66329), 9.85 MiB | 19.69 MiB/s Receiving objects: 29% (19236/66329), 9.85 MiB | 19.69 MiB/s Receiving objects: 30% (19899/66329), 9.85 MiB | 19.69 MiB/s Receiving objects: 31% (20562/66329), 9.85 MiB | 19.69 MiB/s Receiving objects: 32% (21226/66329), 9.85 MiB | 19.69 MiB/s Receiving objects: 33% (21889/66329), 9.85 MiB | 19.69 MiB/s Receiving objects: 34% (22552/66329), 9.85 MiB | 19.69 MiB/s Receiving objects: 35% (23216/66329), 9.85 MiB | 19.69 MiB/s Receiving objects: 36% (23879/66329), 9.85 MiB | 19.69 MiB/s Receiving objects: 37% (24542/66329), 9.85 MiB | 19.69 MiB/s Receiving objects: 38% (25206/66329), 9.85 MiB | 19.69 MiB/s Receiving objects: 39% (25869/66329), 9.85 MiB | 19.69 MiB/s Receiving objects: 40% (26532/66329), 9.85 MiB | 19.69 MiB/s Receiving objects: 41% (27195/66329), 9.85 MiB | 19.69 MiB/s Receiving objects: 42% (27859/66329), 9.85 MiB | 19.69 MiB/s Receiving objects: 43% (28522/66329), 9.85 MiB | 19.69 MiB/s Receiving objects: 44% (29185/66329), 9.85 MiB | 19.69 MiB/s Receiving objects: 45% (29849/66329), 9.85 MiB | 19.69 MiB/s Receiving objects: 46% (30512/66329), 9.85 MiB | 19.69 MiB/s Receiving objects: 47% (31175/66329), 9.85 MiB | 19.69 MiB/s Receiving objects: 48% (31838/66329), 9.85 MiB | 19.69 MiB/s Receiving objects: 49% (32502/66329), 9.85 MiB | 19.69 MiB/s Receiving objects: 50% (33165/66329), 9.85 MiB | 19.69 MiB/s Receiving objects: 50% (33473/66329), 9.85 MiB | 19.69 MiB/s Receiving objects: 51% (33828/66329), 31.52 MiB | 31.51 MiB/s Receiving objects: 52% (34492/66329), 31.52 MiB | 31.51 MiB/s Receiving objects: 53% (35155/66329), 31.52 MiB | 31.51 MiB/s Receiving objects: 54% (35818/66329), 31.52 MiB | 31.51 MiB/s Receiving objects: 55% (36481/66329), 31.52 MiB | 31.51 MiB/s Receiving objects: 56% (37145/66329), 31.52 MiB | 31.51 MiB/s Receiving objects: 57% (37808/66329), 31.52 MiB | 31.51 MiB/s Receiving objects: 58% (38471/66329), 31.52 MiB | 31.51 MiB/s Receiving objects: 59% (39135/66329), 31.52 MiB | 31.51 MiB/s Receiving objects: 60% (39798/66329), 31.52 MiB | 31.51 MiB/s Receiving objects: 61% (40461/66329), 31.52 MiB | 31.51 MiB/s Receiving objects: 62% (41124/66329), 48.96 MiB | 32.55 MiB/s Receiving objects: 63% (41788/66329), 48.96 MiB | 32.55 MiB/s Receiving objects: 64% (42451/66329), 48.96 MiB | 32.55 MiB/s Receiving objects: 65% (43114/66329), 48.96 MiB | 32.55 MiB/s Receiving objects: 66% (43778/66329), 48.96 MiB | 32.55 MiB/s Receiving objects: 67% (44441/66329), 48.96 MiB | 32.55 MiB/s Receiving objects: 68% (45104/66329), 48.96 MiB | 32.55 MiB/s Receiving objects: 69% (45768/66329), 48.96 MiB | 32.55 MiB/s Receiving objects: 70% (46431/66329), 48.96 MiB | 32.55 MiB/s Receiving objects: 71% (47094/66329), 48.96 MiB | 32.55 MiB/s Receiving objects: 72% (47757/66329), 48.96 MiB | 32.55 MiB/s Receiving objects: 73% (48421/66329), 48.96 MiB | 32.55 MiB/s Receiving objects: 74% (49084/66329), 48.96 MiB | 32.55 MiB/s Receiving objects: 74% (49216/66329), 67.32 MiB | 33.39 MiB/s Receiving objects: 75% (49747/66329), 67.32 MiB | 33.39 MiB/s Receiving objects: 76% (50411/66329), 67.32 MiB | 33.39 MiB/s Receiving objects: 77% (51074/66329), 67.32 MiB | 33.39 MiB/s Receiving objects: 78% (51737/66329), 67.32 MiB | 33.39 MiB/s Receiving objects: 79% (52400/66329), 67.32 MiB | 33.39 MiB/s Receiving objects: 80% (53064/66329), 67.32 MiB | 33.39 MiB/s Receiving objects: 81% (53727/66329), 67.32 MiB | 33.39 MiB/s Receiving objects: 82% (54390/66329), 67.32 MiB | 33.39 MiB/s Receiving objects: 83% (55054/66329), 67.32 MiB | 33.39 MiB/s Receiving objects: 84% (55717/66329), 67.32 MiB | 33.39 MiB/s Receiving objects: 85% (56380/66329), 67.32 MiB | 33.39 MiB/s Receiving objects: 86% (57043/66329), 67.32 MiB | 33.39 MiB/s Receiving objects: 87% (57707/66329), 67.32 MiB | 33.39 MiB/s Receiving objects: 88% (58370/66329), 67.32 MiB | 33.39 MiB/s Receiving objects: 89% (59033/66329), 67.32 MiB | 33.39 MiB/s Receiving objects: 90% (59697/66329), 67.32 MiB | 33.39 MiB/s Receiving objects: 91% (60360/66329), 67.32 MiB | 33.39 MiB/s Receiving objects: 92% (61023/66329), 67.32 MiB | 33.39 MiB/s Receiving objects: 93% (61686/66329), 67.32 MiB | 33.39 MiB/s Receiving objects: 94% (62350/66329), 67.32 MiB | 33.39 MiB/s Receiving objects: 95% (63013/66329), 67.32 MiB | 33.39 MiB/s Receiving objects: 96% (63676/66329), 85.53 MiB | 34.00 MiB/s Receiving objects: 97% (64340/66329), 85.53 MiB | 34.00 MiB/s Receiving objects: 98% (65003/66329), 85.53 MiB | 34.00 MiB/s Receiving objects: 99% (65666/66329), 85.53 MiB | 34.00 MiB/s remote: Total 66329 (delta 7283), reused 7248 (delta 6605), pack-reused 57328 (from 1)
  7. 6.20 s Receiving objects: 100% (66329/66329), 85.53 MiB | 34.00 MiB/s Receiving objects: 100% (66329/66329), 98.63 MiB | 33.71 MiB/s, done.
  8. 6.87 s Resolving deltas: 0% (0/46380) Resolving deltas: 1% (464/46380) Resolving deltas: 2% (930/46380) Resolving deltas: 3% (1393/46380) Resolving deltas: 4% (1856/46380) Resolving deltas: 5% (2319/46380) Resolving deltas: 6% (2784/46380) Resolving deltas: 7% (3247/46380) Resolving deltas: 8% (3713/46380) Resolving deltas: 9% (4177/46380) Resolving deltas: 10% (4638/46380) Resolving deltas: 11% (5102/46380) Resolving deltas: 12% (5566/46380) Resolving deltas: 13% (6030/46380) Resolving deltas: 14% (6494/46380) Resolving deltas: 15% (6958/46380) Resolving deltas: 16% (7421/46380) Resolving deltas: 17% (7885/46380) Resolving deltas: 18% (8352/46380) Resolving deltas: 19% (8813/46380) Resolving deltas: 20% (9276/46380) Resolving deltas: 21% (9740/46380) Resolving deltas: 22% (10204/46380) Resolving deltas: 23% (10668/46380) Resolving deltas: 24% (11132/46380) Resolving deltas: 25% (11596/46380) Resolving deltas: 26% (12059/46380) Resolving deltas: 27% (12524/46380) Resolving deltas: 28% (12988/46380) Resolving deltas: 29% (13451/46380) Resolving deltas: 30% (13914/46380) Resolving deltas: 31% (14379/46380) Resolving deltas: 32% (14842/46380) Resolving deltas: 33% (15306/46380) Resolving deltas: 34% (15770/46380) Resolving deltas: 35% (16233/46380) Resolving deltas: 36% (16697/46380) Resolving deltas: 37% (17161/46380) Resolving deltas: 38% (17626/46380) Resolving deltas: 39% (18089/46380) Resolving deltas: 40% (18552/46380) Resolving deltas: 41% (19016/46380) Resolving deltas: 42% (19480/46380) Resolving deltas: 43% (19944/46380) Resolving deltas: 44% (20408/46380) Resolving deltas: 45% (20872/46380) Resolving deltas: 46% (21335/46380) Resolving deltas: 47% (21800/46380) Resolving deltas: 48% (22265/46380) Resolving deltas: 49% (22729/46380) Resolving deltas: 50% (23192/46380) Resolving deltas: 51% (23654/46380) Resolving deltas: 52% (24118/46380) Resolving deltas: 53% (24582/46380) Resolving deltas: 54% (25046/46380) Resolving deltas: 55% (25510/46380) Resolving deltas: 56% (25973/46380) Resolving deltas: 57% (26437/46380) Resolving deltas: 58% (26902/46380) Resolving deltas: 59% (27365/46380) Resolving deltas: 60% (27828/46380) Resolving deltas: 61% (28294/46380) Resolving deltas: 62% (28757/46380) Resolving deltas: 63% (29220/46380) Resolving deltas: 64% (29684/46380) Resolving deltas: 65% (30147/46380) Resolving deltas: 66% (30611/46380) Resolving deltas: 67% (31075/46380) Resolving deltas: 68% (31539/46380) Resolving deltas: 69% (32003/46380) Resolving deltas: 70% (32466/46380) Resolving deltas: 71% (32930/46380) Resolving deltas: 72% (33394/46380) Resolving deltas: 73% (33859/46380) Resolving deltas: 74% (34322/46380) Resolving deltas: 75% (34785/46380) Resolving deltas: 76% (35249/46380) Resolving deltas: 77% (35714/46380) Resolving deltas: 78% (36178/46380) Resolving deltas: 79% (36641/46380) Resolving deltas: 80% (37104/46380) Resolving deltas: 81% (37568/46380) Resolving deltas: 82% (38032/46380) Resolving deltas: 83% (38496/46380) Resolving deltas: 84% (38960/46380) Resolving deltas: 85% (39423/46380) Resolving deltas: 86% (39887/46380) Resolving deltas: 87% (40351/46380) Resolving deltas: 88% (40815/46380) Resolving deltas: 89% (41279/46380) Resolving deltas: 90% (41742/46380) Resolving deltas: 91% (42206/46380) Resolving deltas: 92% (42670/46380) Resolving deltas: 93% (43134/46380) Resolving deltas: 94% (43598/46380) Resolving deltas: 95% (44061/46380) Resolving deltas: 96% (44525/46380) Resolving deltas: 97% (44989/46380) Resolving deltas: 98% (45453/46380) Resolving deltas: 99% (45917/46380) Resolving deltas: 100% (46380/46380) Resolving deltas: 100% (46380/46380), done.
  9. 7.19 s Fetching commit 01539e7ee446a74d841b7fdf6f14190bf7c317ab for tydenso-in-gammaloop ...
  10. 7.19 s $ /nix/store/bcnisk3ydfgv26v2gw3zlky24g00yww2-git-2.54.0/bin/git fetch origin 01539e7ee446a74d841b7fdf6f14190bf7c317ab
  11. 7.64 s From https://github.com/alphal00p/gammaloop
  12. 7.64 s * branch 01539e7ee446a74d841b7fdf6f14190bf7c317ab -> FETCH_HEAD
  13. 7.65 s $ /nix/store/9ypz3flqsrl5xl495mm8h645gadjsxi1-coreutils-9.11/bin/timeout --kill-after=15s 7200s /nix/store/bcnisk3ydfgv26v2gw3zlky24g00yww2-git-2.54.0/bin/git -c advice.detachedHead=false checkout 01539e7ee446a74d841b7fdf6f14190bf7c317ab
  14. 7.83 s HEAD is now at 01539e7ee fix portable Spenso Typst display
  15. 7.83 s $ /nix/store/9ypz3flqsrl5xl495mm8h645gadjsxi1-coreutils-9.11/bin/timeout --kill-after=15s 7200s /nix/store/23zk8sgzamrbmj1fday15szf7f2279s8-nix-2.34.7/bin/nix --extra-experimental-features nix-command --extra-experimental-features flakes --log-format internal-json run .#packages.x86_64-linux.nix-ci-check-gammaloop-nextest-python-api --print-build-logs
  16. 15.76 s
  17. 15.84 s Downloading cached gammaloop-nextest-binaries-python-api-gammaloop-integration-tests from https://cache.nix-ci.com
  18. 16.49 s Downloaded cached gammaloop-nextest-binaries-python-api-gammaloop-integration-tests (8.6 MiB) in 659ms
  19. 16.49 s Progress: 0 of 1 built, 1 of 3 downloaded from cache
  20. 16.49 s Downloading cached gammaloop-nextest-binaries-python-api from https://cache.nix-ci.com
  21. 16.70 s Downloaded cached gammaloop-nextest-binaries-python-api (520 B) in 201ms
  22. 16.70 s Progress: 0 of 1 built, 2 of 3 downloaded from cache
  23. 16.70 s Downloading cached nix-ci-check-gammaloop-nextest-python-api from https://cache.nix-ci.com
  24. 16.70 s Downloaded cached nix-ci-check-gammaloop-nextest-python-api (1104 B) in 3ms
  25. 16.70 s Progress: 0 of 1 built, 3 of 3 downloaded from cache
  26. 25.67 s evaluating derivation 'g copying '/nix/store/wy5l evaluating derivation 'g copying '/nix/store/wy5l evaluating derivation 'g copying '/nix/store/wy5l evaluating derivation 'g copying '/nix/store/wy5l evaluating derivation 'g copying '/nix/store/wy5l evaluating derivation 'g copying '/nix/store/wy5l evaluating derivation 'g copying '/nix/store/wy5l evaluating derivation 'g copying '/nix/store/wy5l evaluating derivation 'g copying '/nix/store/wy5l evaluating derivation 'g querying gammaloop-nexte [0.6 KiB DL] querying py [5.3 KiB DL] querying li [8.0 KiB DL] querying la [0/7 built, 5/0/12 copie [1/0/6 built, 3/4/12 copbuilder.pl> Running phase: patchPhase
  27. 25.71 s builder.pl> Running phase: updateAutotoolsGnuConfigScriptsPhase
  28. 25.71 s builder.pl> Running phase: configurePhase
  29. 25.71 s builder.pl> no configure script, doing nothing
  30. 25.71 s builder.pl> Running phase: buildPhase
  31. 25.71 s builder.pl> Running phase: checkPhase
  32. 25.71 s builder.pl> Running phase: installPhase
  33. 25.71 s builder.pl> no Makefile or custom installPhase, doing nothing
  34. 25.71 s builder.pl> Running phase: fixupPhase
  35. 25.72 s builder.pl> shrinking RPATHs of ELF executables and libraries in /nix/store/n17p4y03iknmyjpnfk30rj7i0klr448n-builder.pl
  36. 25.72 s builder.pl> checking for references to /build/ in /nix/store/n17p4y03iknmyjpnfk30rj7i0klr448n-builder.pl...
  37. 25.73 s builder.pl> patching script interpreter paths in /nix/store/n17p4y03iknmyjpnfk30rj7i0klr448n-builder.pl
  38. 25.75 s builder.pl (post)> Uploading to the NixCI cache: /nix/store/n17p4y03iknmyjpnfk30rj7i0klr448n-builder.pl
  39. 25.79 s builder.pl (post)> warning: 'warn-short-path-literals' is deprecated, use 'lint-short-path-literals = ignore' instead
  40. 25.85 s builder.pl (post)> copying 0 paths...
  41. 25.91 s builder.pl (post)> warning: 'warn-short-path-literals' is deprecated, use 'lint-short-path-literals = ignore' instead
  42. 25.94 s builder.pl (post)> copying 0 paths...
  43. 26.86 s [1/5 built, 2/5/12 copie [1/5 built, 3/6/12 copie [1/4 built, 2/7/12 copie [1/4 built, 2/9/12 copie [1/4 built, 1/11/12 copipython3> structuredAttrs is enabled
  44. 26.92 s [1/1/3 built, 12 copied python3> created 227 symlinks in user environment
  45. 27.82 s python3 (post)> Uploading to the NixCI cache: /nix/store/3gi2x25n327sf3xma8b08jd57aqv69x5-python3-3.13.14-env
  46. 27.86 s python3 (post)> warning: 'warn-short-path-literals' is deprecated, use 'lint-short-path-literals = ignore' instead
  47. 27.93 s python3 (post)> copying 0 paths...
  48. 27.98 s python3 (post)> warning: 'warn-short-path-literals' is deprecated, use 'lint-short-path-literals = ignore' instead
  49. 28.25 s python3 (post)> copying 0 paths...
  50. 28.54 s [2/4 built, 12 copied (2 [1/2/3 built, 12 copied gammaloop-nextest-python-api> Extracting 1 binary, 1 build script output directory, and 3 linked paths to /build/nextest-archive-njqrSI
  51. 28.60 s gammaloop-nextest-python-api> Extracted 18 files to /build/nextest-archive-njqrSI in 0.07s
  52. 28.61 s gammaloop-nextest-python-api> ------------
  53. 28.61 s gammaloop-nextest-python-api> Nextest run ID 0f948b42-03f6-4516-8c27-3911af36eb78 with nextest profile: ci_gammaloop
  54. 28.61 s gammaloop-nextest-python-api> Starting 5 tests across 1 binary
  55. 28.73 s gammaloop-nextest-python-api> FAIL [ 0.122s] (1/5) gammaloop-integration-tests::test_python_api python_evaluate_sample_preserves_graph_grouping_and_incoming_pdgs
  56. 28.73 s gammaloop-nextest-python-api> stdout ---
  57. 28.73 s gammaloop-nextest-python-api>
  58. 28.73 s gammaloop-nextest-python-api> running 1 test
  59. 28.73 s gammaloop-nextest-python-api> test python_evaluate_sample_preserves_graph_grouping_and_incoming_pdgs ... FAILED
  60. 28.73 s gammaloop-nextest-python-api>
  61. 28.73 s gammaloop-nextest-python-api> failures:
  62. 28.73 s gammaloop-nextest-python-api>
  63. 28.73 s gammaloop-nextest-python-api> failures:
  64. 28.73 s gammaloop-nextest-python-api> python_evaluate_sample_preserves_graph_grouping_and_incoming_pdgs
  65. 28.73 s gammaloop-nextest-python-api>
  66. 28.73 s gammaloop-nextest-python-api> test result: FAILED. 0 passed; 1 failed; 0 ignored; 0 measured; 4 filtered out; finished in 0.12s
  67. 28.73 s gammaloop-nextest-python-api>
  68. 28.73 s gammaloop-nextest-python-api> stderr ---
  69. 28.73 s gammaloop-nextest-python-api> Error: Python API test subprocess failed.
  70. 28.73 s gammaloop-nextest-python-api> stdout:
  71. 28.73 s gammaloop-nextest-python-api> ┌────────────────────────────────────────────────────────┐
  72. 28.73 s gammaloop-nextest-python-api> │ You are running a restricted Symbolica instance. │
  73. 28.73 s gammaloop-nextest-python-api> │ │
  74. 28.73 s gammaloop-nextest-python-api> │ This mode is only permitted for non-commercial use and │
  75. 28.73 s gammaloop-nextest-python-api> │ is limited to one instance and core per machine. │
  76. 28.73 s gammaloop-nextest-python-api> │ │
  77. 28.73 s gammaloop-nextest-python-api> │ Hobbyists can easily acquire a free license key │
  78. 28.73 s gammaloop-nextest-python-api> │ that unlocks all cores and removes this banner: │
  79. 28.73 s gammaloop-nextest-python-api> │ │
  80. 28.73 s gammaloop-nextest-python-api> │ from symbolica import * │
  81. 28.73 s gammaloop-nextest-python-api> │ request_hobbyist_license('YOUR_NAME', 'YOUR_EMAIL') │
  82. 28.73 s gammaloop-nextest-python-api> │ │
  83. 28.73 s gammaloop-nextest-python-api> │ All other users can obtain a free 30-day trial key: │
  84. 28.73 s gammaloop-nextest-python-api> │ │
  85. 28.73 s gammaloop-nextest-python-api> │ from symbolica import * │
  86. 28.73 s gammaloop-nextest-python-api> │ request_trial_license('NAME', 'EMAIL', 'EMPLOYER') │
  87. 28.73 s gammaloop-nextest-python-api> │ │
  88. 28.73 s gammaloop-nextest-python-api> │ See https://symbolica.io/docs/get_started.html#license │
  89. 28.73 s gammaloop-nextest-python-api> └────────────────────────────────────────────────────────┘
  90. 28.73 s gammaloop-nextest-python-api> ┌───────────────────────────────────────────────────────────────────────────────────────────────────────────┐
  91. 28.73 s gammaloop-nextest-python-api> │ Cannot start new unlicensed Symbolica instance since there is already another one running on the machine. │
  92. 28.73 s gammaloop-nextest-python-api> └───────────────────────────────────────────────────────────────────────────────────────────────────────────┘
  93. 28.73 s gammaloop-nextest-python-api>
  94. 28.73 s gammaloop-nextest-python-api> stderr:
  95. 28.73 s gammaloop-nextest-python-api> ┌───────────────────────────────────┐
  96. 28.73 s gammaloop-nextest-python-api> │ The Symbolica license has expired │
  97. 28.73 s gammaloop-nextest-python-api> └───────────────────────────────────┘
  98. 28.73 s gammaloop-nextest-python-api>
  99. 28.73 s gammaloop-nextest-python-api>
  100. 28.73 s gammaloop-nextest-python-api> Location:
  101. 28.73 s gammaloop-nextest-python-api> tests/tests/test_python_api.rs:156:20
  102. 28.73 s gammaloop-nextest-python-api>
  103. 28.74 s gammaloop-nextest-python-api> FAIL [ 0.135s] (2/5) gammaloop-integration-tests::test_python_api python_evaluate_samples_batch_and_momentum_space_have_expected_shape
  104. 28.74 s gammaloop-nextest-python-api> stdout ---
  105. 28.74 s gammaloop-nextest-python-api>
  106. 28.74 s gammaloop-nextest-python-api> running 1 test
  107. 28.74 s gammaloop-nextest-python-api> test python_evaluate_samples_batch_and_momentum_space_have_expected_shape ... FAILED
  108. 28.74 s gammaloop-nextest-python-api>
  109. 28.74 s gammaloop-nextest-python-api> failures:
  110. 28.74 s gammaloop-nextest-python-api>
  111. 28.74 s gammaloop-nextest-python-api> failures:
  112. 28.74 s gammaloop-nextest-python-api> python_evaluate_samples_batch_and_momentum_space_have_expected_shape
  113. 28.75 s gammaloop-nextest-python-api>
  114. 28.75 s gammaloop-nextest-python-api> test result: FAILED. 0 passed; 1 failed; 0 ignored; 0 measured; 4 filtered out; finished in 0.13s
  115. 28.75 s gammaloop-nextest-python-api>
  116. 28.75 s gammaloop-nextest-python-api> stderr ---
  117. 28.75 s gammaloop-nextest-python-api> Error: Python API test subprocess failed.
  118. 28.75 s gammaloop-nextest-python-api> stdout:
  119. 28.75 s gammaloop-nextest-python-api> ┌────────────────────────────────────────────────────────┐
  120. 28.75 s gammaloop-nextest-python-api> │ You are running a restricted Symbolica instance. │
  121. 28.75 s gammaloop-nextest-python-api> │ │
  122. 28.75 s gammaloop-nextest-python-api> │ This mode is only permitted for non-commercial use and │
  123. 28.75 s gammaloop-nextest-python-api> │ is limited to one instance and core per machine. │
  124. 28.75 s gammaloop-nextest-python-api> │ │
  125. 28.75 s gammaloop-nextest-python-api> │ Hobbyists can easily acquire a free license key │
  126. 28.75 s gammaloop-nextest-python-api> │ that unlocks all cores and removes this banner: │
  127. 28.75 s gammaloop-nextest-python-api> │ │
  128. 28.75 s gammaloop-nextest-python-api> │ from symbolica import * │
  129. 28.75 s gammaloop-nextest-python-api> │ request_hobbyist_license('YOUR_NAME', 'YOUR_EMAIL') │
  130. 28.75 s gammaloop-nextest-python-api> │ │
  131. 28.75 s gammaloop-nextest-python-api> │ All other users can obtain a free 30-day trial key: │
  132. 28.75 s gammaloop-nextest-python-api> │ │
  133. 28.75 s gammaloop-nextest-python-api> │ from symbolica import * │
  134. 28.75 s gammaloop-nextest-python-api> │ request_trial_license('NAME', 'EMAIL', 'EMPLOYER') │
  135. 28.75 s gammaloop-nextest-python-api> │ │
  136. 28.75 s gammaloop-nextest-python-api> │ See https://symbolica.io/docs/get_started.html#license │
  137. 28.75 s gammaloop-nextest-python-api> └────────────────────────────────────────────────────────┘
  138. 28.75 s gammaloop-nextest-python-api> ┌───────────────────────────────────────────────────────────────────────────────────────────────────────────┐
  139. 28.75 s gammaloop-nextest-python-api> │ Cannot start new unlicensed Symbolica instance since there is already another one running on the machine. │
  140. 28.75 s gammaloop-nextest-python-api> └───────────────────────────────────────────────────────────────────────────────────────────────────────────┘
  141. 28.75 s gammaloop-nextest-python-api>
  142. 28.75 s gammaloop-nextest-python-api> stderr:
  143. 28.75 s gammaloop-nextest-python-api> ┌───────────────────────────────────┐
  144. 28.75 s gammaloop-nextest-python-api> │ The Symbolica license has expired │
  145. 28.75 s gammaloop-nextest-python-api> └───────────────────────────────────┘
  146. 28.75 s gammaloop-nextest-python-api>
  147. 28.75 s gammaloop-nextest-python-api>
  148. 28.75 s gammaloop-nextest-python-api> Location:
  149. 28.75 s gammaloop-nextest-python-api> tests/tests/test_python_api.rs:156:20
  150. 28.75 s gammaloop-nextest-python-api>
  151. 28.76 s gammaloop-nextest-python-api> FAIL [ 0.150s] (3/5) gammaloop-integration-tests::test_python_api python_session_getters_return_live_toml_and_command_blocks
  152. 28.76 s gammaloop-nextest-python-api> stdout ---
  153. 28.76 s gammaloop-nextest-python-api>
  154. 28.76 s gammaloop-nextest-python-api> running 1 test
  155. 28.76 s gammaloop-nextest-python-api> test python_session_getters_return_live_toml_and_command_blocks ... FAILED
  156. 28.76 s gammaloop-nextest-python-api>
  157. 28.76 s gammaloop-nextest-python-api> failures:
  158. 28.76 s gammaloop-nextest-python-api>
  159. 28.76 s gammaloop-nextest-python-api> failures:
  160. 28.76 s gammaloop-nextest-python-api> python_session_getters_return_live_toml_and_command_blocks
  161. 28.76 s gammaloop-nextest-python-api>
  162. 28.76 s gammaloop-nextest-python-api> test result: FAILED. 0 passed; 1 failed; 0 ignored; 0 measured; 4 filtered out; finished in 0.14s
  163. 28.76 s gammaloop-nextest-python-api>
  164. 28.76 s gammaloop-nextest-python-api> stderr ---
  165. 28.76 s gammaloop-nextest-python-api> Error: Python API test subprocess failed.
  166. 28.76 s gammaloop-nextest-python-api> stdout:
  167. 28.76 s gammaloop-nextest-python-api> ┌────────────────────────────────────────────────────────┐
  168. 28.76 s gammaloop-nextest-python-api> │ You are running a restricted Symbolica instance. │
  169. 28.76 s gammaloop-nextest-python-api> │ │
  170. 28.76 s gammaloop-nextest-python-api> │ This mode is only permitted for non-commercial use and │
  171. 28.76 s gammaloop-nextest-python-api> │ is limited to one instance and core per machine. │
  172. 28.76 s gammaloop-nextest-python-api> │ │
  173. 28.76 s gammaloop-nextest-python-api> │ Hobbyists can easily acquire a free license key │
  174. 28.76 s gammaloop-nextest-python-api> │ that unlocks all cores and removes this banner: │
  175. 28.76 s gammaloop-nextest-python-api> │ │
  176. 28.76 s gammaloop-nextest-python-api> │ from symbolica import * │
  177. 28.76 s gammaloop-nextest-python-api> │ request_hobbyist_license('YOUR_NAME', 'YOUR_EMAIL') │
  178. 28.76 s gammaloop-nextest-python-api> │ │
  179. 28.76 s gammaloop-nextest-python-api> │ All other users can obtain a free 30-day trial key: │
  180. 28.76 s gammaloop-nextest-python-api> │ │
  181. 28.76 s gammaloop-nextest-python-api> │ from symbolica import * │
  182. 28.76 s gammaloop-nextest-python-api> │ request_trial_license('NAME', 'EMAIL', 'EMPLOYER') │
  183. 28.76 s gammaloop-nextest-python-api> │ │
  184. 28.76 s gammaloop-nextest-python-api> │ See https://symbolica.io/docs/get_started.html#license │
  185. 28.76 s gammaloop-nextest-python-api> └────────────────────────────────────────────────────────┘
  186. 28.76 s gammaloop-nextest-python-api> ┌───────────────────────────────────────────────────────────────────────────────────────────────────────────┐
  187. 28.76 s gammaloop-nextest-python-api> │ Cannot start new unlicensed Symbolica instance since there is already another one running on the machine. │
  188. 28.76 s gammaloop-nextest-python-api> └───────────────────────────────────────────────────────────────────────────────────────────────────────────┘
  189. 28.76 s gammaloop-nextest-python-api>
  190. 28.76 s gammaloop-nextest-python-api> stderr:
  191. 28.76 s gammaloop-nextest-python-api> ┌───────────────────────────────────┐
  192. 28.76 s gammaloop-nextest-python-api> │ The Symbolica license has expired │
  193. 28.76 s gammaloop-nextest-python-api> └───────────────────────────────────┘
  194. 28.76 s gammaloop-nextest-python-api>
  195. 28.76 s gammaloop-nextest-python-api>
  196. 28.76 s gammaloop-nextest-python-api> Location:
  197. 28.76 s gammaloop-nextest-python-api> tests/tests/test_python_api.rs:156:20
  198. 28.76 s gammaloop-nextest-python-api>
  199. 28.82 s gammaloop-nextest-python-api> FAIL [ 0.215s] (4/5) gammaloop-integration-tests::test_python_api python_evaluate_sample_honors_generate_events_and_observable_snapshots
  200. 28.82 s gammaloop-nextest-python-api> stdout ---
  201. 28.82 s gammaloop-nextest-python-api>
  202. 28.82 s gammaloop-nextest-python-api> running 1 test
  203. 28.82 s gammaloop-nextest-python-api> test python_evaluate_sample_honors_generate_events_and_observable_snapshots ... FAILED
  204. 28.82 s gammaloop-nextest-python-api>
  205. 28.82 s gammaloop-nextest-python-api> failures:
  206. 28.82 s gammaloop-nextest-python-api>
  207. 28.82 s gammaloop-nextest-python-api> failures:
  208. 28.82 s gammaloop-nextest-python-api> python_evaluate_sample_honors_generate_events_and_observable_snapshots
  209. 28.82 s gammaloop-nextest-python-api>
  210. 28.82 s gammaloop-nextest-python-api> test result: FAILED. 0 passed; 1 failed; 0 ignored; 0 measured; 4 filtered out; finished in 0.21s
  211. 28.82 s gammaloop-nextest-python-api>
  212. 28.82 s gammaloop-nextest-python-api> stderr ---
  213. 28.82 s gammaloop-nextest-python-api> Error: Python API test subprocess failed.
  214. 28.82 s gammaloop-nextest-python-api> stdout:
  215. 28.82 s gammaloop-nextest-python-api> ┌────────────────────────────────────────────────────────┐
  216. 28.82 s gammaloop-nextest-python-api> │ You are running a restricted Symbolica instance. │
  217. 28.82 s gammaloop-nextest-python-api> │ │
  218. 28.82 s gammaloop-nextest-python-api> │ This mode is only permitted for non-commercial use and │
  219. 28.82 s gammaloop-nextest-python-api> │ is limited to one instance and core per machine. │
  220. 28.82 s gammaloop-nextest-python-api> │ │
  221. 28.82 s gammaloop-nextest-python-api> │ Hobbyists can easily acquire a free license key │
  222. 28.82 s gammaloop-nextest-python-api> │ that unlocks all cores and removes this banner: │
  223. 28.82 s gammaloop-nextest-python-api> │ │
  224. 28.82 s gammaloop-nextest-python-api> │ from symbolica import * │
  225. 28.82 s gammaloop-nextest-python-api> │ request_hobbyist_license('YOUR_NAME', 'YOUR_EMAIL') │
  226. 28.82 s gammaloop-nextest-python-api> │ │
  227. 28.82 s gammaloop-nextest-python-api> │ All other users can obtain a free 30-day trial key: │
  228. 28.82 s gammaloop-nextest-python-api> │ │
  229. 28.82 s gammaloop-nextest-python-api> │ from symbolica import * │
  230. 28.82 s gammaloop-nextest-python-api> │ request_trial_license('NAME', 'EMAIL', 'EMPLOYER') │
  231. 28.82 s gammaloop-nextest-python-api> │ │
  232. 28.82 s gammaloop-nextest-python-api> │ See https://symbolica.io/docs/get_started.html#license │
  233. 28.82 s gammaloop-nextest-python-api> └────────────────────────────────────────────────────────┘
  234. 28.83 s gammaloop-nextest-python-api> ┌───────────────────────────────────────────────────────────────────────────────────────────────────────────┐
  235. 28.83 s gammaloop-nextest-python-api> │ Cannot start new unlicensed Symbolica instance since there is already another one running on the machine. │
  236. 28.83 s gammaloop-nextest-python-api> └───────────────────────────────────────────────────────────────────────────────────────────────────────────┘
  237. 28.83 s gammaloop-nextest-python-api>
  238. 28.83 s gammaloop-nextest-python-api> stderr:
  239. 28.83 s gammaloop-nextest-python-api> ┌───────────────────────────────────┐
  240. 28.83 s gammaloop-nextest-python-api> │ The Symbolica license has expired │
  241. 28.83 s gammaloop-nextest-python-api> └───────────────────────────────────┘
  242. 28.83 s gammaloop-nextest-python-api> [2026-09-01 16:00:46.411] @gammaloop_api::se... INFO : Running command import model sm-default
  243. 28.83 s gammaloop-nextest-python-api> [2026-09-01 16:00:46.411] @import::model INFO : Loading built-in JSON model sm-default
  244. 28.83 s gammaloop-nextest-python-api> [2026-09-01 16:00:46.447] @gammalooprs::model INFO : The following 11 external parameters were forced to zero by the restriction card:
  245. 28.83 s gammaloop-nextest-python-api> lamWS, AWS, rhoWS, etaWS, ymc, yme, ymm, MC, Me, MM, WTau
  246. 28.83 s gammaloop-nextest-python-api> [2026-09-01 16:00:46.447] @gammalooprs::model INFO : The following 34 vertex rules were removed by the restriction card:
  247. 28.83 s gammaloop-nextest-python-api> V_82 -> (c~, d, G+) | V_83 -> (t~, d, G+) | V_84 -> (c~, s, G+) | V_85 -> (t~, s, G+) | V_86 -> (u~, b, G+) | V_87 -> (c~, b, G+) | V_90 -> (c~, d, W+) | V_91 -> (t~, d, W+) | V_92 -> (u~, s, W+) | V_94 -> (t~, s, W+) | V_95 -> (u~, b, W+) | V_96 -> (c~, b, W+) | V_101 -> (e+, e-, G0) | V_102 -> (mu+, mu-, G0) | V_104 -> (e+, e-, H) | V_105 -> (mu+, mu-, H) | V_110 -> (ve~, e-, G+) | V_111 -> (vm~, mu-, G+) | V_116 -> (b~, u, G-) | V_117 -> (d~, c, G-) | V_118 -> (s~, c, G-) | V_119 -> (b~, c, G-) | V_120 -> (d~, t, G-) | V_121 -> (s~, t, G-) | V_124 -> (s~, u, W-) | V_125 -> (b~, u, W-) | V_126 -> (d~, c, W-) | V_128 -> (b~, c, W-) | V_129 -> (d~, t, W-) | V_130 -> (s~, t, W-) | V_138 -> (c~, c, G0) | V_140 -> (c~, c, H) | V_145 -> (e+, ve, G-) | V_146 -> (mu+, vm, G-)
  248. 28.83 s gammaloop-nextest-python-api> [2026-09-01 16:00:46.447] @gammalooprs::model INFO : The following 36 couplings were removed by the restriction card:
  249. 28.83 s gammaloop-nextest-python-api> GC_13, GC_14, GC_16, GC_17, GC_18, GC_19, GC_20, GC_22, GC_23, GC_24, GC_25, GC_26, GC_28, GC_29, GC_42, GC_43, GC_44, GC_46, GC_47, GC_48, GC_84, GC_85, GC_86, GC_87, GC_88, GC_89, GC_90, GC_91, GC_92, GC_93, GC_101, GC_102, GC_103, GC_105, GC_106, GC_107
  250. 28.83 s gammaloop-nextest-python-api> [2026-09-01 16:00:46.447] @gammaloop_api::se... INFO : Running command set default-runtime kv kinematics.externals='{"type":"constant","data":{"momenta":[[32.0,0.0,0.0,32.0],[32.0,0.0,0.0,-32.0]],"helicities":[1,1]}}'
  251. 28.83 s gammaloop-nextest-python-api> [2026-09-01 16:00:46.448] @gammaloop_api::se... INFO : Running command set default-runtime kv subtraction.disable_threshold_subtraction=true
  252. 28.83 s gammaloop-nextest-python-api> [2026-09-01 16:00:46.449] @gammaloop_api::se... INFO : Running command generate xs e+ e- > d d~ g | e- a d g QED^2==4 [{{2}} QCD=0] --numerator-grouping group_identical_graphs_up_to_sign --clear-existing-processes --only-diagrams
  253. 28.83 s gammaloop-nextest-python-api> [2026-09-01 16:00:46.451] @feyngen::diagram_... INFO : 0s | Δ=0s | Starting Feynman graph generation with Symbolica...
  254. 28.83 s gammaloop-nextest-python-api> [2026-09-01 16:00:46.454] @feyngen::diagram_... INFO : 0s | Δ=0s | Number of graphs resulting from Symbolica generation: 246
  255. 28.83 s gammaloop-nextest-python-api> [2026-09-01 16:00:46.454] @feyngen::diagram_... INFO : 0s | Δ=0s | Number of graphs retained after enforcing supergraph particle content: 8
  256. 28.83 s gammaloop-nextest-python-api> [2026-09-01 16:00:46.454] @feyngen::diagram_... INFO : 0s | Δ=0s | Number of graphs retained after removal of vetoed topologies: 8
  257. 28.83 s gammaloop-nextest-python-api> [2026-09-01 16:00:46.454] @feyngen::diagram_... INFO : 0s | Δ=0s | Number of graphs after vertex info assignment: 8
  258. 28.83 s gammaloop-nextest-python-api> [2026-09-01 16:00:46.454] @feyngen::diagram_... INFO : 0s | Δ=0s | Number of graphs after all complete graphs filters are applied: 8
  259. 28.83 s gammaloop-nextest-python-api>
  260. 28.83 s gammaloop-nextest-python-api>
  261. 28.83 s gammaloop-nextest-python-api> Location:
  262. 28.83 s gammaloop-nextest-python-api> tests/tests/test_python_api.rs:156:20
  263. 28.83 s gammaloop-nextest-python-api>
  264. 28.83 s gammaloop-nextest-python-api> FAIL [ 0.223s] (5/5) gammaloop-integration-tests::test_python_api python_settings_wrappers_expose_nested_runtime_and_global_settings
  265. 28.83 s gammaloop-nextest-python-api> stdout ---
  266. 28.83 s gammaloop-nextest-python-api>
  267. 28.83 s gammaloop-nextest-python-api> running 1 test
  268. 28.83 s gammaloop-nextest-python-api> test python_settings_wrappers_expose_nested_runtime_and_global_settings ... FAILED
  269. 28.83 s gammaloop-nextest-python-api>
  270. 28.83 s gammaloop-nextest-python-api> failures:
  271. 28.83 s gammaloop-nextest-python-api>
  272. 28.83 s gammaloop-nextest-python-api> failures:
  273. 28.83 s gammaloop-nextest-python-api> python_settings_wrappers_expose_nested_runtime_and_global_settings
  274. 28.83 s gammaloop-nextest-python-api>
  275. 28.83 s gammaloop-nextest-python-api> test result: FAILED. 0 passed; 1 failed; 0 ignored; 0 measured; 4 filtered out; finished in 0.22s
  276. 28.83 s gammaloop-nextest-python-api>
  277. 28.83 s gammaloop-nextest-python-api> stderr ---
  278. 28.83 s gammaloop-nextest-python-api> Error: Python API test subprocess failed.
  279. 28.83 s gammaloop-nextest-python-api> stdout:
  280. 28.83 s gammaloop-nextest-python-api> ┌────────────────────────────────────────────────────────┐
  281. 28.83 s gammaloop-nextest-python-api> │ You are running a restricted Symbolica instance. │
  282. 28.83 s gammaloop-nextest-python-api> │ │
  283. 28.83 s gammaloop-nextest-python-api> │ This mode is only permitted for non-commercial use and │
  284. 28.83 s gammaloop-nextest-python-api> │ is limited to one instance and core per machine. │
  285. 28.83 s gammaloop-nextest-python-api> │ │
  286. 28.83 s gammaloop-nextest-python-api> │ Hobbyists can easily acquire a free license key │
  287. 28.83 s gammaloop-nextest-python-api> │ that unlocks all cores and removes this banner: │
  288. 28.83 s gammaloop-nextest-python-api> │ │
  289. 28.83 s gammaloop-nextest-python-api> │ from symbolica import * │
  290. 28.83 s gammaloop-nextest-python-api> │ request_hobbyist_license('YOUR_NAME', 'YOUR_EMAIL') │
  291. 28.83 s gammaloop-nextest-python-api> │ │
  292. 28.83 s gammaloop-nextest-python-api> │ All other users can obtain a free 30-day trial key: │
  293. 28.83 s gammaloop-nextest-python-api> │ │
  294. 28.83 s gammaloop-nextest-python-api> │ from symbolica import * │
  295. 28.83 s gammaloop-nextest-python-api> │ request_trial_license('NAME', 'EMAIL', 'EMPLOYER') │
  296. 28.83 s gammaloop-nextest-python-api> │ │
  297. 28.83 s gammaloop-nextest-python-api> │ See https://symbolica.io/docs/get_started.html#license │
  298. 28.83 s gammaloop-nextest-python-api> └────────────────────────────────────────────────────────┘
  299. 28.83 s gammaloop-nextest-python-api> ┌───────────────────────────────────────────────────────────────────────────────────────────────────────────┐
  300. 28.83 s gammaloop-nextest-python-api> │ Cannot start new unlicensed Symbolica instance since there is already another one running on the machine. │
  301. 28.83 s gammaloop-nextest-python-api> └───────────────────────────────────────────────────────────────────────────────────────────────────────────┘
  302. 28.83 s gammaloop-nextest-python-api>
  303. 28.83 s gammaloop-nextest-python-api> stderr:
  304. 28.83 s gammaloop-nextest-python-api> ┌───────────────────────────────────┐
  305. 28.83 s gammaloop-nextest-python-api> │ The Symbolica license has expired │
  306. 28.83 s gammaloop-nextest-python-api> └───────────────────────────────────┘
  307. 28.83 s gammaloop-nextest-python-api>
  308. 28.83 s gammaloop-nextest-python-api>
  309. 28.83 s gammaloop-nextest-python-api> Location:
  310. 28.83 s gammaloop-nextest-python-api> tests/tests/test_python_api.rs:156:20
  311. 28.83 s gammaloop-nextest-python-api>
  312. 28.83 s gammaloop-nextest-python-api> ------------
  313. 28.83 s gammaloop-nextest-python-api> Summary [ 0.223s] 5 tests run: 0 passed, 5 failed, 0 skipped
  314. 28.83 s gammaloop-nextest-python-api> FAIL [ 0.122s] (1/5) gammaloop-integration-tests::test_python_api python_evaluate_sample_preserves_graph_grouping_and_incoming_pdgs
  315. 28.83 s gammaloop-nextest-python-api> stdout ---
  316. 28.83 s gammaloop-nextest-python-api>
  317. 28.83 s gammaloop-nextest-python-api> running 1 test
  318. 28.83 s gammaloop-nextest-python-api> test python_evaluate_sample_preserves_graph_grouping_and_incoming_pdgs ... FAILED
  319. 28.83 s gammaloop-nextest-python-api>
  320. 28.83 s gammaloop-nextest-python-api> failures:
  321. 28.83 s gammaloop-nextest-python-api>
  322. 28.83 s gammaloop-nextest-python-api> failures:
  323. 28.83 s gammaloop-nextest-python-api> python_evaluate_sample_preserves_graph_grouping_and_incoming_pdgs
  324. 28.83 s gammaloop-nextest-python-api>
  325. 28.83 s gammaloop-nextest-python-api> test result: FAILED. 0 passed; 1 failed; 0 ignored; 0 measured; 4 filtered out; finished in 0.12s
  326. 28.83 s gammaloop-nextest-python-api>
  327. 28.83 s gammaloop-nextest-python-api> stderr ---
  328. 28.83 s gammaloop-nextest-python-api> Error: Python API test subprocess failed.
  329. 28.83 s gammaloop-nextest-python-api> stdout:
  330. 28.83 s gammaloop-nextest-python-api> ┌────────────────────────────────────────────────────────┐
  331. 28.83 s gammaloop-nextest-python-api> │ You are running a restricted Symbolica instance. │
  332. 28.83 s gammaloop-nextest-python-api> │ │
  333. 28.83 s gammaloop-nextest-python-api> │ This mode is only permitted for non-commercial use and │
  334. 28.83 s gammaloop-nextest-python-api> │ is limited to one instance and core per machine. │
  335. 28.83 s gammaloop-nextest-python-api> │ │
  336. 28.83 s gammaloop-nextest-python-api> │ Hobbyists can easily acquire a free license key │
  337. 28.83 s gammaloop-nextest-python-api> │ that unlocks all cores and removes this banner: │
  338. 28.83 s gammaloop-nextest-python-api> │ │
  339. 28.83 s gammaloop-nextest-python-api> │ from symbolica import * │
  340. 28.83 s gammaloop-nextest-python-api> │ request_hobbyist_license('YOUR_NAME', 'YOUR_EMAIL') │
  341. 28.83 s gammaloop-nextest-python-api> │ │
  342. 28.83 s gammaloop-nextest-python-api> │ All other users can obtain a free 30-day trial key: │
  343. 28.83 s gammaloop-nextest-python-api> │ │
  344. 28.83 s gammaloop-nextest-python-api> │ from symbolica import * │
  345. 28.83 s gammaloop-nextest-python-api> │ request_trial_license('NAME', 'EMAIL', 'EMPLOYER') │
  346. 28.83 s gammaloop-nextest-python-api> │ │
  347. 28.83 s gammaloop-nextest-python-api> │ See https://symbolica.io/docs/get_started.html#license │
  348. 28.83 s gammaloop-nextest-python-api> └────────────────────────────────────────────────────────┘
  349. 28.83 s gammaloop-nextest-python-api> ┌───────────────────────────────────────────────────────────────────────────────────────────────────────────┐
  350. 28.83 s gammaloop-nextest-python-api> │ Cannot start new unlicensed Symbolica instance since there is already another one running on the machine. │
  351. 28.83 s gammaloop-nextest-python-api> └───────────────────────────────────────────────────────────────────────────────────────────────────────────┘
  352. 28.83 s gammaloop-nextest-python-api>
  353. 28.83 s gammaloop-nextest-python-api> stderr:
  354. 28.83 s gammaloop-nextest-python-api> ┌───────────────────────────────────┐
  355. 28.83 s gammaloop-nextest-python-api> │ The Symbolica license has expired │
  356. 28.83 s gammaloop-nextest-python-api> └───────────────────────────────────┘
  357. 28.83 s gammaloop-nextest-python-api>
  358. 28.83 s gammaloop-nextest-python-api>
  359. 28.83 s gammaloop-nextest-python-api> Location:
  360. 28.83 s gammaloop-nextest-python-api> tests/tests/test_python_api.rs:156:20
  361. 28.83 s gammaloop-nextest-python-api>
  362. 28.83 s gammaloop-nextest-python-api> FAIL [ 0.135s] (2/5) gammaloop-integration-tests::test_python_api python_evaluate_samples_batch_and_momentum_space_have_expected_shape
  363. 28.83 s gammaloop-nextest-python-api> stdout ---
  364. 28.83 s gammaloop-nextest-python-api>
  365. 28.83 s gammaloop-nextest-python-api> running 1 test
  366. 28.83 s gammaloop-nextest-python-api> test python_evaluate_samples_batch_and_momentum_space_have_expected_shape ... FAILED
  367. 28.83 s gammaloop-nextest-python-api>
  368. 28.83 s gammaloop-nextest-python-api> failures:
  369. 28.83 s gammaloop-nextest-python-api>
  370. 28.83 s gammaloop-nextest-python-api> failures:
  371. 28.83 s gammaloop-nextest-python-api> python_evaluate_samples_batch_and_momentum_space_have_expected_shape
  372. 28.83 s gammaloop-nextest-python-api>
  373. 28.83 s gammaloop-nextest-python-api> test result: FAILED. 0 passed; 1 failed; 0 ignored; 0 measured; 4 filtered out; finished in 0.13s
  374. 28.83 s gammaloop-nextest-python-api>
  375. 28.83 s gammaloop-nextest-python-api> stderr ---
  376. 28.83 s gammaloop-nextest-python-api> Error: Python API test subprocess failed.
  377. 28.83 s gammaloop-nextest-python-api> stdout:
  378. 28.83 s gammaloop-nextest-python-api> ┌────────────────────────────────────────────────────────┐
  379. 28.83 s gammaloop-nextest-python-api> │ You are running a restricted Symbolica instance. │
  380. 28.83 s gammaloop-nextest-python-api> │ │
  381. 28.83 s gammaloop-nextest-python-api> │ This mode is only permitted for non-commercial use and │
  382. 28.83 s gammaloop-nextest-python-api> │ is limited to one instance and core per machine. │
  383. 28.83 s gammaloop-nextest-python-api> │ │
  384. 28.83 s gammaloop-nextest-python-api> │ Hobbyists can easily acquire a free license key │
  385. 28.83 s gammaloop-nextest-python-api> │ that unlocks all cores and removes this banner: │
  386. 28.83 s gammaloop-nextest-python-api> │ │
  387. 28.83 s gammaloop-nextest-python-api> │ from symbolica import * │
  388. 28.83 s gammaloop-nextest-python-api> │ request_hobbyist_license('YOUR_NAME', 'YOUR_EMAIL') │
  389. 28.83 s gammaloop-nextest-python-api> │ │
  390. 28.83 s gammaloop-nextest-python-api> │ All other users can obtain a free 30-day trial key: │
  391. 28.83 s gammaloop-nextest-python-api> │ │
  392. 28.83 s gammaloop-nextest-python-api> │ from symbolica import * │
  393. 28.83 s gammaloop-nextest-python-api> │ request_trial_license('NAME', 'EMAIL', 'EMPLOYER') │
  394. 28.83 s gammaloop-nextest-python-api> │ │
  395. 28.83 s gammaloop-nextest-python-api> │ See https://symbolica.io/docs/get_started.html#license │
  396. 28.83 s gammaloop-nextest-python-api> └────────────────────────────────────────────────────────┘
  397. 28.83 s gammaloop-nextest-python-api> ┌───────────────────────────────────────────────────────────────────────────────────────────────────────────┐
  398. 28.83 s gammaloop-nextest-python-api> │ Cannot start new unlicensed Symbolica instance since there is already another one running on the machine. │
  399. 28.83 s gammaloop-nextest-python-api> └───────────────────────────────────────────────────────────────────────────────────────────────────────────┘
  400. 28.83 s gammaloop-nextest-python-api>
  401. 28.83 s gammaloop-nextest-python-api> stderr:
  402. 28.83 s gammaloop-nextest-python-api> ┌───────────────────────────────────┐
  403. 28.83 s gammaloop-nextest-python-api> │ The Symbolica license has expired │
  404. 28.83 s gammaloop-nextest-python-api> └───────────────────────────────────┘
  405. 28.83 s gammaloop-nextest-python-api>
  406. 28.83 s gammaloop-nextest-python-api>
  407. 28.83 s gammaloop-nextest-python-api> Location:
  408. 28.83 s gammaloop-nextest-python-api> tests/tests/test_python_api.rs:156:20
  409. 28.83 s gammaloop-nextest-python-api>
  410. 28.83 s gammaloop-nextest-python-api> FAIL [ 0.150s] (3/5) gammaloop-integration-tests::test_python_api python_session_getters_return_live_toml_and_command_blocks
  411. 28.83 s gammaloop-nextest-python-api> stdout ---
  412. 28.83 s gammaloop-nextest-python-api>
  413. 28.83 s gammaloop-nextest-python-api> running 1 test
  414. 28.83 s gammaloop-nextest-python-api> test python_session_getters_return_live_toml_and_command_blocks ... FAILED
  415. 28.83 s gammaloop-nextest-python-api>
  416. 28.83 s gammaloop-nextest-python-api> failures:
  417. 28.83 s gammaloop-nextest-python-api>
  418. 28.83 s gammaloop-nextest-python-api> failures:
  419. 28.83 s gammaloop-nextest-python-api> python_session_getters_return_live_toml_and_command_blocks
  420. 28.83 s gammaloop-nextest-python-api>
  421. 28.83 s gammaloop-nextest-python-api> test result: FAILED. 0 passed; 1 failed; 0 ignored; 0 measured; 4 filtered out; finished in 0.14s
  422. 28.83 s gammaloop-nextest-python-api>
  423. 28.83 s gammaloop-nextest-python-api> stderr ---
  424. 28.83 s gammaloop-nextest-python-api> Error: Python API test subprocess failed.
  425. 28.84 s gammaloop-nextest-python-api> stdout:
  426. 28.84 s gammaloop-nextest-python-api> ┌────────────────────────────────────────────────────────┐
  427. 28.84 s gammaloop-nextest-python-api> │ You are running a restricted Symbolica instance. │
  428. 28.84 s gammaloop-nextest-python-api> │ │
  429. 28.84 s gammaloop-nextest-python-api> │ This mode is only permitted for non-commercial use and │
  430. 28.84 s gammaloop-nextest-python-api> │ is limited to one instance and core per machine. │
  431. 28.84 s gammaloop-nextest-python-api> │ │
  432. 28.84 s gammaloop-nextest-python-api> │ Hobbyists can easily acquire a free license key │
  433. 28.84 s gammaloop-nextest-python-api> │ that unlocks all cores and removes this banner: │
  434. 28.84 s gammaloop-nextest-python-api> │ │
  435. 28.84 s gammaloop-nextest-python-api> │ from symbolica import * │
  436. 28.84 s gammaloop-nextest-python-api> │ request_hobbyist_license('YOUR_NAME', 'YOUR_EMAIL') │
  437. 28.84 s gammaloop-nextest-python-api> │ │
  438. 28.84 s gammaloop-nextest-python-api> │ All other users can obtain a free 30-day trial key: │
  439. 28.84 s gammaloop-nextest-python-api> │ │
  440. 28.84 s gammaloop-nextest-python-api> │ from symbolica import * │
  441. 28.84 s gammaloop-nextest-python-api> │ request_trial_license('NAME', 'EMAIL', 'EMPLOYER') │
  442. 28.84 s gammaloop-nextest-python-api> │ │
  443. 28.84 s gammaloop-nextest-python-api> │ See https://symbolica.io/docs/get_started.html#license │
  444. 28.84 s gammaloop-nextest-python-api> └────────────────────────────────────────────────────────┘
  445. 28.84 s gammaloop-nextest-python-api> ┌───────────────────────────────────────────────────────────────────────────────────────────────────────────┐
  446. 28.84 s gammaloop-nextest-python-api> │ Cannot start new unlicensed Symbolica instance since there is already another one running on the machine. │
  447. 28.84 s gammaloop-nextest-python-api> └───────────────────────────────────────────────────────────────────────────────────────────────────────────┘
  448. 28.84 s gammaloop-nextest-python-api>
  449. 28.84 s gammaloop-nextest-python-api> stderr:
  450. 28.84 s gammaloop-nextest-python-api> ┌───────────────────────────────────┐
  451. 28.84 s gammaloop-nextest-python-api> │ The Symbolica license has expired │
  452. 28.84 s gammaloop-nextest-python-api> └───────────────────────────────────┘
  453. 28.84 s gammaloop-nextest-python-api>
  454. 28.84 s gammaloop-nextest-python-api>
  455. 28.84 s gammaloop-nextest-python-api> Location:
  456. 28.84 s gammaloop-nextest-python-api> tests/tests/test_python_api.rs:156:20
  457. 28.84 s gammaloop-nextest-python-api>
  458. 28.84 s gammaloop-nextest-python-api> FAIL [ 0.215s] (4/5) gammaloop-integration-tests::test_python_api python_evaluate_sample_honors_generate_events_and_observable_snapshots
  459. 28.84 s gammaloop-nextest-python-api> stdout ---
  460. 28.84 s gammaloop-nextest-python-api>
  461. 28.84 s gammaloop-nextest-python-api> running 1 test
  462. 28.84 s gammaloop-nextest-python-api> test python_evaluate_sample_honors_generate_events_and_observable_snapshots ... FAILED
  463. 28.84 s gammaloop-nextest-python-api>
  464. 28.84 s gammaloop-nextest-python-api> failures:
  465. 28.84 s gammaloop-nextest-python-api>
  466. 28.84 s gammaloop-nextest-python-api> failures:
  467. 28.84 s gammaloop-nextest-python-api> python_evaluate_sample_honors_generate_events_and_observable_snapshots
  468. 28.84 s gammaloop-nextest-python-api>
  469. 28.84 s gammaloop-nextest-python-api> test result: FAILED. 0 passed; 1 failed; 0 ignored; 0 measured; 4 filtered out; finished in 0.21s
  470. 28.84 s gammaloop-nextest-python-api>
  471. 28.84 s gammaloop-nextest-python-api> stderr ---
  472. 28.84 s gammaloop-nextest-python-api> Error: Python API test subprocess failed.
  473. 28.84 s gammaloop-nextest-python-api> stdout:
  474. 28.84 s gammaloop-nextest-python-api> ┌────────────────────────────────────────────────────────┐
  475. 28.84 s gammaloop-nextest-python-api> │ You are running a restricted Symbolica instance. │
  476. 28.84 s gammaloop-nextest-python-api> │ │
  477. 28.84 s gammaloop-nextest-python-api> │ This mode is only permitted for non-commercial use and │
  478. 28.84 s gammaloop-nextest-python-api> │ is limited to one instance and core per machine. │
  479. 28.84 s gammaloop-nextest-python-api> │ │
  480. 28.84 s gammaloop-nextest-python-api> │ Hobbyists can easily acquire a free license key │
  481. 28.84 s gammaloop-nextest-python-api> │ that unlocks all cores and removes this banner: │
  482. 28.84 s gammaloop-nextest-python-api> │ │
  483. 28.84 s gammaloop-nextest-python-api> │ from symbolica import * │
  484. 28.84 s gammaloop-nextest-python-api> │ request_hobbyist_license('YOUR_NAME', 'YOUR_EMAIL') │
  485. 28.84 s gammaloop-nextest-python-api> │ │
  486. 28.84 s gammaloop-nextest-python-api> │ All other users can obtain a free 30-day trial key: │
  487. 28.84 s gammaloop-nextest-python-api> │ │
  488. 28.84 s gammaloop-nextest-python-api> │ from symbolica import * │
  489. 28.84 s gammaloop-nextest-python-api> │ request_trial_license('NAME', 'EMAIL', 'EMPLOYER') │
  490. 28.84 s gammaloop-nextest-python-api> │ │
  491. 28.84 s gammaloop-nextest-python-api> │ See https://symbolica.io/docs/get_started.html#license │
  492. 28.84 s gammaloop-nextest-python-api> └────────────────────────────────────────────────────────┘
  493. 28.84 s gammaloop-nextest-python-api> ┌───────────────────────────────────────────────────────────────────────────────────────────────────────────┐
  494. 28.84 s gammaloop-nextest-python-api> │ Cannot start new unlicensed Symbolica instance since there is already another one running on the machine. │
  495. 28.84 s gammaloop-nextest-python-api> └───────────────────────────────────────────────────────────────────────────────────────────────────────────┘
  496. 28.84 s gammaloop-nextest-python-api>
  497. 28.84 s gammaloop-nextest-python-api> stderr:
  498. 28.84 s gammaloop-nextest-python-api> ┌───────────────────────────────────┐
  499. 28.84 s gammaloop-nextest-python-api> │ The Symbolica license has expired │
  500. 28.84 s gammaloop-nextest-python-api> └───────────────────────────────────┘
  501. 28.84 s gammaloop-nextest-python-api> [2026-09-01 16:00:46.411] @gammaloop_api::se... INFO : Running command import model sm-default
  502. 28.84 s gammaloop-nextest-python-api> [2026-09-01 16:00:46.411] @import::model INFO : Loading built-in JSON model sm-default
  503. 28.84 s gammaloop-nextest-python-api> [2026-09-01 16:00:46.447] @gammalooprs::model INFO : The following 11 external parameters were forced to zero by the restriction card:
  504. 28.84 s gammaloop-nextest-python-api> lamWS, AWS, rhoWS, etaWS, ymc, yme, ymm, MC, Me, MM, WTau
  505. 28.84 s gammaloop-nextest-python-api> [2026-09-01 16:00:46.447] @gammalooprs::model INFO : The following 34 vertex rules were removed by the restriction card:
  506. 28.84 s gammaloop-nextest-python-api> V_82 -> (c~, d, G+) | V_83 -> (t~, d, G+) | V_84 -> (c~, s, G+) | V_85 -> (t~, s, G+) | V_86 -> (u~, b, G+) | V_87 -> (c~, b, G+) | V_90 -> (c~, d, W+) | V_91 -> (t~, d, W+) | V_92 -> (u~, s, W+) | V_94 -> (t~, s, W+) | V_95 -> (u~, b, W+) | V_96 -> (c~, b, W+) | V_101 -> (e+, e-, G0) | V_102 -> (mu+, mu-, G0) | V_104 -> (e+, e-, H) | V_105 -> (mu+, mu-, H) | V_110 -> (ve~, e-, G+) | V_111 -> (vm~, mu-, G+) | V_116 -> (b~, u, G-) | V_117 -> (d~, c, G-) | V_118 -> (s~, c, G-) | V_119 -> (b~, c, G-) | V_120 -> (d~, t, G-) | V_121 -> (s~, t, G-) | V_124 -> (s~, u, W-) | V_125 -> (b~, u, W-) | V_126 -> (d~, c, W-) | V_128 -> (b~, c, W-) | V_129 -> (d~, t, W-) | V_130 -> (s~, t, W-) | V_138 -> (c~, c, G0) | V_140 -> (c~, c, H) | V_145 -> (e+, ve, G-) | V_146 -> (mu+, vm, G-)
  507. 28.84 s gammaloop-nextest-python-api> [2026-09-01 16:00:46.447] @gammalooprs::model INFO : The following 36 couplings were removed by the restriction card:
  508. 28.84 s gammaloop-nextest-python-api> GC_13, GC_14, GC_16, GC_17, GC_18, GC_19, GC_20, GC_22, GC_23, GC_24, GC_25, GC_26, GC_28, GC_29, GC_42, GC_43, GC_44, GC_46, GC_47, GC_48, GC_84, GC_85, GC_86, GC_87, GC_88, GC_89, GC_90, GC_91, GC_92, GC_93, GC_101, GC_102, GC_103, GC_105, GC_106, GC_107
  509. 28.84 s gammaloop-nextest-python-api> [2026-09-01 16:00:46.447] @gammaloop_api::se... INFO : Running command set default-runtime kv kinematics.externals='{"type":"constant","data":{"momenta":[[32.0,0.0,0.0,32.0],[32.0,0.0,0.0,-32.0]],"helicities":[1,1]}}'
  510. 28.84 s gammaloop-nextest-python-api> [2026-09-01 16:00:46.448] @gammaloop_api::se... INFO : Running command set default-runtime kv subtraction.disable_threshold_subtraction=true
  511. 28.84 s gammaloop-nextest-python-api> [2026-09-01 16:00:46.449] @gammaloop_api::se... INFO : Running command generate xs e+ e- > d d~ g | e- a d g QED^2==4 [{{2}} QCD=0] --numerator-grouping group_identical_graphs_up_to_sign --clear-existing-processes --only-diagrams
  512. 28.84 s gammaloop-nextest-python-api> [2026-09-01 16:00:46.451] @feyngen::diagram_... INFO : 0s | Δ=0s | Starting Feynman graph generation with Symbolica...
  513. 28.84 s gammaloop-nextest-python-api> [2026-09-01 16:00:46.454] @feyngen::diagram_... INFO : 0s | Δ=0s | Number of graphs resulting from Symbolica generation: 246
  514. 28.84 s gammaloop-nextest-python-api> [2026-09-01 16:00:46.454] @feyngen::diagram_... INFO : 0s | Δ=0s | Number of graphs retained after enforcing supergraph particle content: 8
  515. 28.84 s gammaloop-nextest-python-api> [2026-09-01 16:00:46.454] @feyngen::diagram_... INFO : 0s | Δ=0s | Number of graphs retained after removal of vetoed topologies: 8
  516. 28.84 s gammaloop-nextest-python-api> [2026-09-01 16:00:46.454] @feyngen::diagram_... INFO : 0s | Δ=0s | Number of graphs after vertex info assignment: 8
  517. 28.84 s gammaloop-nextest-python-api> [2026-09-01 16:00:46.454] @feyngen::diagram_... INFO : 0s | Δ=0s | Number of graphs after all complete graphs filters are applied: 8
  518. 28.84 s gammaloop-nextest-python-api>
  519. 28.84 s gammaloop-nextest-python-api>
  520. 28.84 s gammaloop-nextest-python-api> Location:
  521. 28.84 s gammaloop-nextest-python-api> tests/tests/test_python_api.rs:156:20
  522. 28.84 s gammaloop-nextest-python-api>
  523. 28.84 s gammaloop-nextest-python-api> FAIL [ 0.223s] (5/5) gammaloop-integration-tests::test_python_api python_settings_wrappers_expose_nested_runtime_and_global_settings
  524. 28.84 s gammaloop-nextest-python-api> stdout ---
  525. 28.84 s gammaloop-nextest-python-api>
  526. 28.84 s gammaloop-nextest-python-api> running 1 test
  527. 28.84 s gammaloop-nextest-python-api> test python_settings_wrappers_expose_nested_runtime_and_global_settings ... FAILED
  528. 28.84 s gammaloop-nextest-python-api>
  529. 28.84 s gammaloop-nextest-python-api> failures:
  530. 28.84 s gammaloop-nextest-python-api>
  531. 28.84 s gammaloop-nextest-python-api> failures:
  532. 28.84 s gammaloop-nextest-python-api> python_settings_wrappers_expose_nested_runtime_and_global_settings
  533. 28.84 s gammaloop-nextest-python-api>
  534. 28.84 s gammaloop-nextest-python-api> test result: FAILED. 0 passed; 1 failed; 0 ignored; 0 measured; 4 filtered out; finished in 0.22s
  535. 28.84 s gammaloop-nextest-python-api>
  536. 28.84 s gammaloop-nextest-python-api> stderr ---
  537. 28.84 s gammaloop-nextest-python-api> Error: Python API test subprocess failed.
  538. 28.84 s gammaloop-nextest-python-api> stdout:
  539. 28.84 s gammaloop-nextest-python-api> ┌────────────────────────────────────────────────────────┐
  540. 28.84 s gammaloop-nextest-python-api> │ You are running a restricted Symbolica instance. │
  541. 28.84 s gammaloop-nextest-python-api> │ │
  542. 28.84 s gammaloop-nextest-python-api> │ This mode is only permitted for non-commercial use and │
  543. 28.84 s gammaloop-nextest-python-api> │ is limited to one instance and core per machine. │
  544. 28.84 s gammaloop-nextest-python-api> │ │
  545. 28.84 s gammaloop-nextest-python-api> │ Hobbyists can easily acquire a free license key │
  546. 28.84 s gammaloop-nextest-python-api> │ that unlocks all cores and removes this banner: │
  547. 28.84 s gammaloop-nextest-python-api> │ │
  548. 28.84 s gammaloop-nextest-python-api> │ from symbolica import * │
  549. 28.84 s gammaloop-nextest-python-api> │ request_hobbyist_license('YOUR_NAME', 'YOUR_EMAIL') │
  550. 28.84 s gammaloop-nextest-python-api> │ │
  551. 28.84 s gammaloop-nextest-python-api> │ All other users can obtain a free 30-day trial key: │
  552. 28.84 s gammaloop-nextest-python-api> │ │
  553. 28.84 s gammaloop-nextest-python-api> │ from symbolica import * │
  554. 28.84 s gammaloop-nextest-python-api> │ request_trial_license('NAME', 'EMAIL', 'EMPLOYER') │
  555. 28.84 s gammaloop-nextest-python-api> │ │
  556. 28.84 s gammaloop-nextest-python-api> │ See https://symbolica.io/docs/get_started.html#license │
  557. 28.84 s gammaloop-nextest-python-api> └────────────────────────────────────────────────────────┘
  558. 28.84 s gammaloop-nextest-python-api> ┌───────────────────────────────────────────────────────────────────────────────────────────────────────────┐
  559. 28.84 s gammaloop-nextest-python-api> │ Cannot start new unlicensed Symbolica instance since there is already another one running on the machine. │
  560. 28.84 s gammaloop-nextest-python-api> └───────────────────────────────────────────────────────────────────────────────────────────────────────────┘
  561. 28.84 s gammaloop-nextest-python-api>
  562. 28.84 s gammaloop-nextest-python-api> stderr:
  563. 28.84 s gammaloop-nextest-python-api> ┌───────────────────────────────────┐
  564. 28.84 s gammaloop-nextest-python-api> │ The Symbolica license has expired │
  565. 28.84 s gammaloop-nextest-python-api> └───────────────────────────────────┘
  566. 28.84 s gammaloop-nextest-python-api>
  567. 28.84 s gammaloop-nextest-python-api>
  568. 28.84 s gammaloop-nextest-python-api> Location:
  569. 28.84 s gammaloop-nextest-python-api> tests/tests/test_python_api.rs:156:20
  570. 28.84 s gammaloop-nextest-python-api>
  571. 28.85 s gammaloop-nextest-python-api> error: test run failed
  572. 28.88 s gammaloop-nextest-python-api>
  573. 28.88 s gammaloop-nextest-python-api> ========== nextest test summary ==========
  574. 28.88 s gammaloop-nextest-python-api> report: target/nextest/ci_gammaloop/junit.xml
  575. 28.88 s gammaloop-nextest-python-api> tests: 5, failures: 5, errors: 0
  576. 28.88 s gammaloop-nextest-python-api>
  577. 28.88 s gammaloop-nextest-python-api> 1. gammaloop-integration-tests::test_python_api::python_evaluate_sample_preserves_graph_grouping_and_incoming_pdgs
  578. 28.88 s gammaloop-nextest-python-api> failure: test failure with exit code 101
  579. 28.88 s gammaloop-nextest-python-api> Error: Python API test subprocess failed.
  580. 28.88 s gammaloop-nextest-python-api> stdout:
  581. 28.88 s gammaloop-nextest-python-api> ┌────────────────────────────────────────────────────────┐
  582. 28.88 s gammaloop-nextest-python-api> │ You are running a restricted Symbolica instance. │
  583. 28.88 s gammaloop-nextest-python-api> │ │
  584. 28.88 s gammaloop-nextest-python-api> │ This mode is only permitted for non-commercial use and │
  585. 28.88 s gammaloop-nextest-python-api> │ is limited to one instance and core per machine. │
  586. 28.88 s gammaloop-nextest-python-api> │ │
  587. 28.88 s gammaloop-nextest-python-api> │ Hobbyists can easily acquire a free license key │
  588. 28.88 s gammaloop-nextest-python-api> │ that unlocks all cores and removes this banner: │
  589. 28.88 s gammaloop-nextest-python-api> │ │
  590. 28.88 s gammaloop-nextest-python-api> │ from symbolica import * │
  591. 28.88 s gammaloop-nextest-python-api> │ request_hobbyist_license('YOUR_NAME', 'YOUR_EMAIL') │
  592. 28.88 s gammaloop-nextest-python-api> │ │
  593. 28.88 s gammaloop-nextest-python-api> │ All other users can obtain a free 30-day trial key: │
  594. 28.88 s gammaloop-nextest-python-api> │ │
  595. 28.88 s gammaloop-nextest-python-api> │ from symbolica import * │
  596. 28.88 s gammaloop-nextest-python-api> │ request_trial_license('NAME', 'EMAIL', 'EMPLOYER') │
  597. 28.88 s gammaloop-nextest-python-api> │ │
  598. 28.88 s gammaloop-nextest-python-api> │ See https://symbolica.io/docs/get_started.html#license │
  599. 28.88 s gammaloop-nextest-python-api> └────────────────────────────────────────────────────────┘
  600. 28.88 s gammaloop-nextest-python-api> ┌───────────────────────────────────────────────────────────────────────────────────────────────────────────┐
  601. 28.88 s gammaloop-nextest-python-api> │ Cannot start new unlicensed Symbolica instance since there is already another one running on the machine. │
  602. 28.88 s gammaloop-nextest-python-api> └───────────────────────────────────────────────────────────────────────────────────────────────────────────┘
  603. 28.88 s gammaloop-nextest-python-api>
  604. 28.88 s gammaloop-nextest-python-api> stderr:
  605. 28.88 s gammaloop-nextest-python-api> ┌───────────────────────────────────┐
  606. 28.88 s gammaloop-nextest-python-api> │ The Symbolica license has expired │
  607. 28.88 s gammaloop-nextest-python-api> └───────────────────────────────────┘
  608. 28.88 s gammaloop-nextest-python-api>
  609. 28.88 s gammaloop-nextest-python-api>
  610. 28.88 s gammaloop-nextest-python-api> Location:
  611. 28.88 s gammaloop-nextest-python-api> tests/tests/test_python_api.rs:156:20
  612. 28.88 s gammaloop-nextest-python-api> system-out
  613. 28.88 s gammaloop-nextest-python-api> running 1 test
  614. 28.88 s gammaloop-nextest-python-api> test python_evaluate_sample_preserves_graph_grouping_and_incoming_pdgs ... FAILED
  615. 28.88 s gammaloop-nextest-python-api>
  616. 28.88 s gammaloop-nextest-python-api> failures:
  617. 28.88 s gammaloop-nextest-python-api>
  618. 28.88 s gammaloop-nextest-python-api> failures:
  619. 28.88 s gammaloop-nextest-python-api> python_evaluate_sample_preserves_graph_grouping_and_incoming_pdgs
  620. 28.88 s gammaloop-nextest-python-api>
  621. 28.88 s gammaloop-nextest-python-api> test result: FAILED. 0 passed; 1 failed; 0 ignored; 0 measured; 4 filtered out; finished in 0.12s
  622. 28.88 s gammaloop-nextest-python-api> system-err
  623. 28.88 s gammaloop-nextest-python-api> Error: Python API test subprocess failed.
  624. 28.88 s gammaloop-nextest-python-api> stdout:
  625. 28.88 s gammaloop-nextest-python-api> ┌────────────────────────────────────────────────────────┐
  626. 28.88 s gammaloop-nextest-python-api> │ You are running a restricted Symbolica instance. │
  627. 28.88 s gammaloop-nextest-python-api> │ │
  628. 28.88 s gammaloop-nextest-python-api> │ This mode is only permitted for non-commercial use and │
  629. 28.88 s gammaloop-nextest-python-api> │ is limited to one instance and core per machine. │
  630. 28.88 s gammaloop-nextest-python-api> │ │
  631. 28.88 s gammaloop-nextest-python-api> │ Hobbyists can easily acquire a free license key │
  632. 28.88 s gammaloop-nextest-python-api> │ that unlocks all cores and removes this banner: │
  633. 28.88 s gammaloop-nextest-python-api> │ │
  634. 28.88 s gammaloop-nextest-python-api> │ from symbolica import * │
  635. 28.88 s gammaloop-nextest-python-api> │ request_hobbyist_license('YOUR_NAME', 'YOUR_EMAIL') │
  636. 28.88 s gammaloop-nextest-python-api> │ │
  637. 28.88 s gammaloop-nextest-python-api> │ All other users can obtain a free 30-day trial key: │
  638. 28.88 s gammaloop-nextest-python-api> │ │
  639. 28.88 s gammaloop-nextest-python-api> │ from symbolica import * │
  640. 28.88 s gammaloop-nextest-python-api> │ request_trial_license('NAME', 'EMAIL', 'EMPLOYER') │
  641. 28.88 s gammaloop-nextest-python-api> │ │
  642. 28.88 s gammaloop-nextest-python-api> │ See https://symbolica.io/docs/get_started.html#license │
  643. 28.88 s gammaloop-nextest-python-api> └────────────────────────────────────────────────────────┘
  644. 28.88 s gammaloop-nextest-python-api> ┌───────────────────────────────────────────────────────────────────────────────────────────────────────────┐
  645. 28.88 s gammaloop-nextest-python-api> │ Cannot start new unlicensed Symbolica instance since there is already another one running on the machine. │
  646. 28.88 s gammaloop-nextest-python-api> └───────────────────────────────────────────────────────────────────────────────────────────────────────────┘
  647. 28.88 s gammaloop-nextest-python-api>
  648. 28.88 s gammaloop-nextest-python-api> stderr:
  649. 28.88 s gammaloop-nextest-python-api> ┌───────────────────────────────────┐
  650. 28.88 s gammaloop-nextest-python-api> │ The Symbolica license has expired │
  651. 28.88 s gammaloop-nextest-python-api> └───────────────────────────────────┘
  652. 28.88 s gammaloop-nextest-python-api>
  653. 28.88 s gammaloop-nextest-python-api>
  654. 28.88 s gammaloop-nextest-python-api> Location:
  655. 28.88 s gammaloop-nextest-python-api> tests/tests/test_python_api.rs:156:20
  656. 28.88 s gammaloop-nextest-python-api>
  657. 28.88 s gammaloop-nextest-python-api> 2. gammaloop-integration-tests::test_python_api::python_evaluate_samples_batch_and_momentum_space_have_expected_shape
  658. 28.88 s gammaloop-nextest-python-api> failure: test failure with exit code 101
  659. 28.88 s gammaloop-nextest-python-api> Error: Python API test subprocess failed.
  660. 28.88 s gammaloop-nextest-python-api> stdout:
  661. 28.88 s gammaloop-nextest-python-api> ┌────────────────────────────────────────────────────────┐
  662. 28.88 s gammaloop-nextest-python-api> │ You are running a restricted Symbolica instance. │
  663. 28.88 s gammaloop-nextest-python-api> │ │
  664. 28.88 s gammaloop-nextest-python-api> │ This mode is only permitted for non-commercial use and │
  665. 28.88 s gammaloop-nextest-python-api> │ is limited to one instance and core per machine. │
  666. 28.88 s gammaloop-nextest-python-api> │ │
  667. 28.88 s gammaloop-nextest-python-api> │ Hobbyists can easily acquire a free license key │
  668. 28.88 s gammaloop-nextest-python-api> │ that unlocks all cores and removes this banner: │
  669. 28.88 s gammaloop-nextest-python-api> │ │
  670. 28.88 s gammaloop-nextest-python-api> │ from symbolica import * │
  671. 28.88 s gammaloop-nextest-python-api> │ request_hobbyist_license('YOUR_NAME', 'YOUR_EMAIL') │
  672. 28.88 s gammaloop-nextest-python-api> │ │
  673. 28.88 s gammaloop-nextest-python-api> │ All other users can obtain a free 30-day trial key: │
  674. 28.88 s gammaloop-nextest-python-api> │ │
  675. 28.88 s gammaloop-nextest-python-api> │ from symbolica import * │
  676. 28.88 s gammaloop-nextest-python-api> │ request_trial_license('NAME', 'EMAIL', 'EMPLOYER') │
  677. 28.88 s gammaloop-nextest-python-api> │ │
  678. 28.88 s gammaloop-nextest-python-api> │ See https://symbolica.io/docs/get_started.html#license │
  679. 28.88 s gammaloop-nextest-python-api> └────────────────────────────────────────────────────────┘
  680. 28.88 s gammaloop-nextest-python-api> ┌───────────────────────────────────────────────────────────────────────────────────────────────────────────┐
  681. 28.88 s gammaloop-nextest-python-api> │ Cannot start new unlicensed Symbolica instance since there is already another one running on the machine. │
  682. 28.88 s gammaloop-nextest-python-api> └───────────────────────────────────────────────────────────────────────────────────────────────────────────┘
  683. 28.88 s gammaloop-nextest-python-api>
  684. 28.88 s gammaloop-nextest-python-api> stderr:
  685. 28.88 s gammaloop-nextest-python-api> ┌───────────────────────────────────┐
  686. 28.88 s gammaloop-nextest-python-api> │ The Symbolica license has expired │
  687. 28.88 s gammaloop-nextest-python-api> └───────────────────────────────────┘
  688. 28.88 s gammaloop-nextest-python-api>
  689. 28.88 s gammaloop-nextest-python-api>
  690. 28.88 s gammaloop-nextest-python-api> Location:
  691. 28.88 s gammaloop-nextest-python-api> tests/tests/test_python_api.rs:156:20
  692. 28.88 s gammaloop-nextest-python-api> system-out
  693. 28.88 s gammaloop-nextest-python-api> running 1 test
  694. 28.88 s gammaloop-nextest-python-api> test python_evaluate_samples_batch_and_momentum_space_have_expected_shape ... FAILED
  695. 28.88 s gammaloop-nextest-python-api>
  696. 28.88 s gammaloop-nextest-python-api> failures:
  697. 28.88 s gammaloop-nextest-python-api>
  698. 28.88 s gammaloop-nextest-python-api> failures:
  699. 28.88 s gammaloop-nextest-python-api> python_evaluate_samples_batch_and_momentum_space_have_expected_shape
  700. 28.88 s gammaloop-nextest-python-api>
  701. 28.88 s gammaloop-nextest-python-api> test result: FAILED. 0 passed; 1 failed; 0 ignored; 0 measured; 4 filtered out; finished in 0.13s
  702. 28.88 s gammaloop-nextest-python-api> system-err
  703. 28.88 s gammaloop-nextest-python-api> Error: Python API test subprocess failed.
  704. 28.88 s gammaloop-nextest-python-api> stdout:
  705. 28.88 s gammaloop-nextest-python-api> ┌────────────────────────────────────────────────────────┐
  706. 28.88 s gammaloop-nextest-python-api> │ You are running a restricted Symbolica instance. │
  707. 28.88 s gammaloop-nextest-python-api> │ │
  708. 28.88 s gammaloop-nextest-python-api> │ This mode is only permitted for non-commercial use and │
  709. 28.88 s gammaloop-nextest-python-api> │ is limited to one instance and core per machine. │
  710. 28.88 s gammaloop-nextest-python-api> │ │
  711. 28.88 s gammaloop-nextest-python-api> │ Hobbyists can easily acquire a free license key │
  712. 28.88 s gammaloop-nextest-python-api> │ that unlocks all cores and removes this banner: │
  713. 28.88 s gammaloop-nextest-python-api> │ │
  714. 28.88 s gammaloop-nextest-python-api> │ from symbolica import * │
  715. 28.88 s gammaloop-nextest-python-api> │ request_hobbyist_license('YOUR_NAME', 'YOUR_EMAIL') │
  716. 28.88 s gammaloop-nextest-python-api> │ │
  717. 28.88 s gammaloop-nextest-python-api> │ All other users can obtain a free 30-day trial key: │
  718. 28.88 s gammaloop-nextest-python-api> │ │
  719. 28.88 s gammaloop-nextest-python-api> │ from symbolica import * │
  720. 28.88 s gammaloop-nextest-python-api> │ request_trial_license('NAME', 'EMAIL', 'EMPLOYER') │
  721. 28.88 s gammaloop-nextest-python-api> │ │
  722. 28.88 s gammaloop-nextest-python-api> │ See https://symbolica.io/docs/get_started.html#license │
  723. 28.88 s gammaloop-nextest-python-api> └────────────────────────────────────────────────────────┘
  724. 28.88 s gammaloop-nextest-python-api> ┌───────────────────────────────────────────────────────────────────────────────────────────────────────────┐
  725. 28.88 s gammaloop-nextest-python-api> │ Cannot start new unlicensed Symbolica instance since there is already another one running on the machine. │
  726. 28.88 s gammaloop-nextest-python-api> └───────────────────────────────────────────────────────────────────────────────────────────────────────────┘
  727. 28.88 s gammaloop-nextest-python-api>
  728. 28.88 s gammaloop-nextest-python-api> stderr:
  729. 28.88 s gammaloop-nextest-python-api> ┌───────────────────────────────────┐
  730. 28.88 s gammaloop-nextest-python-api> │ The Symbolica license has expired │
  731. 28.88 s gammaloop-nextest-python-api> └───────────────────────────────────┘
  732. 28.88 s gammaloop-nextest-python-api>
  733. 28.88 s gammaloop-nextest-python-api>
  734. 28.88 s gammaloop-nextest-python-api> Location:
  735. 28.88 s gammaloop-nextest-python-api> tests/tests/test_python_api.rs:156:20
  736. 28.88 s gammaloop-nextest-python-api>
  737. 28.88 s gammaloop-nextest-python-api> 3. gammaloop-integration-tests::test_python_api::python_session_getters_return_live_toml_and_command_blocks
  738. 28.88 s gammaloop-nextest-python-api> failure: test failure with exit code 101
  739. 28.88 s gammaloop-nextest-python-api> Error: Python API test subprocess failed.
  740. 28.88 s gammaloop-nextest-python-api> stdout:
  741. 28.88 s gammaloop-nextest-python-api> ┌────────────────────────────────────────────────────────┐
  742. 28.88 s gammaloop-nextest-python-api> │ You are running a restricted Symbolica instance. │
  743. 28.88 s gammaloop-nextest-python-api> │ │
  744. 28.88 s gammaloop-nextest-python-api> │ This mode is only permitted for non-commercial use and │
  745. 28.88 s gammaloop-nextest-python-api> │ is limited to one instance and core per machine. │
  746. 28.88 s gammaloop-nextest-python-api> │ │
  747. 28.88 s gammaloop-nextest-python-api> │ Hobbyists can easily acquire a free license key │
  748. 28.88 s gammaloop-nextest-python-api> │ that unlocks all cores and removes this banner: │
  749. 28.88 s gammaloop-nextest-python-api> │ │
  750. 28.88 s gammaloop-nextest-python-api> │ from symbolica import * │
  751. 28.88 s gammaloop-nextest-python-api> │ request_hobbyist_license('YOUR_NAME', 'YOUR_EMAIL') │
  752. 28.88 s gammaloop-nextest-python-api> │ │
  753. 28.88 s gammaloop-nextest-python-api> │ All other users can obtain a free 30-day trial key: │
  754. 28.88 s gammaloop-nextest-python-api> │ │
  755. 28.88 s gammaloop-nextest-python-api> │ from symbolica import * │
  756. 28.88 s gammaloop-nextest-python-api> │ request_trial_license('NAME', 'EMAIL', 'EMPLOYER') │
  757. 28.88 s gammaloop-nextest-python-api> │ │
  758. 28.88 s gammaloop-nextest-python-api> │ See https://symbolica.io/docs/get_started.html#license │
  759. 28.88 s gammaloop-nextest-python-api> └────────────────────────────────────────────────────────┘
  760. 28.88 s gammaloop-nextest-python-api> ┌───────────────────────────────────────────────────────────────────────────────────────────────────────────┐
  761. 28.88 s gammaloop-nextest-python-api> │ Cannot start new unlicensed Symbolica instance since there is already another one running on the machine. │
  762. 28.88 s gammaloop-nextest-python-api> └───────────────────────────────────────────────────────────────────────────────────────────────────────────┘
  763. 28.88 s gammaloop-nextest-python-api>
  764. 28.88 s gammaloop-nextest-python-api> stderr:
  765. 28.88 s gammaloop-nextest-python-api> ┌───────────────────────────────────┐
  766. 28.88 s gammaloop-nextest-python-api> │ The Symbolica license has expired │
  767. 28.88 s gammaloop-nextest-python-api> └───────────────────────────────────┘
  768. 28.88 s gammaloop-nextest-python-api>
  769. 28.88 s gammaloop-nextest-python-api>
  770. 28.88 s gammaloop-nextest-python-api> Location:
  771. 28.88 s gammaloop-nextest-python-api> tests/tests/test_python_api.rs:156:20
  772. 28.88 s gammaloop-nextest-python-api> system-out
  773. 28.88 s gammaloop-nextest-python-api> running 1 test
  774. 28.88 s gammaloop-nextest-python-api> test python_session_getters_return_live_toml_and_command_blocks ... FAILED
  775. 28.88 s gammaloop-nextest-python-api>
  776. 28.88 s gammaloop-nextest-python-api> failures:
  777. 28.88 s gammaloop-nextest-python-api>
  778. 28.88 s gammaloop-nextest-python-api> failures:
  779. 28.88 s gammaloop-nextest-python-api> python_session_getters_return_live_toml_and_command_blocks
  780. 28.88 s gammaloop-nextest-python-api>
  781. 28.88 s gammaloop-nextest-python-api> test result: FAILED. 0 passed; 1 failed; 0 ignored; 0 measured; 4 filtered out; finished in 0.14s
  782. 28.88 s gammaloop-nextest-python-api> system-err
  783. 28.88 s gammaloop-nextest-python-api> Error: Python API test subprocess failed.
  784. 28.88 s gammaloop-nextest-python-api> stdout:
  785. 28.88 s gammaloop-nextest-python-api> ┌────────────────────────────────────────────────────────┐
  786. 28.88 s gammaloop-nextest-python-api> │ You are running a restricted Symbolica instance. │
  787. 28.88 s gammaloop-nextest-python-api> │ │
  788. 28.88 s gammaloop-nextest-python-api> │ This mode is only permitted for non-commercial use and │
  789. 28.88 s gammaloop-nextest-python-api> │ is limited to one instance and core per machine. │
  790. 28.88 s gammaloop-nextest-python-api> │ │
  791. 28.88 s gammaloop-nextest-python-api> │ Hobbyists can easily acquire a free license key │
  792. 28.88 s gammaloop-nextest-python-api> │ that unlocks all cores and removes this banner: │
  793. 28.88 s gammaloop-nextest-python-api> │ │
  794. 28.88 s gammaloop-nextest-python-api> │ from symbolica import * │
  795. 28.88 s gammaloop-nextest-python-api> │ request_hobbyist_license('YOUR_NAME', 'YOUR_EMAIL') │
  796. 28.88 s gammaloop-nextest-python-api> │ │
  797. 28.88 s gammaloop-nextest-python-api> │ All other users can obtain a free 30-day trial key: │
  798. 28.88 s gammaloop-nextest-python-api> │ │
  799. 28.88 s gammaloop-nextest-python-api> │ from symbolica import * │
  800. 28.88 s gammaloop-nextest-python-api> │ request_trial_license('NAME', 'EMAIL', 'EMPLOYER') │
  801. 28.88 s gammaloop-nextest-python-api> │ │
  802. 28.88 s gammaloop-nextest-python-api> │ See https://symbolica.io/docs/get_started.html#license │
  803. 28.88 s gammaloop-nextest-python-api> └────────────────────────────────────────────────────────┘
  804. 28.88 s gammaloop-nextest-python-api> ┌───────────────────────────────────────────────────────────────────────────────────────────────────────────┐
  805. 28.88 s gammaloop-nextest-python-api> │ Cannot start new unlicensed Symbolica instance since there is already another one running on the machine. │
  806. 28.88 s gammaloop-nextest-python-api> └───────────────────────────────────────────────────────────────────────────────────────────────────────────┘
  807. 28.88 s gammaloop-nextest-python-api>
  808. 28.88 s gammaloop-nextest-python-api> stderr:
  809. 28.88 s gammaloop-nextest-python-api> ┌───────────────────────────────────┐
  810. 28.88 s gammaloop-nextest-python-api> │ The Symbolica license has expired │
  811. 28.88 s gammaloop-nextest-python-api> └───────────────────────────────────┘
  812. 28.88 s gammaloop-nextest-python-api>
  813. 28.88 s gammaloop-nextest-python-api>
  814. 28.88 s gammaloop-nextest-python-api> Location:
  815. 28.88 s gammaloop-nextest-python-api> tests/tests/test_python_api.rs:156:20
  816. 28.88 s gammaloop-nextest-python-api>
  817. 28.88 s gammaloop-nextest-python-api> 4. gammaloop-integration-tests::test_python_api::python_evaluate_sample_honors_generate_events_and_observable_snapshots
  818. 28.88 s gammaloop-nextest-python-api> failure: test failure with exit code 101
  819. 28.88 s gammaloop-nextest-python-api> Error: Python API test subprocess failed.
  820. 28.88 s gammaloop-nextest-python-api> stdout:
  821. 28.88 s gammaloop-nextest-python-api> ┌────────────────────────────────────────────────────────┐
  822. 28.88 s gammaloop-nextest-python-api> │ You are running a restricted Symbolica instance. │
  823. 28.88 s gammaloop-nextest-python-api> │ │
  824. 28.88 s gammaloop-nextest-python-api> │ This mode is only permitted for non-commercial use and │
  825. 28.88 s gammaloop-nextest-python-api> │ is limited to one instance and core per machine. │
  826. 28.88 s gammaloop-nextest-python-api> │ │
  827. 28.88 s gammaloop-nextest-python-api> │ Hobbyists can easily acquire a free license key │
  828. 28.88 s gammaloop-nextest-python-api> │ that unlocks all cores and removes this banner: │
  829. 28.88 s gammaloop-nextest-python-api> │ │
  830. 28.88 s gammaloop-nextest-python-api> │ from symbolica import * │
  831. 28.88 s gammaloop-nextest-python-api> │ request_hobbyist_license('YOUR_NAME', 'YOUR_EMAIL') │
  832. 28.88 s gammaloop-nextest-python-api> │ │
  833. 28.88 s gammaloop-nextest-python-api> │ All other users can obtain a free 30-day trial key: │
  834. 28.88 s gammaloop-nextest-python-api> │ │
  835. 28.88 s gammaloop-nextest-python-api> │ from symbolica import * │
  836. 28.88 s gammaloop-nextest-python-api> │ request_trial_license('NAME', 'EMAIL', 'EMPLOYER') │
  837. 28.88 s gammaloop-nextest-python-api> │ │
  838. 28.88 s gammaloop-nextest-python-api> │ See https://symbolica.io/docs/get_started.html#license │
  839. 28.88 s gammaloop-nextest-python-api> └────────────────────────────────────────────────────────┘
  840. 28.88 s gammaloop-nextest-python-api> ┌───────────────────────────────────────────────────────────────────────────────────────────────────────────┐
  841. 28.88 s gammaloop-nextest-python-api> │ Cannot start new unlicensed Symbolica instance since there is already another one running on the machine. │
  842. 28.88 s gammaloop-nextest-python-api> └───────────────────────────────────────────────────────────────────────────────────────────────────────────┘
  843. 28.88 s gammaloop-nextest-python-api>
  844. 28.88 s gammaloop-nextest-python-api> stderr:
  845. 28.88 s gammaloop-nextest-python-api> ┌───────────────────────────────────┐
  846. 28.88 s gammaloop-nextest-python-api> │ The Symbolica license has expired │
  847. 28.88 s gammaloop-nextest-python-api> └───────────────────────────────────┘
  848. 28.88 s gammaloop-nextest-python-api> [2026-09-01 16:00:46.411] @gammaloop_api::se... INFO : Running command import model sm-default
  849. 28.88 s gammaloop-nextest-python-api> [2026-09-01 16:00:46.411] @import::model INFO : Loading built-in JSON model sm-default
  850. 28.88 s gammaloop-nextest-python-api> [2026-09-01 16:00:46.447] @gammalooprs::model INFO : The following 11 external parameters were forced to zero by the restriction card:
  851. 28.88 s gammaloop-nextest-python-api> lamWS, AWS, rhoWS, etaWS, ymc, yme, ymm, MC, Me, MM, WTau
  852. 28.88 s gammaloop-nextest-python-api> [2026-09-01 16:00:46.447] @gammalooprs::model INFO : The following 34 vertex rules were removed by the restriction card:
  853. 28.88 s gammaloop-nextest-python-api> V_82 -> (c~, d, G+) | V_83 -> (t~, d, G+) | V_84 -> (c~, s, G+) | V_85 -> (t~, s, G+) | V_86 -> (u~, b, G+) | V_87 -> (c~, b, G+) | V_90 -> (c~, d, W+) | V_91 -> (t~, d, W+) | V_92 -> (u~, s, W+) | V_94 -> (t~, s, W+) | V_95 -> (u~, b, W+) | V_96 -> (c~, b, W+) | V_101 -> (e+, e-, G0) | V_102 -> (mu+, mu-, G0) | V_104 -> (e+, e-, H) | V_105 -> (mu+, mu-, H) | V_110 -> (ve~, e-, G+) | V_111 -> (vm~, mu-, G+) | V_116 -> (b~, u, G-) | V_117 -> (d~, c, G-) | V_118 -> (s~, c, G-) | V_119 -> (b~, c, G-) | V_120 -> (d~, t, G-) | V_121 -> (s~, t, G-) | V_124 -> (s~, u, W-) | V_125 -> (b~, u, W-) | V_126 -> (d~, c, W-) | V_128 -> (b~, c, W-) | V_129 -> (d~, t, W-) | V_130 -> (s~, t, W-) | V_138 -> (c~, c, G0) | V_140 -> (c~, c, H) | V_145 -> (e+, ve, G-) | V_146 -> (mu+, vm, G-)
  854. 28.88 s gammaloop-nextest-python-api> [2026-09-01 16:00:46.447] @gammalooprs::model INFO : The following 36 couplings were removed by the restriction card:
  855. 28.88 s gammaloop-nextest-python-api> GC_13, GC_14, GC_16, GC_17, GC_18, GC_19, GC_20, GC_22, GC_23, GC_24, GC_25, GC_26, GC_28, GC_29, GC_42, GC_43, GC_44, GC_46, GC_47, GC_48, GC_84, GC_85, GC_86, GC_87, GC_88, GC_89, GC_90, GC_91, GC_92, GC_93, GC_101, GC_102, GC_103, GC_105, GC_106, GC_107
  856. 28.88 s gammaloop-nextest-python-api> [2026-09-01 16:00:46.447] @gammaloop_api::se... INFO : Running command set default-runtime kv kinematics.externals='{"type":"constant","data":{"momenta":[[32.0,0.0,0.0,32.0],[32.0,0.0,0.0,-32.0]],"helicities":[1,1]}}'
  857. 28.88 s gammaloop-nextest-python-api> [2026-09-01 16:00:46.448] @gammaloop_api::se... INFO : Running command set default-runtime kv subtraction.disable_threshold_subtraction=true
  858. 28.88 s gammaloop-nextest-python-api> [2026-09-01 16:00:46.449] @gammaloop_api::se... INFO : Running command generate xs e+ e- > d d~ g | e- a d g QED^2==4 [{{2}} QCD=0] --numerator-grouping group_identical_graphs_up_to_sign --clear-existing-processes --only-diagrams
  859. 28.88 s gammaloop-nextest-python-api> [2026-09-01 16:00:46.451] @feyngen::diagram_... INFO : 0s | Δ=0s | Starting Feynman graph generation with Symbolica...
  860. 28.88 s gammaloop-nextest-python-api> [2026-09-01 16:00:46.454] @feyngen::diagram_... INFO : 0s | Δ=0s | Number of graphs resulting from Symbolica generation: 246
  861. 28.88 s gammaloop-nextest-python-api> [2026-09-01 16:00:46.454] @feyngen::diagram_... INFO : 0s | Δ=0s | Number of graphs retained after enforcing supergraph particle content: 8
  862. 28.88 s gammaloop-nextest-python-api> [2026-09-01 16:00:46.454] @feyngen::diagram_... INFO : 0s | Δ=0s | Number of graphs retained after removal of vetoed topologies: 8
  863. 28.88 s gammaloop-nextest-python-api> [2026-09-01 16:00:46.454] @feyngen::diagram_... INFO : 0s | Δ=0s | Number of graphs after vertex info assignment: 8
  864. 28.88 s gammaloop-nextest-python-api> [2026-09-01 16:00:46.454] @feyngen::diagram_... INFO : 0s | Δ=0s | Number of graphs after all complete graphs filters are applied: 8
  865. 28.88 s gammaloop-nextest-python-api>
  866. 28.88 s gammaloop-nextest-python-api>
  867. 28.88 s gammaloop-nextest-python-api> Location:
  868. 28.88 s gammaloop-nextest-python-api> tests/tests/test_python_api.rs:156:20
  869. 28.88 s gammaloop-nextest-python-api> system-out
  870. 28.88 s gammaloop-nextest-python-api> running 1 test
  871. 28.88 s gammaloop-nextest-python-api> test python_evaluate_sample_honors_generate_events_and_observable_snapshots ... FAILED
  872. 28.88 s gammaloop-nextest-python-api>
  873. 28.88 s gammaloop-nextest-python-api> failures:
  874. 28.88 s gammaloop-nextest-python-api>
  875. 28.88 s gammaloop-nextest-python-api> failures:
  876. 28.88 s gammaloop-nextest-python-api> python_evaluate_sample_honors_generate_events_and_observable_snapshots
  877. 28.88 s gammaloop-nextest-python-api>
  878. 28.88 s gammaloop-nextest-python-api> test result: FAILED. 0 passed; 1 failed; 0 ignored; 0 measured; 4 filtered out; finished in 0.21s
  879. 28.88 s gammaloop-nextest-python-api> system-err
  880. 28.88 s gammaloop-nextest-python-api> Error: Python API test subprocess failed.
  881. 28.88 s gammaloop-nextest-python-api> stdout:
  882. 28.88 s gammaloop-nextest-python-api> ┌────────────────────────────────────────────────────────┐
  883. 28.88 s gammaloop-nextest-python-api> │ You are running a restricted Symbolica instance. │
  884. 28.88 s gammaloop-nextest-python-api> │ │
  885. 28.88 s gammaloop-nextest-python-api> │ This mode is only permitted for non-commercial use and │
  886. 28.88 s gammaloop-nextest-python-api> │ is limited to one instance and core per machine. │
  887. 28.88 s gammaloop-nextest-python-api> │ │
  888. 28.88 s gammaloop-nextest-python-api> │ Hobbyists can easily acquire a free license key │
  889. 28.88 s gammaloop-nextest-python-api> │ that unlocks all cores and removes this banner: │
  890. 28.88 s gammaloop-nextest-python-api> │ │
  891. 28.88 s gammaloop-nextest-python-api> │ from symbolica import * │
  892. 28.88 s gammaloop-nextest-python-api> │ request_hobbyist_license('YOUR_NAME', 'YOUR_EMAIL') │
  893. 28.88 s gammaloop-nextest-python-api> │ │
  894. 28.88 s gammaloop-nextest-python-api> │ All other users can obtain a free 30-day trial key: │
  895. 28.88 s gammaloop-nextest-python-api> │ │
  896. 28.88 s gammaloop-nextest-python-api> │ from symbolica import * │
  897. 28.88 s gammaloop-nextest-python-api> │ request_trial_license('NAME', 'EMAIL', 'EMPLOYER') │
  898. 28.88 s gammaloop-nextest-python-api> │ │
  899. 28.88 s gammaloop-nextest-python-api> │ See https://symbolica.io/docs/get_started.html#license │
  900. 28.88 s gammaloop-nextest-python-api> └────────────────────────────────────────────────────────┘
  901. 28.88 s gammaloop-nextest-python-api> ┌───────────────────────────────────────────────────────────────────────────────────────────────────────────┐
  902. 28.88 s gammaloop-nextest-python-api> │ Cannot start new unlicensed Symbolica instance since there is already another one running on the machine. │
  903. 28.88 s gammaloop-nextest-python-api> └───────────────────────────────────────────────────────────────────────────────────────────────────────────┘
  904. 28.88 s gammaloop-nextest-python-api>
  905. 28.88 s gammaloop-nextest-python-api> stderr:
  906. 28.88 s gammaloop-nextest-python-api> ┌───────────────────────────────────┐
  907. 28.88 s gammaloop-nextest-python-api> │ The Symbolica license has expired │
  908. 28.88 s gammaloop-nextest-python-api> └───────────────────────────────────┘
  909. 28.88 s gammaloop-nextest-python-api> [2026-09-01 16:00:46.411] @gammaloop_api::se... INFO : Running command import model sm-default
  910. 28.88 s gammaloop-nextest-python-api> [2026-09-01 16:00:46.411] @import::model INFO : Loading built-in JSON model sm-default
  911. 28.88 s gammaloop-nextest-python-api> [2026-09-01 16:00:46.447] @gammalooprs::model INFO : The following 11 external parameters were forced to zero by the restriction card:
  912. 28.88 s gammaloop-nextest-python-api> lamWS, AWS, rhoWS, etaWS, ymc, yme, ymm, MC, Me, MM, WTau
  913. 28.88 s gammaloop-nextest-python-api> [2026-09-01 16:00:46.447] @gammalooprs::model INFO : The following 34 vertex rules were removed by the restriction card:
  914. 28.88 s gammaloop-nextest-python-api> V_82 -> (c~, d, G+) | V_83 -> (t~, d, G+) | V_84 -> (c~, s, G+) | V_85 -> (t~, s, G+) | V_86 -> (u~, b, G+) | V_87 -> (c~, b, G+) | V_90 -> (c~, d, W+) | V_91 -> (t~, d, W+) | V_92 -> (u~, s, W+) | V_94 -> (t~, s, W+) | V_95 -> (u~, b, W+) | V_96 -> (c~, b, W+) | V_101 -> (e+, e-, G0) | V_102 -> (mu+, mu-, G0) | V_104 -> (e+, e-, H) | V_105 -> (mu+, mu-, H) | V_110 -> (ve~, e-, G+) | V_111 -> (vm~, mu-, G+) | V_116 -> (b~, u, G-) | V_117 -> (d~, c, G-) | V_118 -> (s~, c, G-) | V_119 -> (b~, c, G-) | V_120 -> (d~, t, G-) | V_121 -> (s~, t, G-) | V_124 -> (s~, u, W-) | V_125 -> (b~, u, W-) | V_126 -> (d~, c, W-) | V_128 -> (b~, c, W-) | V_129 -> (d~, t, W-) | V_130 -> (s~, t, W-) | V_138 -> (c~, c, G0) | V_140 -> (c~, c, H) | V_145 -> (e+, ve, G-) | V_146 -> (mu+, vm, G-)
  915. 28.88 s gammaloop-nextest-python-api> [2026-09-01 16:00:46.447] @gammalooprs::model INFO : The following 36 couplings were removed by the restriction card:
  916. 28.88 s gammaloop-nextest-python-api> GC_13, GC_14, GC_16, GC_17, GC_18, GC_19, GC_20, GC_22, GC_23, GC_24, GC_25, GC_26, GC_28, GC_29, GC_42, GC_43, GC_44, GC_46, GC_47, GC_48, GC_84, GC_85, GC_86, GC_87, GC_88, GC_89, GC_90, GC_91, GC_92, GC_93, GC_101, GC_102, GC_103, GC_105, GC_106, GC_107
  917. 28.88 s gammaloop-nextest-python-api> [2026-09-01 16:00:46.447] @gammaloop_api::se... INFO : Running command set default-runtime kv kinematics.externals='{"type":"constant","data":{"momenta":[[32.0,0.0,0.0,32.0],[32.0,0.0,0.0,-32.0]],"helicities":[1,1]}}'
  918. 28.88 s gammaloop-nextest-python-api> [2026-09-01 16:00:46.448] @gammaloop_api::se... INFO : Running command set default-runtime kv subtraction.disable_threshold_subtraction=true
  919. 28.88 s gammaloop-nextest-python-api> [2026-09-01 16:00:46.449] @gammaloop_api::se... INFO : Running command generate xs e+ e- > d d~ g | e- a d g QED^2==4 [{{2}} QCD=0] --numerator-grouping group_identical_graphs_up_to_sign --clear-existing-processes --only-diagrams
  920. 28.88 s gammaloop-nextest-python-api> [2026-09-01 16:00:46.451] @feyngen::diagram_... INFO : 0s | Δ=0s | Starting Feynman graph generation with Symbolica...
  921. 28.88 s gammaloop-nextest-python-api> [2026-09-01 16:00:46.454] @feyngen::diagram_... INFO : 0s | Δ=0s | Number of graphs resulting from Symbolica generation: 246
  922. 28.88 s gammaloop-nextest-python-api> [2026-09-01 16:00:46.454] @feyngen::diagram_... INFO : 0s | Δ=0s | Number of graphs retained after enforcing supergraph particle content: 8
  923. 28.88 s gammaloop-nextest-python-api> [2026-09-01 16:00:46.454] @feyngen::diagram_... INFO : 0s | Δ=0s | Number of graphs retained after removal of vetoed topologies: 8
  924. 28.88 s gammaloop-nextest-python-api> [2026-09-01 16:00:46.454] @feyngen::diagram_... INFO : 0s | Δ=0s | Number of graphs after vertex info assignment: 8
  925. 28.88 s gammaloop-nextest-python-api> [2026-09-01 16:00:46.454] @feyngen::diagram_... INFO : 0s | Δ=0s | Number of graphs after all complete graphs filters are applied: 8
  926. 28.88 s gammaloop-nextest-python-api>
  927. 28.88 s gammaloop-nextest-python-api>
  928. 28.88 s gammaloop-nextest-python-api> Location:
  929. 28.88 s gammaloop-nextest-python-api> tests/tests/test_python_api.rs:156:20
  930. 28.88 s gammaloop-nextest-python-api>
  931. 28.88 s gammaloop-nextest-python-api> 5. gammaloop-integration-tests::test_python_api::python_settings_wrappers_expose_nested_runtime_and_global_settings
  932. 28.88 s gammaloop-nextest-python-api> failure: test failure with exit code 101
  933. 28.88 s gammaloop-nextest-python-api> Error: Python API test subprocess failed.
  934. 28.88 s gammaloop-nextest-python-api> stdout:
  935. 28.88 s gammaloop-nextest-python-api> ┌────────────────────────────────────────────────────────┐
  936. 28.88 s gammaloop-nextest-python-api> │ You are running a restricted Symbolica instance. │
  937. 28.88 s gammaloop-nextest-python-api> │ │
  938. 28.88 s gammaloop-nextest-python-api> │ This mode is only permitted for non-commercial use and │
  939. 28.88 s gammaloop-nextest-python-api> │ is limited to one instance and core per machine. │
  940. 28.88 s gammaloop-nextest-python-api> │ │
  941. 28.88 s gammaloop-nextest-python-api> │ Hobbyists can easily acquire a free license key │
  942. 28.88 s gammaloop-nextest-python-api> │ that unlocks all cores and removes this banner: │
  943. 28.88 s gammaloop-nextest-python-api> │ │
  944. 28.88 s gammaloop-nextest-python-api> │ from symbolica import * │
  945. 28.88 s gammaloop-nextest-python-api> │ request_hobbyist_license('YOUR_NAME', 'YOUR_EMAIL') │
  946. 28.88 s gammaloop-nextest-python-api> │ │
  947. 28.88 s gammaloop-nextest-python-api> │ All other users can obtain a free 30-day trial key: │
  948. 28.88 s gammaloop-nextest-python-api> │ │
  949. 28.88 s gammaloop-nextest-python-api> │ from symbolica import * │
  950. 28.88 s gammaloop-nextest-python-api> │ request_trial_license('NAME', 'EMAIL', 'EMPLOYER') │
  951. 28.88 s gammaloop-nextest-python-api> │ │
  952. 28.88 s gammaloop-nextest-python-api> │ See https://symbolica.io/docs/get_started.html#license │
  953. 28.88 s gammaloop-nextest-python-api> └────────────────────────────────────────────────────────┘
  954. 28.88 s gammaloop-nextest-python-api> ┌───────────────────────────────────────────────────────────────────────────────────────────────────────────┐
  955. 28.88 s gammaloop-nextest-python-api> │ Cannot start new unlicensed Symbolica instance since there is already another one running on the machine. │
  956. 28.88 s gammaloop-nextest-python-api> └───────────────────────────────────────────────────────────────────────────────────────────────────────────┘
  957. 28.88 s gammaloop-nextest-python-api>
  958. 28.88 s gammaloop-nextest-python-api> stderr:
  959. 28.88 s gammaloop-nextest-python-api> ┌───────────────────────────────────┐
  960. 28.88 s gammaloop-nextest-python-api> │ The Symbolica license has expired │
  961. 28.88 s gammaloop-nextest-python-api> └───────────────────────────────────┘
  962. 28.88 s gammaloop-nextest-python-api>
  963. 28.88 s gammaloop-nextest-python-api>
  964. 28.88 s gammaloop-nextest-python-api> Location:
  965. 28.88 s gammaloop-nextest-python-api> tests/tests/test_python_api.rs:156:20
  966. 28.88 s gammaloop-nextest-python-api> system-out
  967. 28.88 s gammaloop-nextest-python-api> running 1 test
  968. 28.88 s gammaloop-nextest-python-api> test python_settings_wrappers_expose_nested_runtime_and_global_settings ... FAILED
  969. 28.88 s gammaloop-nextest-python-api>
  970. 28.88 s gammaloop-nextest-python-api> failures:
  971. 28.88 s gammaloop-nextest-python-api>
  972. 28.88 s gammaloop-nextest-python-api> failures:
  973. 28.88 s gammaloop-nextest-python-api> python_settings_wrappers_expose_nested_runtime_and_global_settings
  974. 28.88 s gammaloop-nextest-python-api>
  975. 28.88 s gammaloop-nextest-python-api> test result: FAILED. 0 passed; 1 failed; 0 ignored; 0 measured; 4 filtered out; finished in 0.22s
  976. 28.88 s gammaloop-nextest-python-api> system-err
  977. 28.88 s gammaloop-nextest-python-api> Error: Python API test subprocess failed.
  978. 28.88 s gammaloop-nextest-python-api> stdout:
  979. 28.88 s gammaloop-nextest-python-api> ┌────────────────────────────────────────────────────────┐
  980. 28.88 s gammaloop-nextest-python-api> │ You are running a restricted Symbolica instance. │
  981. 28.88 s gammaloop-nextest-python-api> │ │
  982. 28.88 s gammaloop-nextest-python-api> │ This mode is only permitted for non-commercial use and │
  983. 28.88 s gammaloop-nextest-python-api> │ is limited to one instance and core per machine. │
  984. 28.88 s gammaloop-nextest-python-api> │ │
  985. 28.88 s gammaloop-nextest-python-api> │ Hobbyists can easily acquire a free license key │
  986. 28.88 s gammaloop-nextest-python-api> │ that unlocks all cores and removes this banner: │
  987. 28.88 s gammaloop-nextest-python-api> │ │
  988. 28.88 s gammaloop-nextest-python-api> │ from symbolica import * │
  989. 28.88 s gammaloop-nextest-python-api> │ request_hobbyist_license('YOUR_NAME', 'YOUR_EMAIL') │
  990. 28.88 s gammaloop-nextest-python-api> │ │
  991. 28.88 s gammaloop-nextest-python-api> │ All other users can obtain a free 30-day trial key: │
  992. 28.88 s gammaloop-nextest-python-api> │ │
  993. 28.88 s gammaloop-nextest-python-api> │ from symbolica import * │
  994. 28.88 s gammaloop-nextest-python-api> │ request_trial_license('NAME', 'EMAIL', 'EMPLOYER') │
  995. 28.88 s gammaloop-nextest-python-api> │ │
  996. 28.88 s gammaloop-nextest-python-api> │ See https://symbolica.io/docs/get_started.html#license │
  997. 28.88 s gammaloop-nextest-python-api> └────────────────────────────────────────────────────────┘
  998. 28.88 s gammaloop-nextest-python-api> ┌───────────────────────────────────────────────────────────────────────────────────────────────────────────┐
  999. 28.88 s gammaloop-nextest-python-api> │ Cannot start new unlicensed Symbolica instance since there is already another one running on the machine. │
  1000. 28.88 s gammaloop-nextest-python-api> └───────────────────────────────────────────────────────────────────────────────────────────────────────────┘
  1001. 28.88 s gammaloop-nextest-python-api>
  1002. 28.88 s gammaloop-nextest-python-api> stderr:
  1003. 28.88 s gammaloop-nextest-python-api> ┌───────────────────────────────────┐
  1004. 28.88 s gammaloop-nextest-python-api> │ The Symbolica license has expired │
  1005. 28.88 s gammaloop-nextest-python-api> └───────────────────────────────────┘
  1006. 28.88 s gammaloop-nextest-python-api>
  1007. 28.88 s gammaloop-nextest-python-api>
  1008. 28.88 s gammaloop-nextest-python-api> Location:
  1009. 28.88 s gammaloop-nextest-python-api> tests/tests/test_python_api.rs:156:20
  1010. 28.88 s gammaloop-nextest-python-api> =========================================
  1011. 28.93 s [2 built (1 failed), 12 error: Cannot build '/nix/store/bsvj9vr3w2p8wi7qh7xmxqps4i34mbmv-gammaloop-nextest-python-api.drv'.
  1012. 28.93 s Reason: builder failed with exit code 100.
  1013. 28.93 s Output paths:
  1014. 28.93 s /nix/store/q4wjk6rqx4jm4x90px3akqlw3vc5kv10-gammaloop-nextest-python-api
  1015. 28.93 s Last 961 log lines:
  1016. 28.93 s > Extracting 1 binary, 1 build script output directory, and 3 linked paths to /build/nextest-archive-njqrSI
  1017. 28.93 s > Extracted 18 files to /build/nextest-archive-njqrSI in 0.07s
  1018. 28.93 s > ------------
  1019. 28.93 s > Nextest run ID 0f948b42-03f6-4516-8c27-3911af36eb78 with nextest profile: ci_gammaloop
  1020. 28.93 s > Starting 5 tests across 1 binary
  1021. 28.93 s > FAIL [ 0.122s] (1/5) gammaloop-integration-tests::test_python_api python_evaluate_sample_preserves_graph_grouping_and_incoming_pdgs
  1022. 28.93 s > stdout ---
  1023. 28.93 s >
  1024. 28.93 s > running 1 test
  1025. 28.93 s > test python_evaluate_sample_preserves_graph_grouping_and_incoming_pdgs ... FAILED
  1026. 28.93 s >
  1027. 28.93 s > failures:
  1028. 28.93 s >
  1029. 28.93 s > failures:
  1030. 28.93 s > python_evaluate_sample_preserves_graph_grouping_and_incoming_pdgs
  1031. 28.93 s >
  1032. 28.93 s > test result: FAILED. 0 passed; 1 failed; 0 ignored; 0 measured; 4 filtered out; finished in 0.12s
  1033. 28.93 s >
  1034. 28.93 s > stderr ---
  1035. 28.93 s > Error: Python API test subprocess failed.
  1036. 28.93 s > stdout:
  1037. 28.93 s > ┌────────────────────────────────────────────────────────┐
  1038. 28.93 s > │ You are running a restricted Symbolica instance. │
  1039. 28.93 s > │ │
  1040. 28.93 s > │ This mode is only permitted for non-commercial use and │
  1041. 28.93 s > │ is limited to one instance and core per machine. │
  1042. 28.93 s > │ │
  1043. 28.93 s > │ Hobbyists can easily acquire a free license key │
  1044. 28.93 s > │ that unlocks all cores and removes this banner: │
  1045. 28.93 s > │ │
  1046. 28.93 s > │ from symbolica import * │
  1047. 28.93 s > │ request_hobbyist_license('YOUR_NAME', 'YOUR_EMAIL') │
  1048. 28.93 s > │ │
  1049. 28.93 s > │ All other users can obtain a free 30-day trial key: │
  1050. 28.93 s > │ │
  1051. 28.93 s > │ from symbolica import * │
  1052. 28.93 s > │ request_trial_license('NAME', 'EMAIL', 'EMPLOYER') │
  1053. 28.93 s > │ │
  1054. 28.93 s > │ See https://symbolica.io/docs/get_started.html#license │
  1055. 28.93 s > └────────────────────────────────────────────────────────┘
  1056. 28.93 s > ┌───────────────────────────────────────────────────────────────────────────────────────────────────────────┐
  1057. 28.93 s > │ Cannot start new unlicensed Symbolica instance since there is already another one running on the machine. │
  1058. 28.93 s > └───────────────────────────────────────────────────────────────────────────────────────────────────────────┘
  1059. 28.93 s >
  1060. 28.93 s > stderr:
  1061. 28.93 s > ┌───────────────────────────────────┐
  1062. 28.93 s > │ The Symbolica license has expired │
  1063. 28.93 s > └───────────────────────────────────┘
  1064. 28.93 s >
  1065. 28.93 s >
  1066. 28.93 s > Location:
  1067. 28.93 s > tests/tests/test_python_api.rs:156:20
  1068. 28.93 s >
  1069. 28.93 s > FAIL [ 0.135s] (2/5) gammaloop-integration-tests::test_python_api python_evaluate_samples_batch_and_momentum_space_have_expected_shape
  1070. 28.93 s > stdout ---
  1071. 28.93 s >
  1072. 28.93 s > running 1 test
  1073. 28.93 s > test python_evaluate_samples_batch_and_momentum_space_have_expected_shape ... FAILED
  1074. 28.93 s >
  1075. 28.93 s > failures:
  1076. 28.93 s >
  1077. 28.93 s > failures:
  1078. 28.93 s > python_evaluate_samples_batch_and_momentum_space_have_expected_shape
  1079. 28.93 s >
  1080. 28.93 s > test result: FAILED. 0 passed; 1 failed; 0 ignored; 0 measured; 4 filtered out; finished in 0.13s
  1081. 28.93 s >
  1082. 28.93 s > stderr ---
  1083. 28.93 s > Error: Python API test subprocess failed.
  1084. 28.93 s > stdout:
  1085. 28.93 s > ┌────────────────────────────────────────────────────────┐
  1086. 28.93 s > │ You are running a restricted Symbolica instance. │
  1087. 28.93 s > │ │
  1088. 28.93 s > │ This mode is only permitted for non-commercial use and │
  1089. 28.93 s > │ is limited to one instance and core per machine. │
  1090. 28.93 s > │ │
  1091. 28.93 s > │ Hobbyists can easily acquire a free license key │
  1092. 28.93 s > │ that unlocks all cores and removes this banner: │
  1093. 28.93 s > │ │
  1094. 28.93 s > │ from symbolica import * │
  1095. 28.93 s > │ request_hobbyist_license('YOUR_NAME', 'YOUR_EMAIL') │
  1096. 28.93 s > │ │
  1097. 28.93 s > │ All other users can obtain a free 30-day trial key: │
  1098. 28.93 s > │ │
  1099. 28.93 s > │ from symbolica import * │
  1100. 28.93 s > │ request_trial_license('NAME', 'EMAIL', 'EMPLOYER') │
  1101. 28.93 s > │ │
  1102. 28.93 s > │ See https://symbolica.io/docs/get_started.html#license │
  1103. 28.93 s > └────────────────────────────────────────────────────────┘
  1104. 28.93 s > ┌───────────────────────────────────────────────────────────────────────────────────────────────────────────┐
  1105. 28.93 s > │ Cannot start new unlicensed Symbolica instance since there is already another one running on the machine. │
  1106. 28.93 s > └───────────────────────────────────────────────────────────────────────────────────────────────────────────┘
  1107. 28.93 s >
  1108. 28.93 s > stderr:
  1109. 28.93 s > ┌───────────────────────────────────┐
  1110. 28.93 s > │ The Symbolica license has expired │
  1111. 28.93 s > └───────────────────────────────────┘
  1112. 28.93 s >
  1113. 28.93 s >
  1114. 28.93 s > Location:
  1115. 28.93 s > tests/tests/test_python_api.rs:156:20
  1116. 28.93 s >
  1117. 28.93 s > FAIL [ 0.150s] (3/5) gammaloop-integration-tests::test_python_api python_session_getters_return_live_toml_and_command_blocks
  1118. 28.93 s > stdout ---
  1119. 28.93 s >
  1120. 28.93 s > running 1 test
  1121. 28.93 s > test python_session_getters_return_live_toml_and_command_blocks ... FAILED
  1122. 28.93 s >
  1123. 28.93 s > failures:
  1124. 28.93 s >
  1125. 28.93 s > failures:
  1126. 28.93 s > python_session_getters_return_live_toml_and_command_blocks
  1127. 28.93 s >
  1128. 28.93 s > test result: FAILED. 0 passed; 1 failed; 0 ignored; 0 measured; 4 filtered out; finished in 0.14s
  1129. 28.93 s >
  1130. 28.93 s > stderr ---
  1131. 28.93 s > Error: Python API test subprocess failed.
  1132. 28.93 s > stdout:
  1133. 28.93 s > ┌────────────────────────────────────────────────────────┐
  1134. 28.93 s > │ You are running a restricted Symbolica instance. │
  1135. 28.93 s > │ │
  1136. 28.93 s > │ This mode is only permitted for non-commercial use and │
  1137. 28.93 s > │ is limited to one instance and core per machine. │
  1138. 28.93 s > │ │
  1139. 28.93 s > │ Hobbyists can easily acquire a free license key │
  1140. 28.93 s > │ that unlocks all cores and removes this banner: │
  1141. 28.93 s > │ │
  1142. 28.93 s > │ from symbolica import * │
  1143. 28.93 s > │ request_hobbyist_license('YOUR_NAME', 'YOUR_EMAIL') │
  1144. 28.93 s > │ │
  1145. 28.93 s > │ All other users can obtain a free 30-day trial key: │
  1146. 28.93 s > │ │
  1147. 28.93 s > │ from symbolica import * │
  1148. 28.93 s > │ request_trial_license('NAME', 'EMAIL', 'EMPLOYER') │
  1149. 28.93 s > │ │
  1150. 28.93 s > │ See https://symbolica.io/docs/get_started.html#license │
  1151. 28.93 s > └────────────────────────────────────────────────────────┘
  1152. 28.93 s > ┌───────────────────────────────────────────────────────────────────────────────────────────────────────────┐
  1153. 28.93 s > │ Cannot start new unlicensed Symbolica instance since there is already another one running on the machine. │
  1154. 28.93 s > └───────────────────────────────────────────────────────────────────────────────────────────────────────────┘
  1155. 28.93 s >
  1156. 28.93 s > stderr:
  1157. 28.93 s > ┌───────────────────────────────────┐
  1158. 28.93 s > │ The Symbolica license has expired │
  1159. 28.93 s > └───────────────────────────────────┘
  1160. 28.93 s >
  1161. 28.93 s >
  1162. 28.93 s > Location:
  1163. 28.93 s > tests/tests/test_python_api.rs:156:20
  1164. 28.93 s >
  1165. 28.93 s > FAIL [ 0.215s] (4/5) gammaloop-integration-tests::test_python_api python_evaluate_sample_honors_generate_events_and_observable_snapshots
  1166. 28.93 s > stdout ---
  1167. 28.93 s >
  1168. 28.93 s > running 1 test
  1169. 28.93 s > test python_evaluate_sample_honors_generate_events_and_observable_snapshots ... FAILED
  1170. 28.93 s >
  1171. 28.93 s > failures:
  1172. 28.93 s >
  1173. 28.93 s > failures:
  1174. 28.93 s > python_evaluate_sample_honors_generate_events_and_observable_snapshots
  1175. 28.93 s >
  1176. 28.93 s > test result: FAILED. 0 passed; 1 failed; 0 ignored; 0 measured; 4 filtered out; finished in 0.21s
  1177. 28.93 s >
  1178. 28.93 s > stderr ---
  1179. 28.93 s > Error: Python API test subprocess failed.
  1180. 28.93 s > stdout:
  1181. 28.93 s > ┌────────────────────────────────────────────────────────┐
  1182. 28.93 s > │ You are running a restricted Symbolica instance. │
  1183. 28.93 s > │ │
  1184. 28.93 s > │ This mode is only permitted for non-commercial use and │
  1185. 28.93 s > │ is limited to one instance and core per machine. │
  1186. 28.93 s > │ │
  1187. 28.93 s > │ Hobbyists can easily acquire a free license key │
  1188. 28.93 s > │ that unlocks all cores and removes this banner: │
  1189. 28.93 s > │ │
  1190. 28.93 s > │ from symbolica import * │
  1191. 28.93 s > │ request_hobbyist_license('YOUR_NAME', 'YOUR_EMAIL') │
  1192. 28.93 s > │ │
  1193. 28.93 s > │ All other users can obtain a free 30-day trial key: │
  1194. 28.93 s > │ │
  1195. 28.93 s > │ from symbolica import * │
  1196. 28.93 s > │ request_trial_license('NAME', 'EMAIL', 'EMPLOYER') │
  1197. 28.93 s > │ │
  1198. 28.93 s > │ See https://symbolica.io/docs/get_started.html#license │
  1199. 28.93 s > └────────────────────────────────────────────────────────┘
  1200. 28.93 s > ┌───────────────────────────────────────────────────────────────────────────────────────────────────────────┐
  1201. 28.93 s > │ Cannot start new unlicensed Symbolica instance since there is already another one running on the machine. │
  1202. 28.93 s > └───────────────────────────────────────────────────────────────────────────────────────────────────────────┘
  1203. 28.93 s >
  1204. 28.93 s > stderr:
  1205. 28.93 s > ┌───────────────────────────────────┐
  1206. 28.93 s > │ The Symbolica license has expired │
  1207. 28.93 s > └───────────────────────────────────┘
  1208. 28.93 s > [2026-09-01 16:00:46.411] @gammaloop_api::se... INFO : Running command import model sm-default
  1209. 28.93 s > [2026-09-01 16:00:46.411] @import::model INFO : Loading built-in JSON model sm-default
  1210. 28.93 s > [2026-09-01 16:00:46.447] @gammalooprs::model INFO : The following 11 external parameters were forced to zero by the restriction card:
  1211. 28.93 s > lamWS, AWS, rhoWS, etaWS, ymc, yme, ymm, MC, Me, MM, WTau
  1212. 28.93 s > [2026-09-01 16:00:46.447] @gammalooprs::model INFO : The following 34 vertex rules were removed by the restriction card:
  1213. 28.93 s > V_82 -> (c~, d, G+) | V_83 -> (t~, d, G+) | V_84 -> (c~, s, G+) | V_85 -> (t~, s, G+) | V_86 -> (u~, b, G+) | V_87 -> (c~, b, G+) | V_90 -> (c~, d, W+) | V_91 -> (t~, d, W+) | V_92 -> (u~, s, W+) | V_94 -> (t~, s, W+) | V_95 -> (u~, b, W+) | V_96 -> (c~, b, W+) | V_101 -> (e+, e-, G0) | V_102 -> (mu+, mu-, G0) | V_104 -> (e+, e-, H) | V_105 -> (mu+, mu-, H) | V_110 -> (ve~, e-, G+) | V_111 -> (vm~, mu-, G+) | V_116 -> (b~, u, G-) | V_117 -> (d~, c, G-) | V_118 -> (s~, c, G-) | V_119 -> (b~, c, G-) | V_120 -> (d~, t, G-) | V_121 -> (s~, t, G-) | V_124 -> (s~, u, W-) | V_125 -> (b~, u, W-) | V_126 -> (d~, c, W-) | V_128 -> (b~, c, W-) | V_129 -> (d~, t, W-) | V_130 -> (s~, t, W-) | V_138 -> (c~, c, G0) | V_140 -> (c~, c, H) | V_145 -> (e+, ve, G-) | V_146 -> (mu+, vm, G-)
  1214. 28.93 s > [2026-09-01 16:00:46.447] @gammalooprs::model INFO : The following 36 couplings were removed by the restriction card:
  1215. 28.93 s > GC_13, GC_14, GC_16, GC_17, GC_18, GC_19, GC_20, GC_22, GC_23, GC_24, GC_25, GC_26, GC_28, GC_29, GC_42, GC_43, GC_44, GC_46, GC_47, GC_48, GC_84, GC_85, GC_86, GC_87, GC_88, GC_89, GC_90, GC_91, GC_92, GC_93, GC_101, GC_102, GC_103, GC_105, GC_106, GC_107
  1216. 28.93 s > [2026-09-01 16:00:46.447] @gammaloop_api::se... INFO : Running command set default-runtime kv kinematics.externals='{"type":"constant","data":{"momenta":[[32.0,0.0,0.0,32.0],[32.0,0.0,0.0,-32.0]],"helicities":[1,1]}}'
  1217. 28.93 s > [2026-09-01 16:00:46.448] @gammaloop_api::se... INFO : Running command set default-runtime kv subtraction.disable_threshold_subtraction=true
  1218. 28.93 s > [2026-09-01 16:00:46.449] @gammaloop_api::se... INFO : Running command generate xs e+ e- > d d~ g | e- a d g QED^2==4 [{{2}} QCD=0] --numerator-grouping group_identical_graphs_up_to_sign --clear-existing-processes --only-diagrams
  1219. 28.93 s > [2026-09-01 16:00:46.451] @feyngen::diagram_... INFO : 0s | Δ=0s | Starting Feynman graph generation with Symbolica...
  1220. 28.93 s > [2026-09-01 16:00:46.454] @feyngen::diagram_... INFO : 0s | Δ=0s | Number of graphs resulting from Symbolica generation: 246
  1221. 28.93 s > [2026-09-01 16:00:46.454] @feyngen::diagram_... INFO : 0s | Δ=0s | Number of graphs retained after enforcing supergraph particle content: 8
  1222. 28.93 s > [2026-09-01 16:00:46.454] @feyngen::diagram_... INFO : 0s | Δ=0s | Number of graphs retained after removal of vetoed topologies: 8
  1223. 28.93 s > [2026-09-01 16:00:46.454] @feyngen::diagram_... INFO : 0s | Δ=0s | Number of graphs after vertex info assignment: 8
  1224. 28.93 s > [2026-09-01 16:00:46.454] @feyngen::diagram_... INFO : 0s | Δ=0s | Number of graphs after all complete graphs filters are applied: 8
  1225. 28.93 s >
  1226. 28.93 s >
  1227. 28.93 s > Location:
  1228. 28.93 s > tests/tests/test_python_api.rs:156:20
  1229. 28.93 s >
  1230. 28.93 s > FAIL [ 0.223s] (5/5) gammaloop-integration-tests::test_python_api python_settings_wrappers_expose_nested_runtime_and_global_settings
  1231. 28.93 s > stdout ---
  1232. 28.93 s >
  1233. 28.93 s > running 1 test
  1234. 28.93 s > test python_settings_wrappers_expose_nested_runtime_and_global_settings ... FAILED
  1235. 28.93 s >
  1236. 28.93 s > failures:
  1237. 28.93 s >
  1238. 28.93 s > failures:
  1239. 28.93 s > python_settings_wrappers_expose_nested_runtime_and_global_settings
  1240. 28.93 s >
  1241. 28.93 s > test result: FAILED. 0 passed; 1 failed; 0 ignored; 0 measured; 4 filtered out; finished in 0.22s
  1242. 28.93 s >
  1243. 28.93 s > stderr ---
  1244. 28.93 s > Error: Python API test subprocess failed.
  1245. 28.93 s > stdout:
  1246. 28.93 s > ┌────────────────────────────────────────────────────────┐
  1247. 28.93 s > │ You are running a restricted Symbolica instance. │
  1248. 28.93 s > │ │
  1249. 28.93 s > │ This mode is only permitted for non-commercial use and │
  1250. 28.93 s > │ is limited to one instance and core per machine. │
  1251. 28.93 s > │ │
  1252. 28.93 s > │ Hobbyists can easily acquire a free license key │
  1253. 28.93 s > │ that unlocks all cores and removes this banner: │
  1254. 28.93 s > │ │
  1255. 28.93 s > │ from symbolica import * │
  1256. 28.93 s > │ request_hobbyist_license('YOUR_NAME', 'YOUR_EMAIL') │
  1257. 28.93 s > │ │
  1258. 28.93 s > │ All other users can obtain a free 30-day trial key: │
  1259. 28.93 s > │ │
  1260. 28.93 s > │ from symbolica import * │
  1261. 28.93 s > │ request_trial_license('NAME', 'EMAIL', 'EMPLOYER') │
  1262. 28.93 s > │ │
  1263. 28.93 s > │ See https://symbolica.io/docs/get_started.html#license │
  1264. 28.93 s > └────────────────────────────────────────────────────────┘
  1265. 28.93 s > ┌───────────────────────────────────────────────────────────────────────────────────────────────────────────┐
  1266. 28.93 s > │ Cannot start new unlicensed Symbolica instance since there is already another one running on the machine. │
  1267. 28.93 s > └───────────────────────────────────────────────────────────────────────────────────────────────────────────┘
  1268. 28.93 s >
  1269. 28.93 s > stderr:
  1270. 28.93 s > ┌───────────────────────────────────┐
  1271. 28.93 s > │ The Symbolica license has expired │
  1272. 28.93 s > └───────────────────────────────────┘
  1273. 28.93 s >
  1274. 28.93 s >
  1275. 28.93 s > Location:
  1276. 28.93 s > tests/tests/test_python_api.rs:156:20
  1277. 28.93 s >
  1278. 28.93 s > ------------
  1279. 28.93 s > Summary [ 0.223s] 5 tests run: 0 passed, 5 failed, 0 skipped
  1280. 28.93 s > FAIL [ 0.122s] (1/5) gammaloop-integration-tests::test_python_api python_evaluate_sample_preserves_graph_grouping_and_incoming_pdgs
  1281. 28.93 s > stdout ---
  1282. 28.93 s >
  1283. 28.93 s > running 1 test
  1284. 28.93 s > test python_evaluate_sample_preserves_graph_grouping_and_incoming_pdgs ... FAILED
  1285. 28.93 s >
  1286. 28.93 s > failures:
  1287. 28.93 s >
  1288. 28.93 s > failures:
  1289. 28.93 s > python_evaluate_sample_preserves_graph_grouping_and_incoming_pdgs
  1290. 28.93 s >
  1291. 28.93 s > test result: FAILED. 0 passed; 1 failed; 0 ignored; 0 measured; 4 filtered out; finished in 0.12s
  1292. 28.93 s >
  1293. 28.93 s > stderr ---
  1294. 28.93 s > Error: Python API test subprocess failed.
  1295. 28.93 s > stdout:
  1296. 28.93 s > ┌────────────────────────────────────────────────────────┐
  1297. 28.93 s > │ You are running a restricted Symbolica instance. │
  1298. 28.93 s > │ │
  1299. 28.93 s > │ This mode is only permitted for non-commercial use and │
  1300. 28.93 s > │ is limited to one instance and core per machine. │
  1301. 28.93 s > │ │
  1302. 28.93 s > │ Hobbyists can easily acquire a free license key │
  1303. 28.93 s > │ that unlocks all cores and removes this banner: │
  1304. 28.93 s > │ │
  1305. 28.93 s > │ from symbolica import * │
  1306. 28.93 s > │ request_hobbyist_license('YOUR_NAME', 'YOUR_EMAIL') │
  1307. 28.93 s > │ │
  1308. 28.93 s > │ All other users can obtain a free 30-day trial key: │
  1309. 28.93 s > │ │
  1310. 28.93 s > │ from symbolica import * │
  1311. 28.93 s > │ request_trial_license('NAME', 'EMAIL', 'EMPLOYER') │
  1312. 28.93 s > │ │
  1313. 28.93 s > │ See https://symbolica.io/docs/get_started.html#license │
  1314. 28.93 s > └────────────────────────────────────────────────────────┘
  1315. 28.93 s > ┌───────────────────────────────────────────────────────────────────────────────────────────────────────────┐
  1316. 28.93 s > │ Cannot start new unlicensed Symbolica instance since there is already another one running on the machine. │
  1317. 28.93 s > └───────────────────────────────────────────────────────────────────────────────────────────────────────────┘
  1318. 28.93 s >
  1319. 28.93 s > stderr:
  1320. 28.93 s > ┌───────────────────────────────────┐
  1321. 28.93 s > │ The Symbolica license has expired │
  1322. 28.93 s > └───────────────────────────────────┘
  1323. 28.93 s >
  1324. 28.93 s >
  1325. 28.93 s > Location:
  1326. 28.93 s > tests/tests/test_python_api.rs:156:20
  1327. 28.93 s >
  1328. 28.93 s > FAIL [ 0.135s] (2/5) gammaloop-integration-tests::test_python_api python_evaluate_samples_batch_and_momentum_space_have_expected_shape
  1329. 28.93 s > stdout ---
  1330. 28.93 s >
  1331. 28.93 s > running 1 test
  1332. 28.93 s > test python_evaluate_samples_batch_and_momentum_space_have_expected_shape ... FAILED
  1333. 28.93 s >
  1334. 28.93 s > failures:
  1335. 28.93 s >
  1336. 28.93 s > failures:
  1337. 28.93 s > python_evaluate_samples_batch_and_momentum_space_have_expected_shape
  1338. 28.93 s >
  1339. 28.93 s > test result: FAILED. 0 passed; 1 failed; 0 ignored; 0 measured; 4 filtered out; finished in 0.13s
  1340. 28.93 s >
  1341. 28.93 s > stderr ---
  1342. 28.93 s > Error: Python API test subprocess failed.
  1343. 28.93 s > stdout:
  1344. 28.93 s > ┌────────────────────────────────────────────────────────┐
  1345. 28.93 s > │ You are running a restricted Symbolica instance. │
  1346. 28.93 s > │ │
  1347. 28.93 s > │ This mode is only permitted for non-commercial use and │
  1348. 28.93 s > │ is limited to one instance and core per machine. │
  1349. 28.93 s > │ │
  1350. 28.93 s > │ Hobbyists can easily acquire a free license key │
  1351. 28.93 s > │ that unlocks all cores and removes this banner: │
  1352. 28.93 s > │ │
  1353. 28.93 s > │ from symbolica import * │
  1354. 28.93 s > │ request_hobbyist_license('YOUR_NAME', 'YOUR_EMAIL') │
  1355. 28.93 s > │ │
  1356. 28.93 s > │ All other users can obtain a free 30-day trial key: │
  1357. 28.93 s > │ │
  1358. 28.93 s > │ from symbolica import * │
  1359. 28.93 s > │ request_trial_license('NAME', 'EMAIL', 'EMPLOYER') │
  1360. 28.93 s > │ │
  1361. 28.93 s > │ See https://symbolica.io/docs/get_started.html#license │
  1362. 28.93 s > └────────────────────────────────────────────────────────┘
  1363. 28.93 s > ┌───────────────────────────────────────────────────────────────────────────────────────────────────────────┐
  1364. 28.93 s > │ Cannot start new unlicensed Symbolica instance since there is already another one running on the machine. │
  1365. 28.93 s > └───────────────────────────────────────────────────────────────────────────────────────────────────────────┘
  1366. 28.93 s >
  1367. 28.93 s > stderr:
  1368. 28.93 s > ┌───────────────────────────────────┐
  1369. 28.93 s > │ The Symbolica license has expired │
  1370. 28.93 s > └───────────────────────────────────┘
  1371. 28.93 s >
  1372. 28.93 s >
  1373. 28.93 s > Location:
  1374. 28.93 s > tests/tests/test_python_api.rs:156:20
  1375. 28.93 s >
  1376. 28.93 s > FAIL [ 0.150s] (3/5) gammaloop-integration-tests::test_python_api python_session_getters_return_live_toml_and_command_blocks
  1377. 28.93 s > stdout ---
  1378. 28.93 s >
  1379. 28.93 s > running 1 test
  1380. 28.93 s > test python_session_getters_return_live_toml_and_command_blocks ... FAILED
  1381. 28.93 s >
  1382. 28.93 s > failures:
  1383. 28.93 s >
  1384. 28.93 s > failures:
  1385. 28.93 s > python_session_getters_return_live_toml_and_command_blocks
  1386. 28.93 s >
  1387. 28.93 s > test result: FAILED. 0 passed; 1 failed; 0 ignored; 0 measured; 4 filtered out; finished in 0.14s
  1388. 28.93 s >
  1389. 28.93 s > stderr ---
  1390. 28.93 s > Error: Python API test subprocess failed.
  1391. 28.93 s > stdout:
  1392. 28.93 s > ┌────────────────────────────────────────────────────────┐
  1393. 28.93 s > │ You are running a restricted Symbolica instance. │
  1394. 28.93 s > │ │
  1395. 28.93 s > │ This mode is only permitted for non-commercial use and │
  1396. 28.93 s > │ is limited to one instance and core per machine. │
  1397. 28.93 s > │ │
  1398. 28.93 s > │ Hobbyists can easily acquire a free license key │
  1399. 28.93 s > │ that unlocks all cores and removes this banner: │
  1400. 28.93 s > │ │
  1401. 28.93 s > │ from symbolica import * │
  1402. 28.93 s > │ request_hobbyist_license('YOUR_NAME', 'YOUR_EMAIL') │
  1403. 28.93 s > │ │
  1404. 28.93 s > │ All other users can obtain a free 30-day trial key: │
  1405. 28.93 s > │ │
  1406. 28.93 s > │ from symbolica import * │
  1407. 28.93 s > │ request_trial_license('NAME', 'EMAIL', 'EMPLOYER') │
  1408. 28.93 s > │ │
  1409. 28.93 s > │ See https://symbolica.io/docs/get_started.html#license │
  1410. 28.93 s > └────────────────────────────────────────────────────────┘
  1411. 28.93 s > ┌───────────────────────────────────────────────────────────────────────────────────────────────────────────┐
  1412. 28.93 s > │ Cannot start new unlicensed Symbolica instance since there is already another one running on the machine. │
  1413. 28.93 s > └───────────────────────────────────────────────────────────────────────────────────────────────────────────┘
  1414. 28.93 s >
  1415. 28.93 s > stderr:
  1416. 28.93 s > ┌───────────────────────────────────┐
  1417. 28.93 s > │ The Symbolica license has expired │
  1418. 28.93 s > └───────────────────────────────────┘
  1419. 28.93 s >
  1420. 28.93 s >
  1421. 28.93 s > Location:
  1422. 28.93 s > tests/tests/test_python_api.rs:156:20
  1423. 28.93 s >
  1424. 28.93 s > FAIL [ 0.215s] (4/5) gammaloop-integration-tests::test_python_api python_evaluate_sample_honors_generate_events_and_observable_snapshots
  1425. 28.93 s > stdout ---
  1426. 28.93 s >
  1427. 28.93 s > running 1 test
  1428. 28.93 s > test python_evaluate_sample_honors_generate_events_and_observable_snapshots ... FAILED
  1429. 28.93 s >
  1430. 28.93 s > failures:
  1431. 28.93 s >
  1432. 28.93 s > failures:
  1433. 28.93 s > python_evaluate_sample_honors_generate_events_and_observable_snapshots
  1434. 28.93 s >
  1435. 28.93 s > test result: FAILED. 0 passed; 1 failed; 0 ignored; 0 measured; 4 filtered out; finished in 0.21s
  1436. 28.93 s >
  1437. 28.93 s > stderr ---
  1438. 28.93 s > Error: Python API test subprocess failed.
  1439. 28.93 s > stdout:
  1440. 28.93 s > ┌────────────────────────────────────────────────────────┐
  1441. 28.93 s > │ You are running a restricted Symbolica instance. │
  1442. 28.93 s > │ │
  1443. 28.93 s > │ This mode is only permitted for non-commercial use and │
  1444. 28.93 s > │ is limited to one instance and core per machine. │
  1445. 28.93 s > │ │
  1446. 28.93 s > │ Hobbyists can easily acquire a free license key │
  1447. 28.93 s > │ that unlocks all cores and removes this banner: │
  1448. 28.93 s > │ │
  1449. 28.93 s > │ from symbolica import * │
  1450. 28.93 s > │ request_hobbyist_license('YOUR_NAME', 'YOUR_EMAIL') │
  1451. 28.93 s > │ │
  1452. 28.93 s > │ All other users can obtain a free 30-day trial key: │
  1453. 28.93 s > │ │
  1454. 28.93 s > │ from symbolica import * │
  1455. 28.93 s > │ request_trial_license('NAME', 'EMAIL', 'EMPLOYER') │
  1456. 28.93 s > │ │
  1457. 28.93 s > │ See https://symbolica.io/docs/get_started.html#license │
  1458. 28.93 s > └────────────────────────────────────────────────────────┘
  1459. 28.93 s > ┌───────────────────────────────────────────────────────────────────────────────────────────────────────────┐
  1460. 28.93 s > │ Cannot start new unlicensed Symbolica instance since there is already another one running on the machine. │
  1461. 28.93 s > └───────────────────────────────────────────────────────────────────────────────────────────────────────────┘
  1462. 28.93 s >
  1463. 28.93 s > stderr:
  1464. 28.93 s > ┌───────────────────────────────────┐
  1465. 28.93 s > │ The Symbolica license has expired │
  1466. 28.93 s > └───────────────────────────────────┘
  1467. 28.93 s > [2026-09-01 16:00:46.411] @gammaloop_api::se... INFO : Running command import model sm-default
  1468. 28.93 s > [2026-09-01 16:00:46.411] @import::model INFO : Loading built-in JSON model sm-default
  1469. 28.93 s > [2026-09-01 16:00:46.447] @gammalooprs::model INFO : The following 11 external parameters were forced to zero by the restriction card:
  1470. 28.93 s > lamWS, AWS, rhoWS, etaWS, ymc, yme, ymm, MC, Me, MM, WTau
  1471. 28.93 s > [2026-09-01 16:00:46.447] @gammalooprs::model INFO : The following 34 vertex rules were removed by the restriction card:
  1472. 28.93 s > V_82 -> (c~, d, G+) | V_83 -> (t~, d, G+) | V_84 -> (c~, s, G+) | V_85 -> (t~, s, G+) | V_86 -> (u~, b, G+) | V_87 -> (c~, b, G+) | V_90 -> (c~, d, W+) | V_91 -> (t~, d, W+) | V_92 -> (u~, s, W+) | V_94 -> (t~, s, W+) | V_95 -> (u~, b, W+) | V_96 -> (c~, b, W+) | V_101 -> (e+, e-, G0) | V_102 -> (mu+, mu-, G0) | V_104 -> (e+, e-, H) | V_105 -> (mu+, mu-, H) | V_110 -> (ve~, e-, G+) | V_111 -> (vm~, mu-, G+) | V_116 -> (b~, u, G-) | V_117 -> (d~, c, G-) | V_118 -> (s~, c, G-) | V_119 -> (b~, c, G-) | V_120 -> (d~, t, G-) | V_121 -> (s~, t, G-) | V_124 -> (s~, u, W-) | V_125 -> (b~, u, W-) | V_126 -> (d~, c, W-) | V_128 -> (b~, c, W-) | V_129 -> (d~, t, W-) | V_130 -> (s~, t, W-) | V_138 -> (c~, c, G0) | V_140 -> (c~, c, H) | V_145 -> (e+, ve, G-) | V_146 -> (mu+, vm, G-)
  1473. 28.93 s > [2026-09-01 16:00:46.447] @gammalooprs::model INFO : The following 36 couplings were removed by the restriction card:
  1474. 28.93 s > GC_13, GC_14, GC_16, GC_17, GC_18, GC_19, GC_20, GC_22, GC_23, GC_24, GC_25, GC_26, GC_28, GC_29, GC_42, GC_43, GC_44, GC_46, GC_47, GC_48, GC_84, GC_85, GC_86, GC_87, GC_88, GC_89, GC_90, GC_91, GC_92, GC_93, GC_101, GC_102, GC_103, GC_105, GC_106, GC_107
  1475. 28.93 s > [2026-09-01 16:00:46.447] @gammaloop_api::se... INFO : Running command set default-runtime kv kinematics.externals='{"type":"constant","data":{"momenta":[[32.0,0.0,0.0,32.0],[32.0,0.0,0.0,-32.0]],"helicities":[1,1]}}'
  1476. 28.93 s > [2026-09-01 16:00:46.448] @gammaloop_api::se... INFO : Running command set default-runtime kv subtraction.disable_threshold_subtraction=true
  1477. 28.93 s > [2026-09-01 16:00:46.449] @gammaloop_api::se... INFO : Running command generate xs e+ e- > d d~ g | e- a d g QED^2==4 [{{2}} QCD=0] --numerator-grouping group_identical_graphs_up_to_sign --clear-existing-processes --only-diagrams
  1478. 28.93 s > [2026-09-01 16:00:46.451] @feyngen::diagram_... INFO : 0s | Δ=0s | Starting Feynman graph generation with Symbolica...
  1479. 28.93 s > [2026-09-01 16:00:46.454] @feyngen::diagram_... INFO : 0s | Δ=0s | Number of graphs resulting from Symbolica generation: 246
  1480. 28.93 s > [2026-09-01 16:00:46.454] @feyngen::diagram_... INFO : 0s | Δ=0s | Number of graphs retained after enforcing supergraph particle content: 8
  1481. 28.93 s > [2026-09-01 16:00:46.454] @feyngen::diagram_... INFO : 0s | Δ=0s | Number of graphs retained after removal of vetoed topologies: 8
  1482. 28.93 s > [2026-09-01 16:00:46.454] @feyngen::diagram_... INFO : 0s | Δ=0s | Number of graphs after vertex info assignment: 8
  1483. 28.93 s > [2026-09-01 16:00:46.454] @feyngen::diagram_... INFO : 0s | Δ=0s | Number of graphs after all complete graphs filters are applied: 8
  1484. 28.93 s >
  1485. 28.93 s >
  1486. 28.93 s > Location:
  1487. 28.93 s > tests/tests/test_python_api.rs:156:20
  1488. 28.93 s >
  1489. 28.93 s > FAIL [ 0.223s] (5/5) gammaloop-integration-tests::test_python_api python_settings_wrappers_expose_nested_runtime_and_global_settings
  1490. 28.93 s > stdout ---
  1491. 28.93 s >
  1492. 28.93 s > running 1 test
  1493. 28.93 s > test python_settings_wrappers_expose_nested_runtime_and_global_settings ... FAILED
  1494. 28.93 s >
  1495. 28.93 s > failures:
  1496. 28.93 s >
  1497. 28.93 s > failures:
  1498. 28.93 s > python_settings_wrappers_expose_nested_runtime_and_global_settings
  1499. 28.93 s >
  1500. 28.93 s > test result: FAILED. 0 passed; 1 failed; 0 ignored; 0 measured; 4 filtered out; finished in 0.22s
  1501. 28.93 s >
  1502. 28.93 s > stderr ---
  1503. 28.93 s > Error: Python API test subprocess failed.
  1504. 28.93 s > stdout:
  1505. 28.93 s > ┌────────────────────────────────────────────────────────┐
  1506. 28.93 s > │ You are running a restricted Symbolica instance. │
  1507. 28.93 s > │ │
  1508. 28.93 s > │ This mode is only permitted for non-commercial use and │
  1509. 28.93 s > │ is limited to one instance and core per machine. │
  1510. 28.93 s > │ │
  1511. 28.93 s > │ Hobbyists can easily acquire a free license key │
  1512. 28.93 s > │ that unlocks all cores and removes this banner: │
  1513. 28.93 s > │ │
  1514. 28.93 s > │ from symbolica import * │
  1515. 28.93 s > │ request_hobbyist_license('YOUR_NAME', 'YOUR_EMAIL') │
  1516. 28.93 s > │ │
  1517. 28.93 s > │ All other users can obtain a free 30-day trial key: │
  1518. 28.93 s > │ │
  1519. 28.93 s > │ from symbolica import * │
  1520. 28.93 s > │ request_trial_license('NAME', 'EMAIL', 'EMPLOYER') │
  1521. 28.93 s > │ │
  1522. 28.93 s > │ See https://symbolica.io/docs/get_started.html#license │
  1523. 28.93 s > └────────────────────────────────────────────────────────┘
  1524. 28.93 s > ┌───────────────────────────────────────────────────────────────────────────────────────────────────────────┐
  1525. 28.93 s > │ Cannot start new unlicensed Symbolica instance since there is already another one running on the machine. │
  1526. 28.93 s > └───────────────────────────────────────────────────────────────────────────────────────────────────────────┘
  1527. 28.93 s >
  1528. 28.93 s > stderr:
  1529. 28.93 s > ┌───────────────────────────────────┐
  1530. 28.93 s > │ The Symbolica license has expired │
  1531. 28.93 s > └───────────────────────────────────┘
  1532. 28.93 s >
  1533. 28.93 s >
  1534. 28.93 s > Location:
  1535. 28.93 s > tests/tests/test_python_api.rs:156:20
  1536. 28.93 s >
  1537. 28.93 s > error: test run failed
  1538. 28.93 s >
  1539. 28.93 s > ========== nextest test summary ==========
  1540. 28.93 s > report: target/nextest/ci_gammaloop/junit.xml
  1541. 28.93 s > tests: 5, failures: 5, errors: 0
  1542. 28.93 s >
  1543. 28.93 s > 1. gammaloop-integration-tests::test_python_api::python_evaluate_sample_preserves_graph_grouping_and_incoming_pdgs
  1544. 28.93 s > failure: test failure with exit code 101
  1545. 28.93 s > Error: Python API test subprocess failed.
  1546. 28.93 s > stdout:
  1547. 28.93 s > ┌────────────────────────────────────────────────────────┐
  1548. 28.93 s > │ You are running a restricted Symbolica instance. │
  1549. 28.93 s > │ │
  1550. 28.93 s > │ This mode is only permitted for non-commercial use and │
  1551. 28.93 s > │ is limited to one instance and core per machine. │
  1552. 28.93 s > │ │
  1553. 28.93 s > │ Hobbyists can easily acquire a free license key │
  1554. 28.93 s > │ that unlocks all cores and removes this banner: │
  1555. 28.93 s > │ │
  1556. 28.93 s > │ from symbolica import * │
  1557. 28.93 s > │ request_hobbyist_license('YOUR_NAME', 'YOUR_EMAIL') │
  1558. 28.93 s > │ │
  1559. 28.93 s > │ All other users can obtain a free 30-day trial key: │
  1560. 28.93 s > │ │
  1561. 28.93 s > │ from symbolica import * │
  1562. 28.93 s > │ request_trial_license('NAME', 'EMAIL', 'EMPLOYER') │
  1563. 28.93 s > │ │
  1564. 28.93 s > │ See https://symbolica.io/docs/get_started.html#license │
  1565. 28.93 s > └────────────────────────────────────────────────────────┘
  1566. 28.93 s > ┌───────────────────────────────────────────────────────────────────────────────────────────────────────────┐
  1567. 28.93 s > │ Cannot start new unlicensed Symbolica instance since there is already another one running on the machine. │
  1568. 28.93 s > └───────────────────────────────────────────────────────────────────────────────────────────────────────────┘
  1569. 28.93 s >
  1570. 28.93 s > stderr:
  1571. 28.93 s > ┌───────────────────────────────────┐
  1572. 28.93 s > │ The Symbolica license has expired │
  1573. 28.93 s > └───────────────────────────────────┘
  1574. 28.93 s >
  1575. 28.93 s >
  1576. 28.93 s > Location:
  1577. 28.93 s > tests/tests/test_python_api.rs:156:20
  1578. 28.93 s > system-out
  1579. 28.93 s > running 1 test
  1580. 28.93 s > test python_evaluate_sample_preserves_graph_grouping_and_incoming_pdgs ... FAILED
  1581. 28.93 s >
  1582. 28.93 s > failures:
  1583. 28.93 s >
  1584. 28.93 s > failures:
  1585. 28.93 s > python_evaluate_sample_preserves_graph_grouping_and_incoming_pdgs
  1586. 28.93 s >
  1587. 28.93 s > test result: FAILED. 0 passed; 1 failed; 0 ignored; 0 measured; 4 filtered out; finished in 0.12s
  1588. 28.93 s > system-err
  1589. 28.93 s > Error: Python API test subprocess failed.
  1590. 28.93 s > stdout:
  1591. 28.93 s > ┌────────────────────────────────────────────────────────┐
  1592. 28.93 s > │ You are running a restricted Symbolica instance. │
  1593. 28.93 s > │ │
  1594. 28.93 s > │ This mode is only permitted for non-commercial use and │
  1595. 28.93 s > │ is limited to one instance and core per machine. │
  1596. 28.93 s > │ │
  1597. 28.93 s > │ Hobbyists can easily acquire a free license key │
  1598. 28.93 s > │ that unlocks all cores and removes this banner: │
  1599. 28.93 s > │ │
  1600. 28.93 s > │ from symbolica import * │
  1601. 28.93 s > │ request_hobbyist_license('YOUR_NAME', 'YOUR_EMAIL') │
  1602. 28.93 s > │ │
  1603. 28.93 s > │ All other users can obtain a free 30-day trial key: │
  1604. 28.93 s > │ │
  1605. 28.93 s > │ from symbolica import * │
  1606. 28.93 s > │ request_trial_license('NAME', 'EMAIL', 'EMPLOYER') │
  1607. 28.93 s > │ │
  1608. 28.93 s > │ See https://symbolica.io/docs/get_started.html#license │
  1609. 28.93 s > └────────────────────────────────────────────────────────┘
  1610. 28.93 s > ┌───────────────────────────────────────────────────────────────────────────────────────────────────────────┐
  1611. 28.93 s > │ Cannot start new unlicensed Symbolica instance since there is already another one running on the machine. │
  1612. 28.93 s > └───────────────────────────────────────────────────────────────────────────────────────────────────────────┘
  1613. 28.93 s >
  1614. 28.93 s > stderr:
  1615. 28.93 s > ┌───────────────────────────────────┐
  1616. 28.93 s > │ The Symbolica license has expired │
  1617. 28.93 s > └───────────────────────────────────┘
  1618. 28.93 s >
  1619. 28.93 s >
  1620. 28.93 s > Location:
  1621. 28.93 s > tests/tests/test_python_api.rs:156:20
  1622. 28.93 s >
  1623. 28.93 s > 2. gammaloop-integration-tests::test_python_api::python_evaluate_samples_batch_and_momentum_space_have_expected_shape
  1624. 28.93 s > failure: test failure with exit code 101
  1625. 28.93 s > Error: Python API test subprocess failed.
  1626. 28.93 s > stdout:
  1627. 28.93 s > ┌────────────────────────────────────────────────────────┐
  1628. 28.93 s > │ You are running a restricted Symbolica instance. │
  1629. 28.93 s > │ │
  1630. 28.93 s > │ This mode is only permitted for non-commercial use and │
  1631. 28.93 s > │ is limited to one instance and core per machine. │
  1632. 28.93 s > │ │
  1633. 28.93 s > │ Hobbyists can easily acquire a free license key │
  1634. 28.93 s > │ that unlocks all cores and removes this banner: │
  1635. 28.93 s > │ │
  1636. 28.93 s > │ from symbolica import * │
  1637. 28.93 s > │ request_hobbyist_license('YOUR_NAME', 'YOUR_EMAIL') │
  1638. 28.93 s > │ │
  1639. 28.93 s > │ All other users can obtain a free 30-day trial key: │
  1640. 28.93 s > │ │
  1641. 28.93 s > │ from symbolica import * │
  1642. 28.93 s > │ request_trial_license('NAME', 'EMAIL', 'EMPLOYER') │
  1643. 28.93 s > │ │
  1644. 28.93 s > │ See https://symbolica.io/docs/get_started.html#license │
  1645. 28.93 s > └────────────────────────────────────────────────────────┘
  1646. 28.93 s > ┌───────────────────────────────────────────────────────────────────────────────────────────────────────────┐
  1647. 28.93 s > │ Cannot start new unlicensed Symbolica instance since there is already another one running on the machine. │
  1648. 28.93 s > └───────────────────────────────────────────────────────────────────────────────────────────────────────────┘
  1649. 28.93 s >
  1650. 28.93 s > stderr:
  1651. 28.93 s > ┌───────────────────────────────────┐
  1652. 28.93 s > │ The Symbolica license has expired │
  1653. 28.93 s > └───────────────────────────────────┘
  1654. 28.93 s >
  1655. 28.93 s >
  1656. 28.93 s > Location:
  1657. 28.93 s > tests/tests/test_python_api.rs:156:20
  1658. 28.93 s > system-out
  1659. 28.93 s > running 1 test
  1660. 28.93 s > test python_evaluate_samples_batch_and_momentum_space_have_expected_shape ... FAILED
  1661. 28.93 s >
  1662. 28.93 s > failures:
  1663. 28.93 s >
  1664. 28.93 s > failures:
  1665. 28.93 s > python_evaluate_samples_batch_and_momentum_space_have_expected_shape
  1666. 28.93 s >
  1667. 28.93 s > test result: FAILED. 0 passed; 1 failed; 0 ignored; 0 measured; 4 filtered out; finished in 0.13s
  1668. 28.93 s > system-err
  1669. 28.93 s > Error: Python API test subprocess failed.
  1670. 28.93 s > stdout:
  1671. 28.93 s > ┌────────────────────────────────────────────────────────┐
  1672. 28.93 s > │ You are running a restricted Symbolica instance. │
  1673. 28.93 s > │ │
  1674. 28.93 s > │ This mode is only permitted for non-commercial use and │
  1675. 28.93 s > │ is limited to one instance and core per machine. │
  1676. 28.93 s > │ │
  1677. 28.93 s > │ Hobbyists can easily acquire a free license key │
  1678. 28.93 s > │ that unlocks all cores and removes this banner: │
  1679. 28.93 s > │ │
  1680. 28.93 s > │ from symbolica import * │
  1681. 28.93 s > │ request_hobbyist_license('YOUR_NAME', 'YOUR_EMAIL') │
  1682. 28.93 s > │ │
  1683. 28.93 s > │ All other users can obtain a free 30-day trial key: │
  1684. 28.93 s > │ │
  1685. 28.93 s > │ from symbolica import * │
  1686. 28.93 s > │ request_trial_license('NAME', 'EMAIL', 'EMPLOYER') │
  1687. 28.93 s > │ │
  1688. 28.93 s > │ See https://symbolica.io/docs/get_started.html#license │
  1689. 28.93 s > └────────────────────────────────────────────────────────┘
  1690. 28.93 s > ┌───────────────────────────────────────────────────────────────────────────────────────────────────────────┐
  1691. 28.93 s > │ Cannot start new unlicensed Symbolica instance since there is already another one running on the machine. │
  1692. 28.93 s > └───────────────────────────────────────────────────────────────────────────────────────────────────────────┘
  1693. 28.93 s >
  1694. 28.93 s > stderr:
  1695. 28.93 s > ┌───────────────────────────────────┐
  1696. 28.93 s > │ The Symbolica license has expired │
  1697. 28.93 s > └───────────────────────────────────┘
  1698. 28.93 s >
  1699. 28.93 s >
  1700. 28.93 s > Location:
  1701. 28.93 s > tests/tests/test_python_api.rs:156:20
  1702. 28.93 s >
  1703. 28.93 s > 3. gammaloop-integration-tests::test_python_api::python_session_getters_return_live_toml_and_command_blocks
  1704. 28.93 s > failure: test failure with exit code 101
  1705. 28.93 s > Error: Python API test subprocess failed.
  1706. 28.93 s > stdout:
  1707. 28.93 s > ┌────────────────────────────────────────────────────────┐
  1708. 28.93 s > │ You are running a restricted Symbolica instance. │
  1709. 28.93 s > │ │
  1710. 28.93 s > │ This mode is only permitted for non-commercial use and │
  1711. 28.93 s > │ is limited to one instance and core per machine. │
  1712. 28.93 s > │ │
  1713. 28.93 s > │ Hobbyists can easily acquire a free license key │
  1714. 28.93 s > │ that unlocks all cores and removes this banner: │
  1715. 28.93 s > │ │
  1716. 28.93 s > │ from symbolica import * │
  1717. 28.93 s > │ request_hobbyist_license('YOUR_NAME', 'YOUR_EMAIL') │
  1718. 28.93 s > │ │
  1719. 28.93 s > │ All other users can obtain a free 30-day trial key: │
  1720. 28.93 s > │ │
  1721. 28.93 s > │ from symbolica import * │
  1722. 28.93 s > │ request_trial_license('NAME', 'EMAIL', 'EMPLOYER') │
  1723. 28.93 s > │ │
  1724. 28.93 s > │ See https://symbolica.io/docs/get_started.html#license │
  1725. 28.93 s > └────────────────────────────────────────────────────────┘
  1726. 28.93 s > ┌───────────────────────────────────────────────────────────────────────────────────────────────────────────┐
  1727. 28.93 s > │ Cannot start new unlicensed Symbolica instance since there is already another one running on the machine. │
  1728. 28.93 s > └───────────────────────────────────────────────────────────────────────────────────────────────────────────┘
  1729. 28.93 s >
  1730. 28.93 s > stderr:
  1731. 28.93 s > ┌───────────────────────────────────┐
  1732. 28.93 s > │ The Symbolica license has expired │
  1733. 28.93 s > └───────────────────────────────────┘
  1734. 28.93 s >
  1735. 28.93 s >
  1736. 28.93 s > Location:
  1737. 28.93 s > tests/tests/test_python_api.rs:156:20
  1738. 28.93 s > system-out
  1739. 28.93 s > running 1 test
  1740. 28.93 s > test python_session_getters_return_live_toml_and_command_blocks ... FAILED
  1741. 28.93 s >
  1742. 28.93 s > failures:
  1743. 28.93 s >
  1744. 28.93 s > failures:
  1745. 28.93 s > python_session_getters_return_live_toml_and_command_blocks
  1746. 28.93 s >
  1747. 28.93 s > test result: FAILED. 0 passed; 1 failed; 0 ignored; 0 measured; 4 filtered out; finished in 0.14s
  1748. 28.93 s > system-err
  1749. 28.93 s > Error: Python API test subprocess failed.
  1750. 28.93 s > stdout:
  1751. 28.93 s > ┌────────────────────────────────────────────────────────┐
  1752. 28.93 s > │ You are running a restricted Symbolica instance. │
  1753. 28.93 s > │ │
  1754. 28.93 s > │ This mode is only permitted for non-commercial use and │
  1755. 28.93 s > │ is limited to one instance and core per machine. │
  1756. 28.93 s > │ │
  1757. 28.93 s > │ Hobbyists can easily acquire a free license key │
  1758. 28.93 s > │ that unlocks all cores and removes this banner: │
  1759. 28.93 s > │ │
  1760. 28.93 s > │ from symbolica import * │
  1761. 28.93 s > │ request_hobbyist_license('YOUR_NAME', 'YOUR_EMAIL') │
  1762. 28.93 s > │ │
  1763. 28.93 s > │ All other users can obtain a free 30-day trial key: │
  1764. 28.93 s > │ │
  1765. 28.93 s > │ from symbolica import * │
  1766. 28.93 s > │ request_trial_license('NAME', 'EMAIL', 'EMPLOYER') │
  1767. 28.93 s > │ │
  1768. 28.93 s > │ See https://symbolica.io/docs/get_started.html#license │
  1769. 28.93 s > └────────────────────────────────────────────────────────┘
  1770. 28.93 s > ┌───────────────────────────────────────────────────────────────────────────────────────────────────────────┐
  1771. 28.93 s > │ Cannot start new unlicensed Symbolica instance since there is already another one running on the machine. │
  1772. 28.93 s > └───────────────────────────────────────────────────────────────────────────────────────────────────────────┘
  1773. 28.93 s >
  1774. 28.93 s > stderr:
  1775. 28.93 s > ┌───────────────────────────────────┐
  1776. 28.93 s > │ The Symbolica license has expired │
  1777. 28.93 s > └───────────────────────────────────┘
  1778. 28.93 s >
  1779. 28.93 s >
  1780. 28.93 s > Location:
  1781. 28.93 s > tests/tests/test_python_api.rs:156:20
  1782. 28.93 s >
  1783. 28.93 s > 4. gammaloop-integration-tests::test_python_api::python_evaluate_sample_honors_generate_events_and_observable_snapshots
  1784. 28.93 s > failure: test failure with exit code 101
  1785. 28.93 s > Error: Python API test subprocess failed.
  1786. 28.93 s > stdout:
  1787. 28.93 s > ┌────────────────────────────────────────────────────────┐
  1788. 28.93 s > │ You are running a restricted Symbolica instance. │
  1789. 28.93 s > │ │
  1790. 28.93 s > │ This mode is only permitted for non-commercial use and │
  1791. 28.93 s > │ is limited to one instance and core per machine. │
  1792. 28.93 s > │ │
  1793. 28.93 s > │ Hobbyists can easily acquire a free license key │
  1794. 28.93 s > │ that unlocks all cores and removes this banner: │
  1795. 28.93 s > │ │
  1796. 28.93 s > │ from symbolica import * │
  1797. 28.93 s > │ request_hobbyist_license('YOUR_NAME', 'YOUR_EMAIL') │
  1798. 28.93 s > │ │
  1799. 28.93 s > │ All other users can obtain a free 30-day trial key: │
  1800. 28.93 s > │ │
  1801. 28.93 s > │ from symbolica import * │
  1802. 28.93 s > │ request_trial_license('NAME', 'EMAIL', 'EMPLOYER') │
  1803. 28.93 s > │ │
  1804. 28.93 s > │ See https://symbolica.io/docs/get_started.html#license │
  1805. 28.93 s > └────────────────────────────────────────────────────────┘
  1806. 28.93 s > ┌───────────────────────────────────────────────────────────────────────────────────────────────────────────┐
  1807. 28.93 s > │ Cannot start new unlicensed Symbolica instance since there is already another one running on the machine. │
  1808. 28.93 s > └───────────────────────────────────────────────────────────────────────────────────────────────────────────┘
  1809. 28.93 s >
  1810. 28.93 s > stderr:
  1811. 28.93 s > ┌───────────────────────────────────┐
  1812. 28.93 s > │ The Symbolica license has expired │
  1813. 28.93 s > └───────────────────────────────────┘
  1814. 28.93 s > [2026-09-01 16:00:46.411] @gammaloop_api::se... INFO : Running command import model sm-default
  1815. 28.93 s > [2026-09-01 16:00:46.411] @import::model INFO : Loading built-in JSON model sm-default
  1816. 28.93 s > [2026-09-01 16:00:46.447] @gammalooprs::model INFO : The following 11 external parameters were forced to zero by the restriction card:
  1817. 28.93 s > lamWS, AWS, rhoWS, etaWS, ymc, yme, ymm, MC, Me, MM, WTau
  1818. 28.93 s > [2026-09-01 16:00:46.447] @gammalooprs::model INFO : The following 34 vertex rules were removed by the restriction card:
  1819. 28.93 s > V_82 -> (c~, d, G+) | V_83 -> (t~, d, G+) | V_84 -> (c~, s, G+) | V_85 -> (t~, s, G+) | V_86 -> (u~, b, G+) | V_87 -> (c~, b, G+) | V_90 -> (c~, d, W+) | V_91 -> (t~, d, W+) | V_92 -> (u~, s, W+) | V_94 -> (t~, s, W+) | V_95 -> (u~, b, W+) | V_96 -> (c~, b, W+) | V_101 -> (e+, e-, G0) | V_102 -> (mu+, mu-, G0) | V_104 -> (e+, e-, H) | V_105 -> (mu+, mu-, H) | V_110 -> (ve~, e-, G+) | V_111 -> (vm~, mu-, G+) | V_116 -> (b~, u, G-) | V_117 -> (d~, c, G-) | V_118 -> (s~, c, G-) | V_119 -> (b~, c, G-) | V_120 -> (d~, t, G-) | V_121 -> (s~, t, G-) | V_124 -> (s~, u, W-) | V_125 -> (b~, u, W-) | V_126 -> (d~, c, W-) | V_128 -> (b~, c, W-) | V_129 -> (d~, t, W-) | V_130 -> (s~, t, W-) | V_138 -> (c~, c, G0) | V_140 -> (c~, c, H) | V_145 -> (e+, ve, G-) | V_146 -> (mu+, vm, G-)
  1820. 28.93 s > [2026-09-01 16:00:46.447] @gammalooprs::model INFO : The following 36 couplings were removed by the restriction card:
  1821. 28.93 s > GC_13, GC_14, GC_16, GC_17, GC_18, GC_19, GC_20, GC_22, GC_23, GC_24, GC_25, GC_26, GC_28, GC_29, GC_42, GC_43, GC_44, GC_46, GC_47, GC_48, GC_84, GC_85, GC_86, GC_87, GC_88, GC_89, GC_90, GC_91, GC_92, GC_93, GC_101, GC_102, GC_103, GC_105, GC_106, GC_107
  1822. 28.93 s > [2026-09-01 16:00:46.447] @gammaloop_api::se... INFO : Running command set default-runtime kv kinematics.externals='{"type":"constant","data":{"momenta":[[32.0,0.0,0.0,32.0],[32.0,0.0,0.0,-32.0]],"helicities":[1,1]}}'
  1823. 28.93 s > [2026-09-01 16:00:46.448] @gammaloop_api::se... INFO : Running command set default-runtime kv subtraction.disable_threshold_subtraction=true
  1824. 28.93 s > [2026-09-01 16:00:46.449] @gammaloop_api::se... INFO : Running command generate xs e+ e- > d d~ g | e- a d g QED^2==4 [{{2}} QCD=0] --numerator-grouping group_identical_graphs_up_to_sign --clear-existing-processes --only-diagrams
  1825. 28.93 s > [2026-09-01 16:00:46.451] @feyngen::diagram_... INFO : 0s | Δ=0s | Starting Feynman graph generation with Symbolica...
  1826. 28.93 s > [2026-09-01 16:00:46.454] @feyngen::diagram_... INFO : 0s | Δ=0s | Number of graphs resulting from Symbolica generation: 246
  1827. 28.93 s > [2026-09-01 16:00:46.454] @feyngen::diagram_... INFO : 0s | Δ=0s | Number of graphs retained after enforcing supergraph particle content: 8
  1828. 28.93 s > [2026-09-01 16:00:46.454] @feyngen::diagram_... INFO : 0s | Δ=0s | Number of graphs retained after removal of vetoed topologies: 8
  1829. 28.93 s > [2026-09-01 16:00:46.454] @feyngen::diagram_... INFO : 0s | Δ=0s | Number of graphs after vertex info assignment: 8
  1830. 28.93 s > [2026-09-01 16:00:46.454] @feyngen::diagram_... INFO : 0s | Δ=0s | Number of graphs after all complete graphs filters are applied: 8
  1831. 28.93 s >
  1832. 28.93 s >
  1833. 28.93 s > Location:
  1834. 28.93 s > tests/tests/test_python_api.rs:156:20
  1835. 28.93 s > system-out
  1836. 28.93 s > running 1 test
  1837. 28.93 s > test python_evaluate_sample_honors_generate_events_and_observable_snapshots ... FAILED
  1838. 28.93 s >
  1839. 28.93 s > failures:
  1840. 28.93 s >
  1841. 28.93 s > failures:
  1842. 28.93 s > python_evaluate_sample_honors_generate_events_and_observable_snapshots
  1843. 28.93 s >
  1844. 28.93 s > test result: FAILED. 0 passed; 1 failed; 0 ignored; 0 measured; 4 filtered out; finished in 0.21s
  1845. 28.93 s > system-err
  1846. 28.93 s > Error: Python API test subprocess failed.
  1847. 28.93 s > stdout:
  1848. 28.93 s > ┌────────────────────────────────────────────────────────┐
  1849. 28.93 s > │ You are running a restricted Symbolica instance. │
  1850. 28.93 s > │ │
  1851. 28.93 s > │ This mode is only permitted for non-commercial use and │
  1852. 28.93 s > │ is limited to one instance and core per machine. │
  1853. 28.93 s > │ │
  1854. 28.93 s > │ Hobbyists can easily acquire a free license key │
  1855. 28.93 s > │ that unlocks all cores and removes this banner: │
  1856. 28.93 s > │ │
  1857. 28.93 s > │ from symbolica import * │
  1858. 28.93 s > │ request_hobbyist_license('YOUR_NAME', 'YOUR_EMAIL') │
  1859. 28.93 s > │ │
  1860. 28.93 s > │ All other users can obtain a free 30-day trial key: │
  1861. 28.93 s > │ │
  1862. 28.93 s > │ from symbolica import * │
  1863. 28.93 s > │ request_trial_license('NAME', 'EMAIL', 'EMPLOYER') │
  1864. 28.93 s > │ │
  1865. 28.93 s > │ See https://symbolica.io/docs/get_started.html#license │
  1866. 28.93 s > └────────────────────────────────────────────────────────┘
  1867. 28.93 s > ┌───────────────────────────────────────────────────────────────────────────────────────────────────────────┐
  1868. 28.93 s > │ Cannot start new unlicensed Symbolica instance since there is already another one running on the machine. │
  1869. 28.93 s > └───────────────────────────────────────────────────────────────────────────────────────────────────────────┘
  1870. 28.93 s >
  1871. 28.93 s > stderr:
  1872. 28.93 s > ┌───────────────────────────────────┐
  1873. 28.93 s > │ The Symbolica license has expired │
  1874. 28.93 s > └───────────────────────────────────┘
  1875. 28.93 s > [2026-09-01 16:00:46.411] @gammaloop_api::se... INFO : Running command import model sm-default
  1876. 28.93 s > [2026-09-01 16:00:46.411] @import::model INFO : Loading built-in JSON model sm-default
  1877. 28.93 s > [2026-09-01 16:00:46.447] @gammalooprs::model INFO : The following 11 external parameters were forced to zero by the restriction card:
  1878. 28.93 s > lamWS, AWS, rhoWS, etaWS, ymc, yme, ymm, MC, Me, MM, WTau
  1879. 28.93 s > [2026-09-01 16:00:46.447] @gammalooprs::model INFO : The following 34 vertex rules were removed by the restriction card:
  1880. 28.93 s > V_82 -> (c~, d, G+) | V_83 -> (t~, d, G+) | V_84 -> (c~, s, G+) | V_85 -> (t~, s, G+) | V_86 -> (u~, b, G+) | V_87 -> (c~, b, G+) | V_90 -> (c~, d, W+) | V_91 -> (t~, d, W+) | V_92 -> (u~, s, W+) | V_94 -> (t~, s, W+) | V_95 -> (u~, b, W+) | V_96 -> (c~, b, W+) | V_101 -> (e+, e-, G0) | V_102 -> (mu+, mu-, G0) | V_104 -> (e+, e-, H) | V_105 -> (mu+, mu-, H) | V_110 -> (ve~, e-, G+) | V_111 -> (vm~, mu-, G+) | V_116 -> (b~, u, G-) | V_117 -> (d~, c, G-) | V_118 -> (s~, c, G-) | V_119 -> (b~, c, G-) | V_120 -> (d~, t, G-) | V_121 -> (s~, t, G-) | V_124 -> (s~, u, W-) | V_125 -> (b~, u, W-) | V_126 -> (d~, c, W-) | V_128 -> (b~, c, W-) | V_129 -> (d~, t, W-) | V_130 -> (s~, t, W-) | V_138 -> (c~, c, G0) | V_140 -> (c~, c, H) | V_145 -> (e+, ve, G-) | V_146 -> (mu+, vm, G-)
  1881. 28.93 s > [2026-09-01 16:00:46.447] @gammalooprs::model INFO : The following 36 couplings were removed by the restriction card:
  1882. 28.93 s > GC_13, GC_14, GC_16, GC_17, GC_18, GC_19, GC_20, GC_22, GC_23, GC_24, GC_25, GC_26, GC_28, GC_29, GC_42, GC_43, GC_44, GC_46, GC_47, GC_48, GC_84, GC_85, GC_86, GC_87, GC_88, GC_89, GC_90, GC_91, GC_92, GC_93, GC_101, GC_102, GC_103, GC_105, GC_106, GC_107
  1883. 28.93 s > [2026-09-01 16:00:46.447] @gammaloop_api::se... INFO : Running command set default-runtime kv kinematics.externals='{"type":"constant","data":{"momenta":[[32.0,0.0,0.0,32.0],[32.0,0.0,0.0,-32.0]],"helicities":[1,1]}}'
  1884. 28.93 s > [2026-09-01 16:00:46.448] @gammaloop_api::se... INFO : Running command set default-runtime kv subtraction.disable_threshold_subtraction=true
  1885. 28.93 s > [2026-09-01 16:00:46.449] @gammaloop_api::se... INFO : Running command generate xs e+ e- > d d~ g | e- a d g QED^2==4 [{{2}} QCD=0] --numerator-grouping group_identical_graphs_up_to_sign --clear-existing-processes --only-diagrams
  1886. 28.93 s > [2026-09-01 16:00:46.451] @feyngen::diagram_... INFO : 0s | Δ=0s | Starting Feynman graph generation with Symbolica...
  1887. 28.93 s > [2026-09-01 16:00:46.454] @feyngen::diagram_... INFO : 0s | Δ=0s | Number of graphs resulting from Symbolica generation: 246
  1888. 28.93 s > [2026-09-01 16:00:46.454] @feyngen::diagram_... INFO : 0s | Δ=0s | Number of graphs retained after enforcing supergraph particle content: 8
  1889. 28.93 s > [2026-09-01 16:00:46.454] @feyngen::diagram_... INFO : 0s | Δ=0s | Number of graphs retained after removal of vetoed topologies: 8
  1890. 28.93 s > [2026-09-01 16:00:46.454] @feyngen::diagram_... INFO : 0s | Δ=0s | Number of graphs after vertex info assignment: 8
  1891. 28.93 s > [2026-09-01 16:00:46.454] @feyngen::diagram_... INFO : 0s | Δ=0s | Number of graphs after all complete graphs filters are applied: 8
  1892. 28.93 s >
  1893. 28.93 s >
  1894. 28.93 s > Location:
  1895. 28.93 s > tests/tests/test_python_api.rs:156:20
  1896. 28.93 s >
  1897. 28.93 s > 5. gammaloop-integration-tests::test_python_api::python_settings_wrappers_expose_nested_runtime_and_global_settings
  1898. 28.93 s > failure: test failure with exit code 101
  1899. 28.93 s > Error: Python API test subprocess failed.
  1900. 28.93 s > stdout:
  1901. 28.93 s > ┌────────────────────────────────────────────────────────┐
  1902. 28.93 s > │ You are running a restricted Symbolica instance. │
  1903. 28.93 s > │ │
  1904. 28.93 s > │ This mode is only permitted for non-commercial use and │
  1905. 28.93 s > │ is limited to one instance and core per machine. │
  1906. 28.93 s > │ │
  1907. 28.93 s > │ Hobbyists can easily acquire a free license key │
  1908. 28.93 s > │ that unlocks all cores and removes this banner: │
  1909. 28.93 s > │ │
  1910. 28.93 s > │ from symbolica import * │
  1911. 28.93 s > │ request_hobbyist_license('YOUR_NAME', 'YOUR_EMAIL') │
  1912. 28.93 s > │ │
  1913. 28.93 s > │ All other users can obtain a free 30-day trial key: │
  1914. 28.93 s > │ │
  1915. 28.93 s > │ from symbolica import * │
  1916. 28.93 s > │ request_trial_license('NAME', 'EMAIL', 'EMPLOYER') │
  1917. 28.93 s > │ │
  1918. 28.93 s > │ See https://symbolica.io/docs/get_started.html#license │
  1919. 28.93 s > └────────────────────────────────────────────────────────┘
  1920. 28.93 s > ┌───────────────────────────────────────────────────────────────────────────────────────────────────────────┐
  1921. 28.93 s > │ Cannot start new unlicensed Symbolica instance since there is already another one running on the machine. │
  1922. 28.93 s > └───────────────────────────────────────────────────────────────────────────────────────────────────────────┘
  1923. 28.93 s >
  1924. 28.93 s > stderr:
  1925. 28.93 s > ┌───────────────────────────────────┐
  1926. 28.93 s > │ The Symbolica license has expired │
  1927. 28.93 s > └───────────────────────────────────┘
  1928. 28.93 s >
  1929. 28.93 s >
  1930. 28.93 s > Location:
  1931. 28.93 s > tests/tests/test_python_api.rs:156:20
  1932. 28.93 s > system-out
  1933. 28.93 s > running 1 test
  1934. 28.93 s > test python_settings_wrappers_expose_nested_runtime_and_global_settings ... FAILED
  1935. 28.93 s >
  1936. 28.93 s > failures:
  1937. 28.93 s >
  1938. 28.93 s > failures:
  1939. 28.93 s > python_settings_wrappers_expose_nested_runtime_and_global_settings
  1940. 28.93 s >
  1941. 28.93 s > test result: FAILED. 0 passed; 1 failed; 0 ignored; 0 measured; 4 filtered out; finished in 0.22s
  1942. 28.93 s > system-err
  1943. 28.93 s > Error: Python API test subprocess failed.
  1944. 28.93 s > stdout:
  1945. 28.93 s > ┌────────────────────────────────────────────────────────┐
  1946. 28.93 s > │ You are running a restricted Symbolica instance. │
  1947. 28.93 s > │ │
  1948. 28.93 s > │ This mode is only permitted for non-commercial use and │
  1949. 28.93 s > │ is limited to one instance and core per machine. │
  1950. 28.93 s > │ │
  1951. 28.93 s > │ Hobbyists can easily acquire a free license key │
  1952. 28.93 s > │ that unlocks all cores and removes this banner: │
  1953. 28.93 s > │ │
  1954. 28.93 s > │ from symbolica import * │
  1955. 28.93 s > │ request_hobbyist_license('YOUR_NAME', 'YOUR_EMAIL') │
  1956. 28.93 s > │ │
  1957. 28.93 s > │ All other users can obtain a free 30-day trial key: │
  1958. 28.93 s > │ │
  1959. 28.93 s > │ from symbolica import * │
  1960. 28.93 s > │ request_trial_license('NAME', 'EMAIL', 'EMPLOYER') │
  1961. 28.93 s > │ │
  1962. 28.93 s > │ See https://symbolica.io/docs/get_started.html#license │
  1963. 28.93 s > └────────────────────────────────────────────────────────┘
  1964. 28.93 s > ┌───────────────────────────────────────────────────────────────────────────────────────────────────────────┐
  1965. 28.93 s > │ Cannot start new unlicensed Symbolica instance since there is already another one running on the machine. │
  1966. 28.93 s > └───────────────────────────────────────────────────────────────────────────────────────────────────────────┘
  1967. 28.93 s >
  1968. 28.93 s > stderr:
  1969. 28.93 s > ┌───────────────────────────────────┐
  1970. 28.93 s > │ The Symbolica license has expired │
  1971. 28.93 s > └───────────────────────────────────┘
  1972. 28.93 s >
  1973. 28.93 s >
  1974. 28.93 s > Location:
  1975. 28.93 s > tests/tests/test_python_api.rs:156:20
  1976. 28.93 s > =========================================
  1977. 28.93 s For full logs, run:
  1978. 28.93 s nix log /nix/store/bsvj9vr3w2p8wi7qh7xmxqps4i34mbmv-gammaloop-nextest-python-api.drv
  1979. 29.05 s Run failed.