test packages.x86_64-linux.nix-ci-check-gammaloop-nextest-clinnet

Reproduce this run
Original Run
  1. 0.01 s $ /nix/store/bhv6xyvqw6gjs3j488gi1z6wdv18bdpa-coreutils-9.11/bin/timeout --kill-after=15s 7200s /nix/store/bxgja2ppiqi6w2bgn0r07d7mgnl1k6k2-nix-2.34.8/bin/nix --extra-experimental-features nix-command --extra-experimental-features flakes flake clone git+https://github.com/alphal00p/gammaloop --dest /tmp/nix-ci-worker/stable-pwd/repo/
  2. 0.64 s Cloning into '/tmp/nix-ci-worker/stable-pwd/repo'...
  3. 1.64 s remote: Enumerating objects: 162134, done.
  4. 1.76 s remote: Counting objects: 0% (1/16812) remote: Counting objects: 1% (169/16812) remote: Counting objects: 2% (337/16812) remote: Counting objects: 3% (505/16812) remote: Counting objects: 4% (673/16812) remote: Counting objects: 5% (841/16812) remote: Counting objects: 6% (1009/16812) remote: Counting objects: 7% (1177/16812) remote: Counting objects: 8% (1345/16812) remote: Counting objects: 9% (1514/16812) remote: Counting objects: 10% (1682/16812) remote: Counting objects: 11% (1850/16812) remote: Counting objects: 12% (2018/16812) remote: Counting objects: 13% (2186/16812) remote: Counting objects: 14% (2354/16812) remote: Counting objects: 15% (2522/16812) remote: Counting objects: 16% (2690/16812) remote: Counting objects: 17% (2859/16812) remote: Counting objects: 18% (3027/16812) remote: Counting objects: 19% (3195/16812) remote: Counting objects: 20% (3363/16812) remote: Counting objects: 21% (3531/16812) remote: Counting objects: 22% (3699/16812) remote: Counting objects: 23% (3867/16812) remote: Counting objects: 24% (4035/16812) remote: Counting objects: 25% (4203/16812) remote: Counting objects: 26% (4372/16812) remote: Counting objects: 27% (4540/16812) remote: Counting objects: 28% (4708/16812) remote: Counting objects: 29% (4876/16812) remote: Counting objects: 30% (5044/16812) remote: Counting objects: 31% (5212/16812) remote: Counting objects: 32% (5380/16812) remote: Counting objects: 33% (5548/16812) remote: Counting objects: 34% (5717/16812) remote: Counting objects: 35% (5885/16812) remote: Counting objects: 36% (6053/16812) remote: Counting objects: 37% (6221/16812) remote: Counting objects: 38% (6389/16812) remote: Counting objects: 39% (6557/16812) remote: Counting objects: 40% (6725/16812) remote: Counting objects: 41% (6893/16812) remote: Counting objects: 42% (7062/16812) remote: Counting objects: 43% (7230/16812) remote: Counting objects: 44% (7398/16812) remote: Counting objects: 45% (7566/16812) remote: Counting objects: 46% (7734/16812) remote: Counting objects: 47% (7902/16812) remote: Counting objects: 48% (8070/16812) remote: Counting objects: 49% (8238/16812) remote: Counting objects: 50% (8406/16812) remote: Counting objects: 51% (8575/16812) remote: Counting objects: 52% (8743/16812) remote: Counting objects: 53% (8911/16812) remote: Counting objects: 54% (9079/16812) remote: Counting objects: 55% (9247/16812) remote: Counting objects: 56% (9415/16812) remote: Counting objects: 57% (9583/16812) remote: Counting objects: 58% (9751/16812) remote: Counting objects: 59% (9920/16812) remote: Counting objects: 60% (10088/16812) remote: Counting objects: 61% (10256/16812) remote: Counting objects: 62% (10424/16812) remote: Counting objects: 63% (10592/16812) remote: Counting objects: 64% (10760/16812) remote: Counting objects: 65% (10928/16812) remote: Counting objects: 66% (11096/16812) remote: Counting objects: 67% (11265/16812) remote: Counting objects: 68% (11433/16812) remote: Counting objects: 69% (11601/16812) remote: Counting objects: 70% (11769/16812) remote: Counting objects: 71% (11937/16812) remote: Counting objects: 72% (12105/16812) remote: Counting objects: 73% (12273/16812) remote: Counting objects: 74% (12441/16812) remote: Counting objects: 75% (12609/16812) remote: Counting objects: 76% (12778/16812) remote: Counting objects: 77% (12946/16812) remote: Counting objects: 78% (13114/16812) remote: Counting objects: 79% (13282/16812) remote: Counting objects: 80% (13450/16812) remote: Counting objects: 81% (13618/16812) remote: Counting objects: 82% (13786/16812) remote: Counting objects: 83% (13954/16812) remote: Counting objects: 84% (14123/16812) remote: Counting objects: 85% (14291/16812) remote: Counting objects: 86% (14459/16812) remote: Counting objects: 87% (14627/16812) remote: Counting objects: 88% (14795/16812) remote: Counting objects: 89% (14963/16812) remote: Counting objects: 90% (15131/16812) remote: Counting objects: 91% (15299/16812) remote: Counting objects: 92% (15468/16812) remote: Counting objects: 93% (15636/16812) remote: Counting objects: 94% (15804/16812) remote: Counting objects: 95% (15972/16812) remote: Counting objects: 96% (16140/16812) remote: Counting objects: 97% (16308/16812) remote: Counting objects: 98% (16476/16812) remote: Counting objects: 99% (16644/16812) remote: Counting objects: 100% (16812/16812) remote: Counting objects: 100% (16812/16812), done.
  5. 7.74 s remote: Compressing objects: 0% (1/3844) remote: Compressing objects: 1% (39/3844) remote: Compressing objects: 2% (77/3844) remote: Compressing objects: 3% (116/3844) remote: Compressing objects: 4% (154/3844) remote: Compressing objects: 5% (193/3844) remote: Compressing objects: 6% (231/3844) remote: Compressing objects: 7% (270/3844) remote: Compressing objects: 8% (308/3844) remote: Compressing objects: 9% (346/3844) remote: Compressing objects: 9% (375/3844) remote: Compressing objects: 10% (385/3844) remote: Compressing objects: 11% (423/3844) remote: Compressing objects: 12% (462/3844) remote: Compressing objects: 13% (500/3844) remote: Compressing objects: 13% (529/3844) remote: Compressing objects: 14% (539/3844) remote: Compressing objects: 15% (577/3844) remote: Compressing objects: 15% (602/3844) remote: Compressing objects: 16% (616/3844) remote: Compressing objects: 17% (654/3844) remote: Compressing objects: 18% (692/3844) remote: Compressing objects: 19% (731/3844) remote: Compressing objects: 19% (745/3844) remote: Compressing objects: 20% (769/3844) remote: Compressing objects: 21% (808/3844) remote: Compressing objects: 22% (846/3844) remote: Compressing objects: 23% (885/3844) remote: Compressing objects: 24% (923/3844) remote: Compressing objects: 24% (925/3844) remote: Compressing objects: 25% (961/3844) remote: Compressing objects: 26% (1000/3844) remote: Compressing objects: 27% (1038/3844) remote: Compressing objects: 28% (1077/3844) remote: Compressing objects: 29% (1115/3844) remote: Compressing objects: 30% (1154/3844) remote: Compressing objects: 31% (1192/3844) remote: Compressing objects: 32% (1231/3844) remote: Compressing objects: 33% (1269/3844) remote: Compressing objects: 34% (1307/3844) remote: Compressing objects: 35% (1346/3844) remote: Compressing objects: 36% (1384/3844) remote: Compressing objects: 37% (1423/3844) remote: Compressing objects: 38% (1461/3844) remote: Compressing objects: 39% (1500/3844) remote: Compressing objects: 40% (1538/3844) remote: Compressing objects: 41% (1577/3844) remote: Compressing objects: 41% (1612/3844) remote: Compressing objects: 42% (1615/3844) remote: Compressing objects: 43% (1653/3844) remote: Compressing objects: 44% (1692/3844) remote: Compressing objects: 45% (1730/3844) remote: Compressing objects: 46% (1769/3844) remote: Compressing objects: 47% (1807/3844) remote: Compressing objects: 48% (1846/3844) remote: Compressing objects: 49% (1884/3844) remote: Compressing objects: 50% (1922/3844) remote: Compressing objects: 51% (1961/3844) remote: Compressing objects: 52% (1999/3844) remote: Compressing objects: 53% (2038/3844) remote: Compressing objects: 54% (2076/3844) remote: Compressing objects: 55% (2115/3844) remote: Compressing objects: 56% (2153/3844) remote: Compressing objects: 57% (2192/3844) remote: Compressing objects: 58% (2230/3844) remote: Compressing objects: 59% (2268/3844) remote: Compressing objects: 60% (2307/3844) remote: Compressing objects: 61% (2345/3844) remote: Compressing objects: 62% (2384/3844) remote: Compressing objects: 63% (2422/3844) remote: Compressing objects: 64% (2461/3844) remote: Compressing objects: 65% (2499/3844) remote: Compressing objects: 66% (2538/3844) remote: Compressing objects: 67% (2576/3844) remote: Compressing objects: 68% (2614/3844) remote: Compressing objects: 69% (2653/3844) remote: Compressing objects: 70% (2691/3844) remote: Compressing objects: 71% (2730/3844) remote: Compressing objects: 72% (2768/3844) remote: Compressing objects: 73% (2807/3844) remote: Compressing objects: 74% (2845/3844) remote: Compressing objects: 75% (2883/3844) remote: Compressing objects: 76% (2922/3844) remote: Compressing objects: 77% (2960/3844) remote: Compressing objects: 78% (2999/3844) remote: Compressing objects: 79% (3037/3844) remote: Compressing objects: 80% (3076/3844) remote: Compressing objects: 81% (3114/3844) remote: Compressing objects: 82% (3153/3844) remote: Compressing objects: 83% (3191/3844) remote: Compressing objects: 84% (3229/3844) remote: Compressing objects: 85% (3268/3844) remote: Compressing objects: 86% (3306/3844) remote: Compressing objects: 87% (3345/3844) remote: Compressing objects: 88% (3383/3844) remote: Compressing objects: 89% (3422/3844) remote: Compressing objects: 90% (3460/3844) remote: Compressing objects: 91% (3499/3844) remote: Compressing objects: 92% (3537/3844) remote: Compressing objects: 93% (3575/3844) remote: Compressing objects: 94% (3614/3844) remote: Compressing objects: 95% (3652/3844) remote: Compressing objects: 96% (3691/3844) remote: Compressing objects: 97% (3729/3844) remote: Compressing objects: 98% (3768/3844) remote: Compressing objects: 99% (3806/3844) remote: Compressing objects: 100% (3844/3844) remote: Compressing objects: 100% (3844/3844), done.
  6. 22.65 s Receiving objects: 0% (1/162134) Receiving objects: 1% (1622/162134) Receiving objects: 2% (3243/162134), 11.20 MiB | 22.38 MiB/s Receiving objects: 3% (4865/162134), 11.20 MiB | 22.38 MiB/s Receiving objects: 4% (6486/162134), 11.20 MiB | 22.38 MiB/s Receiving objects: 4% (7207/162134), 11.20 MiB | 22.38 MiB/s Receiving objects: 5% (8107/162134), 30.29 MiB | 30.07 MiB/s Receiving objects: 6% (9729/162134), 30.29 MiB | 30.07 MiB/s Receiving objects: 7% (11350/162134), 47.68 MiB | 31.63 MiB/s Receiving objects: 7% (11675/162134), 47.68 MiB | 31.63 MiB/s Receiving objects: 8% (12971/162134), 64.91 MiB | 32.34 MiB/s Receiving objects: 9% (14593/162134), 64.91 MiB | 32.34 MiB/s Receiving objects: 10% (16214/162134), 64.91 MiB | 32.34 MiB/s Receiving objects: 11% (17835/162134), 64.91 MiB | 32.34 MiB/s Receiving objects: 12% (19457/162134), 64.91 MiB | 32.34 MiB/s Receiving objects: 13% (21078/162134), 81.24 MiB | 32.40 MiB/s Receiving objects: 14% (22699/162134), 81.24 MiB | 32.40 MiB/s Receiving objects: 15% (24321/162134), 81.24 MiB | 32.40 MiB/s Receiving objects: 16% (25942/162134), 81.24 MiB | 32.40 MiB/s Receiving objects: 17% (27563/162134), 81.24 MiB | 32.40 MiB/s Receiving objects: 18% (29185/162134), 81.24 MiB | 32.40 MiB/s Receiving objects: 19% (30806/162134), 81.24 MiB | 32.40 MiB/s Receiving objects: 20% (32427/162134), 81.24 MiB | 32.40 MiB/s Receiving objects: 21% (34049/162134), 81.24 MiB | 32.40 MiB/s Receiving objects: 22% (35670/162134), 81.24 MiB | 32.40 MiB/s Receiving objects: 23% (37291/162134), 81.24 MiB | 32.40 MiB/s Receiving objects: 24% (38913/162134), 81.24 MiB | 32.40 MiB/s Receiving objects: 25% (40534/162134), 81.24 MiB | 32.40 MiB/s Receiving objects: 26% (42155/162134), 81.24 MiB | 32.40 MiB/s Receiving objects: 27% (43777/162134), 81.24 MiB | 32.40 MiB/s Receiving objects: 28% (45398/162134), 81.24 MiB | 32.40 MiB/s Receiving objects: 28% (45610/162134), 99.47 MiB | 33.03 MiB/s Receiving objects: 29% (47019/162134), 99.47 MiB | 33.03 MiB/s Receiving objects: 30% (48641/162134), 99.47 MiB | 33.03 MiB/s Receiving objects: 31% (50262/162134), 99.47 MiB | 33.03 MiB/s Receiving objects: 32% (51883/162134), 99.47 MiB | 33.03 MiB/s Receiving objects: 33% (53505/162134), 99.47 MiB | 33.03 MiB/s Receiving objects: 34% (55126/162134), 99.47 MiB | 33.03 MiB/s Receiving objects: 35% (56747/162134), 117.11 MiB | 33.34 MiB/s Receiving objects: 36% (58369/162134), 117.11 MiB | 33.34 MiB/s Receiving objects: 37% (59990/162134), 117.11 MiB | 33.34 MiB/s Receiving objects: 38% (61611/162134), 117.11 MiB | 33.34 MiB/s Receiving objects: 38% (61997/162134), 117.11 MiB | 33.34 MiB/s Receiving objects: 39% (63233/162134), 135.07 MiB | 33.57 MiB/s Receiving objects: 40% (64854/162134), 135.07 MiB | 33.57 MiB/s Receiving objects: 41% (66475/162134), 135.07 MiB | 33.57 MiB/s Receiving objects: 42% (68097/162134), 135.07 MiB | 33.57 MiB/s Receiving objects: 43% (69718/162134), 152.76 MiB | 33.76 MiB/s Receiving objects: 44% (71339/162134), 152.76 MiB | 33.76 MiB/s Receiving objects: 44% (71825/162134), 152.76 MiB | 33.76 MiB/s Receiving objects: 45% (72961/162134), 170.50 MiB | 35.10 MiB/s Receiving objects: 46% (74582/162134), 170.50 MiB | 35.10 MiB/s Receiving objects: 47% (76203/162134), 170.50 MiB | 35.10 MiB/s Receiving objects: 48% (77825/162134), 170.50 MiB | 35.10 MiB/s Receiving objects: 49% (79446/162134), 170.50 MiB | 35.10 MiB/s Receiving objects: 50% (81067/162134), 170.50 MiB | 35.10 MiB/s Receiving objects: 51% (82689/162134), 188.11 MiB | 34.82 MiB/s Receiving objects: 52% (84310/162134), 188.11 MiB | 34.82 MiB/s Receiving objects: 53% (85932/162134), 188.11 MiB | 34.82 MiB/s Receiving objects: 54% (87553/162134), 188.11 MiB | 34.82 MiB/s Receiving objects: 55% (89174/162134), 188.11 MiB | 34.82 MiB/s Receiving objects: 55% (89357/162134), 188.11 MiB | 34.82 MiB/s Receiving objects: 55% (89803/162134), 223.28 MiB | 34.85 MiB/s Receiving objects: 56% (90796/162134), 241.49 MiB | 35.26 MiB/s Receiving objects: 57% (92417/162134), 258.88 MiB | 35.01 MiB/s Receiving objects: 57% (93174/162134), 258.88 MiB | 35.01 MiB/s Receiving objects: 58% (94038/162134), 276.77 MiB | 34.96 MiB/s Receiving objects: 59% (95660/162134), 276.77 MiB | 34.96 MiB/s Receiving objects: 60% (97281/162134), 276.77 MiB | 34.96 MiB/s Receiving objects: 61% (98902/162134), 294.45 MiB | 34.99 MiB/s Receiving objects: 62% (100524/162134), 294.45 MiB | 34.99 MiB/s Receiving objects: 62% (100625/162134), 294.45 MiB | 34.99 MiB/s Receiving objects: 63% (102145/162134), 312.45 MiB | 35.07 MiB/s Receiving objects: 64% (103766/162134), 312.45 MiB | 35.07 MiB/s Receiving objects: 65% (105388/162134), 312.45 MiB | 35.07 MiB/s Receiving objects: 66% (107009/162134), 312.45 MiB | 35.07 MiB/s Receiving objects: 67% (108630/162134), 329.78 MiB | 35.00 MiB/s Receiving objects: 68% (110252/162134), 329.78 MiB | 35.00 MiB/s Receiving objects: 69% (111873/162134), 329.78 MiB | 35.00 MiB/s Receiving objects: 70% (113494/162134), 329.78 MiB | 35.00 MiB/s Receiving objects: 71% (115116/162134), 329.78 MiB | 35.00 MiB/s Receiving objects: 72% (116737/162134), 329.78 MiB | 35.00 MiB/s Receiving objects: 73% (118358/162134), 329.78 MiB | 35.00 MiB/s Receiving objects: 74% (119980/162134), 329.78 MiB | 35.00 MiB/s Receiving objects: 74% (120269/162134), 329.78 MiB | 35.00 MiB/s Receiving objects: 75% (121601/162134), 329.78 MiB | 35.00 MiB/s Receiving objects: 76% (123222/162134), 347.82 MiB | 35.09 MiB/s Receiving objects: 77% (124844/162134), 347.82 MiB | 35.09 MiB/s Receiving objects: 78% (126465/162134), 365.21 MiB | 34.97 MiB/s Receiving objects: 79% (128086/162134), 365.21 MiB | 34.97 MiB/s Receiving objects: 80% (129708/162134), 365.21 MiB | 34.97 MiB/s Receiving objects: 80% (130391/162134), 365.21 MiB | 34.97 MiB/s Receiving objects: 81% (131329/162134), 365.21 MiB | 34.97 MiB/s Receiving objects: 82% (132950/162134), 400.84 MiB | 34.90 MiB/s Receiving objects: 82% (133921/162134), 400.84 MiB | 34.90 MiB/s Receiving objects: 83% (134572/162134), 419.09 MiB | 35.19 MiB/s Receiving objects: 84% (136193/162134), 419.09 MiB | 35.19 MiB/s Receiving objects: 85% (137814/162134), 419.09 MiB | 35.19 MiB/s Receiving objects: 86% (139436/162134), 436.36 MiB | 35.07 MiB/s Receiving objects: 86% (140279/162134), 436.36 MiB | 35.07 MiB/s Receiving objects: 87% (141057/162134), 454.51 MiB | 35.16 MiB/s Receiving objects: 88% (142678/162134), 472.01 MiB | 34.94 MiB/s Receiving objects: 89% (144300/162134), 472.01 MiB | 34.94 MiB/s Receiving objects: 90% (145921/162134), 472.01 MiB | 34.94 MiB/s Receiving objects: 91% (147542/162134), 472.01 MiB | 34.94 MiB/s Receiving objects: 92% (149164/162134), 472.01 MiB | 34.94 MiB/s Receiving objects: 93% (150785/162134), 472.01 MiB | 34.94 MiB/s Receiving objects: 94% (152406/162134), 472.01 MiB | 34.94 MiB/s Receiving objects: 95% (154028/162134), 472.01 MiB | 34.94 MiB/s Receiving objects: 95% (154052/162134), 472.01 MiB | 34.94 MiB/s Receiving objects: 96% (155649/162134), 472.01 MiB | 34.94 MiB/s Receiving objects: 97% (157270/162134), 472.01 MiB | 34.94 MiB/s Receiving objects: 98% (158892/162134), 472.01 MiB | 34.94 MiB/s Receiving objects: 99% (160513/162134), 490.17 MiB | 35.10 MiB/s remote: Total 162134 (delta 14203), reused 13455 (delta 12950), pack-reused 145322 (from 3)
  7. 22.65 s Receiving objects: 100% (162134/162134), 498.52 MiB | 32.98 MiB/s Receiving objects: 100% (162134/162134), 500.72 MiB | 33.63 MiB/s, done.
  8. 24.64 s Resolving deltas: 0% (0/105841) Resolving deltas: 1% (1059/105841) Resolving deltas: 2% (2117/105841) Resolving deltas: 3% (3176/105841) Resolving deltas: 4% (4234/105841) Resolving deltas: 5% (5293/105841) Resolving deltas: 6% (6351/105841) Resolving deltas: 7% (7410/105841) Resolving deltas: 8% (8468/105841) Resolving deltas: 9% (9527/105841) Resolving deltas: 10% (10586/105841) Resolving deltas: 11% (11643/105841) Resolving deltas: 12% (12701/105841) Resolving deltas: 13% (13760/105841) Resolving deltas: 14% (14818/105841) Resolving deltas: 15% (15877/105841) Resolving deltas: 16% (16935/105841) Resolving deltas: 17% (17993/105841) Resolving deltas: 18% (19052/105841) Resolving deltas: 19% (20110/105841) Resolving deltas: 20% (21169/105841) Resolving deltas: 21% (22227/105841) Resolving deltas: 22% (23286/105841) Resolving deltas: 23% (24345/105841) Resolving deltas: 24% (25402/105841) Resolving deltas: 25% (26461/105841) Resolving deltas: 26% (27519/105841) Resolving deltas: 27% (28579/105841) Resolving deltas: 28% (29636/105841) Resolving deltas: 29% (30694/105841) Resolving deltas: 30% (31753/105841) Resolving deltas: 31% (32811/105841) Resolving deltas: 32% (33870/105841) Resolving deltas: 33% (34928/105841) Resolving deltas: 34% (35986/105841) Resolving deltas: 35% (37045/105841) Resolving deltas: 36% (38103/105841) Resolving deltas: 37% (39162/105841) Resolving deltas: 38% (40221/105841) Resolving deltas: 39% (41278/105841) Resolving deltas: 40% (42337/105841) Resolving deltas: 41% (43395/105841) Resolving deltas: 42% (44454/105841) Resolving deltas: 43% (45512/105841) Resolving deltas: 44% (46571/105841) Resolving deltas: 45% (47629/105841) Resolving deltas: 46% (48688/105841) Resolving deltas: 47% (49746/105841) Resolving deltas: 48% (50804/105841) Resolving deltas: 49% (51864/105841) Resolving deltas: 50% (52922/105841) Resolving deltas: 51% (53979/105841) Resolving deltas: 52% (55038/105841) Resolving deltas: 53% (56096/105841) Resolving deltas: 53% (56924/105841) Resolving deltas: 54% (57155/105841) Resolving deltas: 55% (58213/105841) Resolving deltas: 56% (59272/105841) Resolving deltas: 57% (60330/105841) Resolving deltas: 58% (61388/105841) Resolving deltas: 59% (62447/105841) Resolving deltas: 60% (63505/105841) Resolving deltas: 61% (64564/105841) Resolving deltas: 62% (65622/105841) Resolving deltas: 63% (66680/105841) Resolving deltas: 64% (67739/105841) Resolving deltas: 65% (68797/105841) Resolving deltas: 66% (69856/105841) Resolving deltas: 67% (70914/105841) Resolving deltas: 68% (71972/105841) Resolving deltas: 69% (73031/105841) Resolving deltas: 70% (74089/105841) Resolving deltas: 71% (75149/105841) Resolving deltas: 72% (76206/105841) Resolving deltas: 73% (77264/105841) Resolving deltas: 74% (78323/105841) Resolving deltas: 75% (79381/105841) Resolving deltas: 76% (80440/105841) Resolving deltas: 77% (81498/105841) Resolving deltas: 78% (82556/105841) Resolving deltas: 79% (83615/105841) Resolving deltas: 80% (84674/105841) Resolving deltas: 81% (85732/105841) Resolving deltas: 82% (86790/105841) Resolving deltas: 83% (87849/105841) Resolving deltas: 84% (88910/105841) Resolving deltas: 85% (89965/105841) Resolving deltas: 86% (91024/105841) Resolving deltas: 87% (92083/105841) Resolving deltas: 88% (93141/105841) Resolving deltas: 89% (94199/105841) Resolving deltas: 90% (95257/105841) Resolving deltas: 91% (96316/105841) Resolving deltas: 92% (97374/105841) Resolving deltas: 93% (98433/105841) Resolving deltas: 94% (99491/105841) Resolving deltas: 95% (100549/105841) Resolving deltas: 96% (101609/105841) Resolving deltas: 97% (102666/105841) Resolving deltas: 98% (103725/105841) Resolving deltas: 99% (104783/105841) Resolving deltas: 100% (105841/105841) Resolving deltas: 100% (105841/105841), done.
  9. 25.36 s Fetching commit 94a0ce8ee1cfeb9aadefd4d3ecc047ad85353172 for ufo-epsilon-normalization ...
  10. 25.36 s $ /nix/store/b1wn5clix1mz4vpfih7x9cnj9qfh7c6h-git-2.54.0/bin/git fetch origin 94a0ce8ee1cfeb9aadefd4d3ecc047ad85353172
  11. 25.79 s From https://github.com/alphal00p/gammaloop
  12. 25.79 s * branch 94a0ce8ee1cfeb9aadefd4d3ecc047ad85353172 -> FETCH_HEAD
  13. 25.80 s $ /nix/store/bhv6xyvqw6gjs3j488gi1z6wdv18bdpa-coreutils-9.11/bin/timeout --kill-after=15s 7200s /nix/store/b1wn5clix1mz4vpfih7x9cnj9qfh7c6h-git-2.54.0/bin/git -c advice.detachedHead=false checkout 94a0ce8ee1cfeb9aadefd4d3ecc047ad85353172
  14. 26.19 s HEAD is now at 94a0ce8ee nix-ci: enable NixCI for final review
  15. 26.20 s $ /nix/store/bhv6xyvqw6gjs3j488gi1z6wdv18bdpa-coreutils-9.11/bin/timeout --kill-after=15s 7200s /nix/store/bxgja2ppiqi6w2bgn0r07d7mgnl1k6k2-nix-2.34.8/bin/nix --extra-experimental-features nix-command --extra-experimental-features flakes --log-format internal-json run .#packages.x86_64-linux.nix-ci-check-gammaloop-nextest-clinnet --print-build-logs
  16. 26.33 s warning: ignoring untrusted flake configuration setting 'extra-substituters'.
  17. 26.33 s Pass '--accept-flake-config' to trust it
  18. 26.33 s warning: ignoring untrusted flake configuration setting 'extra-trusted-public-keys'.
  19. 26.33 s Pass '--accept-flake-config' to trust it
  20. 35.69 s
  21. 39.25 s evaluating derivation 'gdo you want to allow configuration setting 'extra-substituters' to be set to 'https://cache.nix-ci.com' (y/N)? do you want to permanently mark this value as untrusted (y/N)? warning: ignoring untrusted flake configuration setting 'extra-substituters'.
  22. 39.25 s Pass '--accept-flake-config' to trust it
  23. 39.25 s do you want to allow configuration setting 'extra-trusted-public-keys' to be set to 'nix-ci:g3xV5BDTLtIBZr/A00IU1x0EtKKlb7YLgBN2SgYgM6A=' (y/N)? do you want to permanently mark this value as untrusted (y/N)? warning: ignoring untrusted flake configuration setting 'extra-trusted-public-keys'.
  24. 39.25 s Pass '--accept-flake-config' to trust it
  25. 53.15 s copying '/nix/store/chkj evaluating derivation 'g copying '/nix/store/chkj evaluating derivation 'g copying '/nix/store/chkj evaluating derivation 'g copying '/nix/store/chkj evaluating derivation 'g copying '/nix/store/chkj evaluating derivation 'g copying '/nix/store/chkj evaluating derivation 'g copying '/nix/store/chkj evaluating derivation 'g copying '/nix/store/chkj evaluating derivation 'g copying '/nix/store/chkj evaluating derivation 'g copying '/nix/store/chkj evaluating derivation 'g [0/12 built] [0/1 built] [1/0/1 built] building ggammaloop-nextest-clinnet> Nextest worker budget: 16
  26. 53.18 s gammaloop-nextest-clinnet> Extracting 4 binaries (including 1 non-test binary), 1 build script output directory, and 1 linked path to /build/source
  27. 53.32 s gammaloop-nextest-clinnet> Extracted 16 files to /build/source in 0.15s
  28. 53.36 s gammaloop-nextest-clinnet> ------------
  29. 53.36 s gammaloop-nextest-clinnet> Nextest run ID 30ad54af-7504-47b1-9695-cfa08a9a7663 with nextest profile: ci_gammaloop
  30. 53.36 s gammaloop-nextest-clinnet> Starting 38 tests across 3 binaries
  31. 147.15 s gammaloop-nextest-clinnet> FAIL [ 93.751s] (32/38) clinnet::public_typst_behavior public_linnest_edge_styles_skip_fallbacks
  32. 147.15 s gammaloop-nextest-clinnet> stdout ---
  33. 147.15 s gammaloop-nextest-clinnet>
  34. 147.15 s gammaloop-nextest-clinnet> running 1 test
  35. 147.15 s gammaloop-nextest-clinnet> test public_linnest_edge_styles_skip_fallbacks has been running for over 60 seconds
  36. 147.15 s gammaloop-nextest-clinnet> test public_linnest_edge_styles_skip_fallbacks ... FAILED
  37. 147.15 s gammaloop-nextest-clinnet>
  38. 147.15 s gammaloop-nextest-clinnet> failures:
  39. 147.15 s gammaloop-nextest-clinnet>
  40. 147.15 s gammaloop-nextest-clinnet> failures:
  41. 147.15 s gammaloop-nextest-clinnet> public_linnest_edge_styles_skip_fallbacks
  42. 147.15 s gammaloop-nextest-clinnet>
  43. 147.15 s gammaloop-nextest-clinnet> test result: FAILED. 0 passed; 1 failed; 0 ignored; 0 measured; 17 filtered out; finished in 93.71s
  44. 147.15 s gammaloop-nextest-clinnet>
  45. 147.15 s gammaloop-nextest-clinnet> stderr ---
  46. 147.15 s gammaloop-nextest-clinnet>
  47. 147.15 s gammaloop-nextest-clinnet> thread 'public_linnest_edge_styles_skip_fallbacks' (286) panicked at crates/clinnet/tests/public_typst_behavior.rs:81:55:
  48. 147.15 s gammaloop-nextest-clinnet> called `Result::unwrap()` on an `Err` value: typst failed while compiling template /build/.tmpnXTRS1/.clinnet/templates/linnest-public-behavior.svg
  49. 147.15 s gammaloop-nextest-clinnet>
  50. 147.15 s gammaloop-nextest-clinnet> Command executed:
  51. 147.15 s gammaloop-nextest-clinnet> "typst" "c" "/build/.tmpnXTRS1/.clinnet/templates/linnest-public-behavior.typ" "/build/.tmpnXTRS1/.clinnet/templates/linnest-public-behavior.svg" "--root" "/build/.tmpnXTRS1/.clinnet/templates"
  52. 147.15 s gammaloop-nextest-clinnet>
  53. 147.15 s gammaloop-nextest-clinnet> Typst stdout:
  54. 147.15 s gammaloop-nextest-clinnet>
  55. 147.15 s gammaloop-nextest-clinnet>
  56. 147.15 s gammaloop-nextest-clinnet> Typst stderr:
  57. 147.15 s gammaloop-nextest-clinnet>
  58. 147.15 s gammaloop-nextest-clinnet>
  59. 147.15 s gammaloop-nextest-clinnet> Location:
  60. 147.15 s gammaloop-nextest-clinnet> crates/clinnet/src/lib.rs:741:13
  61. 147.15 s gammaloop-nextest-clinnet> stack backtrace:
  62. 147.15 s gammaloop-nextest-clinnet> 0: __rustc::rust_begin_unwind
  63. 147.15 s gammaloop-nextest-clinnet> 1: core::panicking::panic_fmt
  64. 147.15 s gammaloop-nextest-clinnet> 2: core::result::unwrap_failed
  65. 147.15 s gammaloop-nextest-clinnet> 3: public_typst_behavior::render
  66. 147.15 s gammaloop-nextest-clinnet> 4: <std::sync::once::Once>::call_once_force::<<std::sync::once_lock::OnceLock<alloc::string::String>>::initialize<<std::sync::once_lock::OnceLock<alloc::string::String>>::get_or_init<public_typst_behavior::linnest_public_svg::{closure#0}>::{closure#0}, !>::{closure#0}>::{closure#0}
  67. 147.15 s gammaloop-nextest-clinnet> 5: <std::sys::sync::once::futex::Once>::call
  68. 147.15 s gammaloop-nextest-clinnet> 6: <std::sync::once_lock::OnceLock<alloc::string::String>>::initialize::<<std::sync::once_lock::OnceLock<alloc::string::String>>::get_or_init<public_typst_behavior::linnest_public_svg::{closure#0}>::{closure#0}, !>
  69. 147.15 s gammaloop-nextest-clinnet> 7: <public_typst_behavior::public_linnest_edge_styles_skip_fallbacks::{closure#0} as core::ops::function::FnOnce<()>>::call_once
  70. 147.15 s gammaloop-nextest-clinnet> note: Some details are omitted, run with `RUST_BACKTRACE=full` for a verbose backtrace.
  71. 147.15 s gammaloop-nextest-clinnet>
  72. 162.95 s gammaloop-nextest-clinnet> FAIL [ 109.533s] (33/38) clinnet::public_typst_behavior public_linnest_labels_follow_their_carriers
  73. 162.95 s gammaloop-nextest-clinnet> stdout ---
  74. 162.95 s gammaloop-nextest-clinnet>
  75. 162.95 s gammaloop-nextest-clinnet> running 1 test
  76. 162.95 s gammaloop-nextest-clinnet> test public_linnest_labels_follow_their_carriers has been running for over 60 seconds
  77. 162.95 s gammaloop-nextest-clinnet> test public_linnest_labels_follow_their_carriers ... FAILED
  78. 162.95 s gammaloop-nextest-clinnet>
  79. 162.95 s gammaloop-nextest-clinnet> failures:
  80. 162.95 s gammaloop-nextest-clinnet>
  81. 162.95 s gammaloop-nextest-clinnet> failures:
  82. 162.95 s gammaloop-nextest-clinnet> public_linnest_labels_follow_their_carriers
  83. 162.95 s gammaloop-nextest-clinnet>
  84. 162.95 s gammaloop-nextest-clinnet> test result: FAILED. 0 passed; 1 failed; 0 ignored; 0 measured; 17 filtered out; finished in 109.48s
  85. 162.95 s gammaloop-nextest-clinnet>
  86. 162.95 s gammaloop-nextest-clinnet> stderr ---
  87. 162.95 s gammaloop-nextest-clinnet>
  88. 162.95 s gammaloop-nextest-clinnet> thread 'public_linnest_labels_follow_their_carriers' (271) panicked at crates/clinnet/tests/public_typst_behavior.rs:81:55:
  89. 162.95 s gammaloop-nextest-clinnet> called `Result::unwrap()` on an `Err` value: typst failed while compiling template /build/.tmpkAywEu/.clinnet/templates/linnest-public-behavior.svg
  90. 162.95 s gammaloop-nextest-clinnet>
  91. 162.95 s gammaloop-nextest-clinnet> Command executed:
  92. 162.95 s gammaloop-nextest-clinnet> "typst" "c" "/build/.tmpkAywEu/.clinnet/templates/linnest-public-behavior.typ" "/build/.tmpkAywEu/.clinnet/templates/linnest-public-behavior.svg" "--root" "/build/.tmpkAywEu/.clinnet/templates"
  93. 162.95 s gammaloop-nextest-clinnet>
  94. 162.95 s gammaloop-nextest-clinnet> Typst stdout:
  95. 162.95 s gammaloop-nextest-clinnet>
  96. 162.95 s gammaloop-nextest-clinnet>
  97. 162.95 s gammaloop-nextest-clinnet> Typst stderr:
  98. 162.95 s gammaloop-nextest-clinnet>
  99. 162.95 s gammaloop-nextest-clinnet>
  100. 162.95 s gammaloop-nextest-clinnet> Location:
  101. 162.95 s gammaloop-nextest-clinnet> crates/clinnet/src/lib.rs:741:13
  102. 162.95 s gammaloop-nextest-clinnet> stack backtrace:
  103. 162.95 s gammaloop-nextest-clinnet> 0: __rustc::rust_begin_unwind
  104. 162.95 s gammaloop-nextest-clinnet> 1: core::panicking::panic_fmt
  105. 162.95 s gammaloop-nextest-clinnet> 2: core::result::unwrap_failed
  106. 162.95 s gammaloop-nextest-clinnet> 3: public_typst_behavior::render
  107. 162.95 s gammaloop-nextest-clinnet> 4: <std::sync::once::Once>::call_once_force::<<std::sync::once_lock::OnceLock<alloc::string::String>>::initialize<<std::sync::once_lock::OnceLock<alloc::string::String>>::get_or_init<public_typst_behavior::linnest_public_svg::{closure#0}>::{closure#0}, !>::{closure#0}>::{closure#0}
  108. 162.95 s gammaloop-nextest-clinnet> 5: <std::sys::sync::once::futex::Once>::call
  109. 162.95 s gammaloop-nextest-clinnet> 6: <std::sync::once_lock::OnceLock<alloc::string::String>>::initialize::<<std::sync::once_lock::OnceLock<alloc::string::String>>::get_or_init<public_typst_behavior::linnest_public_svg::{closure#0}>::{closure#0}, !>
  110. 162.95 s gammaloop-nextest-clinnet> 7: <public_typst_behavior::public_linnest_labels_follow_their_carriers::{closure#0} as core::ops::function::FnOnce<()>>::call_once
  111. 162.95 s gammaloop-nextest-clinnet> note: Some details are omitted, run with `RUST_BACKTRACE=full` for a verbose backtrace.
  112. 162.95 s gammaloop-nextest-clinnet>
  113. 188.99 s gammaloop-nextest-clinnet> FAIL [ 135.588s] (34/38) clinnet::public_typst_behavior public_linnest_fixture_assertions_hold
  114. 188.99 s gammaloop-nextest-clinnet> stdout ---
  115. 188.99 s gammaloop-nextest-clinnet>
  116. 188.99 s gammaloop-nextest-clinnet> running 1 test
  117. 188.99 s gammaloop-nextest-clinnet> test public_linnest_fixture_assertions_hold has been running for over 60 seconds
  118. 188.99 s gammaloop-nextest-clinnet> test public_linnest_fixture_assertions_hold ... FAILED
  119. 188.99 s gammaloop-nextest-clinnet>
  120. 188.99 s gammaloop-nextest-clinnet> failures:
  121. 188.99 s gammaloop-nextest-clinnet>
  122. 188.99 s gammaloop-nextest-clinnet> failures:
  123. 188.99 s gammaloop-nextest-clinnet> public_linnest_fixture_assertions_hold
  124. 188.99 s gammaloop-nextest-clinnet>
  125. 188.99 s gammaloop-nextest-clinnet> test result: FAILED. 0 passed; 1 failed; 0 ignored; 0 measured; 17 filtered out; finished in 135.54s
  126. 188.99 s gammaloop-nextest-clinnet>
  127. 188.99 s gammaloop-nextest-clinnet> stderr ---
  128. 188.99 s gammaloop-nextest-clinnet>
  129. 188.99 s gammaloop-nextest-clinnet> thread 'public_linnest_fixture_assertions_hold' (295) panicked at crates/clinnet/tests/public_typst_behavior.rs:81:55:
  130. 188.99 s gammaloop-nextest-clinnet> called `Result::unwrap()` on an `Err` value: typst failed while compiling template /build/.tmpDSaV8y/.clinnet/templates/linnest-public-behavior.svg
  131. 188.99 s gammaloop-nextest-clinnet>
  132. 188.99 s gammaloop-nextest-clinnet> Command executed:
  133. 188.99 s gammaloop-nextest-clinnet> "typst" "c" "/build/.tmpDSaV8y/.clinnet/templates/linnest-public-behavior.typ" "/build/.tmpDSaV8y/.clinnet/templates/linnest-public-behavior.svg" "--root" "/build/.tmpDSaV8y/.clinnet/templates"
  134. 188.99 s gammaloop-nextest-clinnet>
  135. 188.99 s gammaloop-nextest-clinnet> Typst stdout:
  136. 188.99 s gammaloop-nextest-clinnet>
  137. 188.99 s gammaloop-nextest-clinnet>
  138. 188.99 s gammaloop-nextest-clinnet> Typst stderr:
  139. 188.99 s gammaloop-nextest-clinnet>
  140. 188.99 s gammaloop-nextest-clinnet>
  141. 188.99 s gammaloop-nextest-clinnet> Location:
  142. 188.99 s gammaloop-nextest-clinnet> crates/clinnet/src/lib.rs:741:13
  143. 188.99 s gammaloop-nextest-clinnet> stack backtrace:
  144. 188.99 s gammaloop-nextest-clinnet> 0: __rustc::rust_begin_unwind
  145. 188.99 s gammaloop-nextest-clinnet> 1: core::panicking::panic_fmt
  146. 188.99 s gammaloop-nextest-clinnet> 2: core::result::unwrap_failed
  147. 188.99 s gammaloop-nextest-clinnet> 3: public_typst_behavior::render
  148. 188.99 s gammaloop-nextest-clinnet> 4: <std::sync::once::Once>::call_once_force::<<std::sync::once_lock::OnceLock<alloc::string::String>>::initialize<<std::sync::once_lock::OnceLock<alloc::string::String>>::get_or_init<public_typst_behavior::linnest_public_svg::{closure#0}>::{closure#0}, !>::{closure#0}>::{closure#0}
  149. 188.99 s gammaloop-nextest-clinnet> 5: <std::sys::sync::once::futex::Once>::call
  150. 188.99 s gammaloop-nextest-clinnet> 6: <std::sync::once_lock::OnceLock<alloc::string::String>>::initialize::<<std::sync::once_lock::OnceLock<alloc::string::String>>::get_or_init<public_typst_behavior::linnest_public_svg::{closure#0}>::{closure#0}, !>
  151. 188.99 s gammaloop-nextest-clinnet> 7: <public_typst_behavior::public_linnest_fixture_assertions_hold::{closure#0} as core::ops::function::FnOnce<()>>::call_once
  152. 188.99 s gammaloop-nextest-clinnet> note: Some details are omitted, run with `RUST_BACKTRACE=full` for a verbose backtrace.
  153. 188.99 s gammaloop-nextest-clinnet>
  154. 222.14 s gammaloop-nextest-clinnet> ------------
  155. 222.14 s gammaloop-nextest-clinnet> Summary [ 168.772s] 38 tests run: 35 passed (4 slow), 3 failed, 0 skipped
  156. 222.14 s gammaloop-nextest-clinnet> FAIL [ 93.751s] (32/38) clinnet::public_typst_behavior public_linnest_edge_styles_skip_fallbacks
  157. 222.14 s gammaloop-nextest-clinnet> stdout ---
  158. 222.14 s gammaloop-nextest-clinnet>
  159. 222.14 s gammaloop-nextest-clinnet> running 1 test
  160. 222.14 s gammaloop-nextest-clinnet> test public_linnest_edge_styles_skip_fallbacks has been running for over 60 seconds
  161. 222.14 s gammaloop-nextest-clinnet> test public_linnest_edge_styles_skip_fallbacks ... FAILED
  162. 222.14 s gammaloop-nextest-clinnet>
  163. 222.14 s gammaloop-nextest-clinnet> failures:
  164. 222.14 s gammaloop-nextest-clinnet>
  165. 222.14 s gammaloop-nextest-clinnet> failures:
  166. 222.14 s gammaloop-nextest-clinnet> public_linnest_edge_styles_skip_fallbacks
  167. 222.14 s gammaloop-nextest-clinnet>
  168. 222.14 s gammaloop-nextest-clinnet> test result: FAILED. 0 passed; 1 failed; 0 ignored; 0 measured; 17 filtered out; finished in 93.71s
  169. 222.14 s gammaloop-nextest-clinnet>
  170. 222.14 s gammaloop-nextest-clinnet> stderr ---
  171. 222.14 s gammaloop-nextest-clinnet>
  172. 222.14 s gammaloop-nextest-clinnet> thread 'public_linnest_edge_styles_skip_fallbacks' (286) panicked at crates/clinnet/tests/public_typst_behavior.rs:81:55:
  173. 222.14 s gammaloop-nextest-clinnet> called `Result::unwrap()` on an `Err` value: typst failed while compiling template /build/.tmpnXTRS1/.clinnet/templates/linnest-public-behavior.svg
  174. 222.14 s gammaloop-nextest-clinnet>
  175. 222.14 s gammaloop-nextest-clinnet> Command executed:
  176. 222.14 s gammaloop-nextest-clinnet> "typst" "c" "/build/.tmpnXTRS1/.clinnet/templates/linnest-public-behavior.typ" "/build/.tmpnXTRS1/.clinnet/templates/linnest-public-behavior.svg" "--root" "/build/.tmpnXTRS1/.clinnet/templates"
  177. 222.14 s gammaloop-nextest-clinnet>
  178. 222.14 s gammaloop-nextest-clinnet> Typst stdout:
  179. 222.14 s gammaloop-nextest-clinnet>
  180. 222.14 s gammaloop-nextest-clinnet>
  181. 222.14 s gammaloop-nextest-clinnet> Typst stderr:
  182. 222.14 s gammaloop-nextest-clinnet>
  183. 222.14 s gammaloop-nextest-clinnet>
  184. 222.14 s gammaloop-nextest-clinnet> Location:
  185. 222.14 s gammaloop-nextest-clinnet> crates/clinnet/src/lib.rs:741:13
  186. 222.14 s gammaloop-nextest-clinnet> stack backtrace:
  187. 222.14 s gammaloop-nextest-clinnet> 0: __rustc::rust_begin_unwind
  188. 222.14 s gammaloop-nextest-clinnet> 1: core::panicking::panic_fmt
  189. 222.14 s gammaloop-nextest-clinnet> 2: core::result::unwrap_failed
  190. 222.14 s gammaloop-nextest-clinnet> 3: public_typst_behavior::render
  191. 222.14 s gammaloop-nextest-clinnet> 4: <std::sync::once::Once>::call_once_force::<<std::sync::once_lock::OnceLock<alloc::string::String>>::initialize<<std::sync::once_lock::OnceLock<alloc::string::String>>::get_or_init<public_typst_behavior::linnest_public_svg::{closure#0}>::{closure#0}, !>::{closure#0}>::{closure#0}
  192. 222.14 s gammaloop-nextest-clinnet> 5: <std::sys::sync::once::futex::Once>::call
  193. 222.14 s gammaloop-nextest-clinnet> 6: <std::sync::once_lock::OnceLock<alloc::string::String>>::initialize::<<std::sync::once_lock::OnceLock<alloc::string::String>>::get_or_init<public_typst_behavior::linnest_public_svg::{closure#0}>::{closure#0}, !>
  194. 222.14 s gammaloop-nextest-clinnet> 7: <public_typst_behavior::public_linnest_edge_styles_skip_fallbacks::{closure#0} as core::ops::function::FnOnce<()>>::call_once
  195. 222.14 s gammaloop-nextest-clinnet> note: Some details are omitted, run with `RUST_BACKTRACE=full` for a verbose backtrace.
  196. 222.14 s gammaloop-nextest-clinnet>
  197. 222.14 s gammaloop-nextest-clinnet> FAIL [ 109.533s] (33/38) clinnet::public_typst_behavior public_linnest_labels_follow_their_carriers
  198. 222.14 s gammaloop-nextest-clinnet> stdout ---
  199. 222.14 s gammaloop-nextest-clinnet>
  200. 222.14 s gammaloop-nextest-clinnet> running 1 test
  201. 222.14 s gammaloop-nextest-clinnet> test public_linnest_labels_follow_their_carriers has been running for over 60 seconds
  202. 222.14 s gammaloop-nextest-clinnet> test public_linnest_labels_follow_their_carriers ... FAILED
  203. 222.14 s gammaloop-nextest-clinnet>
  204. 222.14 s gammaloop-nextest-clinnet> failures:
  205. 222.14 s gammaloop-nextest-clinnet>
  206. 222.14 s gammaloop-nextest-clinnet> failures:
  207. 222.14 s gammaloop-nextest-clinnet> public_linnest_labels_follow_their_carriers
  208. 222.14 s gammaloop-nextest-clinnet>
  209. 222.14 s gammaloop-nextest-clinnet> test result: FAILED. 0 passed; 1 failed; 0 ignored; 0 measured; 17 filtered out; finished in 109.48s
  210. 222.14 s gammaloop-nextest-clinnet>
  211. 222.14 s gammaloop-nextest-clinnet> stderr ---
  212. 222.14 s gammaloop-nextest-clinnet>
  213. 222.14 s gammaloop-nextest-clinnet> thread 'public_linnest_labels_follow_their_carriers' (271) panicked at crates/clinnet/tests/public_typst_behavior.rs:81:55:
  214. 222.14 s gammaloop-nextest-clinnet> called `Result::unwrap()` on an `Err` value: typst failed while compiling template /build/.tmpkAywEu/.clinnet/templates/linnest-public-behavior.svg
  215. 222.14 s gammaloop-nextest-clinnet>
  216. 222.14 s gammaloop-nextest-clinnet> Command executed:
  217. 222.14 s gammaloop-nextest-clinnet> "typst" "c" "/build/.tmpkAywEu/.clinnet/templates/linnest-public-behavior.typ" "/build/.tmpkAywEu/.clinnet/templates/linnest-public-behavior.svg" "--root" "/build/.tmpkAywEu/.clinnet/templates"
  218. 222.14 s gammaloop-nextest-clinnet>
  219. 222.14 s gammaloop-nextest-clinnet> Typst stdout:
  220. 222.14 s gammaloop-nextest-clinnet>
  221. 222.14 s gammaloop-nextest-clinnet>
  222. 222.14 s gammaloop-nextest-clinnet> Typst stderr:
  223. 222.14 s gammaloop-nextest-clinnet>
  224. 222.14 s gammaloop-nextest-clinnet>
  225. 222.14 s gammaloop-nextest-clinnet> Location:
  226. 222.14 s gammaloop-nextest-clinnet> crates/clinnet/src/lib.rs:741:13
  227. 222.14 s gammaloop-nextest-clinnet> stack backtrace:
  228. 222.14 s gammaloop-nextest-clinnet> 0: __rustc::rust_begin_unwind
  229. 222.14 s gammaloop-nextest-clinnet> 1: core::panicking::panic_fmt
  230. 222.14 s gammaloop-nextest-clinnet> 2: core::result::unwrap_failed
  231. 222.14 s gammaloop-nextest-clinnet> 3: public_typst_behavior::render
  232. 222.14 s gammaloop-nextest-clinnet> 4: <std::sync::once::Once>::call_once_force::<<std::sync::once_lock::OnceLock<alloc::string::String>>::initialize<<std::sync::once_lock::OnceLock<alloc::string::String>>::get_or_init<public_typst_behavior::linnest_public_svg::{closure#0}>::{closure#0}, !>::{closure#0}>::{closure#0}
  233. 222.14 s gammaloop-nextest-clinnet> 5: <std::sys::sync::once::futex::Once>::call
  234. 222.14 s gammaloop-nextest-clinnet> 6: <std::sync::once_lock::OnceLock<alloc::string::String>>::initialize::<<std::sync::once_lock::OnceLock<alloc::string::String>>::get_or_init<public_typst_behavior::linnest_public_svg::{closure#0}>::{closure#0}, !>
  235. 222.14 s gammaloop-nextest-clinnet> 7: <public_typst_behavior::public_linnest_labels_follow_their_carriers::{closure#0} as core::ops::function::FnOnce<()>>::call_once
  236. 222.14 s gammaloop-nextest-clinnet> note: Some details are omitted, run with `RUST_BACKTRACE=full` for a verbose backtrace.
  237. 222.14 s gammaloop-nextest-clinnet>
  238. 222.14 s gammaloop-nextest-clinnet> FAIL [ 135.588s] (34/38) clinnet::public_typst_behavior public_linnest_fixture_assertions_hold
  239. 222.14 s gammaloop-nextest-clinnet> stdout ---
  240. 222.14 s gammaloop-nextest-clinnet>
  241. 222.14 s gammaloop-nextest-clinnet> running 1 test
  242. 222.14 s gammaloop-nextest-clinnet> test public_linnest_fixture_assertions_hold has been running for over 60 seconds
  243. 222.14 s gammaloop-nextest-clinnet> test public_linnest_fixture_assertions_hold ... FAILED
  244. 222.14 s gammaloop-nextest-clinnet>
  245. 222.14 s gammaloop-nextest-clinnet> failures:
  246. 222.14 s gammaloop-nextest-clinnet>
  247. 222.14 s gammaloop-nextest-clinnet> failures:
  248. 222.14 s gammaloop-nextest-clinnet> public_linnest_fixture_assertions_hold
  249. 222.14 s gammaloop-nextest-clinnet>
  250. 222.14 s gammaloop-nextest-clinnet> test result: FAILED. 0 passed; 1 failed; 0 ignored; 0 measured; 17 filtered out; finished in 135.54s
  251. 222.14 s gammaloop-nextest-clinnet>
  252. 222.14 s gammaloop-nextest-clinnet> stderr ---
  253. 222.14 s gammaloop-nextest-clinnet>
  254. 222.14 s gammaloop-nextest-clinnet> thread 'public_linnest_fixture_assertions_hold' (295) panicked at crates/clinnet/tests/public_typst_behavior.rs:81:55:
  255. 222.14 s gammaloop-nextest-clinnet> called `Result::unwrap()` on an `Err` value: typst failed while compiling template /build/.tmpDSaV8y/.clinnet/templates/linnest-public-behavior.svg
  256. 222.14 s gammaloop-nextest-clinnet>
  257. 222.14 s gammaloop-nextest-clinnet> Command executed:
  258. 222.14 s gammaloop-nextest-clinnet> "typst" "c" "/build/.tmpDSaV8y/.clinnet/templates/linnest-public-behavior.typ" "/build/.tmpDSaV8y/.clinnet/templates/linnest-public-behavior.svg" "--root" "/build/.tmpDSaV8y/.clinnet/templates"
  259. 222.14 s gammaloop-nextest-clinnet>
  260. 222.14 s gammaloop-nextest-clinnet> Typst stdout:
  261. 222.14 s gammaloop-nextest-clinnet>
  262. 222.14 s gammaloop-nextest-clinnet>
  263. 222.14 s gammaloop-nextest-clinnet> Typst stderr:
  264. 222.14 s gammaloop-nextest-clinnet>
  265. 222.14 s gammaloop-nextest-clinnet>
  266. 222.14 s gammaloop-nextest-clinnet> Location:
  267. 222.14 s gammaloop-nextest-clinnet> crates/clinnet/src/lib.rs:741:13
  268. 222.14 s gammaloop-nextest-clinnet> stack backtrace:
  269. 222.14 s gammaloop-nextest-clinnet> 0: __rustc::rust_begin_unwind
  270. 222.14 s gammaloop-nextest-clinnet> 1: core::panicking::panic_fmt
  271. 222.14 s gammaloop-nextest-clinnet> 2: core::result::unwrap_failed
  272. 222.14 s gammaloop-nextest-clinnet> 3: public_typst_behavior::render
  273. 222.14 s gammaloop-nextest-clinnet> 4: <std::sync::once::Once>::call_once_force::<<std::sync::once_lock::OnceLock<alloc::string::String>>::initialize<<std::sync::once_lock::OnceLock<alloc::string::String>>::get_or_init<public_typst_behavior::linnest_public_svg::{closure#0}>::{closure#0}, !>::{closure#0}>::{closure#0}
  274. 222.14 s gammaloop-nextest-clinnet> 5: <std::sys::sync::once::futex::Once>::call
  275. 222.14 s gammaloop-nextest-clinnet> 6: <std::sync::once_lock::OnceLock<alloc::string::String>>::initialize::<<std::sync::once_lock::OnceLock<alloc::string::String>>::get_or_init<public_typst_behavior::linnest_public_svg::{closure#0}>::{closure#0}, !>
  276. 222.14 s gammaloop-nextest-clinnet> 7: <public_typst_behavior::public_linnest_fixture_assertions_hold::{closure#0} as core::ops::function::FnOnce<()>>::call_once
  277. 222.14 s gammaloop-nextest-clinnet> note: Some details are omitted, run with `RUST_BACKTRACE=full` for a verbose backtrace.
  278. 222.14 s gammaloop-nextest-clinnet>
  279. 222.16 s gammaloop-nextest-clinnet> error: test run failed
  280. 222.57 s gammaloop-nextest-clinnet>
  281. 222.57 s gammaloop-nextest-clinnet> ========== nextest test summary ==========
  282. 222.57 s gammaloop-nextest-clinnet> report: target/nextest/ci_gammaloop/junit.xml
  283. 222.57 s gammaloop-nextest-clinnet> tests: 38, failures: 3, errors: 0
  284. 222.57 s gammaloop-nextest-clinnet>
  285. 222.57 s gammaloop-nextest-clinnet> 1. clinnet::public_typst_behavior::public_linnest_edge_styles_skip_fallbacks
  286. 222.57 s gammaloop-nextest-clinnet> failure: test failure with exit code 101
  287. 222.57 s gammaloop-nextest-clinnet> thread 'public_linnest_edge_styles_skip_fallbacks' (286) panicked at crates/clinnet/tests/public_typst_behavior.rs:81:55:
  288. 222.57 s gammaloop-nextest-clinnet> called `Result::unwrap()` on an `Err` value: typst failed while compiling template /build/.tmpnXTRS1/.clinnet/templates/linnest-public-behavior.svg
  289. 222.57 s gammaloop-nextest-clinnet>
  290. 222.57 s gammaloop-nextest-clinnet> Command executed:
  291. 222.57 s gammaloop-nextest-clinnet> "typst" "c" "/build/.tmpnXTRS1/.clinnet/templates/linnest-public-behavior.typ" "/build/.tmpnXTRS1/.clinnet/templates/linnest-public-behavior.svg" "--root" "/build/.tmpnXTRS1/.clinnet/templates"
  292. 222.57 s gammaloop-nextest-clinnet>
  293. 222.57 s gammaloop-nextest-clinnet> Typst stdout:
  294. 222.57 s gammaloop-nextest-clinnet>
  295. 222.57 s gammaloop-nextest-clinnet>
  296. 222.57 s gammaloop-nextest-clinnet> Typst stderr:
  297. 222.57 s gammaloop-nextest-clinnet>
  298. 222.57 s gammaloop-nextest-clinnet>
  299. 222.57 s gammaloop-nextest-clinnet> Location:
  300. 222.57 s gammaloop-nextest-clinnet> crates/clinnet/src/lib.rs:741:13
  301. 222.57 s gammaloop-nextest-clinnet> stack backtrace:
  302. 222.57 s gammaloop-nextest-clinnet> 0: __rustc::rust_begin_unwind
  303. 222.57 s gammaloop-nextest-clinnet> 1: core::panicking::panic_fmt
  304. 222.57 s gammaloop-nextest-clinnet> 2: core::result::unwrap_failed
  305. 222.57 s gammaloop-nextest-clinnet> 3: public_typst_behavior::render
  306. 222.57 s gammaloop-nextest-clinnet> 4: <std::sync::once::Once>::call_once_force::<<std::sync::once_lock::OnceLock<alloc::string::String>>::initialize<<std::sync::once_lock::OnceLock<alloc::string::String>>::get_or_init<public_typst_behavior::linnest_public_svg::{closure#0}>::{closure#0}, !>::{closure#0}>::{closure#0}
  307. 222.57 s gammaloop-nextest-clinnet> 5: <std::sys::sync::once::futex::Once>::call
  308. 222.57 s gammaloop-nextest-clinnet> 6: <std::sync::once_lock::OnceLock<alloc::string::String>>::initialize::<<std::sync::once_lock::OnceLock<alloc::string::String>>::get_or_init<public_typst_behavior::linnest_public_svg::{closure#0}>::{closure#0}, !>
  309. 222.57 s gammaloop-nextest-clinnet> 7: <public_typst_behavior::public_linnest_edge_styles_skip_fallbacks::{closure#0} as core::ops::function::FnOnce<()>>::call_once
  310. 222.57 s gammaloop-nextest-clinnet> note: Some details are omitted, run with `RUST_BACKTRACE=full` for a verbose backtrace.
  311. 222.57 s gammaloop-nextest-clinnet> system-out
  312. 222.57 s gammaloop-nextest-clinnet> running 1 test
  313. 222.57 s gammaloop-nextest-clinnet> test public_linnest_edge_styles_skip_fallbacks has been running for over 60 seconds
  314. 222.57 s gammaloop-nextest-clinnet> test public_linnest_edge_styles_skip_fallbacks ... FAILED
  315. 222.57 s gammaloop-nextest-clinnet>
  316. 222.57 s gammaloop-nextest-clinnet> failures:
  317. 222.57 s gammaloop-nextest-clinnet>
  318. 222.57 s gammaloop-nextest-clinnet> failures:
  319. 222.57 s gammaloop-nextest-clinnet> public_linnest_edge_styles_skip_fallbacks
  320. 222.57 s gammaloop-nextest-clinnet>
  321. 222.57 s gammaloop-nextest-clinnet> test result: FAILED. 0 passed; 1 failed; 0 ignored; 0 measured; 17 filtered out; finished in 93.71s
  322. 222.57 s gammaloop-nextest-clinnet> system-err
  323. 222.57 s gammaloop-nextest-clinnet> thread 'public_linnest_edge_styles_skip_fallbacks' (286) panicked at crates/clinnet/tests/public_typst_behavior.rs:81:55:
  324. 222.57 s gammaloop-nextest-clinnet> called `Result::unwrap()` on an `Err` value: typst failed while compiling template /build/.tmpnXTRS1/.clinnet/templates/linnest-public-behavior.svg
  325. 222.57 s gammaloop-nextest-clinnet>
  326. 222.57 s gammaloop-nextest-clinnet> Command executed:
  327. 222.57 s gammaloop-nextest-clinnet> "typst" "c" "/build/.tmpnXTRS1/.clinnet/templates/linnest-public-behavior.typ" "/build/.tmpnXTRS1/.clinnet/templates/linnest-public-behavior.svg" "--root" "/build/.tmpnXTRS1/.clinnet/templates"
  328. 222.57 s gammaloop-nextest-clinnet>
  329. 222.57 s gammaloop-nextest-clinnet> Typst stdout:
  330. 222.57 s gammaloop-nextest-clinnet>
  331. 222.57 s gammaloop-nextest-clinnet>
  332. 222.57 s gammaloop-nextest-clinnet> Typst stderr:
  333. 222.57 s gammaloop-nextest-clinnet>
  334. 222.57 s gammaloop-nextest-clinnet>
  335. 222.57 s gammaloop-nextest-clinnet> Location:
  336. 222.57 s gammaloop-nextest-clinnet> crates/clinnet/src/lib.rs:741:13
  337. 222.57 s gammaloop-nextest-clinnet> stack backtrace:
  338. 222.57 s gammaloop-nextest-clinnet> 0: __rustc::rust_begin_unwind
  339. 222.57 s gammaloop-nextest-clinnet> 1: core::panicking::panic_fmt
  340. 222.57 s gammaloop-nextest-clinnet> 2: core::result::unwrap_failed
  341. 222.57 s gammaloop-nextest-clinnet> 3: public_typst_behavior::render
  342. 222.57 s gammaloop-nextest-clinnet> 4: <std::sync::once::Once>::call_once_force::<<std::sync::once_lock::OnceLock<alloc::string::String>>::initialize<<std::sync::once_lock::OnceLock<alloc::string::String>>::get_or_init<public_typst_behavior::linnest_public_svg::{closure#0}>::{closure#0}, !>::{closure#0}>::{closure#0}
  343. 222.57 s gammaloop-nextest-clinnet> 5: <std::sys::sync::once::futex::Once>::call
  344. 222.57 s gammaloop-nextest-clinnet> 6: <std::sync::once_lock::OnceLock<alloc::string::String>>::initialize::<<std::sync::once_lock::OnceLock<alloc::string::String>>::get_or_init<public_typst_behavior::linnest_public_svg::{closure#0}>::{closure#0}, !>
  345. 222.57 s gammaloop-nextest-clinnet> 7: <public_typst_behavior::public_linnest_edge_styles_skip_fallbacks::{closure#0} as core::ops::function::FnOnce<()>>::call_once
  346. 222.57 s gammaloop-nextest-clinnet> note: Some details are omitted, run with `RUST_BACKTRACE=full` for a verbose backtrace.
  347. 222.57 s gammaloop-nextest-clinnet>
  348. 222.57 s gammaloop-nextest-clinnet> 2. clinnet::public_typst_behavior::public_linnest_labels_follow_their_carriers
  349. 222.57 s gammaloop-nextest-clinnet> failure: test failure with exit code 101
  350. 222.57 s gammaloop-nextest-clinnet> thread 'public_linnest_labels_follow_their_carriers' (271) panicked at crates/clinnet/tests/public_typst_behavior.rs:81:55:
  351. 222.57 s gammaloop-nextest-clinnet> called `Result::unwrap()` on an `Err` value: typst failed while compiling template /build/.tmpkAywEu/.clinnet/templates/linnest-public-behavior.svg
  352. 222.57 s gammaloop-nextest-clinnet>
  353. 222.57 s gammaloop-nextest-clinnet> Command executed:
  354. 222.57 s gammaloop-nextest-clinnet> "typst" "c" "/build/.tmpkAywEu/.clinnet/templates/linnest-public-behavior.typ" "/build/.tmpkAywEu/.clinnet/templates/linnest-public-behavior.svg" "--root" "/build/.tmpkAywEu/.clinnet/templates"
  355. 222.57 s gammaloop-nextest-clinnet>
  356. 222.57 s gammaloop-nextest-clinnet> Typst stdout:
  357. 222.57 s gammaloop-nextest-clinnet>
  358. 222.57 s gammaloop-nextest-clinnet>
  359. 222.57 s gammaloop-nextest-clinnet> Typst stderr:
  360. 222.57 s gammaloop-nextest-clinnet>
  361. 222.57 s gammaloop-nextest-clinnet>
  362. 222.57 s gammaloop-nextest-clinnet> Location:
  363. 222.57 s gammaloop-nextest-clinnet> crates/clinnet/src/lib.rs:741:13
  364. 222.57 s gammaloop-nextest-clinnet> stack backtrace:
  365. 222.57 s gammaloop-nextest-clinnet> 0: __rustc::rust_begin_unwind
  366. 222.57 s gammaloop-nextest-clinnet> 1: core::panicking::panic_fmt
  367. 222.57 s gammaloop-nextest-clinnet> 2: core::result::unwrap_failed
  368. 222.57 s gammaloop-nextest-clinnet> 3: public_typst_behavior::render
  369. 222.57 s gammaloop-nextest-clinnet> 4: <std::sync::once::Once>::call_once_force::<<std::sync::once_lock::OnceLock<alloc::string::String>>::initialize<<std::sync::once_lock::OnceLock<alloc::string::String>>::get_or_init<public_typst_behavior::linnest_public_svg::{closure#0}>::{closure#0}, !>::{closure#0}>::{closure#0}
  370. 222.57 s gammaloop-nextest-clinnet> 5: <std::sys::sync::once::futex::Once>::call
  371. 222.57 s gammaloop-nextest-clinnet> 6: <std::sync::once_lock::OnceLock<alloc::string::String>>::initialize::<<std::sync::once_lock::OnceLock<alloc::string::String>>::get_or_init<public_typst_behavior::linnest_public_svg::{closure#0}>::{closure#0}, !>
  372. 222.57 s gammaloop-nextest-clinnet> 7: <public_typst_behavior::public_linnest_labels_follow_their_carriers::{closure#0} as core::ops::function::FnOnce<()>>::call_once
  373. 222.57 s gammaloop-nextest-clinnet> note: Some details are omitted, run with `RUST_BACKTRACE=full` for a verbose backtrace.
  374. 222.57 s gammaloop-nextest-clinnet> system-out
  375. 222.57 s gammaloop-nextest-clinnet> running 1 test
  376. 222.57 s gammaloop-nextest-clinnet> test public_linnest_labels_follow_their_carriers has been running for over 60 seconds
  377. 222.57 s gammaloop-nextest-clinnet> test public_linnest_labels_follow_their_carriers ... FAILED
  378. 222.57 s gammaloop-nextest-clinnet>
  379. 222.57 s gammaloop-nextest-clinnet> failures:
  380. 222.57 s gammaloop-nextest-clinnet>
  381. 222.57 s gammaloop-nextest-clinnet> failures:
  382. 222.57 s gammaloop-nextest-clinnet> public_linnest_labels_follow_their_carriers
  383. 222.57 s gammaloop-nextest-clinnet>
  384. 222.57 s gammaloop-nextest-clinnet> test result: FAILED. 0 passed; 1 failed; 0 ignored; 0 measured; 17 filtered out; finished in 109.48s
  385. 222.57 s gammaloop-nextest-clinnet> system-err
  386. 222.57 s gammaloop-nextest-clinnet> thread 'public_linnest_labels_follow_their_carriers' (271) panicked at crates/clinnet/tests/public_typst_behavior.rs:81:55:
  387. 222.57 s gammaloop-nextest-clinnet> called `Result::unwrap()` on an `Err` value: typst failed while compiling template /build/.tmpkAywEu/.clinnet/templates/linnest-public-behavior.svg
  388. 222.57 s gammaloop-nextest-clinnet>
  389. 222.57 s gammaloop-nextest-clinnet> Command executed:
  390. 222.57 s gammaloop-nextest-clinnet> "typst" "c" "/build/.tmpkAywEu/.clinnet/templates/linnest-public-behavior.typ" "/build/.tmpkAywEu/.clinnet/templates/linnest-public-behavior.svg" "--root" "/build/.tmpkAywEu/.clinnet/templates"
  391. 222.57 s gammaloop-nextest-clinnet>
  392. 222.57 s gammaloop-nextest-clinnet> Typst stdout:
  393. 222.57 s gammaloop-nextest-clinnet>
  394. 222.57 s gammaloop-nextest-clinnet>
  395. 222.57 s gammaloop-nextest-clinnet> Typst stderr:
  396. 222.57 s gammaloop-nextest-clinnet>
  397. 222.57 s gammaloop-nextest-clinnet>
  398. 222.57 s gammaloop-nextest-clinnet> Location:
  399. 222.57 s gammaloop-nextest-clinnet> crates/clinnet/src/lib.rs:741:13
  400. 222.57 s gammaloop-nextest-clinnet> stack backtrace:
  401. 222.57 s gammaloop-nextest-clinnet> 0: __rustc::rust_begin_unwind
  402. 222.57 s gammaloop-nextest-clinnet> 1: core::panicking::panic_fmt
  403. 222.57 s gammaloop-nextest-clinnet> 2: core::result::unwrap_failed
  404. 222.57 s gammaloop-nextest-clinnet> 3: public_typst_behavior::render
  405. 222.57 s gammaloop-nextest-clinnet> 4: <std::sync::once::Once>::call_once_force::<<std::sync::once_lock::OnceLock<alloc::string::String>>::initialize<<std::sync::once_lock::OnceLock<alloc::string::String>>::get_or_init<public_typst_behavior::linnest_public_svg::{closure#0}>::{closure#0}, !>::{closure#0}>::{closure#0}
  406. 222.57 s gammaloop-nextest-clinnet> 5: <std::sys::sync::once::futex::Once>::call
  407. 222.57 s gammaloop-nextest-clinnet> 6: <std::sync::once_lock::OnceLock<alloc::string::String>>::initialize::<<std::sync::once_lock::OnceLock<alloc::string::String>>::get_or_init<public_typst_behavior::linnest_public_svg::{closure#0}>::{closure#0}, !>
  408. 222.57 s gammaloop-nextest-clinnet> 7: <public_typst_behavior::public_linnest_labels_follow_their_carriers::{closure#0} as core::ops::function::FnOnce<()>>::call_once
  409. 222.57 s gammaloop-nextest-clinnet> note: Some details are omitted, run with `RUST_BACKTRACE=full` for a verbose backtrace.
  410. 222.57 s gammaloop-nextest-clinnet>
  411. 222.57 s gammaloop-nextest-clinnet> 3. clinnet::public_typst_behavior::public_linnest_fixture_assertions_hold
  412. 222.57 s gammaloop-nextest-clinnet> failure: test failure with exit code 101
  413. 222.57 s gammaloop-nextest-clinnet> thread 'public_linnest_fixture_assertions_hold' (295) panicked at crates/clinnet/tests/public_typst_behavior.rs:81:55:
  414. 222.57 s gammaloop-nextest-clinnet> called `Result::unwrap()` on an `Err` value: typst failed while compiling template /build/.tmpDSaV8y/.clinnet/templates/linnest-public-behavior.svg
  415. 222.57 s gammaloop-nextest-clinnet>
  416. 222.57 s gammaloop-nextest-clinnet> Command executed:
  417. 222.57 s gammaloop-nextest-clinnet> "typst" "c" "/build/.tmpDSaV8y/.clinnet/templates/linnest-public-behavior.typ" "/build/.tmpDSaV8y/.clinnet/templates/linnest-public-behavior.svg" "--root" "/build/.tmpDSaV8y/.clinnet/templates"
  418. 222.57 s gammaloop-nextest-clinnet>
  419. 222.57 s gammaloop-nextest-clinnet> Typst stdout:
  420. 222.57 s gammaloop-nextest-clinnet>
  421. 222.57 s gammaloop-nextest-clinnet>
  422. 222.57 s gammaloop-nextest-clinnet> Typst stderr:
  423. 222.57 s gammaloop-nextest-clinnet>
  424. 222.57 s gammaloop-nextest-clinnet>
  425. 222.57 s gammaloop-nextest-clinnet> Location:
  426. 222.57 s gammaloop-nextest-clinnet> crates/clinnet/src/lib.rs:741:13
  427. 222.57 s gammaloop-nextest-clinnet> stack backtrace:
  428. 222.57 s gammaloop-nextest-clinnet> 0: __rustc::rust_begin_unwind
  429. 222.57 s gammaloop-nextest-clinnet> 1: core::panicking::panic_fmt
  430. 222.57 s gammaloop-nextest-clinnet> 2: core::result::unwrap_failed
  431. 222.57 s gammaloop-nextest-clinnet> 3: public_typst_behavior::render
  432. 222.57 s gammaloop-nextest-clinnet> 4: <std::sync::once::Once>::call_once_force::<<std::sync::once_lock::OnceLock<alloc::string::String>>::initialize<<std::sync::once_lock::OnceLock<alloc::string::String>>::get_or_init<public_typst_behavior::linnest_public_svg::{closure#0}>::{closure#0}, !>::{closure#0}>::{closure#0}
  433. 222.57 s gammaloop-nextest-clinnet> 5: <std::sys::sync::once::futex::Once>::call
  434. 222.57 s gammaloop-nextest-clinnet> 6: <std::sync::once_lock::OnceLock<alloc::string::String>>::initialize::<<std::sync::once_lock::OnceLock<alloc::string::String>>::get_or_init<public_typst_behavior::linnest_public_svg::{closure#0}>::{closure#0}, !>
  435. 222.57 s gammaloop-nextest-clinnet> 7: <public_typst_behavior::public_linnest_fixture_assertions_hold::{closure#0} as core::ops::function::FnOnce<()>>::call_once
  436. 222.57 s gammaloop-nextest-clinnet> note: Some details are omitted, run with `RUST_BACKTRACE=full` for a verbose backtrace.
  437. 222.57 s gammaloop-nextest-clinnet> system-out
  438. 222.57 s gammaloop-nextest-clinnet> running 1 test
  439. 222.57 s gammaloop-nextest-clinnet> test public_linnest_fixture_assertions_hold has been running for over 60 seconds
  440. 222.57 s gammaloop-nextest-clinnet> test public_linnest_fixture_assertions_hold ... FAILED
  441. 222.57 s gammaloop-nextest-clinnet>
  442. 222.57 s gammaloop-nextest-clinnet> failures:
  443. 222.57 s gammaloop-nextest-clinnet>
  444. 222.57 s gammaloop-nextest-clinnet> failures:
  445. 222.57 s gammaloop-nextest-clinnet> public_linnest_fixture_assertions_hold
  446. 222.57 s gammaloop-nextest-clinnet>
  447. 222.57 s gammaloop-nextest-clinnet> test result: FAILED. 0 passed; 1 failed; 0 ignored; 0 measured; 17 filtered out; finished in 135.54s
  448. 222.57 s gammaloop-nextest-clinnet> system-err
  449. 222.57 s gammaloop-nextest-clinnet> thread 'public_linnest_fixture_assertions_hold' (295) panicked at crates/clinnet/tests/public_typst_behavior.rs:81:55:
  450. 222.57 s gammaloop-nextest-clinnet> called `Result::unwrap()` on an `Err` value: typst failed while compiling template /build/.tmpDSaV8y/.clinnet/templates/linnest-public-behavior.svg
  451. 222.57 s gammaloop-nextest-clinnet>
  452. 222.57 s gammaloop-nextest-clinnet> Command executed:
  453. 222.57 s gammaloop-nextest-clinnet> "typst" "c" "/build/.tmpDSaV8y/.clinnet/templates/linnest-public-behavior.typ" "/build/.tmpDSaV8y/.clinnet/templates/linnest-public-behavior.svg" "--root" "/build/.tmpDSaV8y/.clinnet/templates"
  454. 222.57 s gammaloop-nextest-clinnet>
  455. 222.57 s gammaloop-nextest-clinnet> Typst stdout:
  456. 222.57 s gammaloop-nextest-clinnet>
  457. 222.57 s gammaloop-nextest-clinnet>
  458. 222.57 s gammaloop-nextest-clinnet> Typst stderr:
  459. 222.57 s gammaloop-nextest-clinnet>
  460. 222.57 s gammaloop-nextest-clinnet>
  461. 222.57 s gammaloop-nextest-clinnet> Location:
  462. 222.57 s gammaloop-nextest-clinnet> crates/clinnet/src/lib.rs:741:13
  463. 222.57 s gammaloop-nextest-clinnet> stack backtrace:
  464. 222.57 s gammaloop-nextest-clinnet> 0: __rustc::rust_begin_unwind
  465. 222.57 s gammaloop-nextest-clinnet> 1: core::panicking::panic_fmt
  466. 222.57 s gammaloop-nextest-clinnet> 2: core::result::unwrap_failed
  467. 222.57 s gammaloop-nextest-clinnet> 3: public_typst_behavior::render
  468. 222.57 s gammaloop-nextest-clinnet> 4: <std::sync::once::Once>::call_once_force::<<std::sync::once_lock::OnceLock<alloc::string::String>>::initialize<<std::sync::once_lock::OnceLock<alloc::string::String>>::get_or_init<public_typst_behavior::linnest_public_svg::{closure#0}>::{closure#0}, !>::{closure#0}>::{closure#0}
  469. 222.57 s gammaloop-nextest-clinnet> 5: <std::sys::sync::once::futex::Once>::call
  470. 222.57 s gammaloop-nextest-clinnet> 6: <std::sync::once_lock::OnceLock<alloc::string::String>>::initialize::<<std::sync::once_lock::OnceLock<alloc::string::String>>::get_or_init<public_typst_behavior::linnest_public_svg::{closure#0}>::{closure#0}, !>
  471. 222.57 s gammaloop-nextest-clinnet> 7: <public_typst_behavior::public_linnest_fixture_assertions_hold::{closure#0} as core::ops::function::FnOnce<()>>::call_once
  472. 222.57 s gammaloop-nextest-clinnet> note: Some details are omitted, run with `RUST_BACKTRACE=full` for a verbose backtrace.
  473. 222.57 s gammaloop-nextest-clinnet> =========================================
  474. 223.56 s [0 built (1 failed)]error: Cannot build '/nix/store/4pqspwvh8pi9s2vg9g6mfsggpl9ynwzx-gammaloop-nextest-clinnet.drv'.
  475. 223.56 s Reason: builder failed with exit code 100.
  476. 223.56 s Output paths:
  477. 223.56 s /nix/store/v9zka7gxdrym1pq03r0i4w2q43fgdwcq-gammaloop-nextest-clinnet
  478. 223.56 s Last 449 log lines:
  479. 223.56 s > Nextest worker budget: 16
  480. 223.56 s > Extracting 4 binaries (including 1 non-test binary), 1 build script output directory, and 1 linked path to /build/source
  481. 223.56 s > Extracted 16 files to /build/source in 0.15s
  482. 223.56 s > ------------
  483. 223.56 s > Nextest run ID 30ad54af-7504-47b1-9695-cfa08a9a7663 with nextest profile: ci_gammaloop
  484. 223.56 s > Starting 38 tests across 3 binaries
  485. 223.56 s > FAIL [ 93.751s] (32/38) clinnet::public_typst_behavior public_linnest_edge_styles_skip_fallbacks
  486. 223.56 s > stdout ---
  487. 223.56 s >
  488. 223.56 s > running 1 test
  489. 223.56 s > test public_linnest_edge_styles_skip_fallbacks has been running for over 60 seconds
  490. 223.56 s > test public_linnest_edge_styles_skip_fallbacks ... FAILED
  491. 223.56 s >
  492. 223.56 s > failures:
  493. 223.56 s >
  494. 223.56 s > failures:
  495. 223.56 s > public_linnest_edge_styles_skip_fallbacks
  496. 223.56 s >
  497. 223.56 s > test result: FAILED. 0 passed; 1 failed; 0 ignored; 0 measured; 17 filtered out; finished in 93.71s
  498. 223.56 s >
  499. 223.56 s > stderr ---
  500. 223.56 s >
  501. 223.56 s > thread 'public_linnest_edge_styles_skip_fallbacks' (286) panicked at crates/clinnet/tests/public_typst_behavior.rs:81:55:
  502. 223.56 s > called `Result::unwrap()` on an `Err` value: typst failed while compiling template /build/.tmpnXTRS1/.clinnet/templates/linnest-public-behavior.svg
  503. 223.56 s >
  504. 223.56 s > Command executed:
  505. 223.56 s > "typst" "c" "/build/.tmpnXTRS1/.clinnet/templates/linnest-public-behavior.typ" "/build/.tmpnXTRS1/.clinnet/templates/linnest-public-behavior.svg" "--root" "/build/.tmpnXTRS1/.clinnet/templates"
  506. 223.56 s >
  507. 223.56 s > Typst stdout:
  508. 223.56 s >
  509. 223.56 s >
  510. 223.56 s > Typst stderr:
  511. 223.56 s >
  512. 223.56 s >
  513. 223.56 s > Location:
  514. 223.56 s > crates/clinnet/src/lib.rs:741:13
  515. 223.56 s > stack backtrace:
  516. 223.56 s > 0: __rustc::rust_begin_unwind
  517. 223.56 s > 1: core::panicking::panic_fmt
  518. 223.56 s > 2: core::result::unwrap_failed
  519. 223.56 s > 3: public_typst_behavior::render
  520. 223.56 s > 4: <std::sync::once::Once>::call_once_force::<<std::sync::once_lock::OnceLock<alloc::string::String>>::initialize<<std::sync::once_lock::OnceLock<alloc::string::String>>::get_or_init<public_typst_behavior::linnest_public_svg::{closure#0}>::{closure#0}, !>::{closure#0}>::{closure#0}
  521. 223.56 s > 5: <std::sys::sync::once::futex::Once>::call
  522. 223.56 s > 6: <std::sync::once_lock::OnceLock<alloc::string::String>>::initialize::<<std::sync::once_lock::OnceLock<alloc::string::String>>::get_or_init<public_typst_behavior::linnest_public_svg::{closure#0}>::{closure#0}, !>
  523. 223.56 s > 7: <public_typst_behavior::public_linnest_edge_styles_skip_fallbacks::{closure#0} as core::ops::function::FnOnce<()>>::call_once
  524. 223.56 s > note: Some details are omitted, run with `RUST_BACKTRACE=full` for a verbose backtrace.
  525. 223.56 s >
  526. 223.56 s > FAIL [ 109.533s] (33/38) clinnet::public_typst_behavior public_linnest_labels_follow_their_carriers
  527. 223.56 s > stdout ---
  528. 223.56 s >
  529. 223.56 s > running 1 test
  530. 223.56 s > test public_linnest_labels_follow_their_carriers has been running for over 60 seconds
  531. 223.56 s > test public_linnest_labels_follow_their_carriers ... FAILED
  532. 223.56 s >
  533. 223.56 s > failures:
  534. 223.56 s >
  535. 223.56 s > failures:
  536. 223.56 s > public_linnest_labels_follow_their_carriers
  537. 223.56 s >
  538. 223.56 s > test result: FAILED. 0 passed; 1 failed; 0 ignored; 0 measured; 17 filtered out; finished in 109.48s
  539. 223.56 s >
  540. 223.56 s > stderr ---
  541. 223.56 s >
  542. 223.56 s > thread 'public_linnest_labels_follow_their_carriers' (271) panicked at crates/clinnet/tests/public_typst_behavior.rs:81:55:
  543. 223.56 s > called `Result::unwrap()` on an `Err` value: typst failed while compiling template /build/.tmpkAywEu/.clinnet/templates/linnest-public-behavior.svg
  544. 223.56 s >
  545. 223.56 s > Command executed:
  546. 223.56 s > "typst" "c" "/build/.tmpkAywEu/.clinnet/templates/linnest-public-behavior.typ" "/build/.tmpkAywEu/.clinnet/templates/linnest-public-behavior.svg" "--root" "/build/.tmpkAywEu/.clinnet/templates"
  547. 223.56 s >
  548. 223.56 s > Typst stdout:
  549. 223.56 s >
  550. 223.56 s >
  551. 223.56 s > Typst stderr:
  552. 223.56 s >
  553. 223.56 s >
  554. 223.56 s > Location:
  555. 223.56 s > crates/clinnet/src/lib.rs:741:13
  556. 223.56 s > stack backtrace:
  557. 223.56 s > 0: __rustc::rust_begin_unwind
  558. 223.56 s > 1: core::panicking::panic_fmt
  559. 223.56 s > 2: core::result::unwrap_failed
  560. 223.56 s > 3: public_typst_behavior::render
  561. 223.56 s > 4: <std::sync::once::Once>::call_once_force::<<std::sync::once_lock::OnceLock<alloc::string::String>>::initialize<<std::sync::once_lock::OnceLock<alloc::string::String>>::get_or_init<public_typst_behavior::linnest_public_svg::{closure#0}>::{closure#0}, !>::{closure#0}>::{closure#0}
  562. 223.56 s > 5: <std::sys::sync::once::futex::Once>::call
  563. 223.56 s > 6: <std::sync::once_lock::OnceLock<alloc::string::String>>::initialize::<<std::sync::once_lock::OnceLock<alloc::string::String>>::get_or_init<public_typst_behavior::linnest_public_svg::{closure#0}>::{closure#0}, !>
  564. 223.56 s > 7: <public_typst_behavior::public_linnest_labels_follow_their_carriers::{closure#0} as core::ops::function::FnOnce<()>>::call_once
  565. 223.56 s > note: Some details are omitted, run with `RUST_BACKTRACE=full` for a verbose backtrace.
  566. 223.56 s >
  567. 223.56 s > FAIL [ 135.588s] (34/38) clinnet::public_typst_behavior public_linnest_fixture_assertions_hold
  568. 223.56 s > stdout ---
  569. 223.56 s >
  570. 223.56 s > running 1 test
  571. 223.56 s > test public_linnest_fixture_assertions_hold has been running for over 60 seconds
  572. 223.56 s > test public_linnest_fixture_assertions_hold ... FAILED
  573. 223.56 s >
  574. 223.56 s > failures:
  575. 223.56 s >
  576. 223.56 s > failures:
  577. 223.56 s > public_linnest_fixture_assertions_hold
  578. 223.56 s >
  579. 223.56 s > test result: FAILED. 0 passed; 1 failed; 0 ignored; 0 measured; 17 filtered out; finished in 135.54s
  580. 223.56 s >
  581. 223.56 s > stderr ---
  582. 223.56 s >
  583. 223.56 s > thread 'public_linnest_fixture_assertions_hold' (295) panicked at crates/clinnet/tests/public_typst_behavior.rs:81:55:
  584. 223.56 s > called `Result::unwrap()` on an `Err` value: typst failed while compiling template /build/.tmpDSaV8y/.clinnet/templates/linnest-public-behavior.svg
  585. 223.56 s >
  586. 223.56 s > Command executed:
  587. 223.56 s > "typst" "c" "/build/.tmpDSaV8y/.clinnet/templates/linnest-public-behavior.typ" "/build/.tmpDSaV8y/.clinnet/templates/linnest-public-behavior.svg" "--root" "/build/.tmpDSaV8y/.clinnet/templates"
  588. 223.56 s >
  589. 223.56 s > Typst stdout:
  590. 223.56 s >
  591. 223.56 s >
  592. 223.56 s > Typst stderr:
  593. 223.56 s >
  594. 223.56 s >
  595. 223.56 s > Location:
  596. 223.56 s > crates/clinnet/src/lib.rs:741:13
  597. 223.56 s > stack backtrace:
  598. 223.56 s > 0: __rustc::rust_begin_unwind
  599. 223.56 s > 1: core::panicking::panic_fmt
  600. 223.56 s > 2: core::result::unwrap_failed
  601. 223.56 s > 3: public_typst_behavior::render
  602. 223.56 s > 4: <std::sync::once::Once>::call_once_force::<<std::sync::once_lock::OnceLock<alloc::string::String>>::initialize<<std::sync::once_lock::OnceLock<alloc::string::String>>::get_or_init<public_typst_behavior::linnest_public_svg::{closure#0}>::{closure#0}, !>::{closure#0}>::{closure#0}
  603. 223.56 s > 5: <std::sys::sync::once::futex::Once>::call
  604. 223.56 s > 6: <std::sync::once_lock::OnceLock<alloc::string::String>>::initialize::<<std::sync::once_lock::OnceLock<alloc::string::String>>::get_or_init<public_typst_behavior::linnest_public_svg::{closure#0}>::{closure#0}, !>
  605. 223.56 s > 7: <public_typst_behavior::public_linnest_fixture_assertions_hold::{closure#0} as core::ops::function::FnOnce<()>>::call_once
  606. 223.56 s > note: Some details are omitted, run with `RUST_BACKTRACE=full` for a verbose backtrace.
  607. 223.56 s >
  608. 223.56 s > ------------
  609. 223.56 s > Summary [ 168.772s] 38 tests run: 35 passed (4 slow), 3 failed, 0 skipped
  610. 223.56 s > FAIL [ 93.751s] (32/38) clinnet::public_typst_behavior public_linnest_edge_styles_skip_fallbacks
  611. 223.56 s > stdout ---
  612. 223.56 s >
  613. 223.56 s > running 1 test
  614. 223.56 s > test public_linnest_edge_styles_skip_fallbacks has been running for over 60 seconds
  615. 223.56 s > test public_linnest_edge_styles_skip_fallbacks ... FAILED
  616. 223.56 s >
  617. 223.56 s > failures:
  618. 223.56 s >
  619. 223.56 s > failures:
  620. 223.56 s > public_linnest_edge_styles_skip_fallbacks
  621. 223.56 s >
  622. 223.56 s > test result: FAILED. 0 passed; 1 failed; 0 ignored; 0 measured; 17 filtered out; finished in 93.71s
  623. 223.56 s >
  624. 223.56 s > stderr ---
  625. 223.56 s >
  626. 223.56 s > thread 'public_linnest_edge_styles_skip_fallbacks' (286) panicked at crates/clinnet/tests/public_typst_behavior.rs:81:55:
  627. 223.56 s > called `Result::unwrap()` on an `Err` value: typst failed while compiling template /build/.tmpnXTRS1/.clinnet/templates/linnest-public-behavior.svg
  628. 223.56 s >
  629. 223.56 s > Command executed:
  630. 223.56 s > "typst" "c" "/build/.tmpnXTRS1/.clinnet/templates/linnest-public-behavior.typ" "/build/.tmpnXTRS1/.clinnet/templates/linnest-public-behavior.svg" "--root" "/build/.tmpnXTRS1/.clinnet/templates"
  631. 223.56 s >
  632. 223.56 s > Typst stdout:
  633. 223.56 s >
  634. 223.56 s >
  635. 223.56 s > Typst stderr:
  636. 223.56 s >
  637. 223.56 s >
  638. 223.56 s > Location:
  639. 223.56 s > crates/clinnet/src/lib.rs:741:13
  640. 223.56 s > stack backtrace:
  641. 223.56 s > 0: __rustc::rust_begin_unwind
  642. 223.56 s > 1: core::panicking::panic_fmt
  643. 223.56 s > 2: core::result::unwrap_failed
  644. 223.56 s > 3: public_typst_behavior::render
  645. 223.56 s > 4: <std::sync::once::Once>::call_once_force::<<std::sync::once_lock::OnceLock<alloc::string::String>>::initialize<<std::sync::once_lock::OnceLock<alloc::string::String>>::get_or_init<public_typst_behavior::linnest_public_svg::{closure#0}>::{closure#0}, !>::{closure#0}>::{closure#0}
  646. 223.56 s > 5: <std::sys::sync::once::futex::Once>::call
  647. 223.56 s > 6: <std::sync::once_lock::OnceLock<alloc::string::String>>::initialize::<<std::sync::once_lock::OnceLock<alloc::string::String>>::get_or_init<public_typst_behavior::linnest_public_svg::{closure#0}>::{closure#0}, !>
  648. 223.56 s > 7: <public_typst_behavior::public_linnest_edge_styles_skip_fallbacks::{closure#0} as core::ops::function::FnOnce<()>>::call_once
  649. 223.56 s > note: Some details are omitted, run with `RUST_BACKTRACE=full` for a verbose backtrace.
  650. 223.56 s >
  651. 223.56 s > FAIL [ 109.533s] (33/38) clinnet::public_typst_behavior public_linnest_labels_follow_their_carriers
  652. 223.56 s > stdout ---
  653. 223.56 s >
  654. 223.56 s > running 1 test
  655. 223.56 s > test public_linnest_labels_follow_their_carriers has been running for over 60 seconds
  656. 223.56 s > test public_linnest_labels_follow_their_carriers ... FAILED
  657. 223.56 s >
  658. 223.56 s > failures:
  659. 223.56 s >
  660. 223.56 s > failures:
  661. 223.56 s > public_linnest_labels_follow_their_carriers
  662. 223.56 s >
  663. 223.56 s > test result: FAILED. 0 passed; 1 failed; 0 ignored; 0 measured; 17 filtered out; finished in 109.48s
  664. 223.56 s >
  665. 223.56 s > stderr ---
  666. 223.56 s >
  667. 223.56 s > thread 'public_linnest_labels_follow_their_carriers' (271) panicked at crates/clinnet/tests/public_typst_behavior.rs:81:55:
  668. 223.56 s > called `Result::unwrap()` on an `Err` value: typst failed while compiling template /build/.tmpkAywEu/.clinnet/templates/linnest-public-behavior.svg
  669. 223.56 s >
  670. 223.56 s > Command executed:
  671. 223.56 s > "typst" "c" "/build/.tmpkAywEu/.clinnet/templates/linnest-public-behavior.typ" "/build/.tmpkAywEu/.clinnet/templates/linnest-public-behavior.svg" "--root" "/build/.tmpkAywEu/.clinnet/templates"
  672. 223.56 s >
  673. 223.56 s > Typst stdout:
  674. 223.56 s >
  675. 223.56 s >
  676. 223.56 s > Typst stderr:
  677. 223.56 s >
  678. 223.56 s >
  679. 223.56 s > Location:
  680. 223.56 s > crates/clinnet/src/lib.rs:741:13
  681. 223.56 s > stack backtrace:
  682. 223.56 s > 0: __rustc::rust_begin_unwind
  683. 223.56 s > 1: core::panicking::panic_fmt
  684. 223.56 s > 2: core::result::unwrap_failed
  685. 223.56 s > 3: public_typst_behavior::render
  686. 223.56 s > 4: <std::sync::once::Once>::call_once_force::<<std::sync::once_lock::OnceLock<alloc::string::String>>::initialize<<std::sync::once_lock::OnceLock<alloc::string::String>>::get_or_init<public_typst_behavior::linnest_public_svg::{closure#0}>::{closure#0}, !>::{closure#0}>::{closure#0}
  687. 223.56 s > 5: <std::sys::sync::once::futex::Once>::call
  688. 223.56 s > 6: <std::sync::once_lock::OnceLock<alloc::string::String>>::initialize::<<std::sync::once_lock::OnceLock<alloc::string::String>>::get_or_init<public_typst_behavior::linnest_public_svg::{closure#0}>::{closure#0}, !>
  689. 223.56 s > 7: <public_typst_behavior::public_linnest_labels_follow_their_carriers::{closure#0} as core::ops::function::FnOnce<()>>::call_once
  690. 223.56 s > note: Some details are omitted, run with `RUST_BACKTRACE=full` for a verbose backtrace.
  691. 223.56 s >
  692. 223.56 s > FAIL [ 135.588s] (34/38) clinnet::public_typst_behavior public_linnest_fixture_assertions_hold
  693. 223.56 s > stdout ---
  694. 223.56 s >
  695. 223.56 s > running 1 test
  696. 223.56 s > test public_linnest_fixture_assertions_hold has been running for over 60 seconds
  697. 223.56 s > test public_linnest_fixture_assertions_hold ... FAILED
  698. 223.56 s >
  699. 223.56 s > failures:
  700. 223.56 s >
  701. 223.56 s > failures:
  702. 223.56 s > public_linnest_fixture_assertions_hold
  703. 223.56 s >
  704. 223.56 s > test result: FAILED. 0 passed; 1 failed; 0 ignored; 0 measured; 17 filtered out; finished in 135.54s
  705. 223.56 s >
  706. 223.56 s > stderr ---
  707. 223.56 s >
  708. 223.56 s > thread 'public_linnest_fixture_assertions_hold' (295) panicked at crates/clinnet/tests/public_typst_behavior.rs:81:55:
  709. 223.56 s > called `Result::unwrap()` on an `Err` value: typst failed while compiling template /build/.tmpDSaV8y/.clinnet/templates/linnest-public-behavior.svg
  710. 223.56 s >
  711. 223.56 s > Command executed:
  712. 223.56 s > "typst" "c" "/build/.tmpDSaV8y/.clinnet/templates/linnest-public-behavior.typ" "/build/.tmpDSaV8y/.clinnet/templates/linnest-public-behavior.svg" "--root" "/build/.tmpDSaV8y/.clinnet/templates"
  713. 223.56 s >
  714. 223.56 s > Typst stdout:
  715. 223.56 s >
  716. 223.56 s >
  717. 223.56 s > Typst stderr:
  718. 223.56 s >
  719. 223.56 s >
  720. 223.56 s > Location:
  721. 223.56 s > crates/clinnet/src/lib.rs:741:13
  722. 223.56 s > stack backtrace:
  723. 223.56 s > 0: __rustc::rust_begin_unwind
  724. 223.56 s > 1: core::panicking::panic_fmt
  725. 223.56 s > 2: core::result::unwrap_failed
  726. 223.56 s > 3: public_typst_behavior::render
  727. 223.56 s > 4: <std::sync::once::Once>::call_once_force::<<std::sync::once_lock::OnceLock<alloc::string::String>>::initialize<<std::sync::once_lock::OnceLock<alloc::string::String>>::get_or_init<public_typst_behavior::linnest_public_svg::{closure#0}>::{closure#0}, !>::{closure#0}>::{closure#0}
  728. 223.56 s > 5: <std::sys::sync::once::futex::Once>::call
  729. 223.56 s > 6: <std::sync::once_lock::OnceLock<alloc::string::String>>::initialize::<<std::sync::once_lock::OnceLock<alloc::string::String>>::get_or_init<public_typst_behavior::linnest_public_svg::{closure#0}>::{closure#0}, !>
  730. 223.56 s > 7: <public_typst_behavior::public_linnest_fixture_assertions_hold::{closure#0} as core::ops::function::FnOnce<()>>::call_once
  731. 223.56 s > note: Some details are omitted, run with `RUST_BACKTRACE=full` for a verbose backtrace.
  732. 223.56 s >
  733. 223.56 s > error: test run failed
  734. 223.56 s >
  735. 223.56 s > ========== nextest test summary ==========
  736. 223.56 s > report: target/nextest/ci_gammaloop/junit.xml
  737. 223.56 s > tests: 38, failures: 3, errors: 0
  738. 223.56 s >
  739. 223.56 s > 1. clinnet::public_typst_behavior::public_linnest_edge_styles_skip_fallbacks
  740. 223.56 s > failure: test failure with exit code 101
  741. 223.56 s > thread 'public_linnest_edge_styles_skip_fallbacks' (286) panicked at crates/clinnet/tests/public_typst_behavior.rs:81:55:
  742. 223.56 s > called `Result::unwrap()` on an `Err` value: typst failed while compiling template /build/.tmpnXTRS1/.clinnet/templates/linnest-public-behavior.svg
  743. 223.56 s >
  744. 223.56 s > Command executed:
  745. 223.56 s > "typst" "c" "/build/.tmpnXTRS1/.clinnet/templates/linnest-public-behavior.typ" "/build/.tmpnXTRS1/.clinnet/templates/linnest-public-behavior.svg" "--root" "/build/.tmpnXTRS1/.clinnet/templates"
  746. 223.56 s >
  747. 223.56 s > Typst stdout:
  748. 223.56 s >
  749. 223.56 s >
  750. 223.57 s > Typst stderr:
  751. 223.57 s >
  752. 223.57 s >
  753. 223.57 s > Location:
  754. 223.57 s > crates/clinnet/src/lib.rs:741:13
  755. 223.57 s > stack backtrace:
  756. 223.57 s > 0: __rustc::rust_begin_unwind
  757. 223.57 s > 1: core::panicking::panic_fmt
  758. 223.57 s > 2: core::result::unwrap_failed
  759. 223.57 s > 3: public_typst_behavior::render
  760. 223.57 s > 4: <std::sync::once::Once>::call_once_force::<<std::sync::once_lock::OnceLock<alloc::string::String>>::initialize<<std::sync::once_lock::OnceLock<alloc::string::String>>::get_or_init<public_typst_behavior::linnest_public_svg::{closure#0}>::{closure#0}, !>::{closure#0}>::{closure#0}
  761. 223.57 s > 5: <std::sys::sync::once::futex::Once>::call
  762. 223.57 s > 6: <std::sync::once_lock::OnceLock<alloc::string::String>>::initialize::<<std::sync::once_lock::OnceLock<alloc::string::String>>::get_or_init<public_typst_behavior::linnest_public_svg::{closure#0}>::{closure#0}, !>
  763. 223.57 s > 7: <public_typst_behavior::public_linnest_edge_styles_skip_fallbacks::{closure#0} as core::ops::function::FnOnce<()>>::call_once
  764. 223.57 s > note: Some details are omitted, run with `RUST_BACKTRACE=full` for a verbose backtrace.
  765. 223.57 s > system-out
  766. 223.57 s > running 1 test
  767. 223.57 s > test public_linnest_edge_styles_skip_fallbacks has been running for over 60 seconds
  768. 223.57 s > test public_linnest_edge_styles_skip_fallbacks ... FAILED
  769. 223.57 s >
  770. 223.57 s > failures:
  771. 223.57 s >
  772. 223.57 s > failures:
  773. 223.57 s > public_linnest_edge_styles_skip_fallbacks
  774. 223.57 s >
  775. 223.57 s > test result: FAILED. 0 passed; 1 failed; 0 ignored; 0 measured; 17 filtered out; finished in 93.71s
  776. 223.57 s > system-err
  777. 223.57 s > thread 'public_linnest_edge_styles_skip_fallbacks' (286) panicked at crates/clinnet/tests/public_typst_behavior.rs:81:55:
  778. 223.57 s > called `Result::unwrap()` on an `Err` value: typst failed while compiling template /build/.tmpnXTRS1/.clinnet/templates/linnest-public-behavior.svg
  779. 223.57 s >
  780. 223.57 s > Command executed:
  781. 223.57 s > "typst" "c" "/build/.tmpnXTRS1/.clinnet/templates/linnest-public-behavior.typ" "/build/.tmpnXTRS1/.clinnet/templates/linnest-public-behavior.svg" "--root" "/build/.tmpnXTRS1/.clinnet/templates"
  782. 223.57 s >
  783. 223.57 s > Typst stdout:
  784. 223.57 s >
  785. 223.57 s >
  786. 223.57 s > Typst stderr:
  787. 223.57 s >
  788. 223.57 s >
  789. 223.57 s > Location:
  790. 223.57 s > crates/clinnet/src/lib.rs:741:13
  791. 223.57 s > stack backtrace:
  792. 223.57 s > 0: __rustc::rust_begin_unwind
  793. 223.57 s > 1: core::panicking::panic_fmt
  794. 223.57 s > 2: core::result::unwrap_failed
  795. 223.57 s > 3: public_typst_behavior::render
  796. 223.57 s > 4: <std::sync::once::Once>::call_once_force::<<std::sync::once_lock::OnceLock<alloc::string::String>>::initialize<<std::sync::once_lock::OnceLock<alloc::string::String>>::get_or_init<public_typst_behavior::linnest_public_svg::{closure#0}>::{closure#0}, !>::{closure#0}>::{closure#0}
  797. 223.57 s > 5: <std::sys::sync::once::futex::Once>::call
  798. 223.57 s > 6: <std::sync::once_lock::OnceLock<alloc::string::String>>::initialize::<<std::sync::once_lock::OnceLock<alloc::string::String>>::get_or_init<public_typst_behavior::linnest_public_svg::{closure#0}>::{closure#0}, !>
  799. 223.57 s > 7: <public_typst_behavior::public_linnest_edge_styles_skip_fallbacks::{closure#0} as core::ops::function::FnOnce<()>>::call_once
  800. 223.57 s > note: Some details are omitted, run with `RUST_BACKTRACE=full` for a verbose backtrace.
  801. 223.57 s >
  802. 223.57 s > 2. clinnet::public_typst_behavior::public_linnest_labels_follow_their_carriers
  803. 223.57 s > failure: test failure with exit code 101
  804. 223.57 s > thread 'public_linnest_labels_follow_their_carriers' (271) panicked at crates/clinnet/tests/public_typst_behavior.rs:81:55:
  805. 223.57 s > called `Result::unwrap()` on an `Err` value: typst failed while compiling template /build/.tmpkAywEu/.clinnet/templates/linnest-public-behavior.svg
  806. 223.57 s >
  807. 223.57 s > Command executed:
  808. 223.57 s > "typst" "c" "/build/.tmpkAywEu/.clinnet/templates/linnest-public-behavior.typ" "/build/.tmpkAywEu/.clinnet/templates/linnest-public-behavior.svg" "--root" "/build/.tmpkAywEu/.clinnet/templates"
  809. 223.57 s >
  810. 223.57 s > Typst stdout:
  811. 223.57 s >
  812. 223.57 s >
  813. 223.57 s > Typst stderr:
  814. 223.57 s >
  815. 223.57 s >
  816. 223.57 s > Location:
  817. 223.57 s > crates/clinnet/src/lib.rs:741:13
  818. 223.57 s > stack backtrace:
  819. 223.57 s > 0: __rustc::rust_begin_unwind
  820. 223.57 s > 1: core::panicking::panic_fmt
  821. 223.57 s > 2: core::result::unwrap_failed
  822. 223.57 s > 3: public_typst_behavior::render
  823. 223.57 s > 4: <std::sync::once::Once>::call_once_force::<<std::sync::once_lock::OnceLock<alloc::string::String>>::initialize<<std::sync::once_lock::OnceLock<alloc::string::String>>::get_or_init<public_typst_behavior::linnest_public_svg::{closure#0}>::{closure#0}, !>::{closure#0}>::{closure#0}
  824. 223.57 s > 5: <std::sys::sync::once::futex::Once>::call
  825. 223.57 s > 6: <std::sync::once_lock::OnceLock<alloc::string::String>>::initialize::<<std::sync::once_lock::OnceLock<alloc::string::String>>::get_or_init<public_typst_behavior::linnest_public_svg::{closure#0}>::{closure#0}, !>
  826. 223.57 s > 7: <public_typst_behavior::public_linnest_labels_follow_their_carriers::{closure#0} as core::ops::function::FnOnce<()>>::call_once
  827. 223.57 s > note: Some details are omitted, run with `RUST_BACKTRACE=full` for a verbose backtrace.
  828. 223.57 s > system-out
  829. 223.57 s > running 1 test
  830. 223.57 s > test public_linnest_labels_follow_their_carriers has been running for over 60 seconds
  831. 223.57 s > test public_linnest_labels_follow_their_carriers ... FAILED
  832. 223.57 s >
  833. 223.57 s > failures:
  834. 223.57 s >
  835. 223.57 s > failures:
  836. 223.57 s > public_linnest_labels_follow_their_carriers
  837. 223.57 s >
  838. 223.57 s > test result: FAILED. 0 passed; 1 failed; 0 ignored; 0 measured; 17 filtered out; finished in 109.48s
  839. 223.57 s > system-err
  840. 223.57 s > thread 'public_linnest_labels_follow_their_carriers' (271) panicked at crates/clinnet/tests/public_typst_behavior.rs:81:55:
  841. 223.57 s > called `Result::unwrap()` on an `Err` value: typst failed while compiling template /build/.tmpkAywEu/.clinnet/templates/linnest-public-behavior.svg
  842. 223.57 s >
  843. 223.57 s > Command executed:
  844. 223.57 s > "typst" "c" "/build/.tmpkAywEu/.clinnet/templates/linnest-public-behavior.typ" "/build/.tmpkAywEu/.clinnet/templates/linnest-public-behavior.svg" "--root" "/build/.tmpkAywEu/.clinnet/templates"
  845. 223.57 s >
  846. 223.57 s > Typst stdout:
  847. 223.57 s >
  848. 223.57 s >
  849. 223.57 s > Typst stderr:
  850. 223.57 s >
  851. 223.57 s >
  852. 223.57 s > Location:
  853. 223.57 s > crates/clinnet/src/lib.rs:741:13
  854. 223.57 s > stack backtrace:
  855. 223.57 s > 0: __rustc::rust_begin_unwind
  856. 223.57 s > 1: core::panicking::panic_fmt
  857. 223.57 s > 2: core::result::unwrap_failed
  858. 223.57 s > 3: public_typst_behavior::render
  859. 223.57 s > 4: <std::sync::once::Once>::call_once_force::<<std::sync::once_lock::OnceLock<alloc::string::String>>::initialize<<std::sync::once_lock::OnceLock<alloc::string::String>>::get_or_init<public_typst_behavior::linnest_public_svg::{closure#0}>::{closure#0}, !>::{closure#0}>::{closure#0}
  860. 223.57 s > 5: <std::sys::sync::once::futex::Once>::call
  861. 223.57 s > 6: <std::sync::once_lock::OnceLock<alloc::string::String>>::initialize::<<std::sync::once_lock::OnceLock<alloc::string::String>>::get_or_init<public_typst_behavior::linnest_public_svg::{closure#0}>::{closure#0}, !>
  862. 223.57 s > 7: <public_typst_behavior::public_linnest_labels_follow_their_carriers::{closure#0} as core::ops::function::FnOnce<()>>::call_once
  863. 223.57 s > note: Some details are omitted, run with `RUST_BACKTRACE=full` for a verbose backtrace.
  864. 223.57 s >
  865. 223.57 s > 3. clinnet::public_typst_behavior::public_linnest_fixture_assertions_hold
  866. 223.57 s > failure: test failure with exit code 101
  867. 223.57 s > thread 'public_linnest_fixture_assertions_hold' (295) panicked at crates/clinnet/tests/public_typst_behavior.rs:81:55:
  868. 223.57 s > called `Result::unwrap()` on an `Err` value: typst failed while compiling template /build/.tmpDSaV8y/.clinnet/templates/linnest-public-behavior.svg
  869. 223.57 s >
  870. 223.57 s > Command executed:
  871. 223.57 s > "typst" "c" "/build/.tmpDSaV8y/.clinnet/templates/linnest-public-behavior.typ" "/build/.tmpDSaV8y/.clinnet/templates/linnest-public-behavior.svg" "--root" "/build/.tmpDSaV8y/.clinnet/templates"
  872. 223.57 s >
  873. 223.57 s > Typst stdout:
  874. 223.57 s >
  875. 223.57 s >
  876. 223.57 s > Typst stderr:
  877. 223.57 s >
  878. 223.57 s >
  879. 223.57 s > Location:
  880. 223.57 s > crates/clinnet/src/lib.rs:741:13
  881. 223.57 s > stack backtrace:
  882. 223.57 s > 0: __rustc::rust_begin_unwind
  883. 223.57 s > 1: core::panicking::panic_fmt
  884. 223.57 s > 2: core::result::unwrap_failed
  885. 223.57 s > 3: public_typst_behavior::render
  886. 223.57 s > 4: <std::sync::once::Once>::call_once_force::<<std::sync::once_lock::OnceLock<alloc::string::String>>::initialize<<std::sync::once_lock::OnceLock<alloc::string::String>>::get_or_init<public_typst_behavior::linnest_public_svg::{closure#0}>::{closure#0}, !>::{closure#0}>::{closure#0}
  887. 223.57 s > 5: <std::sys::sync::once::futex::Once>::call
  888. 223.57 s > 6: <std::sync::once_lock::OnceLock<alloc::string::String>>::initialize::<<std::sync::once_lock::OnceLock<alloc::string::String>>::get_or_init<public_typst_behavior::linnest_public_svg::{closure#0}>::{closure#0}, !>
  889. 223.57 s > 7: <public_typst_behavior::public_linnest_fixture_assertions_hold::{closure#0} as core::ops::function::FnOnce<()>>::call_once
  890. 223.57 s > note: Some details are omitted, run with `RUST_BACKTRACE=full` for a verbose backtrace.
  891. 223.57 s > system-out
  892. 223.57 s > running 1 test
  893. 223.57 s > test public_linnest_fixture_assertions_hold has been running for over 60 seconds
  894. 223.57 s > test public_linnest_fixture_assertions_hold ... FAILED
  895. 223.57 s >
  896. 223.57 s > failures:
  897. 223.57 s >
  898. 223.57 s > failures:
  899. 223.57 s > public_linnest_fixture_assertions_hold
  900. 223.57 s >
  901. 223.57 s > test result: FAILED. 0 passed; 1 failed; 0 ignored; 0 measured; 17 filtered out; finished in 135.54s
  902. 223.57 s > system-err
  903. 223.57 s > thread 'public_linnest_fixture_assertions_hold' (295) panicked at crates/clinnet/tests/public_typst_behavior.rs:81:55:
  904. 223.57 s > called `Result::unwrap()` on an `Err` value: typst failed while compiling template /build/.tmpDSaV8y/.clinnet/templates/linnest-public-behavior.svg
  905. 223.57 s >
  906. 223.57 s > Command executed:
  907. 223.57 s > "typst" "c" "/build/.tmpDSaV8y/.clinnet/templates/linnest-public-behavior.typ" "/build/.tmpDSaV8y/.clinnet/templates/linnest-public-behavior.svg" "--root" "/build/.tmpDSaV8y/.clinnet/templates"
  908. 223.57 s >
  909. 223.57 s > Typst stdout:
  910. 223.57 s >
  911. 223.57 s >
  912. 223.57 s > Typst stderr:
  913. 223.57 s >
  914. 223.57 s >
  915. 223.57 s > Location:
  916. 223.57 s > crates/clinnet/src/lib.rs:741:13
  917. 223.57 s > stack backtrace:
  918. 223.57 s > 0: __rustc::rust_begin_unwind
  919. 223.57 s > 1: core::panicking::panic_fmt
  920. 223.57 s > 2: core::result::unwrap_failed
  921. 223.57 s > 3: public_typst_behavior::render
  922. 223.57 s > 4: <std::sync::once::Once>::call_once_force::<<std::sync::once_lock::OnceLock<alloc::string::String>>::initialize<<std::sync::once_lock::OnceLock<alloc::string::String>>::get_or_init<public_typst_behavior::linnest_public_svg::{closure#0}>::{closure#0}, !>::{closure#0}>::{closure#0}
  923. 223.57 s > 5: <std::sys::sync::once::futex::Once>::call
  924. 223.57 s > 6: <std::sync::once_lock::OnceLock<alloc::string::String>>::initialize::<<std::sync::once_lock::OnceLock<alloc::string::String>>::get_or_init<public_typst_behavior::linnest_public_svg::{closure#0}>::{closure#0}, !>
  925. 223.57 s > 7: <public_typst_behavior::public_linnest_fixture_assertions_hold::{closure#0} as core::ops::function::FnOnce<()>>::call_once
  926. 223.57 s > note: Some details are omitted, run with `RUST_BACKTRACE=full` for a verbose backtrace.
  927. 223.57 s > =========================================
  928. 223.57 s For full logs, run:
  929. 223.57 s nix log /nix/store/4pqspwvh8pi9s2vg9g6mfsggpl9ynwzx-gammaloop-nextest-clinnet.drv
  930. 224.24 s Run failed.