test packages.x86_64-linux.nix-ci-check-gammaloop-nextest-clinnet
0.00 s
$ /nix/store/bhv6xyvqw6gjs3j488gi1z6wdv18bdpa-coreutils-9.11/bin/timeout --kill-after=15s 7200s /nix/store/bxgja2ppiqi6w2bgn0r07d7mgnl1k6k2-nix-2.34.8/bin/nix --extra-experimental-features nix-command --extra-experimental-features flakes flake clone git+https://github.com/alphal00p/gammaloop --dest /tmp/nix-ci-worker/stable-pwd/repo/
0.12 s
Cloning into '/tmp/nix-ci-worker/stable-pwd/repo'...
0.92 s
remote: Enumerating objects: 162134, done.
1.03 s
remote: Counting objects: 0% (1/3710)
remote: Counting objects: 1% (38/3710)
remote: Counting objects: 2% (75/3710)
remote: Counting objects: 3% (112/3710)
remote: Counting objects: 4% (149/3710)
remote: Counting objects: 5% (186/3710)
remote: Counting objects: 6% (223/3710)
remote: Counting objects: 7% (260/3710)
remote: Counting objects: 8% (297/3710)
remote: Counting objects: 9% (334/3710)
remote: Counting objects: 10% (371/3710)
remote: Counting objects: 11% (409/3710)
remote: Counting objects: 12% (446/3710)
remote: Counting objects: 13% (483/3710)
remote: Counting objects: 14% (520/3710)
remote: Counting objects: 15% (557/3710)
remote: Counting objects: 16% (594/3710)
remote: Counting objects: 17% (631/3710)
remote: Counting objects: 18% (668/3710)
remote: Counting objects: 19% (705/3710)
remote: Counting objects: 20% (742/3710)
remote: Counting objects: 21% (780/3710)
remote: Counting objects: 22% (817/3710)
remote: Counting objects: 23% (854/3710)
remote: Counting objects: 24% (891/3710)
remote: Counting objects: 25% (928/3710)
remote: Counting objects: 26% (965/3710)
remote: Counting objects: 27% (1002/3710)
remote: Counting objects: 28% (1039/3710)
remote: Counting objects: 29% (1076/3710)
remote: Counting objects: 30% (1113/3710)
remote: Counting objects: 31% (1151/3710)
remote: Counting objects: 32% (1188/3710)
remote: Counting objects: 33% (1225/3710)
remote: Counting objects: 34% (1262/3710)
remote: Counting objects: 35% (1299/3710)
remote: Counting objects: 36% (1336/3710)
remote: Counting objects: 37% (1373/3710)
remote: Counting objects: 38% (1410/3710)
remote: Counting objects: 39% (1447/3710)
remote: Counting objects: 40% (1484/3710)
remote: Counting objects: 41% (1522/3710)
remote: Counting objects: 42% (1559/3710)
remote: Counting objects: 43% (1596/3710)
remote: Counting objects: 44% (1633/3710)
remote: Counting objects: 45% (1670/3710)
remote: Counting objects: 46% (1707/3710)
remote: Counting objects: 47% (1744/3710)
remote: Counting objects: 48% (1781/3710)
remote: Counting objects: 49% (1818/3710)
remote: Counting objects: 50% (1855/3710)
remote: Counting objects: 51% (1893/3710)
remote: Counting objects: 52% (1930/3710)
remote: Counting objects: 53% (1967/3710)
remote: Counting objects: 54% (2004/3710)
remote: Counting objects: 55% (2041/3710)
remote: Counting objects: 56% (2078/3710)
remote: Counting objects: 57% (2115/3710)
remote: Counting objects: 58% (2152/3710)
remote: Counting objects: 59% (2189/3710)
remote: Counting objects: 60% (2226/3710)
remote: Counting objects: 61% (2264/3710)
remote: Counting objects: 62% (2301/3710)
remote: Counting objects: 63% (2338/3710)
remote: Counting objects: 64% (2375/3710)
remote: Counting objects: 65% (2412/3710)
remote: Counting objects: 66% (2449/3710)
remote: Counting objects: 67% (2486/3710)
remote: Counting objects: 68% (2523/3710)
remote: Counting objects: 69% (2560/3710)
remote: Counting objects: 70% (2597/3710)
remote: Counting objects: 71% (2635/3710)
remote: Counting objects: 72% (2672/3710)
remote: Counting objects: 73% (2709/3710)
remote: Counting objects: 74% (2746/3710)
remote: Counting objects: 75% (2783/3710)
remote: Counting objects: 76% (2820/3710)
remote: Counting objects: 77% (2857/3710)
remote: Counting objects: 78% (2894/3710)
remote: Counting objects: 79% (2931/3710)
remote: Counting objects: 80% (2968/3710)
remote: Counting objects: 81% (3006/3710)
remote: Counting objects: 82% (3043/3710)
remote: Counting objects: 83% (3080/3710)
remote: Counting objects: 84% (3117/3710)
remote: Counting objects: 85% (3154/3710)
remote: Counting objects: 86% (3191/3710)
remote: Counting objects: 87% (3228/3710)
remote: Counting objects: 88% (3265/3710)
remote: Counting objects: 89% (3302/3710)
remote: Counting objects: 90% (3339/3710)
remote: Counting objects: 91% (3377/3710)
remote: Counting objects: 92% (3414/3710)
remote: Counting objects: 93% (3451/3710)
remote: Counting objects: 94% (3488/3710)
remote: Counting objects: 95% (3525/3710)
remote: Counting objects: 96% (3562/3710)
remote: Counting objects: 97% (3599/3710)
remote: Counting objects: 98% (3636/3710)
remote: Counting objects: 99% (3673/3710)
remote: Counting objects: 100% (3710/3710)
remote: Counting objects: 100% (3710/3710), done.
2.91 s
remote: Compressing objects: 0% (1/1481)
remote: Compressing objects: 1% (15/1481)
remote: Compressing objects: 2% (30/1481)
remote: Compressing objects: 3% (45/1481)
remote: Compressing objects: 4% (60/1481)
remote: Compressing objects: 5% (75/1481)
remote: Compressing objects: 6% (89/1481)
remote: Compressing objects: 7% (104/1481)
remote: Compressing objects: 8% (119/1481)
remote: Compressing objects: 9% (134/1481)
remote: Compressing objects: 10% (149/1481)
remote: Compressing objects: 11% (163/1481)
remote: Compressing objects: 12% (178/1481)
remote: Compressing objects: 13% (193/1481)
remote: Compressing objects: 14% (208/1481)
remote: Compressing objects: 15% (223/1481)
remote: Compressing objects: 16% (237/1481)
remote: Compressing objects: 17% (252/1481)
remote: Compressing objects: 18% (267/1481)
remote: Compressing objects: 19% (282/1481)
remote: Compressing objects: 20% (297/1481)
remote: Compressing objects: 21% (312/1481)
remote: Compressing objects: 22% (326/1481)
remote: Compressing objects: 23% (341/1481)
remote: Compressing objects: 24% (356/1481)
remote: Compressing objects: 25% (371/1481)
remote: Compressing objects: 26% (386/1481)
remote: Compressing objects: 27% (400/1481)
remote: Compressing objects: 28% (415/1481)
remote: Compressing objects: 29% (430/1481)
remote: Compressing objects: 30% (445/1481)
remote: Compressing objects: 31% (460/1481)
remote: Compressing objects: 32% (474/1481)
remote: Compressing objects: 32% (482/1481)
remote: Compressing objects: 33% (489/1481)
remote: Compressing objects: 34% (504/1481)
remote: Compressing objects: 35% (519/1481)
remote: Compressing objects: 36% (534/1481)
remote: Compressing objects: 37% (548/1481)
remote: Compressing objects: 38% (563/1481)
remote: Compressing objects: 39% (578/1481)
remote: Compressing objects: 40% (593/1481)
remote: Compressing objects: 41% (608/1481)
remote: Compressing objects: 42% (623/1481)
remote: Compressing objects: 43% (637/1481)
remote: Compressing objects: 44% (652/1481)
remote: Compressing objects: 45% (667/1481)
remote: Compressing objects: 46% (682/1481)
remote: Compressing objects: 47% (697/1481)
remote: Compressing objects: 48% (711/1481)
remote: Compressing objects: 49% (726/1481)
remote: Compressing objects: 50% (741/1481)
remote: Compressing objects: 51% (756/1481)
remote: Compressing objects: 52% (771/1481)
remote: Compressing objects: 53% (785/1481)
remote: Compressing objects: 54% (800/1481)
remote: Compressing objects: 55% (815/1481)
remote: Compressing objects: 56% (830/1481)
remote: Compressing objects: 57% (845/1481)
remote: Compressing objects: 58% (859/1481)
remote: Compressing objects: 59% (874/1481)
remote: Compressing objects: 60% (889/1481)
remote: Compressing objects: 61% (904/1481)
remote: Compressing objects: 62% (919/1481)
remote: Compressing objects: 63% (934/1481)
remote: Compressing objects: 64% (948/1481)
remote: Compressing objects: 65% (963/1481)
remote: Compressing objects: 66% (978/1481)
remote: Compressing objects: 67% (993/1481)
remote: Compressing objects: 68% (1008/1481)
remote: Compressing objects: 69% (1022/1481)
remote: Compressing objects: 70% (1037/1481)
remote: Compressing objects: 71% (1052/1481)
remote: Compressing objects: 72% (1067/1481)
remote: Compressing objects: 73% (1082/1481)
remote: Compressing objects: 74% (1096/1481)
remote: Compressing objects: 75% (1111/1481)
remote: Compressing objects: 76% (1126/1481)
remote: Compressing objects: 77% (1141/1481)
remote: Compressing objects: 78% (1156/1481)
remote: Compressing objects: 79% (1170/1481)
remote: Compressing objects: 80% (1185/1481)
remote: Compressing objects: 81% (1200/1481)
remote: Compressing objects: 82% (1215/1481)
remote: Compressing objects: 83% (1230/1481)
remote: Compressing objects: 84% (1245/1481)
remote: Compressing objects: 85% (1259/1481)
remote: Compressing objects: 86% (1274/1481)
remote: Compressing objects: 87% (1289/1481)
remote: Compressing objects: 88% (1304/1481)
remote: Compressing objects: 89% (1319/1481)
remote: Compressing objects: 90% (1333/1481)
remote: Compressing objects: 91% (1348/1481)
remote: Compressing objects: 92% (1363/1481)
remote: Compressing objects: 93% (1378/1481)
remote: Compressing objects: 94% (1393/1481)
remote: Compressing objects: 95% (1407/1481)
remote: Compressing objects: 96% (1422/1481)
remote: Compressing objects: 97% (1437/1481)
remote: Compressing objects: 98% (1452/1481)
remote: Compressing objects: 99% (1467/1481)
remote: Compressing objects: 100% (1481/1481)
remote: Compressing objects: 100% (1481/1481), done.
39.38 s
Receiving objects: 0% (1/162134)
Receiving objects: 1% (1622/162134)
Receiving objects: 2% (3243/162134)
Receiving objects: 3% (4865/162134)
Receiving objects: 4% (6486/162134), 9.88 MiB | 19.51 MiB/s
Receiving objects: 4% (6560/162134), 9.88 MiB | 19.51 MiB/s
Receiving objects: 5% (8107/162134), 23.27 MiB | 15.07 MiB/s
Receiving objects: 5% (9102/162134), 23.27 MiB | 15.07 MiB/s
Receiving objects: 6% (9729/162134), 28.05 MiB | 13.71 MiB/s
Receiving objects: 6% (10273/162134), 38.57 MiB | 12.66 MiB/s
Receiving objects: 7% (11350/162134), 38.57 MiB | 12.66 MiB/s
Receiving objects: 8% (12971/162134), 38.57 MiB | 12.66 MiB/s
Receiving objects: 9% (14593/162134), 38.57 MiB | 12.66 MiB/s
Receiving objects: 10% (16214/162134), 44.43 MiB | 12.52 MiB/s
Receiving objects: 10% (17704/162134), 44.43 MiB | 12.52 MiB/s
Receiving objects: 11% (17835/162134), 44.43 MiB | 12.52 MiB/s
Receiving objects: 12% (19457/162134), 56.96 MiB | 12.52 MiB/s
Receiving objects: 13% (21078/162134), 56.96 MiB | 12.52 MiB/s
Receiving objects: 13% (21500/162134), 56.96 MiB | 12.52 MiB/s
Receiving objects: 14% (22699/162134), 70.81 MiB | 11.96 MiB/s
Receiving objects: 15% (24321/162134), 70.81 MiB | 11.96 MiB/s
Receiving objects: 15% (25861/162134), 70.81 MiB | 11.96 MiB/s
Receiving objects: 16% (25942/162134), 70.81 MiB | 11.96 MiB/s
Receiving objects: 16% (27547/162134), 94.11 MiB | 13.52 MiB/s
Receiving objects: 17% (27563/162134), 94.11 MiB | 13.52 MiB/s
Receiving objects: 18% (29185/162134), 94.11 MiB | 13.52 MiB/s
Receiving objects: 19% (30806/162134), 102.56 MiB | 14.19 MiB/s
Receiving objects: 20% (32427/162134), 102.56 MiB | 14.19 MiB/s
Receiving objects: 20% (32511/162134), 102.56 MiB | 14.19 MiB/s
Receiving objects: 21% (34049/162134), 111.29 MiB | 14.84 MiB/s
Receiving objects: 22% (35670/162134), 120.41 MiB | 15.52 MiB/s
Receiving objects: 22% (37182/162134), 129.71 MiB | 16.15 MiB/s
Receiving objects: 23% (37291/162134), 129.71 MiB | 16.15 MiB/s
Receiving objects: 24% (38913/162134), 135.90 MiB | 16.02 MiB/s
Receiving objects: 24% (39110/162134), 143.11 MiB | 16.01 MiB/s
Receiving objects: 25% (40534/162134), 143.11 MiB | 16.01 MiB/s
Receiving objects: 26% (42155/162134), 143.11 MiB | 16.01 MiB/s
Receiving objects: 27% (43777/162134), 151.38 MiB | 16.15 MiB/s
Receiving objects: 27% (44959/162134), 151.38 MiB | 16.15 MiB/s
Receiving objects: 28% (45398/162134), 151.38 MiB | 16.15 MiB/s
Receiving objects: 29% (47019/162134), 159.74 MiB | 16.30 MiB/s
Receiving objects: 30% (48641/162134), 159.74 MiB | 16.30 MiB/s
Receiving objects: 31% (50262/162134), 159.74 MiB | 16.30 MiB/s
Receiving objects: 32% (51883/162134), 159.74 MiB | 16.30 MiB/s
Receiving objects: 33% (53505/162134), 159.74 MiB | 16.30 MiB/s
Receiving objects: 34% (55126/162134), 159.74 MiB | 16.30 MiB/s
Receiving objects: 35% (56747/162134), 168.69 MiB | 16.49 MiB/s
Receiving objects: 36% (58369/162134), 168.69 MiB | 16.49 MiB/s
Receiving objects: 37% (59990/162134), 168.69 MiB | 16.49 MiB/s
Receiving objects: 37% (60589/162134), 168.69 MiB | 16.49 MiB/s
Receiving objects: 38% (61611/162134), 177.52 MiB | 16.58 MiB/s
Receiving objects: 39% (63233/162134), 177.52 MiB | 16.58 MiB/s
Receiving objects: 40% (64854/162134), 177.52 MiB | 16.58 MiB/s
Receiving objects: 41% (66475/162134), 186.64 MiB | 16.67 MiB/s
Receiving objects: 42% (68097/162134), 186.64 MiB | 16.67 MiB/s
Receiving objects: 43% (69718/162134), 186.64 MiB | 16.67 MiB/s
Receiving objects: 43% (71041/162134), 186.64 MiB | 16.67 MiB/s
Receiving objects: 44% (71339/162134), 195.96 MiB | 16.71 MiB/s
Receiving objects: 45% (72961/162134), 195.96 MiB | 16.71 MiB/s
Receiving objects: 46% (74582/162134), 195.96 MiB | 16.71 MiB/s
Receiving objects: 47% (76203/162134), 204.04 MiB | 16.44 MiB/s
Receiving objects: 48% (77825/162134), 204.04 MiB | 16.44 MiB/s
Receiving objects: 48% (77846/162134), 210.72 MiB | 16.54 MiB/s
Receiving objects: 48% (77862/162134), 225.11 MiB | 16.36 MiB/s
Receiving objects: 48% (78083/162134), 239.54 MiB | 15.71 MiB/s
Receiving objects: 48% (78211/162134), 253.39 MiB | 14.81 MiB/s
Receiving objects: 48% (78213/162134), 267.30 MiB | 14.04 MiB/s
Receiving objects: 48% (79176/162134), 272.82 MiB | 13.79 MiB/s
Receiving objects: 49% (79446/162134), 272.82 MiB | 13.79 MiB/s
Receiving objects: 50% (81067/162134), 276.77 MiB | 13.10 MiB/s
Receiving objects: 50% (81297/162134), 281.05 MiB | 12.42 MiB/s
Receiving objects: 50% (82656/162134), 290.79 MiB | 11.38 MiB/s
Receiving objects: 51% (82689/162134), 290.79 MiB | 11.38 MiB/s
Receiving objects: 51% (83693/162134), 306.57 MiB | 10.29 MiB/s
Receiving objects: 51% (83694/162134), 311.11 MiB | 9.71 MiB/s
Receiving objects: 52% (84310/162134), 315.83 MiB | 9.53 MiB/s
Receiving objects: 53% (85932/162134), 315.83 MiB | 9.53 MiB/s
Receiving objects: 54% (87553/162134), 315.83 MiB | 9.53 MiB/s
Receiving objects: 54% (88282/162134), 326.25 MiB | 10.01 MiB/s
Receiving objects: 55% (89174/162134), 326.25 MiB | 10.01 MiB/s
Receiving objects: 56% (90796/162134), 326.25 MiB | 10.01 MiB/s
Receiving objects: 57% (92417/162134), 326.25 MiB | 10.01 MiB/s
Receiving objects: 58% (94038/162134), 326.25 MiB | 10.01 MiB/s
Receiving objects: 59% (95660/162134), 326.25 MiB | 10.01 MiB/s
Receiving objects: 60% (97281/162134), 331.87 MiB | 10.23 MiB/s
Receiving objects: 61% (98902/162134), 331.87 MiB | 10.23 MiB/s
Receiving objects: 62% (100524/162134), 331.87 MiB | 10.23 MiB/s
Receiving objects: 63% (102145/162134), 331.87 MiB | 10.23 MiB/s
Receiving objects: 64% (103766/162134), 331.87 MiB | 10.23 MiB/s
Receiving objects: 65% (105388/162134), 331.87 MiB | 10.23 MiB/s
Receiving objects: 66% (107009/162134), 331.87 MiB | 10.23 MiB/s
Receiving objects: 66% (107645/162134), 331.87 MiB | 10.23 MiB/s
Receiving objects: 67% (108630/162134), 331.87 MiB | 10.23 MiB/s
Receiving objects: 68% (110252/162134), 331.87 MiB | 10.23 MiB/s
Receiving objects: 69% (111873/162134), 337.55 MiB | 10.35 MiB/s
Receiving objects: 70% (113494/162134), 337.55 MiB | 10.35 MiB/s
Receiving objects: 71% (115116/162134), 337.55 MiB | 10.35 MiB/s
Receiving objects: 72% (116737/162134), 337.55 MiB | 10.35 MiB/s
Receiving objects: 73% (118358/162134), 337.55 MiB | 10.35 MiB/s
Receiving objects: 74% (119980/162134), 337.55 MiB | 10.35 MiB/s
Receiving objects: 75% (121601/162134), 337.55 MiB | 10.35 MiB/s
Receiving objects: 75% (122910/162134), 343.79 MiB | 10.57 MiB/s
Receiving objects: 76% (123222/162134), 350.25 MiB | 10.73 MiB/s
Receiving objects: 76% (123860/162134), 357.14 MiB | 11.21 MiB/s
Receiving objects: 77% (124844/162134), 364.26 MiB | 11.78 MiB/s
Receiving objects: 78% (126465/162134), 371.73 MiB | 12.39 MiB/s
Receiving objects: 79% (128086/162134), 371.73 MiB | 12.39 MiB/s
Receiving objects: 80% (129708/162134), 371.73 MiB | 12.39 MiB/s
Receiving objects: 81% (131329/162134), 371.73 MiB | 12.39 MiB/s
Receiving objects: 82% (132950/162134), 371.73 MiB | 12.39 MiB/s
Receiving objects: 82% (133387/162134), 371.73 MiB | 12.39 MiB/s
Receiving objects: 82% (133436/162134), 395.89 MiB | 14.18 MiB/s
Receiving objects: 83% (134572/162134), 395.89 MiB | 14.18 MiB/s
Receiving objects: 84% (136193/162134), 395.89 MiB | 14.18 MiB/s
Receiving objects: 85% (137814/162134), 404.49 MiB | 14.83 MiB/s
Receiving objects: 85% (138570/162134), 404.49 MiB | 14.83 MiB/s
Receiving objects: 86% (139436/162134), 412.08 MiB | 15.13 MiB/s
Receiving objects: 87% (141057/162134), 419.00 MiB | 15.24 MiB/s
Receiving objects: 87% (141335/162134), 419.00 MiB | 15.24 MiB/s
Receiving objects: 88% (142678/162134), 424.34 MiB | 14.90 MiB/s
Receiving objects: 89% (144300/162134), 429.86 MiB | 14.54 MiB/s
Receiving objects: 89% (145252/162134), 429.86 MiB | 14.54 MiB/s
Receiving objects: 90% (145921/162134), 442.07 MiB | 13.89 MiB/s
Receiving objects: 90% (146827/162134), 448.75 MiB | 13.58 MiB/s
Receiving objects: 91% (147542/162134), 448.75 MiB | 13.58 MiB/s
Receiving objects: 92% (149164/162134), 448.75 MiB | 13.58 MiB/s
Receiving objects: 93% (150785/162134), 455.64 MiB | 13.26 MiB/s
Receiving objects: 93% (150932/162134), 455.64 MiB | 13.26 MiB/s
Receiving objects: 94% (152406/162134), 463.02 MiB | 12.99 MiB/s
Receiving objects: 94% (152861/162134), 470.52 MiB | 12.97 MiB/s
Receiving objects: 95% (154028/162134), 478.58 MiB | 13.22 MiB/s
Receiving objects: 96% (155649/162134), 478.58 MiB | 13.22 MiB/s
Receiving objects: 97% (157270/162134), 486.79 MiB | 13.86 MiB/s
Receiving objects: 97% (157586/162134), 486.79 MiB | 13.86 MiB/s
Receiving objects: 98% (158892/162134), 486.79 MiB | 13.86 MiB/s
Receiving objects: 99% (160513/162134), 495.37 MiB | 14.54 MiB/s
remote: Total 162134 (delta 2584), reused 2717 (delta 2211), pack-reused 158424 (from 3)
39.38 s
Receiving objects: 100% (162134/162134), 495.37 MiB | 14.54 MiB/s
Receiving objects: 100% (162134/162134), 500.56 MiB | 13.72 MiB/s, done.
42.68 s
Resolving deltas: 0% (0/105592)
Resolving deltas: 1% (1056/105592)
Resolving deltas: 2% (2112/105592)
Resolving deltas: 3% (3169/105592)
Resolving deltas: 4% (4224/105592)
Resolving deltas: 5% (5280/105592)
Resolving deltas: 6% (6338/105592)
Resolving deltas: 7% (7393/105592)
Resolving deltas: 8% (8448/105592)
Resolving deltas: 9% (9505/105592)
Resolving deltas: 10% (10560/105592)
Resolving deltas: 11% (11616/105592)
Resolving deltas: 12% (12672/105592)
Resolving deltas: 13% (13727/105592)
Resolving deltas: 14% (14783/105592)
Resolving deltas: 15% (15841/105592)
Resolving deltas: 16% (16895/105592)
Resolving deltas: 17% (17951/105592)
Resolving deltas: 18% (19007/105592)
Resolving deltas: 19% (20063/105592)
Resolving deltas: 20% (21119/105592)
Resolving deltas: 21% (22175/105592)
Resolving deltas: 22% (23231/105592)
Resolving deltas: 23% (24287/105592)
Resolving deltas: 24% (25343/105592)
Resolving deltas: 25% (26398/105592)
Resolving deltas: 26% (27454/105592)
Resolving deltas: 27% (28510/105592)
Resolving deltas: 28% (29566/105592)
Resolving deltas: 29% (30622/105592)
Resolving deltas: 30% (31678/105592)
Resolving deltas: 31% (32737/105592)
Resolving deltas: 32% (33791/105592)
Resolving deltas: 33% (34846/105592)
Resolving deltas: 34% (35902/105592)
Resolving deltas: 34% (36154/105592)
Resolving deltas: 35% (36958/105592)
Resolving deltas: 36% (38014/105592)
Resolving deltas: 37% (39070/105592)
Resolving deltas: 38% (40125/105592)
Resolving deltas: 39% (41181/105592)
Resolving deltas: 40% (42237/105592)
Resolving deltas: 41% (43293/105592)
Resolving deltas: 42% (44350/105592)
Resolving deltas: 43% (45406/105592)
Resolving deltas: 44% (46461/105592)
Resolving deltas: 45% (47520/105592)
Resolving deltas: 46% (48574/105592)
Resolving deltas: 47% (49630/105592)
Resolving deltas: 48% (50685/105592)
Resolving deltas: 49% (51741/105592)
Resolving deltas: 49% (52668/105592)
Resolving deltas: 50% (52796/105592)
Resolving deltas: 51% (53852/105592)
Resolving deltas: 52% (54908/105592)
Resolving deltas: 53% (55964/105592)
Resolving deltas: 54% (57020/105592)
Resolving deltas: 55% (58078/105592)
Resolving deltas: 56% (59132/105592)
Resolving deltas: 57% (60188/105592)
Resolving deltas: 58% (61244/105592)
Resolving deltas: 59% (62300/105592)
Resolving deltas: 60% (63356/105592)
Resolving deltas: 61% (64412/105592)
Resolving deltas: 62% (65468/105592)
Resolving deltas: 63% (66523/105592)
Resolving deltas: 64% (67579/105592)
Resolving deltas: 65% (68635/105592)
Resolving deltas: 66% (69691/105592)
Resolving deltas: 67% (70747/105592)
Resolving deltas: 68% (71803/105592)
Resolving deltas: 69% (72859/105592)
Resolving deltas: 70% (73915/105592)
Resolving deltas: 71% (74971/105592)
Resolving deltas: 72% (76027/105592)
Resolving deltas: 73% (77086/105592)
Resolving deltas: 74% (78141/105592)
Resolving deltas: 75% (79194/105592)
Resolving deltas: 76% (80250/105592)
Resolving deltas: 77% (81307/105592)
Resolving deltas: 78% (82362/105592)
Resolving deltas: 79% (83418/105592)
Resolving deltas: 80% (84474/105592)
Resolving deltas: 81% (85531/105592)
Resolving deltas: 82% (86586/105592)
Resolving deltas: 83% (87643/105592)
Resolving deltas: 84% (88698/105592)
Resolving deltas: 85% (89754/105592)
Resolving deltas: 86% (90810/105592)
Resolving deltas: 87% (91866/105592)
Resolving deltas: 88% (92921/105592)
Resolving deltas: 89% (93977/105592)
Resolving deltas: 90% (95033/105592)
Resolving deltas: 91% (96089/105592)
Resolving deltas: 92% (97145/105592)
Resolving deltas: 93% (98201/105592)
Resolving deltas: 94% (99257/105592)
Resolving deltas: 94% (99698/105592)
Resolving deltas: 95% (100313/105592)
Resolving deltas: 96% (101369/105592)
Resolving deltas: 97% (102425/105592)
Resolving deltas: 98% (103481/105592)
Resolving deltas: 99% (104537/105592)
Resolving deltas: 100% (105592/105592)
Resolving deltas: 100% (105592/105592), done.
43.54 s
Fetching commit 94a0ce8ee1cfeb9aadefd4d3ecc047ad85353172 for ufo-epsilon-normalization ...
43.54 s
$ /nix/store/b1wn5clix1mz4vpfih7x9cnj9qfh7c6h-git-2.54.0/bin/git fetch origin 94a0ce8ee1cfeb9aadefd4d3ecc047ad85353172
44.11 s
From https://github.com/alphal00p/gammaloop
44.11 s
* branch 94a0ce8ee1cfeb9aadefd4d3ecc047ad85353172 -> FETCH_HEAD
44.14 s
$ /nix/store/bhv6xyvqw6gjs3j488gi1z6wdv18bdpa-coreutils-9.11/bin/timeout --kill-after=15s 7200s /nix/store/b1wn5clix1mz4vpfih7x9cnj9qfh7c6h-git-2.54.0/bin/git -c advice.detachedHead=false checkout 94a0ce8ee1cfeb9aadefd4d3ecc047ad85353172
44.65 s
HEAD is now at 94a0ce8ee nix-ci: enable NixCI for final review
44.66 s
$ /nix/store/bhv6xyvqw6gjs3j488gi1z6wdv18bdpa-coreutils-9.11/bin/timeout --kill-after=15s 7200s /nix/store/bxgja2ppiqi6w2bgn0r07d7mgnl1k6k2-nix-2.34.8/bin/nix --extra-experimental-features nix-command --extra-experimental-features flakes --log-format internal-json run .#packages.x86_64-linux.nix-ci-check-gammaloop-nextest-clinnet --print-build-logs
44.93 s
warning: ignoring untrusted flake configuration setting 'extra-substituters'.
44.93 s
Pass '--accept-flake-config' to trust it
44.93 s
warning: ignoring untrusted flake configuration setting 'extra-trusted-public-keys'.
44.93 s
Pass '--accept-flake-config' to trust it
44.93 s
error (ignored): SQLite database '/var/cache/nix-ci-worker/eval-cache-v6/5d8525160391d531b782f07d5f7dede3414c2af6b5261d670afa476e612e0ea8.sqlite ' is busy
53.05 s
53.35 s
Downloading cached busybox from https://cache.nix-ci.com
53.35 s
Downloading cached boehm-gc from https://cache.nix-ci.com
53.35 s
Downloading cached aws-c-common from https://cache.nix-ci.com
53.35 s
Downloading cached brotli-1.2.0-lib from https://cache.nix-ci.com
53.35 s
Downloading cached editline-1.17.1-unstable-2025-05 from https://cache.nix-ci.com
53.35 s
Downloading cached libcpuid from https://cache.nix-ci.com
53.35 s
Downloading cached libseccomp-2.6.1-lib from https://cache.nix-ci.com
53.35 s
Downloading cached libsodium-1.0.22-unstable-2026-08 from https://cache.nix-ci.com
53.35 s
Downloading cached lowdown-3.0.1-lib from https://cache.nix-ci.com
53.35 s
Downloading cached publicsuffix-list-0-unstable-2026-09 from https://cache.nix-ci.com
53.35 s
Downloading cached icu4c from https://cache.nix-ci.com
53.35 s
Downloading cached libssh2 from https://cache.nix-ci.com
53.35 s
Downloading cached libxml2 from https://cache.nix-ci.com
53.35 s
Downloading cached llhttp from https://cache.nix-ci.com
53.35 s
Downloading cached nghttp2-1.70.0-lib from https://cache.nix-ci.com
53.35 s
Downloading cached nghttp3 from https://cache.nix-ci.com
53.46 s
Downloaded cached editline-1.17.1-unstable-2025-05 (58 KiB) in 107ms
53.46 s
Progress: 0 of 1 built, 1 of 50 downloaded from cache (15 downloading)
53.46 s
Downloading cached hwloc-2.14.0-lib from https://cache.nix-ci.com
53.46 s
Downloaded cached hwloc-2.14.0-lib in 0ms
53.46 s
Progress: 0 of 1 built, 2 of 50 downloaded from cache (15 downloading)
53.46 s
Downloading cached keyutils-1.6.3-lib from https://cache.nix-ci.com
53.46 s
Downloaded cached keyutils-1.6.3-lib in 1ms
53.46 s
Progress: 0 of 1 built, 3 of 50 downloaded from cache (15 downloading)
53.46 s
Downloading cached ngtcp2 from https://cache.nix-ci.com
53.46 s
Downloaded cached ngtcp2 in 0ms
53.46 s
Progress: 0 of 1 built, 4 of 50 downloaded from cache (15 downloading)
53.46 s
Downloading cached krb5-1.22.2-lib from https://cache.nix-ci.com
53.50 s
Downloaded cached llhttp (89 KiB) in 152ms
53.50 s
Progress: 0 of 1 built, 5 of 50 downloaded from cache (15 downloading)
53.50 s
Downloading cached onetbb from https://cache.nix-ci.com
53.50 s
Downloaded cached lowdown-3.0.1-lib (341 KiB) in 154ms
53.51 s
Progress: 0 of 1 built, 6 of 50 downloaded from cache (15 downloading)
53.51 s
Downloading cached s2n-tls from https://cache.nix-ci.com
53.51 s
Downloaded cached s2n-tls in 0ms
53.51 s
Downloaded cached libseccomp-2.6.1-lib (189 KiB) in 156ms
53.51 s
Progress: 0 of 1 built, 7 of 50 downloaded from cache (15 downloading)
53.51 s
Progress: 0 of 1 built, 8 of 50 downloaded from cache (14 downloading)
53.52 s
Downloaded cached nghttp3 (228 KiB) in 165ms
53.52 s
Downloaded cached libcpuid (326 KiB) in 165ms
53.52 s
Progress: 0 of 1 built, 9 of 50 downloaded from cache (13 downloading)
53.52 s
Progress: 0 of 1 built, 10 of 50 downloaded from cache (12 downloading)
53.52 s
Downloaded cached nghttp2-1.70.0-lib (225 KiB) in 166ms
53.52 s
Progress: 0 of 1 built, 11 of 50 downloaded from cache (11 downloading)
53.52 s
Downloaded cached publicsuffix-list-0-unstable-2026-09 (330 KiB) in 167ms
53.52 s
Progress: 0 of 1 built, 12 of 50 downloaded from cache (10 downloading)
53.52 s
Downloading cached libpsl from https://cache.nix-ci.com
53.52 s
Downloaded cached libpsl in 0ms
53.52 s
Progress: 0 of 1 built, 13 of 50 downloaded from cache (10 downloading)
53.52 s
Downloaded cached boehm-gc (312 KiB) in 172ms
53.52 s
Progress: 0 of 1 built, 14 of 50 downloaded from cache (9 downloading)
53.52 s
Downloaded cached libssh2 (330 KiB) in 168ms
53.52 s
Progress: 0 of 1 built, 15 of 50 downloaded from cache (8 downloading)
53.52 s
Downloading cached libgit2-1.9.7-lib from https://cache.nix-ci.com
53.52 s
Downloaded cached libgit2-1.9.7-lib in 0ms
53.52 s
Progress: 0 of 1 built, 16 of 50 downloaded from cache (8 downloading)
53.52 s
Downloaded cached busybox (230 KiB) in 174ms
53.52 s
Progress: 0 of 1 built, 17 of 50 downloaded from cache (7 downloading)
53.54 s
Downloaded cached aws-c-common (1.1 MiB) in 188ms
53.54 s
Progress: 0 of 1 built, 18 of 50 downloaded from cache (6 downloading)
53.54 s
Downloading cached aws-c-cal from https://cache.nix-ci.com
53.54 s
Downloading cached aws-c-compression from https://cache.nix-ci.com
53.54 s
Downloaded cached aws-c-cal in 0ms
53.54 s
Downloading cached aws-c-sdkutils from https://cache.nix-ci.com
53.54 s
Downloading cached aws-checksums from https://cache.nix-ci.com
53.54 s
Downloaded cached aws-c-compression in 0ms
53.54 s
Progress: 0 of 1 built, 19 of 50 downloaded from cache (9 downloading)
53.54 s
Downloaded cached aws-c-sdkutils in 0ms
53.54 s
Downloaded cached aws-checksums in 0ms
53.54 s
Downloading cached aws-c-io from https://cache.nix-ci.com
53.54 s
Progress: 0 of 1 built, 20 of 50 downloaded from cache (9 downloading)
53.54 s
Progress: 0 of 1 built, 21 of 50 downloaded from cache (8 downloading)
53.54 s
Progress: 0 of 1 built, 22 of 50 downloaded from cache (7 downloading)
53.54 s
Downloaded cached libsodium-1.0.22-unstable-2026-08 (669 KiB) in 190ms
53.54 s
Progress: 0 of 1 built, 23 of 50 downloaded from cache (6 downloading)
53.54 s
Downloaded cached brotli-1.2.0-lib (961 KiB) in 194ms
53.54 s
Progress: 0 of 1 built, 24 of 50 downloaded from cache (5 downloading)
53.55 s
Downloaded cached libxml2 (1.4 MiB) in 201ms
53.55 s
Progress: 0 of 1 built, 25 of 50 downloaded from cache (4 downloading)
53.55 s
Downloading cached libarchive-3.8.9-lib from https://cache.nix-ci.com
53.55 s
Downloaded cached libarchive-3.8.9-lib in 0ms
53.55 s
Progress: 0 of 1 built, 26 of 50 downloaded from cache (4 downloading)
53.59 s
Downloaded cached onetbb (626 KiB) in 84ms
53.59 s
Progress: 0 of 1 built, 27 of 50 downloaded from cache (3 downloading)
53.59 s
Downloading cached libblake3 from https://cache.nix-ci.com
53.62 s
Downloaded cached krb5-1.22.2-lib (2.7 MiB) in 164ms
53.62 s
Progress: 0 of 1 built, 28 of 50 downloaded from cache (3 downloading)
53.62 s
Downloading cached curl from https://cache.nix-ci.com
53.62 s
Downloaded cached curl in 0ms
53.62 s
Progress: 0 of 1 built, 29 of 50 downloaded from cache (3 downloading)
53.63 s
Downloaded cached aws-c-io (648 KiB) in 87ms
53.63 s
Progress: 0 of 1 built, 30 of 50 downloaded from cache (2 downloading)
53.63 s
Downloading cached aws-c-event-stream from https://cache.nix-ci.com
53.63 s
Downloaded cached aws-c-event-stream in 0ms
53.63 s
Progress: 0 of 1 built, 31 of 50 downloaded from cache (3 downloading)
53.63 s
Downloading cached aws-c-http from https://cache.nix-ci.com
53.63 s
Downloaded cached aws-c-http in 0ms
53.63 s
Progress: 0 of 1 built, 32 of 50 downloaded from cache (2 downloading)
53.63 s
Downloading cached aws-c-auth from https://cache.nix-ci.com
53.63 s
Downloading cached aws-c-mqtt from https://cache.nix-ci.com
53.64 s
Downloaded cached libblake3 (117 KiB) in 46ms
53.64 s
Progress: 0 of 1 built, 33 of 50 downloaded from cache (3 downloading)
53.75 s
Downloaded cached aws-c-mqtt (557 KiB) in 125ms
53.75 s
Progress: 0 of 1 built, 34 of 50 downloaded from cache (2 downloading)
53.75 s
Downloaded cached aws-c-auth (387 KiB) in 126ms
53.75 s
Progress: 0 of 1 built, 35 of 50 downloaded from cache (1 downloading)
53.75 s
Downloading cached aws-c-s3 from https://cache.nix-ci.com
53.75 s
Downloaded cached aws-c-s3 in 0ms
53.75 s
Progress: 0 of 1 built, 36 of 50 downloaded from cache (1 downloading)
53.75 s
Downloading cached aws-crt-cpp from https://cache.nix-ci.com
53.85 s
Downloaded cached aws-crt-cpp (979 KiB) in 93ms
53.85 s
Progress: 0 of 1 built, 37 of 50 downloaded from cache (1 downloading)
53.92 s
Downloaded cached icu4c (39.5 MiB) in 572ms
53.92 s
Progress: 0 of 1 built, 38 of 50 downloaded from cache
53.92 s
Downloading cached boost from https://cache.nix-ci.com
53.92 s
Downloaded cached boost in 0ms
53.92 s
Progress: 0 of 1 built, 39 of 50 downloaded from cache
53.92 s
Downloading cached nix-util from https://cache.nix-ci.com
53.92 s
Downloaded cached nix-util in 0ms
53.92 s
Progress: 0 of 1 built, 40 of 50 downloaded from cache
53.92 s
Downloading cached nix-nswrapper from https://cache.nix-ci.com
53.92 s
Downloaded cached nix-nswrapper in 0ms
53.92 s
Progress: 0 of 1 built, 41 of 50 downloaded from cache (1 downloading)
53.92 s
Downloading cached nix-store from https://cache.nix-ci.com
53.92 s
Downloaded cached nix-store in 0ms
53.92 s
Progress: 0 of 1 built, 42 of 50 downloaded from cache
53.92 s
Downloading cached nix-fetchers from https://cache.nix-ci.com
53.93 s
Downloaded cached nix-fetchers in 0ms
53.93 s
Downloading cached nix-main from https://cache.nix-ci.com
53.93 s
Downloaded cached nix-main in 0ms
53.93 s
Progress: 0 of 1 built, 43 of 50 downloaded from cache (1 downloading)
53.93 s
Progress: 0 of 1 built, 44 of 50 downloaded from cache (1 downloading)
53.93 s
Downloading cached nix-expr from https://cache.nix-ci.com
54.00 s
Downloaded cached nix-expr (3.3 MiB) in 76ms
54.00 s
Progress: 0 of 1 built, 45 of 50 downloaded from cache
54.00 s
Downloading cached nix-flake from https://cache.nix-ci.com
54.00 s
Downloaded cached nix-flake in 0ms
54.00 s
Progress: 0 of 1 built, 46 of 50 downloaded from cache
54.00 s
Downloading cached nix-cmd from https://cache.nix-ci.com
54.08 s
Downloaded cached nix-cmd (1 MiB) in 75ms
54.08 s
Progress: 0 of 1 built, 47 of 50 downloaded from cache
54.08 s
Downloading cached nix from https://cache.nix-ci.com
54.15 s
Downloaded cached nix (3.9 MiB) in 67ms
54.15 s
Progress: 0 of 1 built, 48 of 50 downloaded from cache
54.15 s
Downloading cached nix from https://cache.nix-ci.com
54.15 s
Downloaded cached nix in 0ms
54.15 s
Progress: 0 of 1 built, 49 of 50 downloaded from cache
54.15 s
Downloading cached nix-ci-check-gammaloop-nextest-clinnet from https://cache.nix-ci.com
54.18 s
Downloaded cached nix-ci-check-gammaloop-nextest-clinnet (1128 B) in 30ms
54.18 s
Progress: 0 of 1 built, 50 of 50 downloaded from cache
54.30 s
evaluating derivation 'gdo you want to allow configuration setting 'extra-substituters' to be set to 'https://cache.nix-ci.com ' (y/N)? do you want to permanently mark this value as untrusted (y/N)? warning: ignoring untrusted flake configuration setting 'extra-substituters'.
54.30 s
Pass '--accept-flake-config' to trust it
54.30 s
do you want to allow configuration setting 'extra-trusted-public-keys' to be set to 'nix-ci:g3xV5BDTLtIBZr/A00IU1x0EtKKlb7YLgBN2SgYgM6A= ' (y/N)? do you want to permanently mark this value as untrusted (y/N)? warning: ignoring untrusted flake configuration setting 'extra-trusted-public-keys'.
54.30 s
Pass '--accept-flake-config' to trust it
68.35 s
copying '/nix/store/chkj
evaluating derivation 'g
copying '/nix/store/chkj
evaluating derivation 'g
copying '/nix/store/chkj
evaluating derivation 'g
copying '/nix/store/chkj
evaluating derivation 'g
copying '/nix/store/chkj
evaluating derivation 'g
copying '/nix/store/chkj
evaluating derivation 'g
copying '/nix/store/chkj
querying source on https
[1 /0 /1 copied (0.0 KiB /2
[1 /0 /1 copied (2.8 /201.4
[1 /0 /1 copied (6.1 /201.4
[1 /0 /1 copied (8.5 /201.4
[1 /0 /1 copied (12.6 /201.
[1 /0 /1 copied (16.4 /201.
[1 /0 /1 copied (19.3 /201.
[1 /0 /1 copied (21.8 /201.
[1 /0 /1 copied (23.8 /201.
[1 /0 /1 copied (25.6 /201.
[1 /0 /1 copied (33.2 /201.
[1 /0 /1 copied (35.3 /201.
[1 /0 /1 copied (37.3 /201.
[1 /0 /1 copied (38.8 /201.
[1 /0 /1 copied (40.5 /201.
[1 /0 /1 copied (42.4 /201.
[1 /0 /1 copied (44.0 /201.
[1 /0 /1 copied (46.9 /201.
[1 /0 /1 copied (48.1 /201.
[1 /0 /1 copied (50.3 /201.
[1 /0 /1 copied (52.0 /201.
[1 /0 /1 copied (54.0 /201.
[1 /0 /1 copied (56.1 /201.
[1 /0 /1 copied (58.0 /201.
[1 /0 /1 copied (60.1 /201.
[1 /0 /1 copied (61.8 /201.
[1 /0 /1 copied (63.3 /201.
[1 /0 /1 copied (64.7 /201.
[1 /0 /1 copied (66.5 /201.
[1 /0 /1 copied (68.5 /201.
[1 /0 /1 copied (70.7 /201.
[1 /0 /1 copied (72.5 /201.
[1 /0 /1 copied (73.9 /201.
[1 /0 /1 copied (75.0 /201.
[1 /0 /1 copied (76.4 /201.
[1 /0 /1 copied (78.1 /201.
[1 /0 /1 copied (80.2 /201.
[1 /0 /1 copied (82.6 /201.
[1 /0 /1 copied (85.2 /201.
[1 /0 /1 copied (86.9 /201.
[1 /0 /1 copied (88.7 /201.
[1 /0 /1 copied (90.3 /201.
[1 /0 /1 copied (92.2 /201.
[1 /0 /1 copied (94.5 /201.
[1 /0 /1 copied (96.7 /201.
[1 /0 /1 copied (98.1 /201.
[1 /0 /1 copied (100.6 /201
[1 /0 /1 copied (102.5 /201
[1 /0 /1 copied (104.1 /201
[1 /0 /1 copied (106.0 /201
[1 /0 /1 copied (107.1 /201
[1 /0 /1 copied (108.1 /201
[1 /0 /1 copied (110.7 /201
[1 /0 /1 copied (113.0 /201
[1 /0 /1 copied (115.2 /201
[1 /0 /1 copied (116.7 /201
[1 /0 /1 copied (118.2 /201
[1 /0 /1 copied (128.8 /201
[1 /0 /1 copied (131.7 /201
[1 /0 /1 copied (136.8 /201
[1 /0 /1 copied (151.0 /201
[1 /0 /1 copied (153.2 /201
[1 /0 /1 copied (158.6 /201
[1 /0 /1 copied (159.4 /201
[1 /0 /1 copied (160.9 /201
[1 /0 /1 copied (161.9 /201
[1 /0 /1 copied (163.1 /201
[1 /0 /1 copied (164.1 /201
[1 /0 /1 copied (165.0 /201
[1 /0 /1 copied (165.9 /201
[1 /0 /1 copied (167.0 /201
[1 /0 /1 copied (167.9 /201
[1 /0 /1 copied (168.9 /201
[1 /0 /1 copied (170.0 /201
[1 /0 /1 copied (170.9 /201
[1 /0 /1 copied (171.9 /201
[1 /0 /1 copied (172.9 /201
[1 /0 /1 copied (174.0 /201
[1 /0 /1 copied (175.0 /201
[1 /0 /1 copied (176.1 /201
[1 /0 /1 copied (177.1 /201
[1 /0 /1 copied (185.4 /201
[1 /0 /1 copied (187.8 /201
[1 /0 /1 copied (189.4 /201
[1 /0 /1 copied (191.7 /201
[1 /0 /1 copied (194.2 /201
[1 /0 /1 copied (201.4 MiB
[1 copied (201.4 MiB), 4
75.81 s
[0 /6 built, 1 /13 copied
[0 /23 built, 16 /1 /75 cop
[0 /21 built, 16 /3 /75 cop
[0 /18 built, 12 /13 /75 co
[0 /18 built, 12 /14 /75 co
[0 /18 built, 11 /15 /75 co
[0 /17 built, 10 /16 /75 co
[0 /17 built, 9 /17 /75 cop
[0 /16 built, 7 /20 /75 cop
[0 /14 built, 6 /22 /75 cop
[0 /14 built, 5 /24 /75 cop
[0 /13 built, 4 /25 /75 cop
[1 /0 /11 built, 3 /28 /75 cgammaloop-nextest-binaries-clinnet (post)> Uploading to the NixCI cache: /nix/store/r6d9ks0lpr631mrcy43137c895a0w5ns-gammaloop-nextest-binaries-clinnet
76.01 s
gammaloop-nextest-binaries-clinnet (post)> warning: 'warn-short-path-literals' is deprecated, use 'lint-short-path-literals = ignore' instead
76.12 s
gammaloop-nextest-binaries-clinnet (post)> copying 0 paths...
76.50 s
gammaloop-nextest-binaries-clinnet (post)> warning: 'warn-short-path-literals' is deprecated, use 'lint-short-path-literals = ignore' instead
77.54 s
gammaloop-nextest-binaries-clinnet (post)> copying 0 paths...
78.60 s
[1 /10 built, 16 /31 /75 co
[1 /10 built, 16 /34 /75 co
[1 /9 built, 15 /39 /75 cop
[1 /9 built, 13 /41 /75 cop
[1 /9 built, 12 /47 /75 cop
[1 /9 built, 10 /51 /75 cop
[1 /9 built, 8 /58 /75 copi
[1 /8 built, 4 /64 /75 copi
[1 /8 built, 6 /65 /75 copi
[1 /8 built, 5 /67 /75 copi
[1 /7 built, 4 /68 /75 copi
[1 /1 /7 built, 4 /68 /75 cobuilder.pl> Running phase: patchPhase
78.60 s
builder.pl> Running phase: updateAutotoolsGnuConfigScriptsPhase
78.61 s
builder.pl> Running phase: configurePhase
78.62 s
builder.pl> no configure script, doing nothing
78.62 s
builder.pl> Running phase: buildPhase
78.63 s
builder.pl> Running phase: checkPhase
78.64 s
builder.pl> Running phase: installPhase
78.64 s
builder.pl> no Makefile or custom installPhase, doing nothing
78.64 s
[1 /1 /7 built, 4 /69 /75 cobuilder.pl> Running phase: fixupPhase
78.66 s
builder.pl> shrinking RPATHs of ELF executables and libraries in /nix/store/zzmspl8wdn2a3ancrz8dg3kci887nw6d-builder.pl
78.66 s
builder.pl> checking for references to /build/ in /nix/store/zzmspl8wdn2a3ancrz8dg3kci887nw6d-builder.pl...
78.67 s
builder.pl> patching script interpreter paths in /nix/store/zzmspl8wdn2a3ancrz8dg3kci887nw6d-builder.pl
78.70 s
builder.pl (post)> Uploading to the NixCI cache: /nix/store/zzmspl8wdn2a3ancrz8dg3kci887nw6d-builder.pl
78.76 s
builder.pl (post)> warning: 'warn-short-path-literals' is deprecated, use 'lint-short-path-literals = ignore' instead
78.86 s
builder.pl (post)> copying 0 paths...
78.93 s
builder.pl (post)> warning: 'warn-short-path-literals' is deprecated, use 'lint-short-path-literals = ignore' instead
79.22 s
builder.pl (post)> copying 0 paths...
79.89 s
[2 /5 built, 1 /72 /75 copi
[2 /5 built, 1 /73 /75 copi
[2 /5 built, 1 /74 /75 copi
[2 /4 built, 75 copied (8 typst> structuredAttrs is enabled
79.94 s
[1 /2 /4 built, 75 copied typst> created 10 symlinks in user environment
80.05 s
typst (post)> Uploading to the NixCI cache: /nix/store/5f1a3n27fy3y8pf6snxr2sbzwhk9brr2-typst-0.15.1-env
80.10 s
typst (post)> warning: 'warn-short-path-literals' is deprecated, use 'lint-short-path-literals = ignore' instead
80.20 s
typst (post)> copying 0 paths...
80.25 s
typst (post)> warning: 'warn-short-path-literals' is deprecated, use 'lint-short-path-literals = ignore' instead
80.57 s
typst (post)> copying 0 paths...
81.02 s
[3 /5 built, 75 copied (8
[1 /3 /4 built, 75 copied gammaloop-nextest-clinnet> Nextest worker budget: 16
81.04 s
gammaloop-nextest-clinnet> Extracting 4 binaries (including 1 non-test binary), 1 build script output directory, and 1 linked path to /build/source
81.11 s
gammaloop-nextest-clinnet> Extracted 16 files to /build/source in 0.07s
81.12 s
gammaloop-nextest-clinnet> ------------
81.12 s
gammaloop-nextest-clinnet> Nextest run ID 4480fd29-0299-4ae9-92cc-c4383e7e551a with nextest profile: ci_gammaloop
81.12 s
gammaloop-nextest-clinnet> Starting 38 tests across 3 binaries
175.71 s
gammaloop-nextest-clinnet> FAIL [ 94.519s] (32/38) clinnet::public_typst_behavior public_linnest_labels_follow_their_carriers
175.71 s
gammaloop-nextest-clinnet> stdout ---
175.71 s
gammaloop-nextest-clinnet>
175.71 s
gammaloop-nextest-clinnet> running 1 test
175.71 s
gammaloop-nextest-clinnet> test public_linnest_labels_follow_their_carriers has been running for over 60 seconds
175.71 s
gammaloop-nextest-clinnet> test public_linnest_labels_follow_their_carriers ... FAILED
175.71 s
gammaloop-nextest-clinnet>
175.71 s
gammaloop-nextest-clinnet> failures:
175.71 s
gammaloop-nextest-clinnet>
175.71 s
gammaloop-nextest-clinnet> failures:
175.71 s
gammaloop-nextest-clinnet> public_linnest_labels_follow_their_carriers
175.71 s
gammaloop-nextest-clinnet>
175.71 s
gammaloop-nextest-clinnet> test result: FAILED. 0 passed; 1 failed; 0 ignored; 0 measured; 17 filtered out; finished in 94.50s
175.71 s
gammaloop-nextest-clinnet>
175.71 s
gammaloop-nextest-clinnet> stderr ---
175.71 s
gammaloop-nextest-clinnet>
175.71 s
gammaloop-nextest-clinnet> thread 'public_linnest_labels_follow_their_carriers' (299) panicked at crates/clinnet/tests/public_typst_behavior.rs:81:55:
175.71 s
gammaloop-nextest-clinnet> called `Result::unwrap()` on an `Err` value: typst failed while compiling template /build/.tmpfvJk4L/.clinnet/templates/linnest-public-behavior.svg
175.71 s
gammaloop-nextest-clinnet>
175.71 s
gammaloop-nextest-clinnet> Command executed:
175.71 s
gammaloop-nextest-clinnet> "typst" "c" "/build/.tmpfvJk4L/.clinnet/templates/linnest-public-behavior.typ" "/build/.tmpfvJk4L/.clinnet/templates/linnest-public-behavior.svg" "--root" "/build/.tmpfvJk4L/.clinnet/templates"
175.71 s
gammaloop-nextest-clinnet>
175.71 s
gammaloop-nextest-clinnet> Typst stdout:
175.71 s
gammaloop-nextest-clinnet>
175.71 s
gammaloop-nextest-clinnet>
175.71 s
gammaloop-nextest-clinnet> Typst stderr:
175.71 s
gammaloop-nextest-clinnet>
175.71 s
gammaloop-nextest-clinnet>
175.71 s
gammaloop-nextest-clinnet> Location:
175.71 s
gammaloop-nextest-clinnet> crates/clinnet/src/lib.rs:741:13
175.71 s
gammaloop-nextest-clinnet> stack backtrace:
175.71 s
gammaloop-nextest-clinnet> 0: __rustc::rust_begin_unwind
175.71 s
gammaloop-nextest-clinnet> 1: core::panicking::panic_fmt
175.71 s
gammaloop-nextest-clinnet> 2: core::result::unwrap_failed
175.71 s
gammaloop-nextest-clinnet> 3: public_typst_behavior::render
175.71 s
gammaloop-nextest-clinnet> 4: <std::sync::once::Once>::call_once_force::<<std::sync::once_lock::OnceLock<alloc::string::String>>::initialize<<std::sync::once_lock::OnceLock<alloc::string::String>>::get_or_init<public_typst_behavior::linnest_public_svg::{closure#0}>::{closure#0}, !>::{closure#0}>::{closure#0}
175.71 s
gammaloop-nextest-clinnet> 5: <std::sys::sync::once::futex::Once>::call
175.71 s
gammaloop-nextest-clinnet> 6: <std::sync::once_lock::OnceLock<alloc::string::String>>::initialize::<<std::sync::once_lock::OnceLock<alloc::string::String>>::get_or_init<public_typst_behavior::linnest_public_svg::{closure#0}>::{closure#0}, !>
175.71 s
gammaloop-nextest-clinnet> 7: <public_typst_behavior::public_linnest_labels_follow_their_carriers::{closure#0} as core::ops::function::FnOnce<()>>::call_once
175.71 s
gammaloop-nextest-clinnet> note: Some details are omitted, run with `RUST_BACKTRACE=full` for a verbose backtrace.
175.71 s
gammaloop-nextest-clinnet>
180.40 s
gammaloop-nextest-clinnet> FAIL [ 99.217s] (33/38) clinnet::public_typst_behavior public_linnest_overlays_follow_the_unit
180.40 s
gammaloop-nextest-clinnet> stdout ---
180.40 s
gammaloop-nextest-clinnet>
180.40 s
gammaloop-nextest-clinnet> running 1 test
180.40 s
gammaloop-nextest-clinnet> test public_linnest_overlays_follow_the_unit has been running for over 60 seconds
180.40 s
gammaloop-nextest-clinnet> test public_linnest_overlays_follow_the_unit ... FAILED
180.40 s
gammaloop-nextest-clinnet>
180.40 s
gammaloop-nextest-clinnet> failures:
180.40 s
gammaloop-nextest-clinnet>
180.40 s
gammaloop-nextest-clinnet> failures:
180.40 s
gammaloop-nextest-clinnet> public_linnest_overlays_follow_the_unit
180.40 s
gammaloop-nextest-clinnet>
180.40 s
gammaloop-nextest-clinnet> test result: FAILED. 0 passed; 1 failed; 0 ignored; 0 measured; 17 filtered out; finished in 99.20s
180.40 s
gammaloop-nextest-clinnet>
180.40 s
gammaloop-nextest-clinnet> stderr ---
180.40 s
gammaloop-nextest-clinnet>
180.40 s
gammaloop-nextest-clinnet> thread 'public_linnest_overlays_follow_the_unit' (311) panicked at crates/clinnet/tests/public_typst_behavior.rs:81:55:
180.40 s
gammaloop-nextest-clinnet> called `Result::unwrap()` on an `Err` value: typst failed while compiling template /build/.tmpNeMZsp/.clinnet/templates/linnest-public-behavior.svg
180.40 s
gammaloop-nextest-clinnet>
180.40 s
gammaloop-nextest-clinnet> Command executed:
180.40 s
gammaloop-nextest-clinnet> "typst" "c" "/build/.tmpNeMZsp/.clinnet/templates/linnest-public-behavior.typ" "/build/.tmpNeMZsp/.clinnet/templates/linnest-public-behavior.svg" "--root" "/build/.tmpNeMZsp/.clinnet/templates"
180.40 s
gammaloop-nextest-clinnet>
180.40 s
gammaloop-nextest-clinnet> Typst stdout:
180.40 s
gammaloop-nextest-clinnet>
180.40 s
gammaloop-nextest-clinnet>
180.40 s
gammaloop-nextest-clinnet> Typst stderr:
180.40 s
gammaloop-nextest-clinnet>
180.40 s
gammaloop-nextest-clinnet>
180.40 s
gammaloop-nextest-clinnet> Location:
180.40 s
gammaloop-nextest-clinnet> crates/clinnet/src/lib.rs:741:13
180.40 s
gammaloop-nextest-clinnet> stack backtrace:
180.40 s
gammaloop-nextest-clinnet> 0: __rustc::rust_begin_unwind
180.40 s
gammaloop-nextest-clinnet> 1: core::panicking::panic_fmt
180.40 s
gammaloop-nextest-clinnet> 2: core::result::unwrap_failed
180.40 s
gammaloop-nextest-clinnet> 3: public_typst_behavior::render
180.40 s
gammaloop-nextest-clinnet> 4: <std::sync::once::Once>::call_once_force::<<std::sync::once_lock::OnceLock<alloc::string::String>>::initialize<<std::sync::once_lock::OnceLock<alloc::string::String>>::get_or_init<public_typst_behavior::linnest_public_svg::{closure#0}>::{closure#0}, !>::{closure#0}>::{closure#0}
180.40 s
gammaloop-nextest-clinnet> 5: <std::sys::sync::once::futex::Once>::call
180.40 s
gammaloop-nextest-clinnet> 6: <std::sync::once_lock::OnceLock<alloc::string::String>>::initialize::<<std::sync::once_lock::OnceLock<alloc::string::String>>::get_or_init<public_typst_behavior::linnest_public_svg::{closure#0}>::{closure#0}, !>
180.40 s
gammaloop-nextest-clinnet> 7: <public_typst_behavior::public_linnest_overlays_follow_the_unit::{closure#0} as core::ops::function::FnOnce<()>>::call_once
180.40 s
gammaloop-nextest-clinnet> note: Some details are omitted, run with `RUST_BACKTRACE=full` for a verbose backtrace.
180.40 s
gammaloop-nextest-clinnet>
197.43 s
gammaloop-nextest-clinnet> FAIL [ 116.286s] (34/38) clinnet::public_typst_behavior public_linnest_fixture_assertions_hold
197.43 s
gammaloop-nextest-clinnet> stdout ---
197.43 s
gammaloop-nextest-clinnet>
197.43 s
gammaloop-nextest-clinnet> running 1 test
197.43 s
gammaloop-nextest-clinnet> test public_linnest_fixture_assertions_hold has been running for over 60 seconds
197.43 s
gammaloop-nextest-clinnet> test public_linnest_fixture_assertions_hold ... FAILED
197.43 s
gammaloop-nextest-clinnet>
197.43 s
gammaloop-nextest-clinnet> failures:
197.43 s
gammaloop-nextest-clinnet>
197.43 s
gammaloop-nextest-clinnet> failures:
197.43 s
gammaloop-nextest-clinnet> public_linnest_fixture_assertions_hold
197.43 s
gammaloop-nextest-clinnet>
197.43 s
gammaloop-nextest-clinnet> test result: FAILED. 0 passed; 1 failed; 0 ignored; 0 measured; 17 filtered out; finished in 116.28s
197.43 s
gammaloop-nextest-clinnet>
197.43 s
gammaloop-nextest-clinnet> stderr ---
197.43 s
gammaloop-nextest-clinnet>
197.43 s
gammaloop-nextest-clinnet> thread 'public_linnest_fixture_assertions_hold' (276) panicked at crates/clinnet/tests/public_typst_behavior.rs:81:55:
197.43 s
gammaloop-nextest-clinnet> called `Result::unwrap()` on an `Err` value: typst failed while compiling template /build/.tmppXJX7C/.clinnet/templates/linnest-public-behavior.svg
197.43 s
gammaloop-nextest-clinnet>
197.43 s
gammaloop-nextest-clinnet> Command executed:
197.43 s
gammaloop-nextest-clinnet> "typst" "c" "/build/.tmppXJX7C/.clinnet/templates/linnest-public-behavior.typ" "/build/.tmppXJX7C/.clinnet/templates/linnest-public-behavior.svg" "--root" "/build/.tmppXJX7C/.clinnet/templates"
197.43 s
gammaloop-nextest-clinnet>
197.43 s
gammaloop-nextest-clinnet> Typst stdout:
197.43 s
gammaloop-nextest-clinnet>
197.43 s
gammaloop-nextest-clinnet>
197.43 s
gammaloop-nextest-clinnet> Typst stderr:
197.43 s
gammaloop-nextest-clinnet>
197.43 s
gammaloop-nextest-clinnet>
197.43 s
gammaloop-nextest-clinnet> Location:
197.43 s
gammaloop-nextest-clinnet> crates/clinnet/src/lib.rs:741:13
197.43 s
gammaloop-nextest-clinnet> stack backtrace:
197.43 s
gammaloop-nextest-clinnet> 0: __rustc::rust_begin_unwind
197.43 s
gammaloop-nextest-clinnet> 1: core::panicking::panic_fmt
197.43 s
gammaloop-nextest-clinnet> 2: core::result::unwrap_failed
197.43 s
gammaloop-nextest-clinnet> 3: public_typst_behavior::render
197.43 s
gammaloop-nextest-clinnet> 4: <std::sync::once::Once>::call_once_force::<<std::sync::once_lock::OnceLock<alloc::string::String>>::initialize<<std::sync::once_lock::OnceLock<alloc::string::String>>::get_or_init<public_typst_behavior::linnest_public_svg::{closure#0}>::{closure#0}, !>::{closure#0}>::{closure#0}
197.43 s
gammaloop-nextest-clinnet> 5: <std::sys::sync::once::futex::Once>::call
197.43 s
gammaloop-nextest-clinnet> 6: <std::sync::once_lock::OnceLock<alloc::string::String>>::initialize::<<std::sync::once_lock::OnceLock<alloc::string::String>>::get_or_init<public_typst_behavior::linnest_public_svg::{closure#0}>::{closure#0}, !>
197.43 s
gammaloop-nextest-clinnet> 7: <public_typst_behavior::public_linnest_fixture_assertions_hold::{closure#0} as core::ops::function::FnOnce<()>>::call_once
197.43 s
gammaloop-nextest-clinnet> note: Some details are omitted, run with `RUST_BACKTRACE=full` for a verbose backtrace.
197.43 s
gammaloop-nextest-clinnet>
208.30 s
gammaloop-nextest-clinnet> ------------
208.30 s
gammaloop-nextest-clinnet> Summary [ 127.180s] 38 tests run: 35 passed (4 slow ), 3 failed , 0 skipped
208.30 s
gammaloop-nextest-clinnet> FAIL [ 94.519s] (32/38) clinnet::public_typst_behavior public_linnest_labels_follow_their_carriers
208.30 s
gammaloop-nextest-clinnet> stdout ---
208.30 s
gammaloop-nextest-clinnet>
208.30 s
gammaloop-nextest-clinnet> running 1 test
208.30 s
gammaloop-nextest-clinnet> test public_linnest_labels_follow_their_carriers has been running for over 60 seconds
208.30 s
gammaloop-nextest-clinnet> test public_linnest_labels_follow_their_carriers ... FAILED
208.30 s
gammaloop-nextest-clinnet>
208.30 s
gammaloop-nextest-clinnet> failures:
208.30 s
gammaloop-nextest-clinnet>
208.30 s
gammaloop-nextest-clinnet> failures:
208.30 s
gammaloop-nextest-clinnet> public_linnest_labels_follow_their_carriers
208.30 s
gammaloop-nextest-clinnet>
208.30 s
gammaloop-nextest-clinnet> test result: FAILED. 0 passed; 1 failed; 0 ignored; 0 measured; 17 filtered out; finished in 94.50s
208.30 s
gammaloop-nextest-clinnet>
208.30 s
gammaloop-nextest-clinnet> stderr ---
208.30 s
gammaloop-nextest-clinnet>
208.30 s
gammaloop-nextest-clinnet> thread 'public_linnest_labels_follow_their_carriers' (299) panicked at crates/clinnet/tests/public_typst_behavior.rs:81:55:
208.30 s
gammaloop-nextest-clinnet> called `Result::unwrap()` on an `Err` value: typst failed while compiling template /build/.tmpfvJk4L/.clinnet/templates/linnest-public-behavior.svg
208.30 s
gammaloop-nextest-clinnet>
208.30 s
gammaloop-nextest-clinnet> Command executed:
208.30 s
gammaloop-nextest-clinnet> "typst" "c" "/build/.tmpfvJk4L/.clinnet/templates/linnest-public-behavior.typ" "/build/.tmpfvJk4L/.clinnet/templates/linnest-public-behavior.svg" "--root" "/build/.tmpfvJk4L/.clinnet/templates"
208.30 s
gammaloop-nextest-clinnet>
208.30 s
gammaloop-nextest-clinnet> Typst stdout:
208.30 s
gammaloop-nextest-clinnet>
208.30 s
gammaloop-nextest-clinnet>
208.30 s
gammaloop-nextest-clinnet> Typst stderr:
208.30 s
gammaloop-nextest-clinnet>
208.30 s
gammaloop-nextest-clinnet>
208.30 s
gammaloop-nextest-clinnet> Location:
208.30 s
gammaloop-nextest-clinnet> crates/clinnet/src/lib.rs:741:13
208.30 s
gammaloop-nextest-clinnet> stack backtrace:
208.30 s
gammaloop-nextest-clinnet> 0: __rustc::rust_begin_unwind
208.30 s
gammaloop-nextest-clinnet> 1: core::panicking::panic_fmt
208.30 s
gammaloop-nextest-clinnet> 2: core::result::unwrap_failed
208.30 s
gammaloop-nextest-clinnet> 3: public_typst_behavior::render
208.30 s
gammaloop-nextest-clinnet> 4: <std::sync::once::Once>::call_once_force::<<std::sync::once_lock::OnceLock<alloc::string::String>>::initialize<<std::sync::once_lock::OnceLock<alloc::string::String>>::get_or_init<public_typst_behavior::linnest_public_svg::{closure#0}>::{closure#0}, !>::{closure#0}>::{closure#0}
208.30 s
gammaloop-nextest-clinnet> 5: <std::sys::sync::once::futex::Once>::call
208.30 s
gammaloop-nextest-clinnet> 6: <std::sync::once_lock::OnceLock<alloc::string::String>>::initialize::<<std::sync::once_lock::OnceLock<alloc::string::String>>::get_or_init<public_typst_behavior::linnest_public_svg::{closure#0}>::{closure#0}, !>
208.30 s
gammaloop-nextest-clinnet> 7: <public_typst_behavior::public_linnest_labels_follow_their_carriers::{closure#0} as core::ops::function::FnOnce<()>>::call_once
208.30 s
gammaloop-nextest-clinnet> note: Some details are omitted, run with `RUST_BACKTRACE=full` for a verbose backtrace.
208.30 s
gammaloop-nextest-clinnet>
208.30 s
gammaloop-nextest-clinnet> FAIL [ 99.217s] (33/38) clinnet::public_typst_behavior public_linnest_overlays_follow_the_unit
208.30 s
gammaloop-nextest-clinnet> stdout ---
208.30 s
gammaloop-nextest-clinnet>
208.30 s
gammaloop-nextest-clinnet> running 1 test
208.30 s
gammaloop-nextest-clinnet> test public_linnest_overlays_follow_the_unit has been running for over 60 seconds
208.30 s
gammaloop-nextest-clinnet> test public_linnest_overlays_follow_the_unit ... FAILED
208.30 s
gammaloop-nextest-clinnet>
208.30 s
gammaloop-nextest-clinnet> failures:
208.30 s
gammaloop-nextest-clinnet>
208.30 s
gammaloop-nextest-clinnet> failures:
208.30 s
gammaloop-nextest-clinnet> public_linnest_overlays_follow_the_unit
208.30 s
gammaloop-nextest-clinnet>
208.30 s
gammaloop-nextest-clinnet> test result: FAILED. 0 passed; 1 failed; 0 ignored; 0 measured; 17 filtered out; finished in 99.20s
208.30 s
gammaloop-nextest-clinnet>
208.30 s
gammaloop-nextest-clinnet> stderr ---
208.30 s
gammaloop-nextest-clinnet>
208.30 s
gammaloop-nextest-clinnet> thread 'public_linnest_overlays_follow_the_unit' (311) panicked at crates/clinnet/tests/public_typst_behavior.rs:81:55:
208.30 s
gammaloop-nextest-clinnet> called `Result::unwrap()` on an `Err` value: typst failed while compiling template /build/.tmpNeMZsp/.clinnet/templates/linnest-public-behavior.svg
208.30 s
gammaloop-nextest-clinnet>
208.30 s
gammaloop-nextest-clinnet> Command executed:
208.30 s
gammaloop-nextest-clinnet> "typst" "c" "/build/.tmpNeMZsp/.clinnet/templates/linnest-public-behavior.typ" "/build/.tmpNeMZsp/.clinnet/templates/linnest-public-behavior.svg" "--root" "/build/.tmpNeMZsp/.clinnet/templates"
208.30 s
gammaloop-nextest-clinnet>
208.30 s
gammaloop-nextest-clinnet> Typst stdout:
208.30 s
gammaloop-nextest-clinnet>
208.30 s
gammaloop-nextest-clinnet>
208.30 s
gammaloop-nextest-clinnet> Typst stderr:
208.30 s
gammaloop-nextest-clinnet>
208.30 s
gammaloop-nextest-clinnet>
208.30 s
gammaloop-nextest-clinnet> Location:
208.30 s
gammaloop-nextest-clinnet> crates/clinnet/src/lib.rs:741:13
208.30 s
gammaloop-nextest-clinnet> stack backtrace:
208.30 s
gammaloop-nextest-clinnet> 0: __rustc::rust_begin_unwind
208.30 s
gammaloop-nextest-clinnet> 1: core::panicking::panic_fmt
208.30 s
gammaloop-nextest-clinnet> 2: core::result::unwrap_failed
208.30 s
gammaloop-nextest-clinnet> 3: public_typst_behavior::render
208.30 s
gammaloop-nextest-clinnet> 4: <std::sync::once::Once>::call_once_force::<<std::sync::once_lock::OnceLock<alloc::string::String>>::initialize<<std::sync::once_lock::OnceLock<alloc::string::String>>::get_or_init<public_typst_behavior::linnest_public_svg::{closure#0}>::{closure#0}, !>::{closure#0}>::{closure#0}
208.30 s
gammaloop-nextest-clinnet> 5: <std::sys::sync::once::futex::Once>::call
208.30 s
gammaloop-nextest-clinnet> 6: <std::sync::once_lock::OnceLock<alloc::string::String>>::initialize::<<std::sync::once_lock::OnceLock<alloc::string::String>>::get_or_init<public_typst_behavior::linnest_public_svg::{closure#0}>::{closure#0}, !>
208.30 s
gammaloop-nextest-clinnet> 7: <public_typst_behavior::public_linnest_overlays_follow_the_unit::{closure#0} as core::ops::function::FnOnce<()>>::call_once
208.30 s
gammaloop-nextest-clinnet> note: Some details are omitted, run with `RUST_BACKTRACE=full` for a verbose backtrace.
208.30 s
gammaloop-nextest-clinnet>
208.30 s
gammaloop-nextest-clinnet> FAIL [ 116.286s] (34/38) clinnet::public_typst_behavior public_linnest_fixture_assertions_hold
208.30 s
gammaloop-nextest-clinnet> stdout ---
208.30 s
gammaloop-nextest-clinnet>
208.30 s
gammaloop-nextest-clinnet> running 1 test
208.30 s
gammaloop-nextest-clinnet> test public_linnest_fixture_assertions_hold has been running for over 60 seconds
208.30 s
gammaloop-nextest-clinnet> test public_linnest_fixture_assertions_hold ... FAILED
208.30 s
gammaloop-nextest-clinnet>
208.30 s
gammaloop-nextest-clinnet> failures:
208.30 s
gammaloop-nextest-clinnet>
208.30 s
gammaloop-nextest-clinnet> failures:
208.30 s
gammaloop-nextest-clinnet> public_linnest_fixture_assertions_hold
208.30 s
gammaloop-nextest-clinnet>
208.30 s
gammaloop-nextest-clinnet> test result: FAILED. 0 passed; 1 failed; 0 ignored; 0 measured; 17 filtered out; finished in 116.28s
208.30 s
gammaloop-nextest-clinnet>
208.30 s
gammaloop-nextest-clinnet> stderr ---
208.30 s
gammaloop-nextest-clinnet>
208.30 s
gammaloop-nextest-clinnet> thread 'public_linnest_fixture_assertions_hold' (276) panicked at crates/clinnet/tests/public_typst_behavior.rs:81:55:
208.30 s
gammaloop-nextest-clinnet> called `Result::unwrap()` on an `Err` value: typst failed while compiling template /build/.tmppXJX7C/.clinnet/templates/linnest-public-behavior.svg
208.30 s
gammaloop-nextest-clinnet>
208.30 s
gammaloop-nextest-clinnet> Command executed:
208.30 s
gammaloop-nextest-clinnet> "typst" "c" "/build/.tmppXJX7C/.clinnet/templates/linnest-public-behavior.typ" "/build/.tmppXJX7C/.clinnet/templates/linnest-public-behavior.svg" "--root" "/build/.tmppXJX7C/.clinnet/templates"
208.30 s
gammaloop-nextest-clinnet>
208.30 s
gammaloop-nextest-clinnet> Typst stdout:
208.30 s
gammaloop-nextest-clinnet>
208.30 s
gammaloop-nextest-clinnet>
208.30 s
gammaloop-nextest-clinnet> Typst stderr:
208.30 s
gammaloop-nextest-clinnet>
208.30 s
gammaloop-nextest-clinnet>
208.30 s
gammaloop-nextest-clinnet> Location:
208.30 s
gammaloop-nextest-clinnet> crates/clinnet/src/lib.rs:741:13
208.30 s
gammaloop-nextest-clinnet> stack backtrace:
208.30 s
gammaloop-nextest-clinnet> 0: __rustc::rust_begin_unwind
208.30 s
gammaloop-nextest-clinnet> 1: core::panicking::panic_fmt
208.30 s
gammaloop-nextest-clinnet> 2: core::result::unwrap_failed
208.30 s
gammaloop-nextest-clinnet> 3: public_typst_behavior::render
208.30 s
gammaloop-nextest-clinnet> 4: <std::sync::once::Once>::call_once_force::<<std::sync::once_lock::OnceLock<alloc::string::String>>::initialize<<std::sync::once_lock::OnceLock<alloc::string::String>>::get_or_init<public_typst_behavior::linnest_public_svg::{closure#0}>::{closure#0}, !>::{closure#0}>::{closure#0}
208.30 s
gammaloop-nextest-clinnet> 5: <std::sys::sync::once::futex::Once>::call
208.30 s
gammaloop-nextest-clinnet> 6: <std::sync::once_lock::OnceLock<alloc::string::String>>::initialize::<<std::sync::once_lock::OnceLock<alloc::string::String>>::get_or_init<public_typst_behavior::linnest_public_svg::{closure#0}>::{closure#0}, !>
208.30 s
gammaloop-nextest-clinnet> 7: <public_typst_behavior::public_linnest_fixture_assertions_hold::{closure#0} as core::ops::function::FnOnce<()>>::call_once
208.30 s
gammaloop-nextest-clinnet> note: Some details are omitted, run with `RUST_BACKTRACE=full` for a verbose backtrace.
208.30 s
gammaloop-nextest-clinnet>
208.33 s
gammaloop-nextest-clinnet> error : test run failed
208.45 s
gammaloop-nextest-clinnet>
208.45 s
gammaloop-nextest-clinnet> ========== nextest test summary ==========
208.45 s
gammaloop-nextest-clinnet> report: target/nextest/ci_gammaloop/junit.xml
208.45 s
gammaloop-nextest-clinnet> tests: 38, failures: 3, errors: 0
208.45 s
gammaloop-nextest-clinnet>
208.45 s
gammaloop-nextest-clinnet> 1. clinnet::public_typst_behavior::public_linnest_labels_follow_their_carriers
208.45 s
gammaloop-nextest-clinnet> failure: test failure with exit code 101
208.45 s
gammaloop-nextest-clinnet> thread 'public_linnest_labels_follow_their_carriers' (299) panicked at crates/clinnet/tests/public_typst_behavior.rs:81:55:
208.45 s
gammaloop-nextest-clinnet> called `Result::unwrap()` on an `Err` value: typst failed while compiling template /build/.tmpfvJk4L/.clinnet/templates/linnest-public-behavior.svg
208.45 s
gammaloop-nextest-clinnet>
208.45 s
gammaloop-nextest-clinnet> Command executed:
208.45 s
gammaloop-nextest-clinnet> "typst" "c" "/build/.tmpfvJk4L/.clinnet/templates/linnest-public-behavior.typ" "/build/.tmpfvJk4L/.clinnet/templates/linnest-public-behavior.svg" "--root" "/build/.tmpfvJk4L/.clinnet/templates"
208.45 s
gammaloop-nextest-clinnet>
208.45 s
gammaloop-nextest-clinnet> Typst stdout:
208.45 s
gammaloop-nextest-clinnet>
208.45 s
gammaloop-nextest-clinnet>
208.45 s
gammaloop-nextest-clinnet> Typst stderr:
208.45 s
gammaloop-nextest-clinnet>
208.45 s
gammaloop-nextest-clinnet>
208.45 s
gammaloop-nextest-clinnet> Location:
208.45 s
gammaloop-nextest-clinnet> crates/clinnet/src/lib.rs:741:13
208.45 s
gammaloop-nextest-clinnet> stack backtrace:
208.45 s
gammaloop-nextest-clinnet> 0: __rustc::rust_begin_unwind
208.45 s
gammaloop-nextest-clinnet> 1: core::panicking::panic_fmt
208.45 s
gammaloop-nextest-clinnet> 2: core::result::unwrap_failed
208.45 s
gammaloop-nextest-clinnet> 3: public_typst_behavior::render
208.45 s
gammaloop-nextest-clinnet> 4: <std::sync::once::Once>::call_once_force::<<std::sync::once_lock::OnceLock<alloc::string::String>>::initialize<<std::sync::once_lock::OnceLock<alloc::string::String>>::get_or_init<public_typst_behavior::linnest_public_svg::{closure#0}>::{closure#0}, !>::{closure#0}>::{closure#0}
208.45 s
gammaloop-nextest-clinnet> 5: <std::sys::sync::once::futex::Once>::call
208.45 s
gammaloop-nextest-clinnet> 6: <std::sync::once_lock::OnceLock<alloc::string::String>>::initialize::<<std::sync::once_lock::OnceLock<alloc::string::String>>::get_or_init<public_typst_behavior::linnest_public_svg::{closure#0}>::{closure#0}, !>
208.45 s
gammaloop-nextest-clinnet> 7: <public_typst_behavior::public_linnest_labels_follow_their_carriers::{closure#0} as core::ops::function::FnOnce<()>>::call_once
208.45 s
gammaloop-nextest-clinnet> note: Some details are omitted, run with `RUST_BACKTRACE=full` for a verbose backtrace.
208.45 s
gammaloop-nextest-clinnet> system-out
208.45 s
gammaloop-nextest-clinnet> running 1 test
208.45 s
gammaloop-nextest-clinnet> test public_linnest_labels_follow_their_carriers has been running for over 60 seconds
208.45 s
gammaloop-nextest-clinnet> test public_linnest_labels_follow_their_carriers ... FAILED
208.45 s
gammaloop-nextest-clinnet>
208.45 s
gammaloop-nextest-clinnet> failures:
208.45 s
gammaloop-nextest-clinnet>
208.45 s
gammaloop-nextest-clinnet> failures:
208.45 s
gammaloop-nextest-clinnet> public_linnest_labels_follow_their_carriers
208.45 s
gammaloop-nextest-clinnet>
208.45 s
gammaloop-nextest-clinnet> test result: FAILED. 0 passed; 1 failed; 0 ignored; 0 measured; 17 filtered out; finished in 94.50s
208.45 s
gammaloop-nextest-clinnet> system-err
208.45 s
gammaloop-nextest-clinnet> thread 'public_linnest_labels_follow_their_carriers' (299) panicked at crates/clinnet/tests/public_typst_behavior.rs:81:55:
208.45 s
gammaloop-nextest-clinnet> called `Result::unwrap()` on an `Err` value: typst failed while compiling template /build/.tmpfvJk4L/.clinnet/templates/linnest-public-behavior.svg
208.45 s
gammaloop-nextest-clinnet>
208.45 s
gammaloop-nextest-clinnet> Command executed:
208.45 s
gammaloop-nextest-clinnet> "typst" "c" "/build/.tmpfvJk4L/.clinnet/templates/linnest-public-behavior.typ" "/build/.tmpfvJk4L/.clinnet/templates/linnest-public-behavior.svg" "--root" "/build/.tmpfvJk4L/.clinnet/templates"
208.45 s
gammaloop-nextest-clinnet>
208.45 s
gammaloop-nextest-clinnet> Typst stdout:
208.45 s
gammaloop-nextest-clinnet>
208.45 s
gammaloop-nextest-clinnet>
208.45 s
gammaloop-nextest-clinnet> Typst stderr:
208.45 s
gammaloop-nextest-clinnet>
208.45 s
gammaloop-nextest-clinnet>
208.45 s
gammaloop-nextest-clinnet> Location:
208.45 s
gammaloop-nextest-clinnet> crates/clinnet/src/lib.rs:741:13
208.45 s
gammaloop-nextest-clinnet> stack backtrace:
208.45 s
gammaloop-nextest-clinnet> 0: __rustc::rust_begin_unwind
208.45 s
gammaloop-nextest-clinnet> 1: core::panicking::panic_fmt
208.45 s
gammaloop-nextest-clinnet> 2: core::result::unwrap_failed
208.45 s
gammaloop-nextest-clinnet> 3: public_typst_behavior::render
208.45 s
gammaloop-nextest-clinnet> 4: <std::sync::once::Once>::call_once_force::<<std::sync::once_lock::OnceLock<alloc::string::String>>::initialize<<std::sync::once_lock::OnceLock<alloc::string::String>>::get_or_init<public_typst_behavior::linnest_public_svg::{closure#0}>::{closure#0}, !>::{closure#0}>::{closure#0}
208.45 s
gammaloop-nextest-clinnet> 5: <std::sys::sync::once::futex::Once>::call
208.45 s
gammaloop-nextest-clinnet> 6: <std::sync::once_lock::OnceLock<alloc::string::String>>::initialize::<<std::sync::once_lock::OnceLock<alloc::string::String>>::get_or_init<public_typst_behavior::linnest_public_svg::{closure#0}>::{closure#0}, !>
208.45 s
gammaloop-nextest-clinnet> 7: <public_typst_behavior::public_linnest_labels_follow_their_carriers::{closure#0} as core::ops::function::FnOnce<()>>::call_once
208.45 s
gammaloop-nextest-clinnet> note: Some details are omitted, run with `RUST_BACKTRACE=full` for a verbose backtrace.
208.45 s
gammaloop-nextest-clinnet>
208.45 s
gammaloop-nextest-clinnet> 2. clinnet::public_typst_behavior::public_linnest_overlays_follow_the_unit
208.45 s
gammaloop-nextest-clinnet> failure: test failure with exit code 101
208.45 s
gammaloop-nextest-clinnet> thread 'public_linnest_overlays_follow_the_unit' (311) panicked at crates/clinnet/tests/public_typst_behavior.rs:81:55:
208.45 s
gammaloop-nextest-clinnet> called `Result::unwrap()` on an `Err` value: typst failed while compiling template /build/.tmpNeMZsp/.clinnet/templates/linnest-public-behavior.svg
208.45 s
gammaloop-nextest-clinnet>
208.45 s
gammaloop-nextest-clinnet> Command executed:
208.45 s
gammaloop-nextest-clinnet> "typst" "c" "/build/.tmpNeMZsp/.clinnet/templates/linnest-public-behavior.typ" "/build/.tmpNeMZsp/.clinnet/templates/linnest-public-behavior.svg" "--root" "/build/.tmpNeMZsp/.clinnet/templates"
208.45 s
gammaloop-nextest-clinnet>
208.45 s
gammaloop-nextest-clinnet> Typst stdout:
208.45 s
gammaloop-nextest-clinnet>
208.45 s
gammaloop-nextest-clinnet>
208.45 s
gammaloop-nextest-clinnet> Typst stderr:
208.45 s
gammaloop-nextest-clinnet>
208.45 s
gammaloop-nextest-clinnet>
208.45 s
gammaloop-nextest-clinnet> Location:
208.45 s
gammaloop-nextest-clinnet> crates/clinnet/src/lib.rs:741:13
208.45 s
gammaloop-nextest-clinnet> stack backtrace:
208.45 s
gammaloop-nextest-clinnet> 0: __rustc::rust_begin_unwind
208.45 s
gammaloop-nextest-clinnet> 1: core::panicking::panic_fmt
208.45 s
gammaloop-nextest-clinnet> 2: core::result::unwrap_failed
208.45 s
gammaloop-nextest-clinnet> 3: public_typst_behavior::render
208.45 s
gammaloop-nextest-clinnet> 4: <std::sync::once::Once>::call_once_force::<<std::sync::once_lock::OnceLock<alloc::string::String>>::initialize<<std::sync::once_lock::OnceLock<alloc::string::String>>::get_or_init<public_typst_behavior::linnest_public_svg::{closure#0}>::{closure#0}, !>::{closure#0}>::{closure#0}
208.45 s
gammaloop-nextest-clinnet> 5: <std::sys::sync::once::futex::Once>::call
208.45 s
gammaloop-nextest-clinnet> 6: <std::sync::once_lock::OnceLock<alloc::string::String>>::initialize::<<std::sync::once_lock::OnceLock<alloc::string::String>>::get_or_init<public_typst_behavior::linnest_public_svg::{closure#0}>::{closure#0}, !>
208.45 s
gammaloop-nextest-clinnet> 7: <public_typst_behavior::public_linnest_overlays_follow_the_unit::{closure#0} as core::ops::function::FnOnce<()>>::call_once
208.45 s
gammaloop-nextest-clinnet> note: Some details are omitted, run with `RUST_BACKTRACE=full` for a verbose backtrace.
208.45 s
gammaloop-nextest-clinnet> system-out
208.45 s
gammaloop-nextest-clinnet> running 1 test
208.45 s
gammaloop-nextest-clinnet> test public_linnest_overlays_follow_the_unit has been running for over 60 seconds
208.45 s
gammaloop-nextest-clinnet> test public_linnest_overlays_follow_the_unit ... FAILED
208.45 s
gammaloop-nextest-clinnet>
208.45 s
gammaloop-nextest-clinnet> failures:
208.45 s
gammaloop-nextest-clinnet>
208.45 s
gammaloop-nextest-clinnet> failures:
208.45 s
gammaloop-nextest-clinnet> public_linnest_overlays_follow_the_unit
208.45 s
gammaloop-nextest-clinnet>
208.45 s
gammaloop-nextest-clinnet> test result: FAILED. 0 passed; 1 failed; 0 ignored; 0 measured; 17 filtered out; finished in 99.20s
208.45 s
gammaloop-nextest-clinnet> system-err
208.45 s
gammaloop-nextest-clinnet> thread 'public_linnest_overlays_follow_the_unit' (311) panicked at crates/clinnet/tests/public_typst_behavior.rs:81:55:
208.45 s
gammaloop-nextest-clinnet> called `Result::unwrap()` on an `Err` value: typst failed while compiling template /build/.tmpNeMZsp/.clinnet/templates/linnest-public-behavior.svg
208.45 s
gammaloop-nextest-clinnet>
208.45 s
gammaloop-nextest-clinnet> Command executed:
208.45 s
gammaloop-nextest-clinnet> "typst" "c" "/build/.tmpNeMZsp/.clinnet/templates/linnest-public-behavior.typ" "/build/.tmpNeMZsp/.clinnet/templates/linnest-public-behavior.svg" "--root" "/build/.tmpNeMZsp/.clinnet/templates"
208.45 s
gammaloop-nextest-clinnet>
208.45 s
gammaloop-nextest-clinnet> Typst stdout:
208.45 s
gammaloop-nextest-clinnet>
208.45 s
gammaloop-nextest-clinnet>
208.45 s
gammaloop-nextest-clinnet> Typst stderr:
208.45 s
gammaloop-nextest-clinnet>
208.45 s
gammaloop-nextest-clinnet>
208.45 s
gammaloop-nextest-clinnet> Location:
208.45 s
gammaloop-nextest-clinnet> crates/clinnet/src/lib.rs:741:13
208.45 s
gammaloop-nextest-clinnet> stack backtrace:
208.45 s
gammaloop-nextest-clinnet> 0: __rustc::rust_begin_unwind
208.45 s
gammaloop-nextest-clinnet> 1: core::panicking::panic_fmt
208.45 s
gammaloop-nextest-clinnet> 2: core::result::unwrap_failed
208.45 s
gammaloop-nextest-clinnet> 3: public_typst_behavior::render
208.45 s
gammaloop-nextest-clinnet> 4: <std::sync::once::Once>::call_once_force::<<std::sync::once_lock::OnceLock<alloc::string::String>>::initialize<<std::sync::once_lock::OnceLock<alloc::string::String>>::get_or_init<public_typst_behavior::linnest_public_svg::{closure#0}>::{closure#0}, !>::{closure#0}>::{closure#0}
208.45 s
gammaloop-nextest-clinnet> 5: <std::sys::sync::once::futex::Once>::call
208.45 s
gammaloop-nextest-clinnet> 6: <std::sync::once_lock::OnceLock<alloc::string::String>>::initialize::<<std::sync::once_lock::OnceLock<alloc::string::String>>::get_or_init<public_typst_behavior::linnest_public_svg::{closure#0}>::{closure#0}, !>
208.45 s
gammaloop-nextest-clinnet> 7: <public_typst_behavior::public_linnest_overlays_follow_the_unit::{closure#0} as core::ops::function::FnOnce<()>>::call_once
208.45 s
gammaloop-nextest-clinnet> note: Some details are omitted, run with `RUST_BACKTRACE=full` for a verbose backtrace.
208.45 s
gammaloop-nextest-clinnet>
208.45 s
gammaloop-nextest-clinnet> 3. clinnet::public_typst_behavior::public_linnest_fixture_assertions_hold
208.45 s
gammaloop-nextest-clinnet> failure: test failure with exit code 101
208.45 s
gammaloop-nextest-clinnet> thread 'public_linnest_fixture_assertions_hold' (276) panicked at crates/clinnet/tests/public_typst_behavior.rs:81:55:
208.45 s
gammaloop-nextest-clinnet> called `Result::unwrap()` on an `Err` value: typst failed while compiling template /build/.tmppXJX7C/.clinnet/templates/linnest-public-behavior.svg
208.45 s
gammaloop-nextest-clinnet>
208.45 s
gammaloop-nextest-clinnet> Command executed:
208.45 s
gammaloop-nextest-clinnet> "typst" "c" "/build/.tmppXJX7C/.clinnet/templates/linnest-public-behavior.typ" "/build/.tmppXJX7C/.clinnet/templates/linnest-public-behavior.svg" "--root" "/build/.tmppXJX7C/.clinnet/templates"
208.45 s
gammaloop-nextest-clinnet>
208.45 s
gammaloop-nextest-clinnet> Typst stdout:
208.45 s
gammaloop-nextest-clinnet>
208.45 s
gammaloop-nextest-clinnet>
208.45 s
gammaloop-nextest-clinnet> Typst stderr:
208.45 s
gammaloop-nextest-clinnet>
208.45 s
gammaloop-nextest-clinnet>
208.45 s
gammaloop-nextest-clinnet> Location:
208.45 s
gammaloop-nextest-clinnet> crates/clinnet/src/lib.rs:741:13
208.45 s
gammaloop-nextest-clinnet> stack backtrace:
208.45 s
gammaloop-nextest-clinnet> 0: __rustc::rust_begin_unwind
208.45 s
gammaloop-nextest-clinnet> 1: core::panicking::panic_fmt
208.45 s
gammaloop-nextest-clinnet> 2: core::result::unwrap_failed
208.45 s
gammaloop-nextest-clinnet> 3: public_typst_behavior::render
208.45 s
gammaloop-nextest-clinnet> 4: <std::sync::once::Once>::call_once_force::<<std::sync::once_lock::OnceLock<alloc::string::String>>::initialize<<std::sync::once_lock::OnceLock<alloc::string::String>>::get_or_init<public_typst_behavior::linnest_public_svg::{closure#0}>::{closure#0}, !>::{closure#0}>::{closure#0}
208.45 s
gammaloop-nextest-clinnet> 5: <std::sys::sync::once::futex::Once>::call
208.45 s
gammaloop-nextest-clinnet> 6: <std::sync::once_lock::OnceLock<alloc::string::String>>::initialize::<<std::sync::once_lock::OnceLock<alloc::string::String>>::get_or_init<public_typst_behavior::linnest_public_svg::{closure#0}>::{closure#0}, !>
208.45 s
gammaloop-nextest-clinnet> 7: <public_typst_behavior::public_linnest_fixture_assertions_hold::{closure#0} as core::ops::function::FnOnce<()>>::call_once
208.45 s
gammaloop-nextest-clinnet> note: Some details are omitted, run with `RUST_BACKTRACE=full` for a verbose backtrace.
208.45 s
gammaloop-nextest-clinnet> system-out
208.45 s
gammaloop-nextest-clinnet> running 1 test
208.45 s
gammaloop-nextest-clinnet> test public_linnest_fixture_assertions_hold has been running for over 60 seconds
208.45 s
gammaloop-nextest-clinnet> test public_linnest_fixture_assertions_hold ... FAILED
208.45 s
gammaloop-nextest-clinnet>
208.45 s
gammaloop-nextest-clinnet> failures:
208.45 s
gammaloop-nextest-clinnet>
208.45 s
gammaloop-nextest-clinnet> failures:
208.45 s
gammaloop-nextest-clinnet> public_linnest_fixture_assertions_hold
208.45 s
gammaloop-nextest-clinnet>
208.45 s
gammaloop-nextest-clinnet> test result: FAILED. 0 passed; 1 failed; 0 ignored; 0 measured; 17 filtered out; finished in 116.28s
208.45 s
gammaloop-nextest-clinnet> system-err
208.45 s
gammaloop-nextest-clinnet> thread 'public_linnest_fixture_assertions_hold' (276) panicked at crates/clinnet/tests/public_typst_behavior.rs:81:55:
208.45 s
gammaloop-nextest-clinnet> called `Result::unwrap()` on an `Err` value: typst failed while compiling template /build/.tmppXJX7C/.clinnet/templates/linnest-public-behavior.svg
208.45 s
gammaloop-nextest-clinnet>
208.45 s
gammaloop-nextest-clinnet> Command executed:
208.45 s
gammaloop-nextest-clinnet> "typst" "c" "/build/.tmppXJX7C/.clinnet/templates/linnest-public-behavior.typ" "/build/.tmppXJX7C/.clinnet/templates/linnest-public-behavior.svg" "--root" "/build/.tmppXJX7C/.clinnet/templates"
208.45 s
gammaloop-nextest-clinnet>
208.45 s
gammaloop-nextest-clinnet> Typst stdout:
208.45 s
gammaloop-nextest-clinnet>
208.45 s
gammaloop-nextest-clinnet>
208.45 s
gammaloop-nextest-clinnet> Typst stderr:
208.45 s
gammaloop-nextest-clinnet>
208.45 s
gammaloop-nextest-clinnet>
208.45 s
gammaloop-nextest-clinnet> Location:
208.45 s
gammaloop-nextest-clinnet> crates/clinnet/src/lib.rs:741:13
208.45 s
gammaloop-nextest-clinnet> stack backtrace:
208.45 s
gammaloop-nextest-clinnet> 0: __rustc::rust_begin_unwind
208.45 s
gammaloop-nextest-clinnet> 1: core::panicking::panic_fmt
208.45 s
gammaloop-nextest-clinnet> 2: core::result::unwrap_failed
208.45 s
gammaloop-nextest-clinnet> 3: public_typst_behavior::render
208.45 s
gammaloop-nextest-clinnet> 4: <std::sync::once::Once>::call_once_force::<<std::sync::once_lock::OnceLock<alloc::string::String>>::initialize<<std::sync::once_lock::OnceLock<alloc::string::String>>::get_or_init<public_typst_behavior::linnest_public_svg::{closure#0}>::{closure#0}, !>::{closure#0}>::{closure#0}
208.45 s
gammaloop-nextest-clinnet> 5: <std::sys::sync::once::futex::Once>::call
208.45 s
gammaloop-nextest-clinnet> 6: <std::sync::once_lock::OnceLock<alloc::string::String>>::initialize::<<std::sync::once_lock::OnceLock<alloc::string::String>>::get_or_init<public_typst_behavior::linnest_public_svg::{closure#0}>::{closure#0}, !>
208.45 s
gammaloop-nextest-clinnet> 7: <public_typst_behavior::public_linnest_fixture_assertions_hold::{closure#0} as core::ops::function::FnOnce<()>>::call_once
208.45 s
gammaloop-nextest-clinnet> note: Some details are omitted, run with `RUST_BACKTRACE=full` for a verbose backtrace.
208.45 s
gammaloop-nextest-clinnet> =========================================
208.67 s
error: Cannot build '/nix/store/4pqspwvh8pi9s2vg9g6mfsggpl9ynwzx-gammaloop-nextest-clinnet.drv '.
208.67 s
Reason: builder failed with exit code 100 .
208.67 s
Output paths:
208.67 s
/nix/store/v9zka7gxdrym1pq03r0i4w2q43fgdwcq-gammaloop-nextest-clinnet
208.67 s
Last 449 log lines:
208.67 s
> Nextest worker budget: 16
208.67 s
> Extracting 4 binaries (including 1 non-test binary), 1 build script output directory, and 1 linked path to /build/source
208.67 s
> Extracted 16 files to /build/source in 0.07s
208.67 s
> ------------
208.67 s
> Nextest run ID 4480fd29-0299-4ae9-92cc-c4383e7e551a with nextest profile: ci_gammaloop
208.67 s
> Starting 38 tests across 3 binaries
208.67 s
> FAIL [ 94.519s] (32/38) clinnet::public_typst_behavior public_linnest_labels_follow_their_carriers
208.67 s
> stdout ---
208.67 s
>
208.67 s
> running 1 test
208.67 s
> test public_linnest_labels_follow_their_carriers has been running for over 60 seconds
208.67 s
> test public_linnest_labels_follow_their_carriers ... FAILED
208.67 s
>
208.67 s
> failures:
208.67 s
>
208.67 s
> failures:
208.67 s
> public_linnest_labels_follow_their_carriers
208.67 s
>
208.67 s
> test result: FAILED. 0 passed; 1 failed; 0 ignored; 0 measured; 17 filtered out; finished in 94.50s
208.67 s
>
208.67 s
> stderr ---
208.67 s
>
208.67 s
> thread 'public_linnest_labels_follow_their_carriers' (299) panicked at crates/clinnet/tests/public_typst_behavior.rs:81:55:
208.67 s
> called `Result::unwrap()` on an `Err` value: typst failed while compiling template /build/.tmpfvJk4L/.clinnet/templates/linnest-public-behavior.svg
208.67 s
>
208.67 s
> Command executed:
208.67 s
> "typst" "c" "/build/.tmpfvJk4L/.clinnet/templates/linnest-public-behavior.typ" "/build/.tmpfvJk4L/.clinnet/templates/linnest-public-behavior.svg" "--root" "/build/.tmpfvJk4L/.clinnet/templates"
208.67 s
>
208.67 s
> Typst stdout:
208.67 s
>
208.67 s
>
208.67 s
> Typst stderr:
208.67 s
>
208.67 s
>
208.67 s
> Location:
208.67 s
> crates/clinnet/src/lib.rs:741:13
208.67 s
> stack backtrace:
208.67 s
> 0: __rustc::rust_begin_unwind
208.67 s
> 1: core::panicking::panic_fmt
208.67 s
> 2: core::result::unwrap_failed
208.67 s
> 3: public_typst_behavior::render
208.67 s
> 4: <std::sync::once::Once>::call_once_force::<<std::sync::once_lock::OnceLock<alloc::string::String>>::initialize<<std::sync::once_lock::OnceLock<alloc::string::String>>::get_or_init<public_typst_behavior::linnest_public_svg::{closure#0}>::{closure#0}, !>::{closure#0}>::{closure#0}
208.67 s
> 5: <std::sys::sync::once::futex::Once>::call
208.67 s
> 6: <std::sync::once_lock::OnceLock<alloc::string::String>>::initialize::<<std::sync::once_lock::OnceLock<alloc::string::String>>::get_or_init<public_typst_behavior::linnest_public_svg::{closure#0}>::{closure#0}, !>
208.67 s
> 7: <public_typst_behavior::public_linnest_labels_follow_their_carriers::{closure#0} as core::ops::function::FnOnce<()>>::call_once
208.67 s
> note: Some details are omitted, run with `RUST_BACKTRACE=full` for a verbose backtrace.
208.67 s
>
208.67 s
> FAIL [ 99.217s] (33/38) clinnet::public_typst_behavior public_linnest_overlays_follow_the_unit
208.67 s
> stdout ---
208.67 s
>
208.67 s
> running 1 test
208.67 s
> test public_linnest_overlays_follow_the_unit has been running for over 60 seconds
208.67 s
> test public_linnest_overlays_follow_the_unit ... FAILED
208.67 s
>
208.67 s
> failures:
208.67 s
>
208.67 s
> failures:
208.67 s
> public_linnest_overlays_follow_the_unit
208.67 s
>
208.67 s
> test result: FAILED. 0 passed; 1 failed; 0 ignored; 0 measured; 17 filtered out; finished in 99.20s
208.67 s
>
208.67 s
> stderr ---
208.67 s
>
208.67 s
> thread 'public_linnest_overlays_follow_the_unit' (311) panicked at crates/clinnet/tests/public_typst_behavior.rs:81:55:
208.67 s
> called `Result::unwrap()` on an `Err` value: typst failed while compiling template /build/.tmpNeMZsp/.clinnet/templates/linnest-public-behavior.svg
208.67 s
>
208.67 s
> Command executed:
208.67 s
> "typst" "c" "/build/.tmpNeMZsp/.clinnet/templates/linnest-public-behavior.typ" "/build/.tmpNeMZsp/.clinnet/templates/linnest-public-behavior.svg" "--root" "/build/.tmpNeMZsp/.clinnet/templates"
208.67 s
>
208.67 s
> Typst stdout:
208.67 s
>
208.67 s
>
208.67 s
> Typst stderr:
208.67 s
>
208.67 s
>
208.67 s
> Location:
208.67 s
> crates/clinnet/src/lib.rs:741:13
208.67 s
> stack backtrace:
208.67 s
> 0: __rustc::rust_begin_unwind
208.67 s
> 1: core::panicking::panic_fmt
208.67 s
> 2: core::result::unwrap_failed
208.67 s
> 3: public_typst_behavior::render
208.67 s
> 4: <std::sync::once::Once>::call_once_force::<<std::sync::once_lock::OnceLock<alloc::string::String>>::initialize<<std::sync::once_lock::OnceLock<alloc::string::String>>::get_or_init<public_typst_behavior::linnest_public_svg::{closure#0}>::{closure#0}, !>::{closure#0}>::{closure#0}
208.67 s
> 5: <std::sys::sync::once::futex::Once>::call
208.67 s
> 6: <std::sync::once_lock::OnceLock<alloc::string::String>>::initialize::<<std::sync::once_lock::OnceLock<alloc::string::String>>::get_or_init<public_typst_behavior::linnest_public_svg::{closure#0}>::{closure#0}, !>
208.67 s
> 7: <public_typst_behavior::public_linnest_overlays_follow_the_unit::{closure#0} as core::ops::function::FnOnce<()>>::call_once
208.67 s
> note: Some details are omitted, run with `RUST_BACKTRACE=full` for a verbose backtrace.
208.67 s
>
208.67 s
> FAIL [ 116.286s] (34/38) clinnet::public_typst_behavior public_linnest_fixture_assertions_hold
208.67 s
> stdout ---
208.67 s
>
208.67 s
> running 1 test
208.67 s
> test public_linnest_fixture_assertions_hold has been running for over 60 seconds
208.67 s
> test public_linnest_fixture_assertions_hold ... FAILED
208.67 s
>
208.67 s
> failures:
208.67 s
>
208.67 s
> failures:
208.67 s
> public_linnest_fixture_assertions_hold
208.67 s
>
208.67 s
> test result: FAILED. 0 passed; 1 failed; 0 ignored; 0 measured; 17 filtered out; finished in 116.28s
208.67 s
>
208.67 s
> stderr ---
208.67 s
>
208.67 s
> thread 'public_linnest_fixture_assertions_hold' (276) panicked at crates/clinnet/tests/public_typst_behavior.rs:81:55:
208.67 s
> called `Result::unwrap()` on an `Err` value: typst failed while compiling template /build/.tmppXJX7C/.clinnet/templates/linnest-public-behavior.svg
208.67 s
>
208.67 s
> Command executed:
208.67 s
> "typst" "c" "/build/.tmppXJX7C/.clinnet/templates/linnest-public-behavior.typ" "/build/.tmppXJX7C/.clinnet/templates/linnest-public-behavior.svg" "--root" "/build/.tmppXJX7C/.clinnet/templates"
208.67 s
>
208.67 s
> Typst stdout:
208.67 s
>
208.67 s
>
208.67 s
> Typst stderr:
208.67 s
>
208.67 s
>
208.67 s
> Location:
208.67 s
> crates/clinnet/src/lib.rs:741:13
208.67 s
> stack backtrace:
208.67 s
> 0: __rustc::rust_begin_unwind
208.67 s
> 1: core::panicking::panic_fmt
208.67 s
> 2: core::result::unwrap_failed
208.67 s
> 3: public_typst_behavior::render
208.67 s
> 4: <std::sync::once::Once>::call_once_force::<<std::sync::once_lock::OnceLock<alloc::string::String>>::initialize<<std::sync::once_lock::OnceLock<alloc::string::String>>::get_or_init<public_typst_behavior::linnest_public_svg::{closure#0}>::{closure#0}, !>::{closure#0}>::{closure#0}
208.67 s
> 5: <std::sys::sync::once::futex::Once>::call
208.67 s
> 6: <std::sync::once_lock::OnceLock<alloc::string::String>>::initialize::<<std::sync::once_lock::OnceLock<alloc::string::String>>::get_or_init<public_typst_behavior::linnest_public_svg::{closure#0}>::{closure#0}, !>
208.67 s
> 7: <public_typst_behavior::public_linnest_fixture_assertions_hold::{closure#0} as core::ops::function::FnOnce<()>>::call_once
208.67 s
> note: Some details are omitted, run with `RUST_BACKTRACE=full` for a verbose backtrace.
208.67 s
>
208.67 s
> ------------
208.67 s
> Summary [ 127.180s] 38 tests run: 35 passed (4 slow ), 3 failed , 0 skipped
208.67 s
> FAIL [ 94.519s] (32/38) clinnet::public_typst_behavior public_linnest_labels_follow_their_carriers
208.67 s
> stdout ---
208.67 s
>
208.67 s
> running 1 test
208.67 s
> test public_linnest_labels_follow_their_carriers has been running for over 60 seconds
208.67 s
> test public_linnest_labels_follow_their_carriers ... FAILED
208.67 s
>
208.67 s
> failures:
208.67 s
>
208.67 s
> failures:
208.67 s
> public_linnest_labels_follow_their_carriers
208.67 s
>
208.67 s
> test result: FAILED. 0 passed; 1 failed; 0 ignored; 0 measured; 17 filtered out; finished in 94.50s
208.67 s
>
208.67 s
> stderr ---
208.67 s
>
208.67 s
> thread 'public_linnest_labels_follow_their_carriers' (299) panicked at crates/clinnet/tests/public_typst_behavior.rs:81:55:
208.67 s
> called `Result::unwrap()` on an `Err` value: typst failed while compiling template /build/.tmpfvJk4L/.clinnet/templates/linnest-public-behavior.svg
208.67 s
>
208.67 s
> Command executed:
208.67 s
> "typst" "c" "/build/.tmpfvJk4L/.clinnet/templates/linnest-public-behavior.typ" "/build/.tmpfvJk4L/.clinnet/templates/linnest-public-behavior.svg" "--root" "/build/.tmpfvJk4L/.clinnet/templates"
208.67 s
>
208.67 s
> Typst stdout:
208.67 s
>
208.67 s
>
208.67 s
> Typst stderr:
208.67 s
>
208.67 s
>
208.67 s
> Location:
208.67 s
> crates/clinnet/src/lib.rs:741:13
208.67 s
> stack backtrace:
208.67 s
> 0: __rustc::rust_begin_unwind
208.67 s
> 1: core::panicking::panic_fmt
208.67 s
> 2: core::result::unwrap_failed
208.67 s
> 3: public_typst_behavior::render
208.67 s
> 4: <std::sync::once::Once>::call_once_force::<<std::sync::once_lock::OnceLock<alloc::string::String>>::initialize<<std::sync::once_lock::OnceLock<alloc::string::String>>::get_or_init<public_typst_behavior::linnest_public_svg::{closure#0}>::{closure#0}, !>::{closure#0}>::{closure#0}
208.67 s
> 5: <std::sys::sync::once::futex::Once>::call
208.67 s
> 6: <std::sync::once_lock::OnceLock<alloc::string::String>>::initialize::<<std::sync::once_lock::OnceLock<alloc::string::String>>::get_or_init<public_typst_behavior::linnest_public_svg::{closure#0}>::{closure#0}, !>
208.67 s
> 7: <public_typst_behavior::public_linnest_labels_follow_their_carriers::{closure#0} as core::ops::function::FnOnce<()>>::call_once
208.67 s
> note: Some details are omitted, run with `RUST_BACKTRACE=full` for a verbose backtrace.
208.67 s
>
208.67 s
> FAIL [ 99.217s] (33/38) clinnet::public_typst_behavior public_linnest_overlays_follow_the_unit
208.67 s
> stdout ---
208.67 s
>
208.67 s
> running 1 test
208.67 s
> test public_linnest_overlays_follow_the_unit has been running for over 60 seconds
208.67 s
> test public_linnest_overlays_follow_the_unit ... FAILED
208.67 s
>
208.67 s
> failures:
208.67 s
>
208.67 s
> failures:
208.67 s
> public_linnest_overlays_follow_the_unit
208.67 s
>
208.67 s
> test result: FAILED. 0 passed; 1 failed; 0 ignored; 0 measured; 17 filtered out; finished in 99.20s
208.67 s
>
208.67 s
> stderr ---
208.67 s
>
208.67 s
> thread 'public_linnest_overlays_follow_the_unit' (311) panicked at crates/clinnet/tests/public_typst_behavior.rs:81:55:
208.67 s
> called `Result::unwrap()` on an `Err` value: typst failed while compiling template /build/.tmpNeMZsp/.clinnet/templates/linnest-public-behavior.svg
208.67 s
>
208.67 s
> Command executed:
208.67 s
> "typst" "c" "/build/.tmpNeMZsp/.clinnet/templates/linnest-public-behavior.typ" "/build/.tmpNeMZsp/.clinnet/templates/linnest-public-behavior.svg" "--root" "/build/.tmpNeMZsp/.clinnet/templates"
208.67 s
>
208.67 s
> Typst stdout:
208.67 s
>
208.67 s
>
208.67 s
> Typst stderr:
208.67 s
>
208.67 s
>
208.67 s
> Location:
208.67 s
> crates/clinnet/src/lib.rs:741:13
208.67 s
> stack backtrace:
208.67 s
> 0: __rustc::rust_begin_unwind
208.67 s
> 1: core::panicking::panic_fmt
208.67 s
> 2: core::result::unwrap_failed
208.67 s
> 3: public_typst_behavior::render
208.67 s
> 4: <std::sync::once::Once>::call_once_force::<<std::sync::once_lock::OnceLock<alloc::string::String>>::initialize<<std::sync::once_lock::OnceLock<alloc::string::String>>::get_or_init<public_typst_behavior::linnest_public_svg::{closure#0}>::{closure#0}, !>::{closure#0}>::{closure#0}
208.67 s
> 5: <std::sys::sync::once::futex::Once>::call
208.67 s
> 6: <std::sync::once_lock::OnceLock<alloc::string::String>>::initialize::<<std::sync::once_lock::OnceLock<alloc::string::String>>::get_or_init<public_typst_behavior::linnest_public_svg::{closure#0}>::{closure#0}, !>
208.67 s
> 7: <public_typst_behavior::public_linnest_overlays_follow_the_unit::{closure#0} as core::ops::function::FnOnce<()>>::call_once
208.67 s
> note: Some details are omitted, run with `RUST_BACKTRACE=full` for a verbose backtrace.
208.67 s
>
208.67 s
> FAIL [ 116.286s] (34/38) clinnet::public_typst_behavior public_linnest_fixture_assertions_hold
208.67 s
> stdout ---
208.67 s
>
208.67 s
> running 1 test
208.67 s
> test public_linnest_fixture_assertions_hold has been running for over 60 seconds
208.67 s
> test public_linnest_fixture_assertions_hold ... FAILED
208.67 s
>
208.67 s
> failures:
208.67 s
>
208.67 s
> failures:
208.67 s
> public_linnest_fixture_assertions_hold
208.67 s
>
208.67 s
> test result: FAILED. 0 passed; 1 failed; 0 ignored; 0 measured; 17 filtered out; finished in 116.28s
208.67 s
>
208.67 s
> stderr ---
208.67 s
>
208.67 s
> thread 'public_linnest_fixture_assertions_hold' (276) panicked at crates/clinnet/tests/public_typst_behavior.rs:81:55:
208.67 s
> called `Result::unwrap()` on an `Err` value: typst failed while compiling template /build/.tmppXJX7C/.clinnet/templates/linnest-public-behavior.svg
208.67 s
>
208.67 s
> Command executed:
208.67 s
> "typst" "c" "/build/.tmppXJX7C/.clinnet/templates/linnest-public-behavior.typ" "/build/.tmppXJX7C/.clinnet/templates/linnest-public-behavior.svg" "--root" "/build/.tmppXJX7C/.clinnet/templates"
208.67 s
>
208.67 s
> Typst stdout:
208.67 s
>
208.67 s
>
208.67 s
> Typst stderr:
208.67 s
>
208.67 s
>
208.67 s
> Location:
208.67 s
> crates/clinnet/src/lib.rs:741:13
208.67 s
> stack backtrace:
208.67 s
> 0: __rustc::rust_begin_unwind
208.67 s
> 1: core::panicking::panic_fmt
208.67 s
> 2: core::result::unwrap_failed
208.67 s
> 3: public_typst_behavior::render
208.67 s
> 4: <std::sync::once::Once>::call_once_force::<<std::sync::once_lock::OnceLock<alloc::string::String>>::initialize<<std::sync::once_lock::OnceLock<alloc::string::String>>::get_or_init<public_typst_behavior::linnest_public_svg::{closure#0}>::{closure#0}, !>::{closure#0}>::{closure#0}
208.67 s
> 5: <std::sys::sync::once::futex::Once>::call
208.67 s
> 6: <std::sync::once_lock::OnceLock<alloc::string::String>>::initialize::<<std::sync::once_lock::OnceLock<alloc::string::String>>::get_or_init<public_typst_behavior::linnest_public_svg::{closure#0}>::{closure#0}, !>
208.67 s
> 7: <public_typst_behavior::public_linnest_fixture_assertions_hold::{closure#0} as core::ops::function::FnOnce<()>>::call_once
208.67 s
> note: Some details are omitted, run with `RUST_BACKTRACE=full` for a verbose backtrace.
208.67 s
>
208.67 s
> error : test run failed
208.67 s
>
208.67 s
> ========== nextest test summary ==========
208.67 s
> report: target/nextest/ci_gammaloop/junit.xml
208.67 s
> tests: 38, failures: 3, errors: 0
208.67 s
>
208.67 s
> 1. clinnet::public_typst_behavior::public_linnest_labels_follow_their_carriers
208.67 s
> failure: test failure with exit code 101
208.67 s
> thread 'public_linnest_labels_follow_their_carriers' (299) panicked at crates/clinnet/tests/public_typst_behavior.rs:81:55:
208.67 s
> called `Result::unwrap()` on an `Err` value: typst failed while compiling template /build/.tmpfvJk4L/.clinnet/templates/linnest-public-behavior.svg
208.67 s
>
208.67 s
> Command executed:
208.67 s
> "typst" "c" "/build/.tmpfvJk4L/.clinnet/templates/linnest-public-behavior.typ" "/build/.tmpfvJk4L/.clinnet/templates/linnest-public-behavior.svg" "--root" "/build/.tmpfvJk4L/.clinnet/templates"
208.67 s
>
208.67 s
> Typst stdout:
208.67 s
>
208.67 s
>
208.67 s
> Typst stderr:
208.67 s
>
208.67 s
>
208.67 s
> Location:
208.67 s
> crates/clinnet/src/lib.rs:741:13
208.67 s
> stack backtrace:
208.67 s
> 0: __rustc::rust_begin_unwind
208.67 s
> 1: core::panicking::panic_fmt
208.67 s
> 2: core::result::unwrap_failed
208.67 s
> 3: public_typst_behavior::render
208.67 s
> 4: <std::sync::once::Once>::call_once_force::<<std::sync::once_lock::OnceLock<alloc::string::String>>::initialize<<std::sync::once_lock::OnceLock<alloc::string::String>>::get_or_init<public_typst_behavior::linnest_public_svg::{closure#0}>::{closure#0}, !>::{closure#0}>::{closure#0}
208.67 s
> 5: <std::sys::sync::once::futex::Once>::call
208.67 s
> 6: <std::sync::once_lock::OnceLock<alloc::string::String>>::initialize::<<std::sync::once_lock::OnceLock<alloc::string::String>>::get_or_init<public_typst_behavior::linnest_public_svg::{closure#0}>::{closure#0}, !>
208.67 s
> 7: <public_typst_behavior::public_linnest_labels_follow_their_carriers::{closure#0} as core::ops::function::FnOnce<()>>::call_once
208.67 s
> note: Some details are omitted, run with `RUST_BACKTRACE=full` for a verbose backtrace.
208.67 s
> system-out
208.67 s
> running 1 test
208.67 s
> test public_linnest_labels_follow_their_carriers has been running for over 60 seconds
208.67 s
> test public_linnest_labels_follow_their_carriers ... FAILED
208.67 s
>
208.67 s
> failures:
208.67 s
>
208.67 s
> failures:
208.67 s
> public_linnest_labels_follow_their_carriers
208.67 s
>
208.67 s
> test result: FAILED. 0 passed; 1 failed; 0 ignored; 0 measured; 17 filtered out; finished in 94.50s
208.67 s
> system-err
208.67 s
> thread 'public_linnest_labels_follow_their_carriers' (299) panicked at crates/clinnet/tests/public_typst_behavior.rs:81:55:
208.67 s
> called `Result::unwrap()` on an `Err` value: typst failed while compiling template /build/.tmpfvJk4L/.clinnet/templates/linnest-public-behavior.svg
208.67 s
>
208.67 s
> Command executed:
208.67 s
> "typst" "c" "/build/.tmpfvJk4L/.clinnet/templates/linnest-public-behavior.typ" "/build/.tmpfvJk4L/.clinnet/templates/linnest-public-behavior.svg" "--root" "/build/.tmpfvJk4L/.clinnet/templates"
208.67 s
>
208.67 s
> Typst stdout:
208.67 s
>
208.67 s
>
208.67 s
> Typst stderr:
208.67 s
>
208.67 s
>
208.67 s
> Location:
208.67 s
> crates/clinnet/src/lib.rs:741:13
208.67 s
> stack backtrace:
208.67 s
> 0: __rustc::rust_begin_unwind
208.67 s
> 1: core::panicking::panic_fmt
208.67 s
> 2: core::result::unwrap_failed
208.67 s
> 3: public_typst_behavior::render
208.67 s
> 4: <std::sync::once::Once>::call_once_force::<<std::sync::once_lock::OnceLock<alloc::string::String>>::initialize<<std::sync::once_lock::OnceLock<alloc::string::String>>::get_or_init<public_typst_behavior::linnest_public_svg::{closure#0}>::{closure#0}, !>::{closure#0}>::{closure#0}
208.67 s
> 5: <std::sys::sync::once::futex::Once>::call
208.67 s
> 6: <std::sync::once_lock::OnceLock<alloc::string::String>>::initialize::<<std::sync::once_lock::OnceLock<alloc::string::String>>::get_or_init<public_typst_behavior::linnest_public_svg::{closure#0}>::{closure#0}, !>
208.67 s
> 7: <public_typst_behavior::public_linnest_labels_follow_their_carriers::{closure#0} as core::ops::function::FnOnce<()>>::call_once
208.67 s
> note: Some details are omitted, run with `RUST_BACKTRACE=full` for a verbose backtrace.
208.67 s
>
208.67 s
> 2. clinnet::public_typst_behavior::public_linnest_overlays_follow_the_unit
208.67 s
> failure: test failure with exit code 101
208.67 s
> thread 'public_linnest_overlays_follow_the_unit' (311) panicked at crates/clinnet/tests/public_typst_behavior.rs:81:55:
208.67 s
> called `Result::unwrap()` on an `Err` value: typst failed while compiling template /build/.tmpNeMZsp/.clinnet/templates/linnest-public-behavior.svg
208.67 s
>
208.67 s
> Command executed:
208.67 s
> "typst" "c" "/build/.tmpNeMZsp/.clinnet/templates/linnest-public-behavior.typ" "/build/.tmpNeMZsp/.clinnet/templates/linnest-public-behavior.svg" "--root" "/build/.tmpNeMZsp/.clinnet/templates"
208.67 s
>
208.67 s
> Typst stdout:
208.67 s
>
208.67 s
>
208.67 s
> Typst stderr:
208.67 s
>
208.67 s
>
208.67 s
> Location:
208.67 s
> crates/clinnet/src/lib.rs:741:13
208.67 s
> stack backtrace:
208.67 s
> 0: __rustc::rust_begin_unwind
208.67 s
> 1: core::panicking::panic_fmt
208.67 s
> 2: core::result::unwrap_failed
208.67 s
> 3: public_typst_behavior::render
208.67 s
> 4: <std::sync::once::Once>::call_once_force::<<std::sync::once_lock::OnceLock<alloc::string::String>>::initialize<<std::sync::once_lock::OnceLock<alloc::string::String>>::get_or_init<public_typst_behavior::linnest_public_svg::{closure#0}>::{closure#0}, !>::{closure#0}>::{closure#0}
208.67 s
> 5: <std::sys::sync::once::futex::Once>::call
208.67 s
> 6: <std::sync::once_lock::OnceLock<alloc::string::String>>::initialize::<<std::sync::once_lock::OnceLock<alloc::string::String>>::get_or_init<public_typst_behavior::linnest_public_svg::{closure#0}>::{closure#0}, !>
208.67 s
> 7: <public_typst_behavior::public_linnest_overlays_follow_the_unit::{closure#0} as core::ops::function::FnOnce<()>>::call_once
208.67 s
> note: Some details are omitted, run with `RUST_BACKTRACE=full` for a verbose backtrace.
208.67 s
> system-out
208.67 s
> running 1 test
208.67 s
> test public_linnest_overlays_follow_the_unit has been running for over 60 seconds
208.67 s
> test public_linnest_overlays_follow_the_unit ... FAILED
208.67 s
>
208.67 s
> failures:
208.67 s
>
208.67 s
> failures:
208.67 s
> public_linnest_overlays_follow_the_unit
208.67 s
>
208.67 s
> test result: FAILED. 0 passed; 1 failed; 0 ignored; 0 measured; 17 filtered out; finished in 99.20s
208.67 s
> system-err
208.67 s
> thread 'public_linnest_overlays_follow_the_unit' (311) panicked at crates/clinnet/tests/public_typst_behavior.rs:81:55:
208.67 s
> called `Result::unwrap()` on an `Err` value: typst failed while compiling template /build/.tmpNeMZsp/.clinnet/templates/linnest-public-behavior.svg
208.67 s
>
208.67 s
> Command executed:
208.67 s
> "typst" "c" "/build/.tmpNeMZsp/.clinnet/templates/linnest-public-behavior.typ" "/build/.tmpNeMZsp/.clinnet/templates/linnest-public-behavior.svg" "--root" "/build/.tmpNeMZsp/.clinnet/templates"
208.67 s
>
208.67 s
> Typst stdout:
208.67 s
>
208.67 s
>
208.67 s
> Typst stderr:
208.67 s
>
208.67 s
>
208.67 s
> Location:
208.67 s
> crates/clinnet/src/lib.rs:741:13
208.67 s
> stack backtrace:
208.67 s
> 0: __rustc::rust_begin_unwind
208.67 s
> 1: core::panicking::panic_fmt
208.67 s
> 2: core::result::unwrap_failed
208.67 s
> 3: public_typst_behavior::render
208.67 s
> 4: <std::sync::once::Once>::call_once_force::<<std::sync::once_lock::OnceLock<alloc::string::String>>::initialize<<std::sync::once_lock::OnceLock<alloc::string::String>>::get_or_init<public_typst_behavior::linnest_public_svg::{closure#0}>::{closure#0}, !>::{closure#0}>::{closure#0}
208.67 s
> 5: <std::sys::sync::once::futex::Once>::call
208.67 s
> 6: <std::sync::once_lock::OnceLock<alloc::string::String>>::initialize::<<std::sync::once_lock::OnceLock<alloc::string::String>>::get_or_init<public_typst_behavior::linnest_public_svg::{closure#0}>::{closure#0}, !>
208.67 s
> 7: <public_typst_behavior::public_linnest_overlays_follow_the_unit::{closure#0} as core::ops::function::FnOnce<()>>::call_once
208.67 s
> note: Some details are omitted, run with `RUST_BACKTRACE=full` for a verbose backtrace.
208.67 s
>
208.67 s
> 3. clinnet::public_typst_behavior::public_linnest_fixture_assertions_hold
208.67 s
> failure: test failure with exit code 101
208.67 s
> thread 'public_linnest_fixture_assertions_hold' (276) panicked at crates/clinnet/tests/public_typst_behavior.rs:81:55:
208.67 s
> called `Result::unwrap()` on an `Err` value: typst failed while compiling template /build/.tmppXJX7C/.clinnet/templates/linnest-public-behavior.svg
208.67 s
>
208.67 s
> Command executed:
208.67 s
> "typst" "c" "/build/.tmppXJX7C/.clinnet/templates/linnest-public-behavior.typ" "/build/.tmppXJX7C/.clinnet/templates/linnest-public-behavior.svg" "--root" "/build/.tmppXJX7C/.clinnet/templates"
208.67 s
>
208.67 s
> Typst stdout:
208.67 s
>
208.67 s
>
208.67 s
> Typst stderr:
208.67 s
>
208.67 s
>
208.67 s
> Location:
208.67 s
> crates/clinnet/src/lib.rs:741:13
208.67 s
> stack backtrace:
208.67 s
> 0: __rustc::rust_begin_unwind
208.67 s
> 1: core::panicking::panic_fmt
208.67 s
> 2: core::result::unwrap_failed
208.67 s
> 3: public_typst_behavior::render
208.67 s
> 4: <std::sync::once::Once>::call_once_force::<<std::sync::once_lock::OnceLock<alloc::string::String>>::initialize<<std::sync::once_lock::OnceLock<alloc::string::String>>::get_or_init<public_typst_behavior::linnest_public_svg::{closure#0}>::{closure#0}, !>::{closure#0}>::{closure#0}
208.67 s
> 5: <std::sys::sync::once::futex::Once>::call
208.67 s
> 6: <std::sync::once_lock::OnceLock<alloc::string::String>>::initialize::<<std::sync::once_lock::OnceLock<alloc::string::String>>::get_or_init<public_typst_behavior::linnest_public_svg::{closure#0}>::{closure#0}, !>
208.67 s
> 7: <public_typst_behavior::public_linnest_fixture_assertions_hold::{closure#0} as core::ops::function::FnOnce<()>>::call_once
208.67 s
> note: Some details are omitted, run with `RUST_BACKTRACE=full` for a verbose backtrace.
208.67 s
> system-out
208.67 s
> running 1 test
208.67 s
> test public_linnest_fixture_assertions_hold has been running for over 60 seconds
208.67 s
> test public_linnest_fixture_assertions_hold ... FAILED
208.67 s
>
208.67 s
> failures:
208.67 s
>
208.67 s
> failures:
208.67 s
> public_linnest_fixture_assertions_hold
208.67 s
>
208.67 s
> test result: FAILED. 0 passed; 1 failed; 0 ignored; 0 measured; 17 filtered out; finished in 116.28s
208.67 s
> system-err
208.67 s
> thread 'public_linnest_fixture_assertions_hold' (276) panicked at crates/clinnet/tests/public_typst_behavior.rs:81:55:
208.67 s
> called `Result::unwrap()` on an `Err` value: typst failed while compiling template /build/.tmppXJX7C/.clinnet/templates/linnest-public-behavior.svg
208.67 s
>
208.67 s
> Command executed:
208.67 s
> "typst" "c" "/build/.tmppXJX7C/.clinnet/templates/linnest-public-behavior.typ" "/build/.tmppXJX7C/.clinnet/templates/linnest-public-behavior.svg" "--root" "/build/.tmppXJX7C/.clinnet/templates"
208.67 s
>
208.67 s
> Typst stdout:
208.67 s
>
208.67 s
>
208.67 s
> Typst stderr:
208.67 s
>
208.67 s
>
208.67 s
> Location:
208.67 s
> crates/clinnet/src/lib.rs:741:13
208.67 s
> stack backtrace:
208.67 s
> 0: __rustc::rust_begin_unwind
208.67 s
> 1: core::panicking::panic_fmt
208.67 s
> 2: core::result::unwrap_failed
208.67 s
> 3: public_typst_behavior::render
208.67 s
> 4: <std::sync::once::Once>::call_once_force::<<std::sync::once_lock::OnceLock<alloc::string::String>>::initialize<<std::sync::once_lock::OnceLock<alloc::string::String>>::get_or_init<public_typst_behavior::linnest_public_svg::{closure#0}>::{closure#0}, !>::{closure#0}>::{closure#0}
208.67 s
> 5: <std::sys::sync::once::futex::Once>::call
208.67 s
> 6: <std::sync::once_lock::OnceLock<alloc::string::String>>::initialize::<<std::sync::once_lock::OnceLock<alloc::string::String>>::get_or_init<public_typst_behavior::linnest_public_svg::{closure#0}>::{closure#0}, !>
208.67 s
> 7: <public_typst_behavior::public_linnest_fixture_assertions_hold::{closure#0} as core::ops::function::FnOnce<()>>::call_once
208.67 s
> note: Some details are omitted, run with `RUST_BACKTRACE=full` for a verbose backtrace.
208.67 s
> =========================================
208.67 s
For full logs, run:
208.67 s
nix log /nix/store/4pqspwvh8pi9s2vg9g6mfsggpl9ynwzx-gammaloop-nextest-clinnet.drv
209.05 s
[3 built (1 failed ), 75 Run failed.