test packages.x86_64-linux.nix-ci-check-gammaloop-nextest-spenso
1.66 s
$ /nix/store/9ypz3flqsrl5xl495mm8h645gadjsxi1-coreutils-9.11/bin/timeout --kill-after=15s 7200s /nix/store/23zk8sgzamrbmj1fday15szf7f2279s8-nix-2.34.7/bin/nix --extra-experimental-features nix-command --extra-experimental-features flakes flake clone git+https://github.com/alphal00p/gammaloop --dest /tmp/nix-ci-worker/stable-pwd/repo/
2.65 s
Cloning into '/tmp/nix-ci-worker/stable-pwd/repo'...
2.65 s
remote: Enumerating objects: 65014, done.
2.65 s
remote: Counting objects: 0% (1/7686)
remote: Counting objects: 1% (77/7686)
remote: Counting objects: 2% (154/7686)
remote: Counting objects: 3% (231/7686)
remote: Counting objects: 4% (308/7686)
remote: Counting objects: 5% (385/7686)
remote: Counting objects: 6% (462/7686)
remote: Counting objects: 7% (539/7686)
remote: Counting objects: 8% (615/7686)
remote: Counting objects: 9% (692/7686)
remote: Counting objects: 10% (769/7686)
remote: Counting objects: 11% (846/7686)
remote: Counting objects: 12% (923/7686)
remote: Counting objects: 13% (1000/7686)
remote: Counting objects: 14% (1077/7686)
remote: Counting objects: 15% (1153/7686)
remote: Counting objects: 16% (1230/7686)
remote: Counting objects: 17% (1307/7686)
remote: Counting objects: 18% (1384/7686)
remote: Counting objects: 19% (1461/7686)
remote: Counting objects: 20% (1538/7686)
remote: Counting objects: 21% (1615/7686)
remote: Counting objects: 22% (1691/7686)
remote: Counting objects: 23% (1768/7686)
remote: Counting objects: 24% (1845/7686)
remote: Counting objects: 25% (1922/7686)
remote: Counting objects: 26% (1999/7686)
remote: Counting objects: 27% (2076/7686)
remote: Counting objects: 28% (2153/7686)
remote: Counting objects: 29% (2229/7686)
remote: Counting objects: 30% (2306/7686)
remote: Counting objects: 31% (2383/7686)
remote: Counting objects: 32% (2460/7686)
remote: Counting objects: 33% (2537/7686)
remote: Counting objects: 34% (2614/7686)
remote: Counting objects: 35% (2691/7686)
remote: Counting objects: 36% (2767/7686)
remote: Counting objects: 37% (2844/7686)
remote: Counting objects: 38% (2921/7686)
remote: Counting objects: 39% (2998/7686)
remote: Counting objects: 40% (3075/7686)
remote: Counting objects: 41% (3152/7686)
remote: Counting objects: 42% (3229/7686)
remote: Counting objects: 43% (3305/7686)
remote: Counting objects: 44% (3382/7686)
remote: Counting objects: 45% (3459/7686)
remote: Counting objects: 46% (3536/7686)
remote: Counting objects: 47% (3613/7686)
remote: Counting objects: 48% (3690/7686)
remote: Counting objects: 49% (3767/7686)
remote: Counting objects: 50% (3843/7686)
remote: Counting objects: 51% (3920/7686)
remote: Counting objects: 52% (3997/7686)
remote: Counting objects: 53% (4074/7686)
remote: Counting objects: 54% (4151/7686)
remote: Counting objects: 55% (4228/7686)
remote: Counting objects: 56% (4305/7686)
remote: Counting objects: 57% (4382/7686)
remote: Counting objects: 58% (4458/7686)
remote: Counting objects: 59% (4535/7686)
remote: Counting objects: 60% (4612/7686)
remote: Counting objects: 61% (4689/7686)
remote: Counting objects: 62% (4766/7686)
remote: Counting objects: 63% (4843/7686)
remote: Counting objects: 64% (4920/7686)
remote: Counting objects: 65% (4996/7686)
remote: Counting objects: 66% (5073/7686)
remote: Counting objects: 67% (5150/7686)
remote: Counting objects: 68% (5227/7686)
remote: Counting objects: 69% (5304/7686)
remote: Counting objects: 70% (5381/7686)
remote: Counting objects: 71% (5458/7686)
remote: Counting objects: 72% (5534/7686)
remote: Counting objects: 73% (5611/7686)
remote: Counting objects: 74% (5688/7686)
remote: Counting objects: 75% (5765/7686)
remote: Counting objects: 76% (5842/7686)
remote: Counting objects: 77% (5919/7686)
remote: Counting objects: 78% (5996/7686)
remote: Counting objects: 79% (6072/7686)
remote: Counting objects: 80% (6149/7686)
remote: Counting objects: 81% (6226/7686)
remote: Counting objects: 82% (6303/7686)
remote: Counting objects: 83% (6380/7686)
remote: Counting objects: 84% (6457/7686)
remote: Counting objects: 85% (6534/7686)
remote: Counting objects: 86% (6610/7686)
remote: Counting objects: 87% (6687/7686)
remote: Counting objects: 88% (6764/7686)
remote: Counting objects: 89% (6841/7686)
remote: Counting objects: 90% (6918/7686)
remote: Counting objects: 91% (6995/7686)
remote: Counting objects: 92% (7072/7686)
remote: Counting objects: 93% (7148/7686)
remote: Counting objects: 94% (7225/7686)
remote: Counting objects: 95% (7302/7686)
remote: Counting objects: 96% (7379/7686)
remote: Counting objects: 97% (7456/7686)
remote: Counting objects: 98% (7533/7686)
remote: Counting objects: 99% (7610/7686)
remote: Counting objects: 100% (7686/7686)
remote: Counting objects: 100% (7686/7686), done.
2.65 s
remote: Compressing objects: 0% (1/1402)
remote: Compressing objects: 1% (15/1402)
remote: Compressing objects: 2% (29/1402)
remote: Compressing objects: 3% (43/1402)
remote: Compressing objects: 4% (57/1402)
remote: Compressing objects: 5% (71/1402)
remote: Compressing objects: 6% (85/1402)
remote: Compressing objects: 7% (99/1402)
remote: Compressing objects: 8% (113/1402)
remote: Compressing objects: 9% (127/1402)
remote: Compressing objects: 10% (141/1402)
remote: Compressing objects: 11% (155/1402)
remote: Compressing objects: 12% (169/1402)
remote: Compressing objects: 12% (170/1402)
remote: Compressing objects: 13% (183/1402)
remote: Compressing objects: 14% (197/1402)
remote: Compressing objects: 15% (211/1402)
remote: Compressing objects: 16% (225/1402)
remote: Compressing objects: 17% (239/1402)
remote: Compressing objects: 18% (253/1402)
remote: Compressing objects: 19% (267/1402)
remote: Compressing objects: 20% (281/1402)
remote: Compressing objects: 21% (295/1402)
remote: Compressing objects: 22% (309/1402)
remote: Compressing objects: 23% (323/1402)
remote: Compressing objects: 24% (337/1402)
remote: Compressing objects: 25% (351/1402)
remote: Compressing objects: 26% (365/1402)
remote: Compressing objects: 27% (379/1402)
remote: Compressing objects: 28% (393/1402)
remote: Compressing objects: 29% (407/1402)
remote: Compressing objects: 30% (421/1402)
remote: Compressing objects: 31% (435/1402)
remote: Compressing objects: 32% (449/1402)
remote: Compressing objects: 33% (463/1402)
remote: Compressing objects: 34% (477/1402)
remote: Compressing objects: 35% (491/1402)
remote: Compressing objects: 36% (505/1402)
remote: Compressing objects: 37% (519/1402)
remote: Compressing objects: 38% (533/1402)
remote: Compressing objects: 39% (547/1402)
remote: Compressing objects: 40% (561/1402)
remote: Compressing objects: 41% (575/1402)
remote: Compressing objects: 42% (589/1402)
remote: Compressing objects: 43% (603/1402)
remote: Compressing objects: 44% (617/1402)
remote: Compressing objects: 45% (631/1402)
remote: Compressing objects: 46% (645/1402)
remote: Compressing objects: 47% (659/1402)
remote: Compressing objects: 48% (673/1402)
remote: Compressing objects: 49% (687/1402)
remote: Compressing objects: 50% (701/1402)
remote: Compressing objects: 51% (716/1402)
remote: Compressing objects: 52% (730/1402)
remote: Compressing objects: 53% (744/1402)
remote: Compressing objects: 54% (758/1402)
remote: Compressing objects: 55% (772/1402)
remote: Compressing objects: 56% (786/1402)
remote: Compressing objects: 57% (800/1402)
remote: Compressing objects: 58% (814/1402)
remote: Compressing objects: 59% (828/1402)
remote: Compressing objects: 60% (842/1402)
remote: Compressing objects: 61% (856/1402)
remote: Compressing objects: 62% (870/1402)
remote: Compressing objects: 63% (884/1402)
remote: Compressing objects: 64% (898/1402)
remote: Compressing objects: 65% (912/1402)
remote: Compressing objects: 66% (926/1402)
remote: Compressing objects: 67% (940/1402)
remote: Compressing objects: 68% (954/1402)
remote: Compressing objects: 69% (968/1402)
remote: Compressing objects: 70% (982/1402)
remote: Compressing objects: 71% (996/1402)
remote: Compressing objects: 72% (1010/1402)
remote: Compressing objects: 73% (1024/1402)
remote: Compressing objects: 74% (1038/1402)
remote: Compressing objects: 75% (1052/1402)
remote: Compressing objects: 76% (1066/1402)
remote: Compressing objects: 77% (1080/1402)
remote: Compressing objects: 78% (1094/1402)
remote: Compressing objects: 79% (1108/1402)
remote: Compressing objects: 80% (1122/1402)
remote: Compressing objects: 81% (1136/1402)
remote: Compressing objects: 82% (1150/1402)
remote: Compressing objects: 83% (1164/1402)
remote: Compressing objects: 84% (1178/1402)
remote: Compressing objects: 85% (1192/1402)
remote: Compressing objects: 86% (1206/1402)
remote: Compressing objects: 87% (1220/1402)
remote: Compressing objects: 88% (1234/1402)
remote: Compressing objects: 89% (1248/1402)
remote: Compressing objects: 90% (1262/1402)
remote: Compressing objects: 91% (1276/1402)
remote: Compressing objects: 92% (1290/1402)
remote: Compressing objects: 93% (1304/1402)
remote: Compressing objects: 94% (1318/1402)
remote: Compressing objects: 95% (1332/1402)
remote: Compressing objects: 96% (1346/1402)
remote: Compressing objects: 97% (1360/1402)
remote: Compressing objects: 98% (1374/1402)
remote: Compressing objects: 99% (1388/1402)
remote: Compressing objects: 100% (1402/1402)
remote: Compressing objects: 100% (1402/1402), done.
4.67 s
Receiving objects: 0% (1/65014)
Receiving objects: 1% (651/65014)
Receiving objects: 2% (1301/65014)
Receiving objects: 3% (1951/65014)
Receiving objects: 4% (2601/65014)
Receiving objects: 5% (3251/65014)
Receiving objects: 6% (3901/65014)
Receiving objects: 7% (4551/65014)
Receiving objects: 8% (5202/65014)
Receiving objects: 9% (5852/65014)
Receiving objects: 10% (6502/65014)
Receiving objects: 11% (7152/65014)
Receiving objects: 12% (7802/65014), 16.19 MiB | 32.36 MiB/s
Receiving objects: 13% (8452/65014), 16.19 MiB | 32.36 MiB/s
Receiving objects: 14% (9102/65014), 16.19 MiB | 32.36 MiB/s
Receiving objects: 15% (9753/65014), 16.19 MiB | 32.36 MiB/s
Receiving objects: 16% (10403/65014), 16.19 MiB | 32.36 MiB/s
Receiving objects: 17% (11053/65014), 16.19 MiB | 32.36 MiB/s
Receiving objects: 18% (11703/65014), 16.19 MiB | 32.36 MiB/s
Receiving objects: 19% (12353/65014), 16.19 MiB | 32.36 MiB/s
Receiving objects: 20% (13003/65014), 16.19 MiB | 32.36 MiB/s
Receiving objects: 21% (13653/65014), 16.19 MiB | 32.36 MiB/s
Receiving objects: 22% (14304/65014), 16.19 MiB | 32.36 MiB/s
Receiving objects: 23% (14954/65014), 16.19 MiB | 32.36 MiB/s
Receiving objects: 24% (15604/65014), 16.19 MiB | 32.36 MiB/s
Receiving objects: 25% (16254/65014), 16.19 MiB | 32.36 MiB/s
Receiving objects: 26% (16904/65014), 16.19 MiB | 32.36 MiB/s
Receiving objects: 27% (17554/65014), 16.19 MiB | 32.36 MiB/s
Receiving objects: 28% (18204/65014), 16.19 MiB | 32.36 MiB/s
Receiving objects: 29% (18855/65014), 16.19 MiB | 32.36 MiB/s
Receiving objects: 30% (19505/65014), 16.19 MiB | 32.36 MiB/s
Receiving objects: 31% (20155/65014), 16.19 MiB | 32.36 MiB/s
Receiving objects: 32% (20805/65014), 16.19 MiB | 32.36 MiB/s
Receiving objects: 33% (21455/65014), 16.19 MiB | 32.36 MiB/s
Receiving objects: 34% (22105/65014), 16.19 MiB | 32.36 MiB/s
Receiving objects: 35% (22755/65014), 16.19 MiB | 32.36 MiB/s
Receiving objects: 36% (23406/65014), 16.19 MiB | 32.36 MiB/s
Receiving objects: 37% (24056/65014), 16.19 MiB | 32.36 MiB/s
Receiving objects: 38% (24706/65014), 16.19 MiB | 32.36 MiB/s
Receiving objects: 39% (25356/65014), 16.19 MiB | 32.36 MiB/s
Receiving objects: 40% (26006/65014), 16.19 MiB | 32.36 MiB/s
Receiving objects: 41% (26656/65014), 16.19 MiB | 32.36 MiB/s
Receiving objects: 42% (27306/65014), 16.19 MiB | 32.36 MiB/s
Receiving objects: 43% (27957/65014), 16.19 MiB | 32.36 MiB/s
Receiving objects: 44% (28607/65014), 16.19 MiB | 32.36 MiB/s
Receiving objects: 45% (29257/65014), 16.19 MiB | 32.36 MiB/s
Receiving objects: 46% (29907/65014), 16.19 MiB | 32.36 MiB/s
Receiving objects: 47% (30557/65014), 16.19 MiB | 32.36 MiB/s
Receiving objects: 48% (31207/65014), 16.19 MiB | 32.36 MiB/s
Receiving objects: 49% (31857/65014), 16.19 MiB | 32.36 MiB/s
Receiving objects: 50% (32507/65014), 16.19 MiB | 32.36 MiB/s
Receiving objects: 51% (33158/65014), 16.19 MiB | 32.36 MiB/s
Receiving objects: 52% (33808/65014), 16.19 MiB | 32.36 MiB/s
Receiving objects: 52% (34356/65014), 35.72 MiB | 35.71 MiB/s
Receiving objects: 53% (34458/65014), 35.72 MiB | 35.71 MiB/s
Receiving objects: 54% (35108/65014), 35.72 MiB | 35.71 MiB/s
Receiving objects: 55% (35758/65014), 35.72 MiB | 35.71 MiB/s
Receiving objects: 56% (36408/65014), 35.72 MiB | 35.71 MiB/s
Receiving objects: 57% (37058/65014), 35.72 MiB | 35.71 MiB/s
Receiving objects: 58% (37709/65014), 35.72 MiB | 35.71 MiB/s
Receiving objects: 59% (38359/65014), 35.72 MiB | 35.71 MiB/s
Receiving objects: 60% (39009/65014), 35.72 MiB | 35.71 MiB/s
Receiving objects: 61% (39659/65014), 35.72 MiB | 35.71 MiB/s
Receiving objects: 62% (40309/65014), 35.72 MiB | 35.71 MiB/s
Receiving objects: 63% (40959/65014), 35.72 MiB | 35.71 MiB/s
Receiving objects: 64% (41609/65014), 35.72 MiB | 35.71 MiB/s
Receiving objects: 65% (42260/65014), 35.72 MiB | 35.71 MiB/s
Receiving objects: 66% (42910/65014), 35.72 MiB | 35.71 MiB/s
Receiving objects: 67% (43560/65014), 35.72 MiB | 35.71 MiB/s
Receiving objects: 68% (44210/65014), 35.72 MiB | 35.71 MiB/s
Receiving objects: 69% (44860/65014), 35.72 MiB | 35.71 MiB/s
Receiving objects: 70% (45510/65014), 54.32 MiB | 35.69 MiB/s
Receiving objects: 71% (46160/65014), 54.32 MiB | 35.69 MiB/s
Receiving objects: 72% (46811/65014), 54.32 MiB | 35.69 MiB/s
Receiving objects: 73% (47461/65014), 54.32 MiB | 35.69 MiB/s
Receiving objects: 74% (48111/65014), 54.32 MiB | 35.69 MiB/s
Receiving objects: 75% (48761/65014), 54.32 MiB | 35.69 MiB/s
Receiving objects: 76% (49411/65014), 54.32 MiB | 35.69 MiB/s
Receiving objects: 77% (50061/65014), 54.32 MiB | 35.69 MiB/s
Receiving objects: 78% (50711/65014), 54.32 MiB | 35.69 MiB/s
Receiving objects: 78% (50737/65014), 54.32 MiB | 35.69 MiB/s
Receiving objects: 79% (51362/65014), 54.32 MiB | 35.69 MiB/s
Receiving objects: 80% (52012/65014), 73.16 MiB | 36.19 MiB/s
Receiving objects: 81% (52662/65014), 73.16 MiB | 36.19 MiB/s
Receiving objects: 82% (53312/65014), 73.16 MiB | 36.19 MiB/s
Receiving objects: 83% (53962/65014), 73.16 MiB | 36.19 MiB/s
Receiving objects: 84% (54612/65014), 73.16 MiB | 36.19 MiB/s
Receiving objects: 85% (55262/65014), 73.16 MiB | 36.19 MiB/s
Receiving objects: 86% (55913/65014), 73.16 MiB | 36.19 MiB/s
Receiving objects: 87% (56563/65014), 73.16 MiB | 36.19 MiB/s
Receiving objects: 88% (57213/65014), 73.16 MiB | 36.19 MiB/s
Receiving objects: 89% (57863/65014), 73.16 MiB | 36.19 MiB/s
Receiving objects: 90% (58513/65014), 73.16 MiB | 36.19 MiB/s
Receiving objects: 91% (59163/65014), 73.16 MiB | 36.19 MiB/s
Receiving objects: 92% (59813/65014), 73.16 MiB | 36.19 MiB/s
Receiving objects: 93% (60464/65014), 73.16 MiB | 36.19 MiB/s
Receiving objects: 94% (61114/65014), 73.16 MiB | 36.19 MiB/s
Receiving objects: 95% (61764/65014), 73.16 MiB | 36.19 MiB/s
Receiving objects: 96% (62414/65014), 73.16 MiB | 36.19 MiB/s
Receiving objects: 97% (63064/65014), 73.16 MiB | 36.19 MiB/s
Receiving objects: 98% (63714/65014), 73.16 MiB | 36.19 MiB/s
Receiving objects: 99% (64364/65014), 73.16 MiB | 36.19 MiB/s
remote: Total 65014 (delta 6802), reused 6284 (delta 6284), pack-reused 57328 (from 1)
4.67 s
Receiving objects: 100% (65014/65014), 73.16 MiB | 36.19 MiB/s
Receiving objects: 100% (65014/65014), 86.90 MiB | 35.81 MiB/s, done.
5.39 s
Resolving deltas: 0% (0/45899)
Resolving deltas: 1% (459/45899)
Resolving deltas: 2% (918/45899)
Resolving deltas: 3% (1378/45899)
Resolving deltas: 4% (1836/45899)
Resolving deltas: 5% (2295/45899)
Resolving deltas: 6% (2754/45899)
Resolving deltas: 7% (3213/45899)
Resolving deltas: 8% (3672/45899)
Resolving deltas: 9% (4131/45899)
Resolving deltas: 10% (4590/45899)
Resolving deltas: 11% (5049/45899)
Resolving deltas: 12% (5508/45899)
Resolving deltas: 13% (5967/45899)
Resolving deltas: 14% (6426/45899)
Resolving deltas: 15% (6887/45899)
Resolving deltas: 16% (7344/45899)
Resolving deltas: 17% (7803/45899)
Resolving deltas: 18% (8262/45899)
Resolving deltas: 19% (8721/45899)
Resolving deltas: 20% (9180/45899)
Resolving deltas: 21% (9639/45899)
Resolving deltas: 22% (10099/45899)
Resolving deltas: 23% (10557/45899)
Resolving deltas: 24% (11017/45899)
Resolving deltas: 25% (11480/45899)
Resolving deltas: 26% (11935/45899)
Resolving deltas: 27% (12393/45899)
Resolving deltas: 28% (12852/45899)
Resolving deltas: 29% (13311/45899)
Resolving deltas: 30% (13770/45899)
Resolving deltas: 31% (14229/45899)
Resolving deltas: 32% (14690/45899)
Resolving deltas: 33% (15147/45899)
Resolving deltas: 34% (15608/45899)
Resolving deltas: 35% (16065/45899)
Resolving deltas: 36% (16524/45899)
Resolving deltas: 37% (16984/45899)
Resolving deltas: 38% (17442/45899)
Resolving deltas: 39% (17901/45899)
Resolving deltas: 40% (18363/45899)
Resolving deltas: 41% (18820/45899)
Resolving deltas: 42% (19278/45899)
Resolving deltas: 43% (19737/45899)
Resolving deltas: 44% (20196/45899)
Resolving deltas: 45% (20655/45899)
Resolving deltas: 46% (21115/45899)
Resolving deltas: 47% (21573/45899)
Resolving deltas: 48% (22032/45899)
Resolving deltas: 49% (22492/45899)
Resolving deltas: 50% (22950/45899)
Resolving deltas: 51% (23409/45899)
Resolving deltas: 52% (23868/45899)
Resolving deltas: 53% (24327/45899)
Resolving deltas: 54% (24787/45899)
Resolving deltas: 55% (25245/45899)
Resolving deltas: 56% (25704/45899)
Resolving deltas: 57% (26163/45899)
Resolving deltas: 58% (26623/45899)
Resolving deltas: 59% (27081/45899)
Resolving deltas: 60% (27540/45899)
Resolving deltas: 61% (28000/45899)
Resolving deltas: 62% (28458/45899)
Resolving deltas: 63% (28917/45899)
Resolving deltas: 64% (29376/45899)
Resolving deltas: 65% (29835/45899)
Resolving deltas: 66% (30294/45899)
Resolving deltas: 67% (30753/45899)
Resolving deltas: 68% (31212/45899)
Resolving deltas: 69% (31671/45899)
Resolving deltas: 70% (32130/45899)
Resolving deltas: 71% (32589/45899)
Resolving deltas: 72% (33054/45899)
Resolving deltas: 73% (33507/45899)
Resolving deltas: 74% (33966/45899)
Resolving deltas: 75% (34425/45899)
Resolving deltas: 76% (34884/45899)
Resolving deltas: 77% (35343/45899)
Resolving deltas: 78% (35802/45899)
Resolving deltas: 79% (36261/45899)
Resolving deltas: 80% (36720/45899)
Resolving deltas: 81% (37179/45899)
Resolving deltas: 82% (37639/45899)
Resolving deltas: 83% (38097/45899)
Resolving deltas: 84% (38556/45899)
Resolving deltas: 85% (39015/45899)
Resolving deltas: 86% (39474/45899)
Resolving deltas: 87% (39933/45899)
Resolving deltas: 88% (40392/45899)
Resolving deltas: 89% (40851/45899)
Resolving deltas: 90% (41310/45899)
Resolving deltas: 91% (41769/45899)
Resolving deltas: 92% (42228/45899)
Resolving deltas: 93% (42687/45899)
Resolving deltas: 94% (43148/45899)
Resolving deltas: 95% (43605/45899)
Resolving deltas: 96% (44064/45899)
Resolving deltas: 97% (44523/45899)
Resolving deltas: 98% (44982/45899)
Resolving deltas: 99% (45441/45899)
Resolving deltas: 100% (45899/45899)
Resolving deltas: 100% (45899/45899), done.
5.72 s
Fetching commit 185337f01e5e562fa8f23f8e846b12c2a0cd39cc for vakint_rustred ...
5.72 s
$ /nix/store/bcnisk3ydfgv26v2gw3zlky24g00yww2-git-2.54.0/bin/git fetch origin 185337f01e5e562fa8f23f8e846b12c2a0cd39cc
6.12 s
From https://github.com/alphal00p/gammaloop
6.12 s
* branch 185337f01e5e562fa8f23f8e846b12c2a0cd39cc -> FETCH_HEAD
6.13 s
$ /nix/store/9ypz3flqsrl5xl495mm8h645gadjsxi1-coreutils-9.11/bin/timeout --kill-after=15s 7200s /nix/store/bcnisk3ydfgv26v2gw3zlky24g00yww2-git-2.54.0/bin/git -c advice.detachedHead=false checkout 185337f01e5e562fa8f23f8e846b12c2a0cd39cc
6.29 s
HEAD is now at 185337f0 Add RustRed tensor reduction mode boundary
6.29 s
$ /nix/store/9ypz3flqsrl5xl495mm8h645gadjsxi1-coreutils-9.11/bin/timeout --kill-after=15s 7200s /nix/store/23zk8sgzamrbmj1fday15szf7f2279s8-nix-2.34.7/bin/nix --extra-experimental-features nix-command --extra-experimental-features flakes --log-format internal-json run .#packages.x86_64-linux.nix-ci-check-gammaloop-nextest-spenso --print-build-logs
9.68 s
13.62 s
evaluating derivation 'g
copying '/nix/store/9ycf
evaluating derivation 'g
copying '/nix/store/9ycf
evaluating derivation 'g
[0 /1 built]
[1 /0 /1 built] building g gammaloop-nextest-spenso> Extracting 5 binaries and 2 linked paths to /build/nextest-archive-BFEfRg
13.80 s
gammaloop-nextest-spenso> Extracted 19 files to /build/nextest-archive-BFEfRg in 0.18s
13.81 s
gammaloop-nextest-spenso> ------------
13.81 s
gammaloop-nextest-spenso> Nextest run ID 9bb61e44-86ab-4dd8-8a41-4d487e1c706c with nextest profile: ci_gammaloop
13.81 s
gammaloop-nextest-spenso> Starting 224 tests across 5 binaries (26 tests skipped , including 2 tests via profile.ci_gammaloop.default-filter )
13.91 s
gammaloop-nextest-spenso> FAIL [ 0.012s] ( 47/224) idenso color::test::form_reference :: metric_contraction_respects_antisymmetric_normalization
13.91 s
gammaloop-nextest-spenso> stdout ---
13.91 s
gammaloop-nextest-spenso>
13.91 s
gammaloop-nextest-spenso> running 1 test
13.91 s
gammaloop-nextest-spenso> test color::test::form_reference::metric_contraction_respects_antisymmetric_normalization ... FAILED
13.91 s
gammaloop-nextest-spenso>
13.91 s
gammaloop-nextest-spenso> failures:
13.91 s
gammaloop-nextest-spenso>
13.91 s
gammaloop-nextest-spenso> failures:
13.91 s
gammaloop-nextest-spenso> color::test::form_reference::metric_contraction_respects_antisymmetric_normalization
13.91 s
gammaloop-nextest-spenso>
13.91 s
gammaloop-nextest-spenso> test result: FAILED. 0 passed; 1 failed; 0 ignored; 0 measured; 240 filtered out; finished in 0.00s
13.91 s
gammaloop-nextest-spenso>
13.91 s
gammaloop-nextest-spenso> stderr ---
13.91 s
gammaloop-nextest-spenso>
13.91 s
gammaloop-nextest-spenso> thread 'color::test::form_reference::metric_contraction_respects_antisymmetric_normalization' (341) panicked at crates/idenso/src/color/test/form_reference.rs:171:5:
13.91 s
gammaloop-nextest-spenso> assertion `left == right` failed
13.91 s
gammaloop-nextest-spenso> left: "-1*f(coad(8,standalone_metric_j),coad(8,standalone_metric_s),coad(8,standalone_metric_u))"
13.91 s
gammaloop-nextest-spenso> right: "f(coad(8,standalone_metric_j),coad(8,standalone_metric_s),coad(8,standalone_metric_u))"
13.91 s
gammaloop-nextest-spenso> stack backtrace:
13.91 s
gammaloop-nextest-spenso> 0: __rustc::rust_begin_unwind
13.91 s
gammaloop-nextest-spenso> 1: core::panicking::panic_fmt
13.91 s
gammaloop-nextest-spenso> 2: core::panicking::assert_failed_inner
13.91 s
gammaloop-nextest-spenso> 3: core::panicking::assert_failed::<alloc::string::String, alloc::string::String>
13.91 s
gammaloop-nextest-spenso> 4: idenso::color::test::form_reference::metric_contraction_respects_antisymmetric_normalization
13.91 s
gammaloop-nextest-spenso> 5: <idenso::color::test::form_reference::metric_contraction_respects_antisymmetric_normalization::{closure#0} as core::ops::function::FnOnce<()>>::call_once
13.91 s
gammaloop-nextest-spenso> note: Some details are omitted, run with `RUST_BACKTRACE=full` for a verbose backtrace.
13.91 s
gammaloop-nextest-spenso>
14.17 s
gammaloop-nextest-spenso> FAIL [ 0.047s] (220/224) idenso tensor::tests::parsing :: infinite_execution
14.17 s
gammaloop-nextest-spenso> stdout ---
14.17 s
gammaloop-nextest-spenso>
14.17 s
gammaloop-nextest-spenso> running 1 test
14.17 s
gammaloop-nextest-spenso> ━━━━━━━━━━━━━━━━━━━━━━━━━━━━━━━ Snapshot Summary ━━━━━━━━━━━━━━━━━━━━━━━━━━━━━━━
14.17 s
gammaloop-nextest-spenso> Snapshot: infinite_execution
14.17 s
gammaloop-nextest-spenso> Source: crates/idenso/src/tensor/tests/parsing.rs:910
14.17 s
gammaloop-nextest-spenso> ────────────────────────────────────────────────────────────────────────────────
14.17 s
gammaloop-nextest-spenso> Expression: net_iter.snapshot_dot()
14.17 s
gammaloop-nextest-spenso> ────────────────────────────────────────────────────────────────────────────────
14.17 s
gammaloop-nextest-spenso> -old snapshot
14.17 s
gammaloop-nextest-spenso> +new results
14.17 s
gammaloop-nextest-spenso> ────────────┬───────────────────────────────────────────────────────────────────
14.17 s
gammaloop-nextest-spenso> 8 8 │ 0:0:s -> ext0 [id=0 color="red"];
14.17 s
gammaloop-nextest-spenso> 9 9 │ ext1 [style=invis];
14.17 s
gammaloop-nextest-spenso> 10 10 │ 0:5:s -> ext1 [id=1 dir=none color="red" label="mink4|l_0"];
14.17 s
gammaloop-nextest-spenso> 11 11 │ ext2 [style=invis];
14.17 s
gammaloop-nextest-spenso> 12 │- 0:4:s -> ext2 [id=2 dir=none color="red" label="bis4|l_2"];
14.17 s
gammaloop-nextest-spenso> 12 │+ 0:3:s -> ext2 [id=2 dir=none color="red" label="mink4|l_1"];
14.17 s
gammaloop-nextest-spenso> 13 13 │ ext3 [style=invis];
14.17 s
gammaloop-nextest-spenso> 14 │- 0:3:s -> ext3 [id=3 dir=none color="red" label="bis4|l_3"];
14.17 s
gammaloop-nextest-spenso> 14 │+ 0:1:s -> ext3 [id=3 dir=none color="red" label="bis4|l_2"];
14.17 s
gammaloop-nextest-spenso> 15 15 │ ext4 [style=invis];
14.17 s
gammaloop-nextest-spenso> 16 │- 0:1:s -> ext4 [id=4 dir=none color="red" label="mink4|l_1"];
14.17 s
gammaloop-nextest-spenso> 16 │+ 0:2:s -> ext4 [id=4 dir=none color="red" label="mink4|l_4"];
14.17 s
gammaloop-nextest-spenso> 17 17 │ ext5 [style=invis];
14.17 s
gammaloop-nextest-spenso> 18 │- 0:2:s -> ext5 [id=5 dir=none color="red" label="mink4|l_4"];
14.17 s
gammaloop-nextest-spenso> 18 │+ 0:4:s -> ext5 [id=5 dir=none color="red" label="bis4|l_3"];
14.17 s
gammaloop-nextest-spenso> 19 19 │ }
14.17 s
gammaloop-nextest-spenso> ────────────┴───────────────────────────────────────────────────────────────────
14.17 s
gammaloop-nextest-spenso> To update snapshots run `cargo insta review`
14.17 s
gammaloop-nextest-spenso> Stopped on the first failure. Run `cargo insta test` to run all snapshots.
14.17 s
gammaloop-nextest-spenso> test tensor::tests::parsing::infinite_execution ... FAILED
14.17 s
gammaloop-nextest-spenso>
14.17 s
gammaloop-nextest-spenso> failures:
14.17 s
gammaloop-nextest-spenso>
14.17 s
gammaloop-nextest-spenso> failures:
14.17 s
gammaloop-nextest-spenso> tensor::tests::parsing::infinite_execution
14.17 s
gammaloop-nextest-spenso>
14.17 s
gammaloop-nextest-spenso> test result: FAILED. 0 passed; 1 failed; 0 ignored; 0 measured; 240 filtered out; finished in 0.04s
14.17 s
gammaloop-nextest-spenso>
14.17 s
gammaloop-nextest-spenso> stderr ---
14.17 s
gammaloop-nextest-spenso>
14.17 s
gammaloop-nextest-spenso> thread 'tensor::tests::parsing::infinite_execution' (829) panicked at /nix/store/5nq6hmff26w9jbhbmba4wsvgnvglj2xd-vendor-cargo-deps/c19b7c6f923b580ac259164a89f2577984ad5ab09ee9d583b888f934adbbe8d0/insta-1.47.2/src/runtime.rs:719:13:
14.17 s
gammaloop-nextest-spenso> snapshot assertion for 'infinite_execution' failed in line 910
14.17 s
gammaloop-nextest-spenso> stack backtrace:
14.17 s
gammaloop-nextest-spenso> 0: __rustc::rust_begin_unwind
14.17 s
gammaloop-nextest-spenso> 1: core::panicking::panic_fmt
14.17 s
gammaloop-nextest-spenso> 2: insta::runtime::assert_snapshot
14.17 s
gammaloop-nextest-spenso> 3: idenso::tensor::tests::parsing::infinite_execution
14.17 s
gammaloop-nextest-spenso> 4: <idenso::tensor::tests::parsing::infinite_execution::{closure#0} as core::ops::function::FnOnce<()>>::call_once
14.17 s
gammaloop-nextest-spenso> note: Some details are omitted, run with `RUST_BACKTRACE=full` for a verbose backtrace.
14.17 s
gammaloop-nextest-spenso>
15.54 s
gammaloop-nextest-spenso> ------------
15.54 s
gammaloop-nextest-spenso> Summary [ 1.725s] 224 tests run: 222 passed , 2 failed , 26 skipped
15.54 s
gammaloop-nextest-spenso> FAIL [ 0.012s] ( 47/224) idenso color::test::form_reference :: metric_contraction_respects_antisymmetric_normalization
15.54 s
gammaloop-nextest-spenso> stdout ---
15.54 s
gammaloop-nextest-spenso>
15.54 s
gammaloop-nextest-spenso> running 1 test
15.54 s
gammaloop-nextest-spenso> test color::test::form_reference::metric_contraction_respects_antisymmetric_normalization ... FAILED
15.54 s
gammaloop-nextest-spenso>
15.54 s
gammaloop-nextest-spenso> failures:
15.54 s
gammaloop-nextest-spenso>
15.54 s
gammaloop-nextest-spenso> failures:
15.54 s
gammaloop-nextest-spenso> color::test::form_reference::metric_contraction_respects_antisymmetric_normalization
15.54 s
gammaloop-nextest-spenso>
15.54 s
gammaloop-nextest-spenso> test result: FAILED. 0 passed; 1 failed; 0 ignored; 0 measured; 240 filtered out; finished in 0.00s
15.54 s
gammaloop-nextest-spenso>
15.54 s
gammaloop-nextest-spenso> stderr ---
15.54 s
gammaloop-nextest-spenso>
15.54 s
gammaloop-nextest-spenso> thread 'color::test::form_reference::metric_contraction_respects_antisymmetric_normalization' (341) panicked at crates/idenso/src/color/test/form_reference.rs:171:5:
15.54 s
gammaloop-nextest-spenso> assertion `left == right` failed
15.54 s
gammaloop-nextest-spenso> left: "-1*f(coad(8,standalone_metric_j),coad(8,standalone_metric_s),coad(8,standalone_metric_u))"
15.54 s
gammaloop-nextest-spenso> right: "f(coad(8,standalone_metric_j),coad(8,standalone_metric_s),coad(8,standalone_metric_u))"
15.54 s
gammaloop-nextest-spenso> stack backtrace:
15.54 s
gammaloop-nextest-spenso> 0: __rustc::rust_begin_unwind
15.54 s
gammaloop-nextest-spenso> 1: core::panicking::panic_fmt
15.54 s
gammaloop-nextest-spenso> 2: core::panicking::assert_failed_inner
15.54 s
gammaloop-nextest-spenso> 3: core::panicking::assert_failed::<alloc::string::String, alloc::string::String>
15.54 s
gammaloop-nextest-spenso> 4: idenso::color::test::form_reference::metric_contraction_respects_antisymmetric_normalization
15.54 s
gammaloop-nextest-spenso> 5: <idenso::color::test::form_reference::metric_contraction_respects_antisymmetric_normalization::{closure#0} as core::ops::function::FnOnce<()>>::call_once
15.54 s
gammaloop-nextest-spenso> note: Some details are omitted, run with `RUST_BACKTRACE=full` for a verbose backtrace.
15.54 s
gammaloop-nextest-spenso>
15.54 s
gammaloop-nextest-spenso> FAIL [ 0.047s] (220/224) idenso tensor::tests::parsing :: infinite_execution
15.54 s
gammaloop-nextest-spenso> stdout ---
15.54 s
gammaloop-nextest-spenso>
15.54 s
gammaloop-nextest-spenso> running 1 test
15.54 s
gammaloop-nextest-spenso> ━━━━━━━━━━━━━━━━━━━━━━━━━━━━━━━ Snapshot Summary ━━━━━━━━━━━━━━━━━━━━━━━━━━━━━━━
15.54 s
gammaloop-nextest-spenso> Snapshot: infinite_execution
15.54 s
gammaloop-nextest-spenso> Source: crates/idenso/src/tensor/tests/parsing.rs:910
15.54 s
gammaloop-nextest-spenso> ────────────────────────────────────────────────────────────────────────────────
15.54 s
gammaloop-nextest-spenso> Expression: net_iter.snapshot_dot()
15.54 s
gammaloop-nextest-spenso> ────────────────────────────────────────────────────────────────────────────────
15.54 s
gammaloop-nextest-spenso> -old snapshot
15.54 s
gammaloop-nextest-spenso> +new results
15.54 s
gammaloop-nextest-spenso> ────────────┬───────────────────────────────────────────────────────────────────
15.54 s
gammaloop-nextest-spenso> 8 8 │ 0:0:s -> ext0 [id=0 color="red"];
15.54 s
gammaloop-nextest-spenso> 9 9 │ ext1 [style=invis];
15.54 s
gammaloop-nextest-spenso> 10 10 │ 0:5:s -> ext1 [id=1 dir=none color="red" label="mink4|l_0"];
15.54 s
gammaloop-nextest-spenso> 11 11 │ ext2 [style=invis];
15.54 s
gammaloop-nextest-spenso> 12 │- 0:4:s -> ext2 [id=2 dir=none color="red" label="bis4|l_2"];
15.54 s
gammaloop-nextest-spenso> 12 │+ 0:3:s -> ext2 [id=2 dir=none color="red" label="mink4|l_1"];
15.54 s
gammaloop-nextest-spenso> 13 13 │ ext3 [style=invis];
15.54 s
gammaloop-nextest-spenso> 14 │- 0:3:s -> ext3 [id=3 dir=none color="red" label="bis4|l_3"];
15.54 s
gammaloop-nextest-spenso> 14 │+ 0:1:s -> ext3 [id=3 dir=none color="red" label="bis4|l_2"];
15.54 s
gammaloop-nextest-spenso> 15 15 │ ext4 [style=invis];
15.54 s
gammaloop-nextest-spenso> 16 │- 0:1:s -> ext4 [id=4 dir=none color="red" label="mink4|l_1"];
15.54 s
gammaloop-nextest-spenso> 16 │+ 0:2:s -> ext4 [id=4 dir=none color="red" label="mink4|l_4"];
15.54 s
gammaloop-nextest-spenso> 17 17 │ ext5 [style=invis];
15.54 s
gammaloop-nextest-spenso> 18 │- 0:2:s -> ext5 [id=5 dir=none color="red" label="mink4|l_4"];
15.54 s
gammaloop-nextest-spenso> 18 │+ 0:4:s -> ext5 [id=5 dir=none color="red" label="bis4|l_3"];
15.54 s
gammaloop-nextest-spenso> 19 19 │ }
15.54 s
gammaloop-nextest-spenso> ────────────┴───────────────────────────────────────────────────────────────────
15.54 s
gammaloop-nextest-spenso> To update snapshots run `cargo insta review`
15.54 s
gammaloop-nextest-spenso> Stopped on the first failure. Run `cargo insta test` to run all snapshots.
15.54 s
gammaloop-nextest-spenso> test tensor::tests::parsing::infinite_execution ... FAILED
15.54 s
gammaloop-nextest-spenso>
15.54 s
gammaloop-nextest-spenso> failures:
15.54 s
gammaloop-nextest-spenso>
15.54 s
gammaloop-nextest-spenso> failures:
15.54 s
gammaloop-nextest-spenso> tensor::tests::parsing::infinite_execution
15.54 s
gammaloop-nextest-spenso>
15.54 s
gammaloop-nextest-spenso> test result: FAILED. 0 passed; 1 failed; 0 ignored; 0 measured; 240 filtered out; finished in 0.04s
15.54 s
gammaloop-nextest-spenso>
15.54 s
gammaloop-nextest-spenso> stderr ---
15.54 s
gammaloop-nextest-spenso>
15.54 s
gammaloop-nextest-spenso> thread 'tensor::tests::parsing::infinite_execution' (829) panicked at /nix/store/5nq6hmff26w9jbhbmba4wsvgnvglj2xd-vendor-cargo-deps/c19b7c6f923b580ac259164a89f2577984ad5ab09ee9d583b888f934adbbe8d0/insta-1.47.2/src/runtime.rs:719:13:
15.54 s
gammaloop-nextest-spenso> snapshot assertion for 'infinite_execution' failed in line 910
15.54 s
gammaloop-nextest-spenso> stack backtrace:
15.54 s
gammaloop-nextest-spenso> 0: __rustc::rust_begin_unwind
15.54 s
gammaloop-nextest-spenso> 1: core::panicking::panic_fmt
15.54 s
gammaloop-nextest-spenso> 2: insta::runtime::assert_snapshot
15.54 s
gammaloop-nextest-spenso> 3: idenso::tensor::tests::parsing::infinite_execution
15.54 s
gammaloop-nextest-spenso> 4: <idenso::tensor::tests::parsing::infinite_execution::{closure#0} as core::ops::function::FnOnce<()>>::call_once
15.54 s
gammaloop-nextest-spenso> note: Some details are omitted, run with `RUST_BACKTRACE=full` for a verbose backtrace.
15.54 s
gammaloop-nextest-spenso>
15.57 s
gammaloop-nextest-spenso> error : test run failed
15.60 s
gammaloop-nextest-spenso>
15.60 s
gammaloop-nextest-spenso> ========== nextest test summary ==========
15.60 s
gammaloop-nextest-spenso> report: target/nextest/ci_gammaloop/junit.xml
15.60 s
gammaloop-nextest-spenso> tests: 224, failures: 2, errors: 0
15.60 s
gammaloop-nextest-spenso>
15.60 s
gammaloop-nextest-spenso> 1. idenso::color::test::form_reference::metric_contraction_respects_antisymmetric_normalization
15.60 s
gammaloop-nextest-spenso> failure: test failure with exit code 101
15.60 s
gammaloop-nextest-spenso> thread 'color::test::form_reference::metric_contraction_respects_antisymmetric_normalization' (341) panicked at crates/idenso/src/color/test/form_reference.rs:171:5:
15.60 s
gammaloop-nextest-spenso> assertion `left == right` failed
15.60 s
gammaloop-nextest-spenso> left: "-1*f(coad(8,standalone_metric_j),coad(8,standalone_metric_s),coad(8,standalone_metric_u))"
15.60 s
gammaloop-nextest-spenso> right: "f(coad(8,standalone_metric_j),coad(8,standalone_metric_s),coad(8,standalone_metric_u))"
15.60 s
gammaloop-nextest-spenso> stack backtrace:
15.60 s
gammaloop-nextest-spenso> 0: __rustc::rust_begin_unwind
15.60 s
gammaloop-nextest-spenso> 1: core::panicking::panic_fmt
15.60 s
gammaloop-nextest-spenso> 2: core::panicking::assert_failed_inner
15.60 s
gammaloop-nextest-spenso> 3: core::panicking::assert_failed::<alloc::string::String, alloc::string::String>
15.60 s
gammaloop-nextest-spenso> 4: idenso::color::test::form_reference::metric_contraction_respects_antisymmetric_normalization
15.60 s
gammaloop-nextest-spenso> 5: <idenso::color::test::form_reference::metric_contraction_respects_antisymmetric_normalization::{closure#0} as core::ops::function::FnOnce<()>>::call_once
15.60 s
gammaloop-nextest-spenso> note: Some details are omitted, run with `RUST_BACKTRACE=full` for a verbose backtrace.
15.60 s
gammaloop-nextest-spenso> system-out
15.60 s
gammaloop-nextest-spenso> running 1 test
15.60 s
gammaloop-nextest-spenso> test color::test::form_reference::metric_contraction_respects_antisymmetric_normalization ... FAILED
15.60 s
gammaloop-nextest-spenso>
15.60 s
gammaloop-nextest-spenso> failures:
15.60 s
gammaloop-nextest-spenso>
15.60 s
gammaloop-nextest-spenso> failures:
15.60 s
gammaloop-nextest-spenso> color::test::form_reference::metric_contraction_respects_antisymmetric_normalization
15.60 s
gammaloop-nextest-spenso>
15.60 s
gammaloop-nextest-spenso> test result: FAILED. 0 passed; 1 failed; 0 ignored; 0 measured; 240 filtered out; finished in 0.00s
15.60 s
gammaloop-nextest-spenso> system-err
15.60 s
gammaloop-nextest-spenso> thread 'color::test::form_reference::metric_contraction_respects_antisymmetric_normalization' (341) panicked at crates/idenso/src/color/test/form_reference.rs:171:5:
15.60 s
gammaloop-nextest-spenso> assertion `left == right` failed
15.60 s
gammaloop-nextest-spenso> left: "-1*f(coad(8,standalone_metric_j),coad(8,standalone_metric_s),coad(8,standalone_metric_u))"
15.60 s
gammaloop-nextest-spenso> right: "f(coad(8,standalone_metric_j),coad(8,standalone_metric_s),coad(8,standalone_metric_u))"
15.60 s
gammaloop-nextest-spenso> stack backtrace:
15.60 s
gammaloop-nextest-spenso> 0: __rustc::rust_begin_unwind
15.60 s
gammaloop-nextest-spenso> 1: core::panicking::panic_fmt
15.60 s
gammaloop-nextest-spenso> 2: core::panicking::assert_failed_inner
15.60 s
gammaloop-nextest-spenso> 3: core::panicking::assert_failed::<alloc::string::String, alloc::string::String>
15.60 s
gammaloop-nextest-spenso> 4: idenso::color::test::form_reference::metric_contraction_respects_antisymmetric_normalization
15.60 s
gammaloop-nextest-spenso> 5: <idenso::color::test::form_reference::metric_contraction_respects_antisymmetric_normalization::{closure#0} as core::ops::function::FnOnce<()>>::call_once
15.60 s
gammaloop-nextest-spenso> note: Some details are omitted, run with `RUST_BACKTRACE=full` for a verbose backtrace.
15.60 s
gammaloop-nextest-spenso>
15.60 s
gammaloop-nextest-spenso> 2. idenso::tensor::tests::parsing::infinite_execution
15.60 s
gammaloop-nextest-spenso> failure: test failure with exit code 101
15.60 s
gammaloop-nextest-spenso> thread 'tensor::tests::parsing::infinite_execution' (829) panicked at /nix/store/5nq6hmff26w9jbhbmba4wsvgnvglj2xd-vendor-cargo-deps/c19b7c6f923b580ac259164a89f2577984ad5ab09ee9d583b888f934adbbe8d0/insta-1.47.2/src/runtime.rs:719:13:
15.60 s
gammaloop-nextest-spenso> snapshot assertion for 'infinite_execution' failed in line 910
15.60 s
gammaloop-nextest-spenso> stack backtrace:
15.60 s
gammaloop-nextest-spenso> 0: __rustc::rust_begin_unwind
15.60 s
gammaloop-nextest-spenso> 1: core::panicking::panic_fmt
15.60 s
gammaloop-nextest-spenso> 2: insta::runtime::assert_snapshot
15.60 s
gammaloop-nextest-spenso> 3: idenso::tensor::tests::parsing::infinite_execution
15.60 s
gammaloop-nextest-spenso> 4: <idenso::tensor::tests::parsing::infinite_execution::{closure#0} as core::ops::function::FnOnce<()>>::call_once
15.60 s
gammaloop-nextest-spenso> note: Some details are omitted, run with `RUST_BACKTRACE=full` for a verbose backtrace.
15.60 s
gammaloop-nextest-spenso> system-out
15.60 s
gammaloop-nextest-spenso> running 1 test
15.60 s
gammaloop-nextest-spenso> ━━━━━━━━━━━━━━━━━━━━━━━━━━━━━━━ Snapshot Summary ━━━━━━━━━━━━━━━━━━━━━━━━━━━━━━━
15.60 s
gammaloop-nextest-spenso> Snapshot: infinite_execution
15.60 s
gammaloop-nextest-spenso> Source: crates/idenso/src/tensor/tests/parsing.rs:910
15.60 s
gammaloop-nextest-spenso> ────────────────────────────────────────────────────────────────────────────────
15.60 s
gammaloop-nextest-spenso> Expression: net_iter.snapshot_dot()
15.60 s
gammaloop-nextest-spenso> ────────────────────────────────────────────────────────────────────────────────
15.60 s
gammaloop-nextest-spenso> -old snapshot
15.60 s
gammaloop-nextest-spenso> +new results
15.60 s
gammaloop-nextest-spenso> ────────────┬───────────────────────────────────────────────────────────────────
15.60 s
gammaloop-nextest-spenso> 8 8 │ 0:0:s-> ext0 [id=0 color="red"];
15.60 s
gammaloop-nextest-spenso> 9 9 │ ext1 [style=invis];
15.60 s
gammaloop-nextest-spenso> 10 10 │ 0:5:s-> ext1 [id=1 dir=none color="red" label="mink4|l_0"];
15.60 s
gammaloop-nextest-spenso> 11 11 │ ext2 [style=invis];
15.60 s
gammaloop-nextest-spenso> 12 │- 0:4:s-> ext2 [id=2 dir=none color="red" label="bis4|l_2"];
15.60 s
gammaloop-nextest-spenso> 12 │+ 0:3:s-> ext2 [id=2 dir=none color="red" label="mink4|l_1"];
15.60 s
gammaloop-nextest-spenso> 13 13 │ ext3 [style=invis];
15.60 s
gammaloop-nextest-spenso> 14 │- 0:3:s-> ext3 [id=3 dir=none color="red" label="bis4|l_3"];
15.60 s
gammaloop-nextest-spenso> 14 │+ 0:1:s-> ext3 [id=3 dir=none color="red" label="bis4|l_2"];
15.60 s
gammaloop-nextest-spenso> 15 15 │ ext4 [style=invis];
15.60 s
gammaloop-nextest-spenso> 16 │- 0:1:s-> ext4 [id=4 dir=none color="red" label="mink4|l_1"];
15.60 s
gammaloop-nextest-spenso> 16 │+ 0:2:s-> ext4 [id=4 dir=none color="red" label="mink4|l_4"];
15.60 s
gammaloop-nextest-spenso> 17 17 │ ext5 [style=invis];
15.60 s
gammaloop-nextest-spenso> 18 │- 0:2:s-> ext5 [id=5 dir=none color="red" label="mink4|l_4"];
15.60 s
gammaloop-nextest-spenso> 18 │+ 0:4:s-> ext5 [id=5 dir=none color="red" label="bis4|l_3"];
15.60 s
gammaloop-nextest-spenso> 19 19 │ }
15.60 s
gammaloop-nextest-spenso> ────────────┴───────────────────────────────────────────────────────────────────
15.60 s
gammaloop-nextest-spenso> To update snapshots run `cargo insta review`
15.60 s
gammaloop-nextest-spenso> Stopped on the first failure. Run `cargo insta test` to run all snapshots.
15.60 s
gammaloop-nextest-spenso> test tensor::tests::parsing::infinite_execution ... FAILED
15.60 s
gammaloop-nextest-spenso>
15.60 s
gammaloop-nextest-spenso> failures:
15.60 s
gammaloop-nextest-spenso>
15.60 s
gammaloop-nextest-spenso> failures:
15.60 s
gammaloop-nextest-spenso> tensor::tests::parsing::infinite_execution
15.60 s
gammaloop-nextest-spenso>
15.60 s
gammaloop-nextest-spenso> test result: FAILED. 0 passed; 1 failed; 0 ignored; 0 measured; 240 filtered out; finished in 0.04s
15.60 s
gammaloop-nextest-spenso> system-err
15.60 s
gammaloop-nextest-spenso> thread 'tensor::tests::parsing::infinite_execution' (829) panicked at /nix/store/5nq6hmff26w9jbhbmba4wsvgnvglj2xd-vendor-cargo-deps/c19b7c6f923b580ac259164a89f2577984ad5ab09ee9d583b888f934adbbe8d0/insta-1.47.2/src/runtime.rs:719:13:
15.60 s
gammaloop-nextest-spenso> snapshot assertion for 'infinite_execution' failed in line 910
15.60 s
gammaloop-nextest-spenso> stack backtrace:
15.60 s
gammaloop-nextest-spenso> 0: __rustc::rust_begin_unwind
15.60 s
gammaloop-nextest-spenso> 1: core::panicking::panic_fmt
15.60 s
gammaloop-nextest-spenso> 2: insta::runtime::assert_snapshot
15.60 s
gammaloop-nextest-spenso> 3: idenso::tensor::tests::parsing::infinite_execution
15.60 s
gammaloop-nextest-spenso> 4: <idenso::tensor::tests::parsing::infinite_execution::{closure#0} as core::ops::function::FnOnce<()>>::call_once
15.60 s
gammaloop-nextest-spenso> note: Some details are omitted, run with `RUST_BACKTRACE=full` for a verbose backtrace.
15.60 s
gammaloop-nextest-spenso> =========================================
15.61 s
gammaloop-nextest-spenso> Extracting 2 binaries and 1 linked path to /build/nextest-archive-5H6FiX
15.69 s
gammaloop-nextest-spenso> Extracted 8 files to /build/nextest-archive-5H6FiX in 0.08s
15.70 s
gammaloop-nextest-spenso> ------------
15.70 s
gammaloop-nextest-spenso> Nextest run ID 4aef78d2-9383-4843-b320-cdfb1979457e with nextest profile: ci_gammaloop
15.70 s
gammaloop-nextest-spenso> Starting 135 tests across 2 binaries
15.78 s
gammaloop-nextest-spenso> ------------
15.78 s
gammaloop-nextest-spenso> Summary [ 0.083s] 135 tests run: 135 passed , 0 skipped
15.83 s
gammaloop-nextest-spenso>
15.83 s
gammaloop-nextest-spenso> ========== nextest test summary ==========
15.83 s
gammaloop-nextest-spenso> report: target/nextest/ci_gammaloop/junit.xml
15.83 s
gammaloop-nextest-spenso> tests: 135, failures: 0, errors: 0
15.83 s
gammaloop-nextest-spenso> No failing testcases found.
15.83 s
gammaloop-nextest-spenso> =========================================
15.84 s
gammaloop-nextest-spenso> Extracting 5 binaries and 2 linked paths to /build/nextest-archive-60faXK
16.05 s
gammaloop-nextest-spenso> Extracted 19 files to /build/nextest-archive-60faXK in 0.21s
16.06 s
gammaloop-nextest-spenso> ------------
16.06 s
gammaloop-nextest-spenso> Nextest run ID 578d13ac-3324-400e-a8a6-2a307d0b9907 with nextest profile: ci_gammaloop
16.06 s
gammaloop-nextest-spenso> Starting 25 tests across 5 binaries (1 test skipped via profile.ci_gammaloop.default-filter )
16.27 s
gammaloop-nextest-spenso> ------------
16.27 s
gammaloop-nextest-spenso> Summary [ 0.211s] 25 tests run: 25 passed , 1 skipped
16.33 s
gammaloop-nextest-spenso>
16.33 s
gammaloop-nextest-spenso> ========== nextest test summary ==========
16.33 s
gammaloop-nextest-spenso> report: target/nextest/ci_gammaloop/junit.xml
16.33 s
gammaloop-nextest-spenso> tests: 25, failures: 0, errors: 0
16.33 s
gammaloop-nextest-spenso> No failing testcases found.
16.33 s
gammaloop-nextest-spenso> =========================================
16.35 s
gammaloop-nextest-spenso> Extracting 2 binaries and 1 linked path to /build/nextest-archive-Yzi7s1
16.40 s
gammaloop-nextest-spenso> Extracted 8 files to /build/nextest-archive-Yzi7s1 in 0.06s
16.41 s
gammaloop-nextest-spenso> ------------
16.41 s
gammaloop-nextest-spenso> Nextest run ID 37d11fb6-b9ca-48f0-b411-8689f52aefd0 with nextest profile: ci_gammaloop
16.41 s
gammaloop-nextest-spenso> Starting 1 test across 2 binaries
16.42 s
gammaloop-nextest-spenso> ------------
16.42 s
gammaloop-nextest-spenso> Summary [ 0.005s] 1 test run: 1 passed , 0 skipped
16.45 s
gammaloop-nextest-spenso>
16.45 s
gammaloop-nextest-spenso> ========== nextest test summary ==========
16.45 s
gammaloop-nextest-spenso> report: target/nextest/ci_gammaloop/junit.xml
16.45 s
gammaloop-nextest-spenso> tests: 1, failures: 0, errors: 0
16.45 s
gammaloop-nextest-spenso> No failing testcases found.
16.46 s
gammaloop-nextest-spenso> =========================================
16.47 s
gammaloop-nextest-spenso> Extracting 1 binary and 1 linked path to /build/nextest-archive-9RPJwj
16.52 s
gammaloop-nextest-spenso> Extracted 7 files to /build/nextest-archive-9RPJwj in 0.05s
16.53 s
gammaloop-nextest-spenso> ------------
16.53 s
gammaloop-nextest-spenso> Nextest run ID fda93146-c47a-429c-bc64-41b3daf9e287 with nextest profile: ci_gammaloop
16.53 s
gammaloop-nextest-spenso> Starting 0 tests across 1 binary
16.53 s
gammaloop-nextest-spenso> ------------
16.53 s
gammaloop-nextest-spenso> Summary [ 0.000s] 0 tests run: 0 passed , 0 skipped
16.57 s
gammaloop-nextest-spenso>
16.57 s
gammaloop-nextest-spenso> ========== nextest test summary ==========
16.57 s
gammaloop-nextest-spenso> report: target/nextest/ci_gammaloop/junit.xml
16.57 s
gammaloop-nextest-spenso> tests: 0, failures: 0, errors: 0
16.57 s
gammaloop-nextest-spenso> No failing testcases found.
16.57 s
gammaloop-nextest-spenso> =========================================
16.60 s
error: Cannot build '/nix/store/a8c4pj5idcxyzd4f7mjzbgpqsplch99h-gammaloop-nextest-spenso.drv '.
16.60 s
Reason: builder failed with exit code 100 .
16.60 s
Output paths:
16.60 s
/nix/store/0ac09738mgqyrr4w556r0sn3jnyda0xd-gammaloop-nextest-spenso
16.60 s
Last 325 log lines:
16.60 s
> Extracting 5 binaries and 2 linked paths to /build/nextest-archive-BFEfRg
16.60 s
> Extracted 19 files to /build/nextest-archive-BFEfRg in 0.18s
16.60 s
> ------------
16.60 s
> Nextest run ID 9bb61e44-86ab-4dd8-8a41-4d487e1c706c with nextest profile: ci_gammaloop
16.60 s
> Starting 224 tests across 5 binaries (26 tests skipped , including 2 tests via profile.ci_gammaloop.default-filter )
16.60 s
> FAIL [ 0.012s] ( 47/224) idenso color::test::form_reference :: metric_contraction_respects_antisymmetric_normalization
16.60 s
> stdout ---
16.60 s
>
16.60 s
> running 1 test
16.60 s
> test color::test::form_reference::metric_contraction_respects_antisymmetric_normalization ... FAILED
16.60 s
>
16.60 s
> failures:
16.60 s
>
16.60 s
> failures:
16.60 s
> color::test::form_reference::metric_contraction_respects_antisymmetric_normalization
16.60 s
>
16.60 s
> test result: FAILED. 0 passed; 1 failed; 0 ignored; 0 measured; 240 filtered out; finished in 0.00s
16.60 s
>
16.60 s
> stderr ---
16.60 s
>
16.60 s
> thread 'color::test::form_reference::metric_contraction_respects_antisymmetric_normalization' (341) panicked at crates/idenso/src/color/test/form_reference.rs:171:5:
16.60 s
> assertion `left == right` failed
16.60 s
> left: "-1*f(coad(8,standalone_metric_j),coad(8,standalone_metric_s),coad(8,standalone_metric_u))"
16.60 s
> right: "f(coad(8,standalone_metric_j),coad(8,standalone_metric_s),coad(8,standalone_metric_u))"
16.60 s
> stack backtrace:
16.60 s
> 0: __rustc::rust_begin_unwind
16.60 s
> 1: core::panicking::panic_fmt
16.60 s
> 2: core::panicking::assert_failed_inner
16.60 s
> 3: core::panicking::assert_failed::<alloc::string::String, alloc::string::String>
16.60 s
> 4: idenso::color::test::form_reference::metric_contraction_respects_antisymmetric_normalization
16.60 s
> 5: <idenso::color::test::form_reference::metric_contraction_respects_antisymmetric_normalization::{closure#0} as core::ops::function::FnOnce<()>>::call_once
16.60 s
> note: Some details are omitted, run with `RUST_BACKTRACE=full` for a verbose backtrace.
16.60 s
>
16.60 s
> FAIL [ 0.047s] (220/224) idenso tensor::tests::parsing :: infinite_execution
16.60 s
> stdout ---
16.60 s
>
16.60 s
> running 1 test
16.60 s
> ━━━━━━━━━━━━━━━━━━━━━━━━━━━━━━━ Snapshot Summary ━━━━━━━━━━━━━━━━━━━━━━━━━━━━━━━
16.60 s
> Snapshot: infinite_execution
16.60 s
> Source: crates/idenso/src/tensor/tests/parsing.rs:910
16.60 s
> ────────────────────────────────────────────────────────────────────────────────
16.60 s
> Expression: net_iter.snapshot_dot()
16.60 s
> ────────────────────────────────────────────────────────────────────────────────
16.60 s
> -old snapshot
16.60 s
> +new results
16.60 s
> ────────────┬───────────────────────────────────────────────────────────────────
16.60 s
> 8 8 │ 0:0:s -> ext0 [id=0 color="red"];
16.60 s
> 9 9 │ ext1 [style=invis];
16.60 s
> 10 10 │ 0:5:s -> ext1 [id=1 dir=none color="red" label="mink4|l_0"];
16.60 s
> 11 11 │ ext2 [style=invis];
16.60 s
> 12 │- 0:4:s -> ext2 [id=2 dir=none color="red" label="bis4|l_2"];
16.60 s
> 12 │+ 0:3:s -> ext2 [id=2 dir=none color="red" label="mink4|l_1"];
16.60 s
> 13 13 │ ext3 [style=invis];
16.60 s
> 14 │- 0:3:s -> ext3 [id=3 dir=none color="red" label="bis4|l_3"];
16.60 s
> 14 │+ 0:1:s -> ext3 [id=3 dir=none color="red" label="bis4|l_2"];
16.60 s
> 15 15 │ ext4 [style=invis];
16.60 s
> 16 │- 0:1:s -> ext4 [id=4 dir=none color="red" label="mink4|l_1"];
16.60 s
> 16 │+ 0:2:s -> ext4 [id=4 dir=none color="red" label="mink4|l_4"];
16.60 s
> 17 17 │ ext5 [style=invis];
16.60 s
> 18 │- 0:2:s -> ext5 [id=5 dir=none color="red" label="mink4|l_4"];
16.60 s
> 18 │+ 0:4:s -> ext5 [id=5 dir=none color="red" label="bis4|l_3"];
16.60 s
> 19 19 │ }
16.60 s
> ────────────┴───────────────────────────────────────────────────────────────────
16.60 s
> To update snapshots run `cargo insta review`
16.60 s
> Stopped on the first failure. Run `cargo insta test` to run all snapshots.
16.60 s
> test tensor::tests::parsing::infinite_execution ... FAILED
16.60 s
>
16.60 s
> failures:
16.60 s
>
16.60 s
> failures:
16.60 s
> tensor::tests::parsing::infinite_execution
16.60 s
>
16.60 s
> test result: FAILED. 0 passed; 1 failed; 0 ignored; 0 measured; 240 filtered out; finished in 0.04s
16.60 s
>
16.60 s
> stderr ---
16.60 s
>
16.60 s
> thread 'tensor::tests::parsing::infinite_execution' (829) panicked at /nix/store/5nq6hmff26w9jbhbmba4wsvgnvglj2xd-vendor-cargo-deps/c19b7c6f923b580ac259164a89f2577984ad5ab09ee9d583b888f934adbbe8d0/insta-1.47.2/src/runtime.rs:719:13:
16.60 s
> snapshot assertion for 'infinite_execution' failed in line 910
16.60 s
> stack backtrace:
16.60 s
> 0: __rustc::rust_begin_unwind
16.60 s
> 1: core::panicking::panic_fmt
16.60 s
> 2: insta::runtime::assert_snapshot
16.60 s
> 3: idenso::tensor::tests::parsing::infinite_execution
16.60 s
> 4: <idenso::tensor::tests::parsing::infinite_execution::{closure#0} as core::ops::function::FnOnce<()>>::call_once
16.60 s
> note: Some details are omitted, run with `RUST_BACKTRACE=full` for a verbose backtrace.
16.60 s
>
16.60 s
> ------------
16.60 s
> Summary [ 1.725s] 224 tests run: 222 passed , 2 failed , 26 skipped
16.60 s
> FAIL [ 0.012s] ( 47/224) idenso color::test::form_reference :: metric_contraction_respects_antisymmetric_normalization
16.60 s
> stdout ---
16.60 s
>
16.60 s
> running 1 test
16.60 s
> test color::test::form_reference::metric_contraction_respects_antisymmetric_normalization ... FAILED
16.60 s
>
16.60 s
> failures:
16.60 s
>
16.60 s
> failures:
16.60 s
> color::test::form_reference::metric_contraction_respects_antisymmetric_normalization
16.60 s
>
16.60 s
> test result: FAILED. 0 passed; 1 failed; 0 ignored; 0 measured; 240 filtered out; finished in 0.00s
16.60 s
>
16.60 s
> stderr ---
16.60 s
>
16.60 s
> thread 'color::test::form_reference::metric_contraction_respects_antisymmetric_normalization' (341) panicked at crates/idenso/src/color/test/form_reference.rs:171:5:
16.60 s
> assertion `left == right` failed
16.60 s
> left: "-1*f(coad(8,standalone_metric_j),coad(8,standalone_metric_s),coad(8,standalone_metric_u))"
16.60 s
> right: "f(coad(8,standalone_metric_j),coad(8,standalone_metric_s),coad(8,standalone_metric_u))"
16.60 s
> stack backtrace:
16.60 s
> 0: __rustc::rust_begin_unwind
16.60 s
> 1: core::panicking::panic_fmt
16.60 s
> 2: core::panicking::assert_failed_inner
16.60 s
> 3: core::panicking::assert_failed::<alloc::string::String, alloc::string::String>
16.60 s
> 4: idenso::color::test::form_reference::metric_contraction_respects_antisymmetric_normalization
16.60 s
> 5: <idenso::color::test::form_reference::metric_contraction_respects_antisymmetric_normalization::{closure#0} as core::ops::function::FnOnce<()>>::call_once
16.60 s
> note: Some details are omitted, run with `RUST_BACKTRACE=full` for a verbose backtrace.
16.60 s
>
16.60 s
> FAIL [ 0.047s] (220/224) idenso tensor::tests::parsing :: infinite_execution
16.60 s
> stdout ---
16.60 s
>
16.60 s
> running 1 test
16.60 s
> ━━━━━━━━━━━━━━━━━━━━━━━━━━━━━━━ Snapshot Summary ━━━━━━━━━━━━━━━━━━━━━━━━━━━━━━━
16.60 s
> Snapshot: infinite_execution
16.60 s
> Source: crates/idenso/src/tensor/tests/parsing.rs:910
16.60 s
> ────────────────────────────────────────────────────────────────────────────────
16.60 s
> Expression: net_iter.snapshot_dot()
16.60 s
> ────────────────────────────────────────────────────────────────────────────────
16.60 s
> -old snapshot
16.60 s
> +new results
16.60 s
> ────────────┬───────────────────────────────────────────────────────────────────
16.60 s
> 8 8 │ 0:0:s -> ext0 [id=0 color="red"];
16.60 s
> 9 9 │ ext1 [style=invis];
16.60 s
> 10 10 │ 0:5:s -> ext1 [id=1 dir=none color="red" label="mink4|l_0"];
16.60 s
> 11 11 │ ext2 [style=invis];
16.60 s
> 12 │- 0:4:s -> ext2 [id=2 dir=none color="red" label="bis4|l_2"];
16.60 s
> 12 │+ 0:3:s -> ext2 [id=2 dir=none color="red" label="mink4|l_1"];
16.60 s
> 13 13 │ ext3 [style=invis];
16.60 s
> 14 │- 0:3:s -> ext3 [id=3 dir=none color="red" label="bis4|l_3"];
16.60 s
> 14 │+ 0:1:s -> ext3 [id=3 dir=none color="red" label="bis4|l_2"];
16.60 s
> 15 15 │ ext4 [style=invis];
16.60 s
> 16 │- 0:1:s -> ext4 [id=4 dir=none color="red" label="mink4|l_1"];
16.60 s
> 16 │+ 0:2:s -> ext4 [id=4 dir=none color="red" label="mink4|l_4"];
16.60 s
> 17 17 │ ext5 [style=invis];
16.60 s
> 18 │- 0:2:s -> ext5 [id=5 dir=none color="red" label="mink4|l_4"];
16.60 s
> 18 │+ 0:4:s -> ext5 [id=5 dir=none color="red" label="bis4|l_3"];
16.60 s
> 19 19 │ }
16.60 s
> ────────────┴───────────────────────────────────────────────────────────────────
16.60 s
> To update snapshots run `cargo insta review`
16.60 s
> Stopped on the first failure. Run `cargo insta test` to run all snapshots.
16.60 s
> test tensor::tests::parsing::infinite_execution ... FAILED
16.60 s
>
16.60 s
> failures:
16.60 s
>
16.60 s
> failures:
16.60 s
> tensor::tests::parsing::infinite_execution
16.60 s
>
16.60 s
> test result: FAILED. 0 passed; 1 failed; 0 ignored; 0 measured; 240 filtered out; finished in 0.04s
16.60 s
>
16.60 s
> stderr ---
16.60 s
>
16.60 s
> thread 'tensor::tests::parsing::infinite_execution' (829) panicked at /nix/store/5nq6hmff26w9jbhbmba4wsvgnvglj2xd-vendor-cargo-deps/c19b7c6f923b580ac259164a89f2577984ad5ab09ee9d583b888f934adbbe8d0/insta-1.47.2/src/runtime.rs:719:13:
16.60 s
> snapshot assertion for 'infinite_execution' failed in line 910
16.60 s
> stack backtrace:
16.60 s
> 0: __rustc::rust_begin_unwind
16.60 s
> 1: core::panicking::panic_fmt
16.60 s
> 2: insta::runtime::assert_snapshot
16.60 s
> 3: idenso::tensor::tests::parsing::infinite_execution
16.60 s
> 4: <idenso::tensor::tests::parsing::infinite_execution::{closure#0} as core::ops::function::FnOnce<()>>::call_once
16.60 s
> note: Some details are omitted, run with `RUST_BACKTRACE=full` for a verbose backtrace.
16.60 s
>
16.60 s
> error : test run failed
16.60 s
>
16.60 s
> ========== nextest test summary ==========
16.60 s
> report: target/nextest/ci_gammaloop/junit.xml
16.60 s
> tests: 224, failures: 2, errors: 0
16.60 s
>
16.60 s
> 1. idenso::color::test::form_reference::metric_contraction_respects_antisymmetric_normalization
16.60 s
> failure: test failure with exit code 101
16.60 s
> thread 'color::test::form_reference::metric_contraction_respects_antisymmetric_normalization' (341) panicked at crates/idenso/src/color/test/form_reference.rs:171:5:
16.60 s
> assertion `left == right` failed
16.60 s
> left: "-1*f(coad(8,standalone_metric_j),coad(8,standalone_metric_s),coad(8,standalone_metric_u))"
16.60 s
> right: "f(coad(8,standalone_metric_j),coad(8,standalone_metric_s),coad(8,standalone_metric_u))"
16.60 s
> stack backtrace:
16.60 s
> 0: __rustc::rust_begin_unwind
16.60 s
> 1: core::panicking::panic_fmt
16.60 s
> 2: core::panicking::assert_failed_inner
16.60 s
> 3: core::panicking::assert_failed::<alloc::string::String, alloc::string::String>
16.60 s
> 4: idenso::color::test::form_reference::metric_contraction_respects_antisymmetric_normalization
16.60 s
> 5: <idenso::color::test::form_reference::metric_contraction_respects_antisymmetric_normalization::{closure#0} as core::ops::function::FnOnce<()>>::call_once
16.60 s
> note: Some details are omitted, run with `RUST_BACKTRACE=full` for a verbose backtrace.
16.60 s
> system-out
16.60 s
> running 1 test
16.60 s
> test color::test::form_reference::metric_contraction_respects_antisymmetric_normalization ... FAILED
16.60 s
>
16.60 s
> failures:
16.60 s
>
16.60 s
> failures:
16.60 s
> color::test::form_reference::metric_contraction_respects_antisymmetric_normalization
16.60 s
>
16.60 s
> test result: FAILED. 0 passed; 1 failed; 0 ignored; 0 measured; 240 filtered out; finished in 0.00s
16.60 s
> system-err
16.60 s
> thread 'color::test::form_reference::metric_contraction_respects_antisymmetric_normalization' (341) panicked at crates/idenso/src/color/test/form_reference.rs:171:5:
16.60 s
> assertion `left == right` failed
16.60 s
> left: "-1*f(coad(8,standalone_metric_j),coad(8,standalone_metric_s),coad(8,standalone_metric_u))"
16.60 s
> right: "f(coad(8,standalone_metric_j),coad(8,standalone_metric_s),coad(8,standalone_metric_u))"
16.60 s
> stack backtrace:
16.60 s
> 0: __rustc::rust_begin_unwind
16.60 s
> 1: core::panicking::panic_fmt
16.60 s
> 2: core::panicking::assert_failed_inner
16.60 s
> 3: core::panicking::assert_failed::<alloc::string::String, alloc::string::String>
16.60 s
> 4: idenso::color::test::form_reference::metric_contraction_respects_antisymmetric_normalization
16.60 s
> 5: <idenso::color::test::form_reference::metric_contraction_respects_antisymmetric_normalization::{closure#0} as core::ops::function::FnOnce<()>>::call_once
16.60 s
> note: Some details are omitted, run with `RUST_BACKTRACE=full` for a verbose backtrace.
16.60 s
>
16.60 s
> 2. idenso::tensor::tests::parsing::infinite_execution
16.60 s
> failure: test failure with exit code 101
16.60 s
> thread 'tensor::tests::parsing::infinite_execution' (829) panicked at /nix/store/5nq6hmff26w9jbhbmba4wsvgnvglj2xd-vendor-cargo-deps/c19b7c6f923b580ac259164a89f2577984ad5ab09ee9d583b888f934adbbe8d0/insta-1.47.2/src/runtime.rs:719:13:
16.60 s
> snapshot assertion for 'infinite_execution' failed in line 910
16.60 s
> stack backtrace:
16.60 s
> 0: __rustc::rust_begin_unwind
16.60 s
> 1: core::panicking::panic_fmt
16.60 s
> 2: insta::runtime::assert_snapshot
16.60 s
> 3: idenso::tensor::tests::parsing::infinite_execution
16.60 s
> 4: <idenso::tensor::tests::parsing::infinite_execution::{closure#0} as core::ops::function::FnOnce<()>>::call_once
16.60 s
> note: Some details are omitted, run with `RUST_BACKTRACE=full` for a verbose backtrace.
16.60 s
> system-out
16.60 s
> running 1 test
16.60 s
> ━━━━━━━━━━━━━━━━━━━━━━━━━━━━━━━ Snapshot Summary ━━━━━━━━━━━━━━━━━━━━━━━━━━━━━━━
16.60 s
> Snapshot: infinite_execution
16.60 s
> Source: crates/idenso/src/tensor/tests/parsing.rs:910
16.60 s
> ────────────────────────────────────────────────────────────────────────────────
16.60 s
> Expression: net_iter.snapshot_dot()
16.60 s
> ────────────────────────────────────────────────────────────────────────────────
16.60 s
> -old snapshot
16.60 s
> +new results
16.60 s
> ────────────┬───────────────────────────────────────────────────────────────────
16.60 s
> 8 8 │ 0:0:s-> ext0 [id=0 color="red"];
16.60 s
> 9 9 │ ext1 [style=invis];
16.60 s
> 10 10 │ 0:5:s-> ext1 [id=1 dir=none color="red" label="mink4|l_0"];
16.60 s
> 11 11 │ ext2 [style=invis];
16.60 s
> 12 │- 0:4:s-> ext2 [id=2 dir=none color="red" label="bis4|l_2"];
16.60 s
> 12 │+ 0:3:s-> ext2 [id=2 dir=none color="red" label="mink4|l_1"];
16.60 s
> 13 13 │ ext3 [style=invis];
16.60 s
> 14 │- 0:3:s-> ext3 [id=3 dir=none color="red" label="bis4|l_3"];
16.60 s
> 14 │+ 0:1:s-> ext3 [id=3 dir=none color="red" label="bis4|l_2"];
16.60 s
> 15 15 │ ext4 [style=invis];
16.60 s
> 16 │- 0:1:s-> ext4 [id=4 dir=none color="red" label="mink4|l_1"];
16.60 s
> 16 │+ 0:2:s-> ext4 [id=4 dir=none color="red" label="mink4|l_4"];
16.60 s
> 17 17 │ ext5 [style=invis];
16.60 s
> 18 │- 0:2:s-> ext5 [id=5 dir=none color="red" label="mink4|l_4"];
16.60 s
> 18 │+ 0:4:s-> ext5 [id=5 dir=none color="red" label="bis4|l_3"];
16.60 s
> 19 19 │ }
16.60 s
> ────────────┴───────────────────────────────────────────────────────────────────
16.60 s
> To update snapshots run `cargo insta review`
16.60 s
> Stopped on the first failure. Run `cargo insta test` to run all snapshots.
16.60 s
> test tensor::tests::parsing::infinite_execution ... FAILED
16.60 s
>
16.60 s
> failures:
16.60 s
>
16.60 s
> failures:
16.60 s
> tensor::tests::parsing::infinite_execution
16.60 s
>
16.60 s
> test result: FAILED. 0 passed; 1 failed; 0 ignored; 0 measured; 240 filtered out; finished in 0.04s
16.60 s
> system-err
16.60 s
> thread 'tensor::tests::parsing::infinite_execution' (829) panicked at /nix/store/5nq6hmff26w9jbhbmba4wsvgnvglj2xd-vendor-cargo-deps/c19b7c6f923b580ac259164a89f2577984ad5ab09ee9d583b888f934adbbe8d0/insta-1.47.2/src/runtime.rs:719:13:
16.60 s
> snapshot assertion for 'infinite_execution' failed in line 910
16.60 s
> stack backtrace:
16.60 s
> 0: __rustc::rust_begin_unwind
16.60 s
> 1: core::panicking::panic_fmt
16.60 s
> 2: insta::runtime::assert_snapshot
16.60 s
> 3: idenso::tensor::tests::parsing::infinite_execution
16.60 s
> 4: <idenso::tensor::tests::parsing::infinite_execution::{closure#0} as core::ops::function::FnOnce<()>>::call_once
16.60 s
> note: Some details are omitted, run with `RUST_BACKTRACE=full` for a verbose backtrace.
16.60 s
> =========================================
16.60 s
> Extracting 2 binaries and 1 linked path to /build/nextest-archive-5H6FiX
16.60 s
> Extracted 8 files to /build/nextest-archive-5H6FiX in 0.08s
16.60 s
> ------------
16.60 s
> Nextest run ID 4aef78d2-9383-4843-b320-cdfb1979457e with nextest profile: ci_gammaloop
16.60 s
> Starting 135 tests across 2 binaries
16.60 s
> ------------
16.60 s
> Summary [ 0.083s] 135 tests run: 135 passed , 0 skipped
16.60 s
>
16.60 s
> ========== nextest test summary ==========
16.60 s
> report: target/nextest/ci_gammaloop/junit.xml
16.60 s
> tests: 135, failures: 0, errors: 0
16.60 s
> No failing testcases found.
16.60 s
> =========================================
16.60 s
> Extracting 5 binaries and 2 linked paths to /build/nextest-archive-60faXK
16.60 s
> Extracted 19 files to /build/nextest-archive-60faXK in 0.21s
16.60 s
> ------------
16.60 s
> Nextest run ID 578d13ac-3324-400e-a8a6-2a307d0b9907 with nextest profile: ci_gammaloop
16.60 s
> Starting 25 tests across 5 binaries (1 test skipped via profile.ci_gammaloop.default-filter )
16.60 s
> ------------
16.60 s
> Summary [ 0.211s] 25 tests run: 25 passed , 1 skipped
16.60 s
>
16.60 s
> ========== nextest test summary ==========
16.60 s
> report: target/nextest/ci_gammaloop/junit.xml
16.60 s
> tests: 25, failures: 0, errors: 0
16.60 s
> No failing testcases found.
16.60 s
> =========================================
16.60 s
> Extracting 2 binaries and 1 linked path to /build/nextest-archive-Yzi7s1
16.60 s
> Extracted 8 files to /build/nextest-archive-Yzi7s1 in 0.06s
16.60 s
> ------------
16.60 s
> Nextest run ID 37d11fb6-b9ca-48f0-b411-8689f52aefd0 with nextest profile: ci_gammaloop
16.60 s
> Starting 1 test across 2 binaries
16.60 s
> ------------
16.60 s
> Summary [ 0.005s] 1 test run: 1 passed , 0 skipped
16.60 s
>
16.60 s
> ========== nextest test summary ==========
16.60 s
> report: target/nextest/ci_gammaloop/junit.xml
16.60 s
> tests: 1, failures: 0, errors: 0
16.60 s
> No failing testcases found.
16.60 s
> =========================================
16.60 s
> Extracting 1 binary and 1 linked path to /build/nextest-archive-9RPJwj
16.60 s
> Extracted 7 files to /build/nextest-archive-9RPJwj in 0.05s
16.60 s
> ------------
16.60 s
> Nextest run ID fda93146-c47a-429c-bc64-41b3daf9e287 with nextest profile: ci_gammaloop
16.60 s
> Starting 0 tests across 1 binary
16.60 s
> ------------
16.60 s
> Summary [ 0.000s] 0 tests run: 0 passed , 0 skipped
16.60 s
>
16.60 s
> ========== nextest test summary ==========
16.60 s
> report: target/nextest/ci_gammaloop/junit.xml
16.60 s
> tests: 0, failures: 0, errors: 0
16.60 s
> No failing testcases found.
16.60 s
> =========================================
16.60 s
For full logs, run:
16.60 s
nix log /nix/store/a8c4pj5idcxyzd4f7mjzbgpqsplch99h-gammaloop-nextest-spenso.drv
16.69 s
[0 built (1 failed )]Run failed.