test packages.x86_64-linux.nix-ci-check-gammaloop-nextest-spenso

Reproduce this run
Retry Run
  1. 0.80 s $ /nix/store/9ypz3flqsrl5xl495mm8h645gadjsxi1-coreutils-9.11/bin/timeout --kill-after=15s 7200s /nix/store/23zk8sgzamrbmj1fday15szf7f2279s8-nix-2.34.7/bin/nix --extra-experimental-features nix-command --extra-experimental-features flakes flake clone git+https://github.com/alphal00p/gammaloop --dest /tmp/nix-ci-worker/stable-pwd/repo/
  2. 0.82 s Cloning into '/tmp/nix-ci-worker/stable-pwd/repo'...
  3. 1.26 s remote: Enumerating objects: 65014, done.
  4. 1.50 s remote: Counting objects: 0% (1/7686) remote: Counting objects: 1% (77/7686) remote: Counting objects: 2% (154/7686) remote: Counting objects: 3% (231/7686) remote: Counting objects: 4% (308/7686) remote: Counting objects: 5% (385/7686) remote: Counting objects: 6% (462/7686) remote: Counting objects: 7% (539/7686) remote: Counting objects: 8% (615/7686) remote: Counting objects: 9% (692/7686) remote: Counting objects: 10% (769/7686) remote: Counting objects: 11% (846/7686) remote: Counting objects: 12% (923/7686) remote: Counting objects: 13% (1000/7686) remote: Counting objects: 14% (1077/7686) remote: Counting objects: 15% (1153/7686) remote: Counting objects: 16% (1230/7686) remote: Counting objects: 17% (1307/7686) remote: Counting objects: 18% (1384/7686) remote: Counting objects: 19% (1461/7686) remote: Counting objects: 20% (1538/7686) remote: Counting objects: 21% (1615/7686) remote: Counting objects: 22% (1691/7686) remote: Counting objects: 23% (1768/7686) remote: Counting objects: 24% (1845/7686) remote: Counting objects: 25% (1922/7686) remote: Counting objects: 26% (1999/7686) remote: Counting objects: 27% (2076/7686) remote: Counting objects: 28% (2153/7686) remote: Counting objects: 29% (2229/7686) remote: Counting objects: 30% (2306/7686) remote: Counting objects: 31% (2383/7686) remote: Counting objects: 32% (2460/7686) remote: Counting objects: 33% (2537/7686) remote: Counting objects: 34% (2614/7686) remote: Counting objects: 35% (2691/7686) remote: Counting objects: 36% (2767/7686) remote: Counting objects: 37% (2844/7686) remote: Counting objects: 38% (2921/7686) remote: Counting objects: 39% (2998/7686) remote: Counting objects: 40% (3075/7686) remote: Counting objects: 41% (3152/7686) remote: Counting objects: 42% (3229/7686) remote: Counting objects: 43% (3305/7686) remote: Counting objects: 44% (3382/7686) remote: Counting objects: 45% (3459/7686) remote: Counting objects: 46% (3536/7686) remote: Counting objects: 47% (3613/7686) remote: Counting objects: 48% (3690/7686) remote: Counting objects: 49% (3767/7686) remote: Counting objects: 50% (3843/7686) remote: Counting objects: 51% (3920/7686) remote: Counting objects: 52% (3997/7686) remote: Counting objects: 53% (4074/7686) remote: Counting objects: 54% (4151/7686) remote: Counting objects: 55% (4228/7686) remote: Counting objects: 56% (4305/7686) remote: Counting objects: 57% (4382/7686) remote: Counting objects: 58% (4458/7686) remote: Counting objects: 59% (4535/7686) remote: Counting objects: 60% (4612/7686) remote: Counting objects: 61% (4689/7686) remote: Counting objects: 62% (4766/7686) remote: Counting objects: 63% (4843/7686) remote: Counting objects: 64% (4920/7686) remote: Counting objects: 65% (4996/7686) remote: Counting objects: 66% (5073/7686) remote: Counting objects: 67% (5150/7686) remote: Counting objects: 68% (5227/7686) remote: Counting objects: 69% (5304/7686) remote: Counting objects: 70% (5381/7686) remote: Counting objects: 71% (5458/7686) remote: Counting objects: 72% (5534/7686) remote: Counting objects: 73% (5611/7686) remote: Counting objects: 74% (5688/7686) remote: Counting objects: 75% (5765/7686) remote: Counting objects: 76% (5842/7686) remote: Counting objects: 77% (5919/7686) remote: Counting objects: 78% (5996/7686) remote: Counting objects: 79% (6072/7686) remote: Counting objects: 80% (6149/7686) remote: Counting objects: 81% (6226/7686) remote: Counting objects: 82% (6303/7686) remote: Counting objects: 83% (6380/7686) remote: Counting objects: 84% (6457/7686) remote: Counting objects: 85% (6534/7686) remote: Counting objects: 86% (6610/7686) remote: Counting objects: 87% (6687/7686) remote: Counting objects: 88% (6764/7686) remote: Counting objects: 89% (6841/7686) remote: Counting objects: 90% (6918/7686) remote: Counting objects: 91% (6995/7686) remote: Counting objects: 92% (7072/7686) remote: Counting objects: 93% (7148/7686) remote: Counting objects: 94% (7225/7686) remote: Counting objects: 95% (7302/7686) remote: Counting objects: 96% (7379/7686) remote: Counting objects: 97% (7456/7686) remote: Counting objects: 98% (7533/7686) remote: Counting objects: 99% (7610/7686) remote: Counting objects: 100% (7686/7686) remote: Counting objects: 100% (7686/7686), done.
  5. 2.86 s remote: Compressing objects: 0% (1/1402) remote: Compressing objects: 1% (15/1402) remote: Compressing objects: 2% (29/1402) remote: Compressing objects: 3% (43/1402) remote: Compressing objects: 4% (57/1402) remote: Compressing objects: 5% (71/1402) remote: Compressing objects: 6% (85/1402) remote: Compressing objects: 7% (99/1402) remote: Compressing objects: 8% (113/1402) remote: Compressing objects: 9% (127/1402) remote: Compressing objects: 10% (141/1402) remote: Compressing objects: 11% (155/1402) remote: Compressing objects: 11% (156/1402) remote: Compressing objects: 12% (169/1402) remote: Compressing objects: 13% (183/1402) remote: Compressing objects: 14% (197/1402) remote: Compressing objects: 15% (211/1402) remote: Compressing objects: 16% (225/1402) remote: Compressing objects: 17% (239/1402) remote: Compressing objects: 18% (253/1402) remote: Compressing objects: 19% (267/1402) remote: Compressing objects: 20% (281/1402) remote: Compressing objects: 21% (295/1402) remote: Compressing objects: 22% (309/1402) remote: Compressing objects: 23% (323/1402) remote: Compressing objects: 24% (337/1402) remote: Compressing objects: 25% (351/1402) remote: Compressing objects: 26% (365/1402) remote: Compressing objects: 27% (379/1402) remote: Compressing objects: 28% (393/1402) remote: Compressing objects: 29% (407/1402) remote: Compressing objects: 30% (421/1402) remote: Compressing objects: 31% (435/1402) remote: Compressing objects: 32% (449/1402) remote: Compressing objects: 33% (463/1402) remote: Compressing objects: 34% (477/1402) remote: Compressing objects: 35% (491/1402) remote: Compressing objects: 36% (505/1402) remote: Compressing objects: 37% (519/1402) remote: Compressing objects: 38% (533/1402) remote: Compressing objects: 39% (547/1402) remote: Compressing objects: 40% (561/1402) remote: Compressing objects: 41% (575/1402) remote: Compressing objects: 42% (589/1402) remote: Compressing objects: 43% (603/1402) remote: Compressing objects: 44% (617/1402) remote: Compressing objects: 45% (631/1402) remote: Compressing objects: 46% (645/1402) remote: Compressing objects: 47% (659/1402) remote: Compressing objects: 48% (673/1402) remote: Compressing objects: 49% (687/1402) remote: Compressing objects: 50% (701/1402) remote: Compressing objects: 51% (716/1402) remote: Compressing objects: 52% (730/1402) remote: Compressing objects: 53% (744/1402) remote: Compressing objects: 54% (758/1402) remote: Compressing objects: 55% (772/1402) remote: Compressing objects: 56% (786/1402) remote: Compressing objects: 57% (800/1402) remote: Compressing objects: 58% (814/1402) remote: Compressing objects: 59% (828/1402) remote: Compressing objects: 60% (842/1402) remote: Compressing objects: 61% (856/1402) remote: Compressing objects: 62% (870/1402) remote: Compressing objects: 63% (884/1402) remote: Compressing objects: 64% (898/1402) remote: Compressing objects: 65% (912/1402) remote: Compressing objects: 66% (926/1402) remote: Compressing objects: 67% (940/1402) remote: Compressing objects: 68% (954/1402) remote: Compressing objects: 69% (968/1402) remote: Compressing objects: 70% (982/1402) remote: Compressing objects: 71% (996/1402) remote: Compressing objects: 72% (1010/1402) remote: Compressing objects: 73% (1024/1402) remote: Compressing objects: 74% (1038/1402) remote: Compressing objects: 75% (1052/1402) remote: Compressing objects: 76% (1066/1402) remote: Compressing objects: 77% (1080/1402) remote: Compressing objects: 78% (1094/1402) remote: Compressing objects: 79% (1108/1402) remote: Compressing objects: 80% (1122/1402) remote: Compressing objects: 81% (1136/1402) remote: Compressing objects: 82% (1150/1402) remote: Compressing objects: 83% (1164/1402) remote: Compressing objects: 84% (1178/1402) remote: Compressing objects: 85% (1192/1402) remote: Compressing objects: 86% (1206/1402) remote: Compressing objects: 87% (1220/1402) remote: Compressing objects: 88% (1234/1402) remote: Compressing objects: 89% (1248/1402) remote: Compressing objects: 90% (1262/1402) remote: Compressing objects: 91% (1276/1402) remote: Compressing objects: 92% (1290/1402) remote: Compressing objects: 93% (1304/1402) remote: Compressing objects: 94% (1318/1402) remote: Compressing objects: 95% (1332/1402) remote: Compressing objects: 96% (1346/1402) remote: Compressing objects: 97% (1360/1402) remote: Compressing objects: 98% (1374/1402) remote: Compressing objects: 99% (1388/1402) remote: Compressing objects: 100% (1402/1402) remote: Compressing objects: 100% (1402/1402), done.
  6. 7.28 s Receiving objects: 0% (1/65014) Receiving objects: 1% (651/65014) Receiving objects: 2% (1301/65014) Receiving objects: 3% (1951/65014), 5.42 MiB | 10.74 MiB/s Receiving objects: 4% (2601/65014), 5.42 MiB | 10.74 MiB/s Receiving objects: 5% (3251/65014), 5.42 MiB | 10.74 MiB/s Receiving objects: 6% (3901/65014), 5.42 MiB | 10.74 MiB/s Receiving objects: 7% (4551/65014), 5.42 MiB | 10.74 MiB/s Receiving objects: 7% (4874/65014), 9.37 MiB | 9.32 MiB/s Receiving objects: 8% (5202/65014), 9.37 MiB | 9.32 MiB/s Receiving objects: 9% (5852/65014), 9.37 MiB | 9.32 MiB/s Receiving objects: 10% (6502/65014), 9.37 MiB | 9.32 MiB/s Receiving objects: 11% (7152/65014), 9.37 MiB | 9.32 MiB/s Receiving objects: 12% (7802/65014), 17.25 MiB | 11.46 MiB/s Receiving objects: 13% (8452/65014), 17.25 MiB | 11.46 MiB/s Receiving objects: 14% (9102/65014), 17.25 MiB | 11.46 MiB/s Receiving objects: 15% (9753/65014), 17.25 MiB | 11.46 MiB/s Receiving objects: 16% (10403/65014), 17.25 MiB | 11.46 MiB/s Receiving objects: 17% (11053/65014), 17.25 MiB | 11.46 MiB/s Receiving objects: 18% (11703/65014), 17.25 MiB | 11.46 MiB/s Receiving objects: 19% (12353/65014), 17.25 MiB | 11.46 MiB/s Receiving objects: 20% (13003/65014), 17.25 MiB | 11.46 MiB/s Receiving objects: 21% (13653/65014), 17.25 MiB | 11.46 MiB/s Receiving objects: 22% (14304/65014), 17.25 MiB | 11.46 MiB/s Receiving objects: 23% (14954/65014), 17.25 MiB | 11.46 MiB/s Receiving objects: 24% (15604/65014), 17.25 MiB | 11.46 MiB/s Receiving objects: 25% (16254/65014), 17.25 MiB | 11.46 MiB/s Receiving objects: 26% (16904/65014), 17.25 MiB | 11.46 MiB/s Receiving objects: 27% (17554/65014), 17.25 MiB | 11.46 MiB/s Receiving objects: 28% (18204/65014), 17.25 MiB | 11.46 MiB/s Receiving objects: 29% (18855/65014), 17.25 MiB | 11.46 MiB/s Receiving objects: 30% (19505/65014), 17.25 MiB | 11.46 MiB/s Receiving objects: 31% (20155/65014), 17.25 MiB | 11.46 MiB/s Receiving objects: 32% (20805/65014), 17.25 MiB | 11.46 MiB/s Receiving objects: 33% (21455/65014), 17.25 MiB | 11.46 MiB/s Receiving objects: 34% (22105/65014), 17.25 MiB | 11.46 MiB/s Receiving objects: 34% (22656/65014), 17.25 MiB | 11.46 MiB/s Receiving objects: 35% (22755/65014), 23.69 MiB | 11.81 MiB/s Receiving objects: 36% (23406/65014), 23.69 MiB | 11.81 MiB/s Receiving objects: 37% (24056/65014), 23.69 MiB | 11.81 MiB/s Receiving objects: 38% (24706/65014), 23.69 MiB | 11.81 MiB/s Receiving objects: 39% (25356/65014), 23.69 MiB | 11.81 MiB/s Receiving objects: 40% (26006/65014), 23.69 MiB | 11.81 MiB/s Receiving objects: 41% (26656/65014), 23.69 MiB | 11.81 MiB/s Receiving objects: 42% (27306/65014), 23.69 MiB | 11.81 MiB/s Receiving objects: 43% (27957/65014), 23.69 MiB | 11.81 MiB/s Receiving objects: 44% (28607/65014), 23.69 MiB | 11.81 MiB/s Receiving objects: 45% (29257/65014), 23.69 MiB | 11.81 MiB/s Receiving objects: 46% (29907/65014), 23.69 MiB | 11.81 MiB/s Receiving objects: 47% (30557/65014), 23.69 MiB | 11.81 MiB/s Receiving objects: 48% (31207/65014), 23.69 MiB | 11.81 MiB/s Receiving objects: 49% (31857/65014), 23.69 MiB | 11.81 MiB/s Receiving objects: 50% (32507/65014), 23.69 MiB | 11.81 MiB/s Receiving objects: 51% (33158/65014), 30.56 MiB | 12.19 MiB/s Receiving objects: 52% (33808/65014), 30.56 MiB | 12.19 MiB/s Receiving objects: 53% (34458/65014), 30.56 MiB | 12.19 MiB/s Receiving objects: 54% (35108/65014), 30.56 MiB | 12.19 MiB/s Receiving objects: 55% (35758/65014), 30.56 MiB | 12.19 MiB/s Receiving objects: 56% (36408/65014), 30.56 MiB | 12.19 MiB/s Receiving objects: 57% (37058/65014), 30.56 MiB | 12.19 MiB/s Receiving objects: 57% (37579/65014), 30.56 MiB | 12.19 MiB/s Receiving objects: 58% (37709/65014), 40.89 MiB | 13.60 MiB/s Receiving objects: 59% (38359/65014), 40.89 MiB | 13.60 MiB/s Receiving objects: 60% (39009/65014), 40.89 MiB | 13.60 MiB/s Receiving objects: 61% (39659/65014), 40.89 MiB | 13.60 MiB/s Receiving objects: 62% (40309/65014), 40.89 MiB | 13.60 MiB/s Receiving objects: 63% (40959/65014), 40.89 MiB | 13.60 MiB/s Receiving objects: 64% (41609/65014), 40.89 MiB | 13.60 MiB/s Receiving objects: 65% (42260/65014), 40.89 MiB | 13.60 MiB/s Receiving objects: 66% (42910/65014), 40.89 MiB | 13.60 MiB/s Receiving objects: 67% (43560/65014), 40.89 MiB | 13.60 MiB/s Receiving objects: 68% (44210/65014), 40.89 MiB | 13.60 MiB/s Receiving objects: 69% (44860/65014), 40.89 MiB | 13.60 MiB/s Receiving objects: 70% (45510/65014), 40.89 MiB | 13.60 MiB/s Receiving objects: 71% (46160/65014), 40.89 MiB | 13.60 MiB/s Receiving objects: 72% (46811/65014), 58.46 MiB | 16.66 MiB/s Receiving objects: 73% (47461/65014), 58.46 MiB | 16.66 MiB/s Receiving objects: 74% (48111/65014), 58.46 MiB | 16.66 MiB/s Receiving objects: 75% (48761/65014), 58.46 MiB | 16.66 MiB/s Receiving objects: 76% (49411/65014), 58.46 MiB | 16.66 MiB/s Receiving objects: 77% (50061/65014), 58.46 MiB | 16.66 MiB/s Receiving objects: 78% (50711/65014), 58.46 MiB | 16.66 MiB/s Receiving objects: 79% (51362/65014), 58.46 MiB | 16.66 MiB/s Receiving objects: 79% (51856/65014), 58.46 MiB | 16.66 MiB/s Receiving objects: 80% (52012/65014), 58.46 MiB | 16.66 MiB/s Receiving objects: 81% (52662/65014), 74.64 MiB | 18.62 MiB/s Receiving objects: 82% (53312/65014), 74.64 MiB | 18.62 MiB/s Receiving objects: 83% (53962/65014), 74.64 MiB | 18.62 MiB/s Receiving objects: 84% (54612/65014), 74.64 MiB | 18.62 MiB/s Receiving objects: 85% (55262/65014), 74.64 MiB | 18.62 MiB/s Receiving objects: 86% (55913/65014), 74.64 MiB | 18.62 MiB/s Receiving objects: 87% (56563/65014), 74.64 MiB | 18.62 MiB/s Receiving objects: 88% (57213/65014), 74.64 MiB | 18.62 MiB/s Receiving objects: 89% (57863/65014), 74.64 MiB | 18.62 MiB/s Receiving objects: 90% (58513/65014), 74.64 MiB | 18.62 MiB/s Receiving objects: 91% (59163/65014), 74.64 MiB | 18.62 MiB/s Receiving objects: 92% (59813/65014), 74.64 MiB | 18.62 MiB/s Receiving objects: 93% (60464/65014), 74.64 MiB | 18.62 MiB/s Receiving objects: 94% (61114/65014), 74.64 MiB | 18.62 MiB/s Receiving objects: 95% (61764/65014), 74.64 MiB | 18.62 MiB/s Receiving objects: 96% (62414/65014), 74.64 MiB | 18.62 MiB/s Receiving objects: 97% (63064/65014), 74.64 MiB | 18.62 MiB/s Receiving objects: 98% (63714/65014), 74.64 MiB | 18.62 MiB/s Receiving objects: 99% (64364/65014), 74.64 MiB | 18.62 MiB/s remote: Total 65014 (delta 6802), reused 6284 (delta 6284), pack-reused 57328 (from 1)
  7. 7.30 s Receiving objects: 100% (65014/65014), 74.64 MiB | 18.62 MiB/s Receiving objects: 100% (65014/65014), 86.90 MiB | 19.69 MiB/s, done.
  8. 8.48 s Resolving deltas: 0% (0/45899) Resolving deltas: 1% (459/45899) Resolving deltas: 2% (918/45899) Resolving deltas: 3% (1377/45899) Resolving deltas: 4% (1836/45899) Resolving deltas: 5% (2296/45899) Resolving deltas: 6% (2754/45899) Resolving deltas: 7% (3213/45899) Resolving deltas: 8% (3673/45899) Resolving deltas: 9% (4131/45899) Resolving deltas: 10% (4590/45899) Resolving deltas: 11% (5049/45899) Resolving deltas: 12% (5510/45899) Resolving deltas: 13% (5969/45899) Resolving deltas: 14% (6426/45899) Resolving deltas: 15% (6885/45899) Resolving deltas: 16% (7344/45899) Resolving deltas: 17% (7803/45899) Resolving deltas: 18% (8262/45899) Resolving deltas: 19% (8721/45899) Resolving deltas: 20% (9181/45899) Resolving deltas: 21% (9639/45899) Resolving deltas: 22% (10098/45899) Resolving deltas: 23% (10560/45899) Resolving deltas: 24% (11016/45899) Resolving deltas: 25% (11475/45899) Resolving deltas: 26% (11934/45899) Resolving deltas: 27% (12393/45899) Resolving deltas: 28% (12852/45899) Resolving deltas: 29% (13311/45899) Resolving deltas: 30% (13770/45899) Resolving deltas: 31% (14229/45899) Resolving deltas: 32% (14688/45899) Resolving deltas: 33% (15147/45899) Resolving deltas: 34% (15606/45899) Resolving deltas: 35% (16065/45899) Resolving deltas: 36% (16524/45899) Resolving deltas: 37% (16984/45899) Resolving deltas: 38% (17442/45899) Resolving deltas: 39% (17901/45899) Resolving deltas: 40% (18360/45899) Resolving deltas: 41% (18819/45899) Resolving deltas: 42% (19278/45899) Resolving deltas: 43% (19737/45899) Resolving deltas: 44% (20196/45899) Resolving deltas: 45% (20655/45899) Resolving deltas: 46% (21114/45899) Resolving deltas: 47% (21573/45899) Resolving deltas: 48% (22033/45899) Resolving deltas: 49% (22492/45899) Resolving deltas: 50% (22951/45899) Resolving deltas: 51% (23410/45899) Resolving deltas: 52% (23871/45899) Resolving deltas: 53% (24327/45899) Resolving deltas: 54% (24788/45899) Resolving deltas: 55% (25246/45899) Resolving deltas: 56% (25704/45899) Resolving deltas: 57% (26163/45899) Resolving deltas: 58% (26622/45899) Resolving deltas: 59% (27083/45899) Resolving deltas: 60% (27540/45899) Resolving deltas: 61% (27999/45899) Resolving deltas: 62% (28458/45899) Resolving deltas: 63% (28917/45899) Resolving deltas: 64% (29376/45899) Resolving deltas: 65% (29835/45899) Resolving deltas: 66% (30294/45899) Resolving deltas: 67% (30754/45899) Resolving deltas: 68% (31212/45899) Resolving deltas: 69% (31671/45899) Resolving deltas: 70% (32130/45899) Resolving deltas: 71% (32591/45899) Resolving deltas: 72% (33048/45899) Resolving deltas: 73% (33507/45899) Resolving deltas: 74% (33966/45899) Resolving deltas: 75% (34425/45899) Resolving deltas: 76% (34884/45899) Resolving deltas: 77% (35343/45899) Resolving deltas: 78% (35802/45899) Resolving deltas: 79% (36261/45899) Resolving deltas: 80% (36720/45899) Resolving deltas: 81% (37179/45899) Resolving deltas: 82% (37638/45899) Resolving deltas: 83% (38098/45899) Resolving deltas: 83% (38142/45899) Resolving deltas: 84% (38556/45899) Resolving deltas: 85% (39015/45899) Resolving deltas: 86% (39474/45899) Resolving deltas: 87% (39933/45899) Resolving deltas: 88% (40392/45899) Resolving deltas: 89% (40851/45899) Resolving deltas: 90% (41310/45899) Resolving deltas: 91% (41769/45899) Resolving deltas: 92% (42228/45899) Resolving deltas: 93% (42687/45899) Resolving deltas: 94% (43146/45899) Resolving deltas: 95% (43605/45899) Resolving deltas: 96% (44064/45899) Resolving deltas: 97% (44523/45899) Resolving deltas: 98% (44982/45899) Resolving deltas: 99% (45442/45899) Resolving deltas: 100% (45899/45899) Resolving deltas: 100% (45899/45899), done.
  9. 8.88 s Fetching commit 185337f01e5e562fa8f23f8e846b12c2a0cd39cc for vakint_rustred ...
  10. 8.88 s $ /nix/store/bcnisk3ydfgv26v2gw3zlky24g00yww2-git-2.54.0/bin/git fetch origin 185337f01e5e562fa8f23f8e846b12c2a0cd39cc
  11. 9.32 s From https://github.com/alphal00p/gammaloop
  12. 9.32 s * branch 185337f01e5e562fa8f23f8e846b12c2a0cd39cc -> FETCH_HEAD
  13. 9.34 s $ /nix/store/9ypz3flqsrl5xl495mm8h645gadjsxi1-coreutils-9.11/bin/timeout --kill-after=15s 7200s /nix/store/bcnisk3ydfgv26v2gw3zlky24g00yww2-git-2.54.0/bin/git -c advice.detachedHead=false checkout 185337f01e5e562fa8f23f8e846b12c2a0cd39cc
  14. 9.59 s HEAD is now at 185337f0 Add RustRed tensor reduction mode boundary
  15. 9.60 s $ /nix/store/9ypz3flqsrl5xl495mm8h645gadjsxi1-coreutils-9.11/bin/timeout --kill-after=15s 7200s /nix/store/23zk8sgzamrbmj1fday15szf7f2279s8-nix-2.34.7/bin/nix --extra-experimental-features nix-command --extra-experimental-features flakes --log-format internal-json run .#packages.x86_64-linux.nix-ci-check-gammaloop-nextest-spenso --print-build-logs
  16. 13.76 s
  17. 18.58 s evaluating derivation 'g copying '/nix/store/9ycf evaluating derivation 'g querying gammaloop-nexte [0/3 built, 0/1 copied, [0/1 built, 1 copied (4. [1/0/1 built, 1 copied (gammaloop-nextest-spenso> Extracting 5 binaries and 2 linked paths to /build/nextest-archive-ahjtCz
  18. 18.77 s gammaloop-nextest-spenso> Extracted 19 files to /build/nextest-archive-ahjtCz in 0.18s
  19. 18.78 s gammaloop-nextest-spenso> ------------
  20. 18.78 s gammaloop-nextest-spenso> Nextest run ID 388f1e9a-fe1d-488a-9e33-6a50361ff8a5 with nextest profile: ci_gammaloop
  21. 18.78 s gammaloop-nextest-spenso> Starting 224 tests across 5 binaries (26 tests skipped, including 2 tests via profile.ci_gammaloop.default-filter)
  22. 18.87 s gammaloop-nextest-spenso> FAIL [ 0.016s] ( 42/224) idenso color::test::form_reference::metric_contraction_respects_antisymmetric_normalization
  23. 18.87 s gammaloop-nextest-spenso> stdout ---
  24. 18.87 s gammaloop-nextest-spenso>
  25. 18.87 s gammaloop-nextest-spenso> running 1 test
  26. 18.87 s gammaloop-nextest-spenso> test color::test::form_reference::metric_contraction_respects_antisymmetric_normalization ... FAILED
  27. 18.87 s gammaloop-nextest-spenso>
  28. 18.87 s gammaloop-nextest-spenso> failures:
  29. 18.87 s gammaloop-nextest-spenso>
  30. 18.87 s gammaloop-nextest-spenso> failures:
  31. 18.87 s gammaloop-nextest-spenso> color::test::form_reference::metric_contraction_respects_antisymmetric_normalization
  32. 18.87 s gammaloop-nextest-spenso>
  33. 18.87 s gammaloop-nextest-spenso> test result: FAILED. 0 passed; 1 failed; 0 ignored; 0 measured; 240 filtered out; finished in 0.01s
  34. 18.87 s gammaloop-nextest-spenso>
  35. 18.87 s gammaloop-nextest-spenso> stderr ---
  36. 18.87 s gammaloop-nextest-spenso>
  37. 18.87 s gammaloop-nextest-spenso> thread 'color::test::form_reference::metric_contraction_respects_antisymmetric_normalization' (335) panicked at crates/idenso/src/color/test/form_reference.rs:171:5:
  38. 18.87 s gammaloop-nextest-spenso> assertion `left == right` failed
  39. 18.87 s gammaloop-nextest-spenso> left: "-1*f(coad(8,standalone_metric_j),coad(8,standalone_metric_s),coad(8,standalone_metric_u))"
  40. 18.87 s gammaloop-nextest-spenso> right: "f(coad(8,standalone_metric_j),coad(8,standalone_metric_s),coad(8,standalone_metric_u))"
  41. 18.87 s gammaloop-nextest-spenso> stack backtrace:
  42. 18.87 s gammaloop-nextest-spenso> 0: __rustc::rust_begin_unwind
  43. 18.87 s gammaloop-nextest-spenso> 1: core::panicking::panic_fmt
  44. 18.87 s gammaloop-nextest-spenso> 2: core::panicking::assert_failed_inner
  45. 18.87 s gammaloop-nextest-spenso> 3: core::panicking::assert_failed::<alloc::string::String, alloc::string::String>
  46. 18.87 s gammaloop-nextest-spenso> 4: idenso::color::test::form_reference::metric_contraction_respects_antisymmetric_normalization
  47. 18.87 s gammaloop-nextest-spenso> 5: <idenso::color::test::form_reference::metric_contraction_respects_antisymmetric_normalization::{closure#0} as core::ops::function::FnOnce<()>>::call_once
  48. 18.87 s gammaloop-nextest-spenso> note: Some details are omitted, run with `RUST_BACKTRACE=full` for a verbose backtrace.
  49. 18.87 s gammaloop-nextest-spenso>
  50. 19.19 s gammaloop-nextest-spenso> FAIL [ 0.121s] (221/224) idenso tensor::tests::parsing::infinite_execution
  51. 19.19 s gammaloop-nextest-spenso> stdout ---
  52. 19.19 s gammaloop-nextest-spenso>
  53. 19.19 s gammaloop-nextest-spenso> running 1 test
  54. 19.19 s gammaloop-nextest-spenso> ━━━━━━━━━━━━━━━━━━━━━━━━━━━━━━━ Snapshot Summary ━━━━━━━━━━━━━━━━━━━━━━━━━━━━━━━
  55. 19.19 s gammaloop-nextest-spenso> Snapshot: infinite_execution
  56. 19.19 s gammaloop-nextest-spenso> Source: crates/idenso/src/tensor/tests/parsing.rs:910
  57. 19.19 s gammaloop-nextest-spenso> ────────────────────────────────────────────────────────────────────────────────
  58. 19.19 s gammaloop-nextest-spenso> Expression: net_iter.snapshot_dot()
  59. 19.19 s gammaloop-nextest-spenso> ────────────────────────────────────────────────────────────────────────────────
  60. 19.19 s gammaloop-nextest-spenso> -old snapshot
  61. 19.19 s gammaloop-nextest-spenso> +new results
  62. 19.19 s gammaloop-nextest-spenso> ────────────┬───────────────────────────────────────────────────────────────────
  63. 19.19 s gammaloop-nextest-spenso> 8 8 │ 0:0:s -> ext0 [id=0 color="red"];
  64. 19.19 s gammaloop-nextest-spenso> 9 9 │ ext1 [style=invis];
  65. 19.19 s gammaloop-nextest-spenso> 10 10 │ 0:5:s -> ext1 [id=1 dir=none color="red" label="mink4|l_0"];
  66. 19.19 s gammaloop-nextest-spenso> 11 11 │ ext2 [style=invis];
  67. 19.19 s gammaloop-nextest-spenso> 12 │- 0:4:s -> ext2 [id=2 dir=none color="red" label="bis4|l_2"];
  68. 19.19 s gammaloop-nextest-spenso> 12 │+ 0:3:s -> ext2 [id=2 dir=none color="red" label="mink4|l_1"];
  69. 19.19 s gammaloop-nextest-spenso> 13 13 │ ext3 [style=invis];
  70. 19.19 s gammaloop-nextest-spenso> 14 │- 0:3:s -> ext3 [id=3 dir=none color="red" label="bis4|l_3"];
  71. 19.19 s gammaloop-nextest-spenso> 14 │+ 0:1:s -> ext3 [id=3 dir=none color="red" label="bis4|l_2"];
  72. 19.19 s gammaloop-nextest-spenso> 15 15 │ ext4 [style=invis];
  73. 19.19 s gammaloop-nextest-spenso> 16 │- 0:1:s -> ext4 [id=4 dir=none color="red" label="mink4|l_1"];
  74. 19.19 s gammaloop-nextest-spenso> 16 │+ 0:2:s -> ext4 [id=4 dir=none color="red" label="mink4|l_4"];
  75. 19.19 s gammaloop-nextest-spenso> 17 17 │ ext5 [style=invis];
  76. 19.19 s gammaloop-nextest-spenso> 18 │- 0:2:s -> ext5 [id=5 dir=none color="red" label="mink4|l_4"];
  77. 19.19 s gammaloop-nextest-spenso> 18 │+ 0:4:s -> ext5 [id=5 dir=none color="red" label="bis4|l_3"];
  78. 19.19 s gammaloop-nextest-spenso> 19 19 │ }
  79. 19.19 s gammaloop-nextest-spenso> ────────────┴───────────────────────────────────────────────────────────────────
  80. 19.19 s gammaloop-nextest-spenso> To update snapshots run `cargo insta review`
  81. 19.19 s gammaloop-nextest-spenso> Stopped on the first failure. Run `cargo insta test` to run all snapshots.
  82. 19.19 s gammaloop-nextest-spenso> test tensor::tests::parsing::infinite_execution ... FAILED
  83. 19.19 s gammaloop-nextest-spenso>
  84. 19.19 s gammaloop-nextest-spenso> failures:
  85. 19.19 s gammaloop-nextest-spenso>
  86. 19.19 s gammaloop-nextest-spenso> failures:
  87. 19.19 s gammaloop-nextest-spenso> tensor::tests::parsing::infinite_execution
  88. 19.19 s gammaloop-nextest-spenso>
  89. 19.19 s gammaloop-nextest-spenso> test result: FAILED. 0 passed; 1 failed; 0 ignored; 0 measured; 240 filtered out; finished in 0.12s
  90. 19.19 s gammaloop-nextest-spenso>
  91. 19.19 s gammaloop-nextest-spenso> stderr ---
  92. 19.19 s gammaloop-nextest-spenso>
  93. 19.19 s gammaloop-nextest-spenso> thread 'tensor::tests::parsing::infinite_execution' (836) panicked at /nix/store/5nq6hmff26w9jbhbmba4wsvgnvglj2xd-vendor-cargo-deps/c19b7c6f923b580ac259164a89f2577984ad5ab09ee9d583b888f934adbbe8d0/insta-1.47.2/src/runtime.rs:719:13:
  94. 19.19 s gammaloop-nextest-spenso> snapshot assertion for 'infinite_execution' failed in line 910
  95. 19.19 s gammaloop-nextest-spenso> stack backtrace:
  96. 19.19 s gammaloop-nextest-spenso> 0: __rustc::rust_begin_unwind
  97. 19.19 s gammaloop-nextest-spenso> 1: core::panicking::panic_fmt
  98. 19.19 s gammaloop-nextest-spenso> 2: insta::runtime::assert_snapshot
  99. 19.19 s gammaloop-nextest-spenso> 3: idenso::tensor::tests::parsing::infinite_execution
  100. 19.19 s gammaloop-nextest-spenso> 4: <idenso::tensor::tests::parsing::infinite_execution::{closure#0} as core::ops::function::FnOnce<()>>::call_once
  101. 19.19 s gammaloop-nextest-spenso> note: Some details are omitted, run with `RUST_BACKTRACE=full` for a verbose backtrace.
  102. 19.19 s gammaloop-nextest-spenso>
  103. 20.51 s gammaloop-nextest-spenso> ------------
  104. 20.51 s gammaloop-nextest-spenso> Summary [ 1.731s] 224 tests run: 222 passed, 2 failed, 26 skipped
  105. 20.51 s gammaloop-nextest-spenso> FAIL [ 0.016s] ( 42/224) idenso color::test::form_reference::metric_contraction_respects_antisymmetric_normalization
  106. 20.51 s gammaloop-nextest-spenso> stdout ---
  107. 20.51 s gammaloop-nextest-spenso>
  108. 20.51 s gammaloop-nextest-spenso> running 1 test
  109. 20.51 s gammaloop-nextest-spenso> test color::test::form_reference::metric_contraction_respects_antisymmetric_normalization ... FAILED
  110. 20.51 s gammaloop-nextest-spenso>
  111. 20.51 s gammaloop-nextest-spenso> failures:
  112. 20.51 s gammaloop-nextest-spenso>
  113. 20.51 s gammaloop-nextest-spenso> failures:
  114. 20.51 s gammaloop-nextest-spenso> color::test::form_reference::metric_contraction_respects_antisymmetric_normalization
  115. 20.51 s gammaloop-nextest-spenso>
  116. 20.51 s gammaloop-nextest-spenso> test result: FAILED. 0 passed; 1 failed; 0 ignored; 0 measured; 240 filtered out; finished in 0.01s
  117. 20.51 s gammaloop-nextest-spenso>
  118. 20.51 s gammaloop-nextest-spenso> stderr ---
  119. 20.51 s gammaloop-nextest-spenso>
  120. 20.51 s gammaloop-nextest-spenso> thread 'color::test::form_reference::metric_contraction_respects_antisymmetric_normalization' (335) panicked at crates/idenso/src/color/test/form_reference.rs:171:5:
  121. 20.51 s gammaloop-nextest-spenso> assertion `left == right` failed
  122. 20.51 s gammaloop-nextest-spenso> left: "-1*f(coad(8,standalone_metric_j),coad(8,standalone_metric_s),coad(8,standalone_metric_u))"
  123. 20.51 s gammaloop-nextest-spenso> right: "f(coad(8,standalone_metric_j),coad(8,standalone_metric_s),coad(8,standalone_metric_u))"
  124. 20.51 s gammaloop-nextest-spenso> stack backtrace:
  125. 20.51 s gammaloop-nextest-spenso> 0: __rustc::rust_begin_unwind
  126. 20.51 s gammaloop-nextest-spenso> 1: core::panicking::panic_fmt
  127. 20.51 s gammaloop-nextest-spenso> 2: core::panicking::assert_failed_inner
  128. 20.51 s gammaloop-nextest-spenso> 3: core::panicking::assert_failed::<alloc::string::String, alloc::string::String>
  129. 20.51 s gammaloop-nextest-spenso> 4: idenso::color::test::form_reference::metric_contraction_respects_antisymmetric_normalization
  130. 20.51 s gammaloop-nextest-spenso> 5: <idenso::color::test::form_reference::metric_contraction_respects_antisymmetric_normalization::{closure#0} as core::ops::function::FnOnce<()>>::call_once
  131. 20.51 s gammaloop-nextest-spenso> note: Some details are omitted, run with `RUST_BACKTRACE=full` for a verbose backtrace.
  132. 20.51 s gammaloop-nextest-spenso>
  133. 20.51 s gammaloop-nextest-spenso> FAIL [ 0.121s] (221/224) idenso tensor::tests::parsing::infinite_execution
  134. 20.51 s gammaloop-nextest-spenso> stdout ---
  135. 20.51 s gammaloop-nextest-spenso>
  136. 20.51 s gammaloop-nextest-spenso> running 1 test
  137. 20.51 s gammaloop-nextest-spenso> ━━━━━━━━━━━━━━━━━━━━━━━━━━━━━━━ Snapshot Summary ━━━━━━━━━━━━━━━━━━━━━━━━━━━━━━━
  138. 20.51 s gammaloop-nextest-spenso> Snapshot: infinite_execution
  139. 20.51 s gammaloop-nextest-spenso> Source: crates/idenso/src/tensor/tests/parsing.rs:910
  140. 20.51 s gammaloop-nextest-spenso> ────────────────────────────────────────────────────────────────────────────────
  141. 20.51 s gammaloop-nextest-spenso> Expression: net_iter.snapshot_dot()
  142. 20.51 s gammaloop-nextest-spenso> ────────────────────────────────────────────────────────────────────────────────
  143. 20.51 s gammaloop-nextest-spenso> -old snapshot
  144. 20.51 s gammaloop-nextest-spenso> +new results
  145. 20.51 s gammaloop-nextest-spenso> ────────────┬───────────────────────────────────────────────────────────────────
  146. 20.51 s gammaloop-nextest-spenso> 8 8 │ 0:0:s -> ext0 [id=0 color="red"];
  147. 20.51 s gammaloop-nextest-spenso> 9 9 │ ext1 [style=invis];
  148. 20.51 s gammaloop-nextest-spenso> 10 10 │ 0:5:s -> ext1 [id=1 dir=none color="red" label="mink4|l_0"];
  149. 20.51 s gammaloop-nextest-spenso> 11 11 │ ext2 [style=invis];
  150. 20.51 s gammaloop-nextest-spenso> 12 │- 0:4:s -> ext2 [id=2 dir=none color="red" label="bis4|l_2"];
  151. 20.51 s gammaloop-nextest-spenso> 12 │+ 0:3:s -> ext2 [id=2 dir=none color="red" label="mink4|l_1"];
  152. 20.51 s gammaloop-nextest-spenso> 13 13 │ ext3 [style=invis];
  153. 20.51 s gammaloop-nextest-spenso> 14 │- 0:3:s -> ext3 [id=3 dir=none color="red" label="bis4|l_3"];
  154. 20.51 s gammaloop-nextest-spenso> 14 │+ 0:1:s -> ext3 [id=3 dir=none color="red" label="bis4|l_2"];
  155. 20.51 s gammaloop-nextest-spenso> 15 15 │ ext4 [style=invis];
  156. 20.51 s gammaloop-nextest-spenso> 16 │- 0:1:s -> ext4 [id=4 dir=none color="red" label="mink4|l_1"];
  157. 20.51 s gammaloop-nextest-spenso> 16 │+ 0:2:s -> ext4 [id=4 dir=none color="red" label="mink4|l_4"];
  158. 20.51 s gammaloop-nextest-spenso> 17 17 │ ext5 [style=invis];
  159. 20.51 s gammaloop-nextest-spenso> 18 │- 0:2:s -> ext5 [id=5 dir=none color="red" label="mink4|l_4"];
  160. 20.51 s gammaloop-nextest-spenso> 18 │+ 0:4:s -> ext5 [id=5 dir=none color="red" label="bis4|l_3"];
  161. 20.51 s gammaloop-nextest-spenso> 19 19 │ }
  162. 20.51 s gammaloop-nextest-spenso> ────────────┴───────────────────────────────────────────────────────────────────
  163. 20.51 s gammaloop-nextest-spenso> To update snapshots run `cargo insta review`
  164. 20.51 s gammaloop-nextest-spenso> Stopped on the first failure. Run `cargo insta test` to run all snapshots.
  165. 20.51 s gammaloop-nextest-spenso> test tensor::tests::parsing::infinite_execution ... FAILED
  166. 20.51 s gammaloop-nextest-spenso>
  167. 20.51 s gammaloop-nextest-spenso> failures:
  168. 20.51 s gammaloop-nextest-spenso>
  169. 20.51 s gammaloop-nextest-spenso> failures:
  170. 20.51 s gammaloop-nextest-spenso> tensor::tests::parsing::infinite_execution
  171. 20.51 s gammaloop-nextest-spenso>
  172. 20.51 s gammaloop-nextest-spenso> test result: FAILED. 0 passed; 1 failed; 0 ignored; 0 measured; 240 filtered out; finished in 0.12s
  173. 20.51 s gammaloop-nextest-spenso>
  174. 20.51 s gammaloop-nextest-spenso> stderr ---
  175. 20.51 s gammaloop-nextest-spenso>
  176. 20.51 s gammaloop-nextest-spenso> thread 'tensor::tests::parsing::infinite_execution' (836) panicked at /nix/store/5nq6hmff26w9jbhbmba4wsvgnvglj2xd-vendor-cargo-deps/c19b7c6f923b580ac259164a89f2577984ad5ab09ee9d583b888f934adbbe8d0/insta-1.47.2/src/runtime.rs:719:13:
  177. 20.51 s gammaloop-nextest-spenso> snapshot assertion for 'infinite_execution' failed in line 910
  178. 20.51 s gammaloop-nextest-spenso> stack backtrace:
  179. 20.51 s gammaloop-nextest-spenso> 0: __rustc::rust_begin_unwind
  180. 20.51 s gammaloop-nextest-spenso> 1: core::panicking::panic_fmt
  181. 20.51 s gammaloop-nextest-spenso> 2: insta::runtime::assert_snapshot
  182. 20.51 s gammaloop-nextest-spenso> 3: idenso::tensor::tests::parsing::infinite_execution
  183. 20.51 s gammaloop-nextest-spenso> 4: <idenso::tensor::tests::parsing::infinite_execution::{closure#0} as core::ops::function::FnOnce<()>>::call_once
  184. 20.51 s gammaloop-nextest-spenso> note: Some details are omitted, run with `RUST_BACKTRACE=full` for a verbose backtrace.
  185. 20.51 s gammaloop-nextest-spenso>
  186. 20.54 s gammaloop-nextest-spenso> error: test run failed
  187. 20.59 s gammaloop-nextest-spenso>
  188. 20.59 s gammaloop-nextest-spenso> ========== nextest test summary ==========
  189. 20.59 s gammaloop-nextest-spenso> report: target/nextest/ci_gammaloop/junit.xml
  190. 20.59 s gammaloop-nextest-spenso> tests: 224, failures: 2, errors: 0
  191. 20.59 s gammaloop-nextest-spenso>
  192. 20.59 s gammaloop-nextest-spenso> 1. idenso::color::test::form_reference::metric_contraction_respects_antisymmetric_normalization
  193. 20.59 s gammaloop-nextest-spenso> failure: test failure with exit code 101
  194. 20.59 s gammaloop-nextest-spenso> thread 'color::test::form_reference::metric_contraction_respects_antisymmetric_normalization' (335) panicked at crates/idenso/src/color/test/form_reference.rs:171:5:
  195. 20.59 s gammaloop-nextest-spenso> assertion `left == right` failed
  196. 20.59 s gammaloop-nextest-spenso> left: "-1*f(coad(8,standalone_metric_j),coad(8,standalone_metric_s),coad(8,standalone_metric_u))"
  197. 20.59 s gammaloop-nextest-spenso> right: "f(coad(8,standalone_metric_j),coad(8,standalone_metric_s),coad(8,standalone_metric_u))"
  198. 20.59 s gammaloop-nextest-spenso> stack backtrace:
  199. 20.59 s gammaloop-nextest-spenso> 0: __rustc::rust_begin_unwind
  200. 20.59 s gammaloop-nextest-spenso> 1: core::panicking::panic_fmt
  201. 20.59 s gammaloop-nextest-spenso> 2: core::panicking::assert_failed_inner
  202. 20.59 s gammaloop-nextest-spenso> 3: core::panicking::assert_failed::<alloc::string::String, alloc::string::String>
  203. 20.59 s gammaloop-nextest-spenso> 4: idenso::color::test::form_reference::metric_contraction_respects_antisymmetric_normalization
  204. 20.59 s gammaloop-nextest-spenso> 5: <idenso::color::test::form_reference::metric_contraction_respects_antisymmetric_normalization::{closure#0} as core::ops::function::FnOnce<()>>::call_once
  205. 20.59 s gammaloop-nextest-spenso> note: Some details are omitted, run with `RUST_BACKTRACE=full` for a verbose backtrace.
  206. 20.59 s gammaloop-nextest-spenso> system-out
  207. 20.59 s gammaloop-nextest-spenso> running 1 test
  208. 20.59 s gammaloop-nextest-spenso> test color::test::form_reference::metric_contraction_respects_antisymmetric_normalization ... FAILED
  209. 20.59 s gammaloop-nextest-spenso>
  210. 20.59 s gammaloop-nextest-spenso> failures:
  211. 20.59 s gammaloop-nextest-spenso>
  212. 20.59 s gammaloop-nextest-spenso> failures:
  213. 20.59 s gammaloop-nextest-spenso> color::test::form_reference::metric_contraction_respects_antisymmetric_normalization
  214. 20.59 s gammaloop-nextest-spenso>
  215. 20.59 s gammaloop-nextest-spenso> test result: FAILED. 0 passed; 1 failed; 0 ignored; 0 measured; 240 filtered out; finished in 0.01s
  216. 20.59 s gammaloop-nextest-spenso> system-err
  217. 20.59 s gammaloop-nextest-spenso> thread 'color::test::form_reference::metric_contraction_respects_antisymmetric_normalization' (335) panicked at crates/idenso/src/color/test/form_reference.rs:171:5:
  218. 20.59 s gammaloop-nextest-spenso> assertion `left == right` failed
  219. 20.59 s gammaloop-nextest-spenso> left: "-1*f(coad(8,standalone_metric_j),coad(8,standalone_metric_s),coad(8,standalone_metric_u))"
  220. 20.59 s gammaloop-nextest-spenso> right: "f(coad(8,standalone_metric_j),coad(8,standalone_metric_s),coad(8,standalone_metric_u))"
  221. 20.59 s gammaloop-nextest-spenso> stack backtrace:
  222. 20.59 s gammaloop-nextest-spenso> 0: __rustc::rust_begin_unwind
  223. 20.59 s gammaloop-nextest-spenso> 1: core::panicking::panic_fmt
  224. 20.59 s gammaloop-nextest-spenso> 2: core::panicking::assert_failed_inner
  225. 20.59 s gammaloop-nextest-spenso> 3: core::panicking::assert_failed::<alloc::string::String, alloc::string::String>
  226. 20.59 s gammaloop-nextest-spenso> 4: idenso::color::test::form_reference::metric_contraction_respects_antisymmetric_normalization
  227. 20.59 s gammaloop-nextest-spenso> 5: <idenso::color::test::form_reference::metric_contraction_respects_antisymmetric_normalization::{closure#0} as core::ops::function::FnOnce<()>>::call_once
  228. 20.59 s gammaloop-nextest-spenso> note: Some details are omitted, run with `RUST_BACKTRACE=full` for a verbose backtrace.
  229. 20.59 s gammaloop-nextest-spenso>
  230. 20.59 s gammaloop-nextest-spenso> 2. idenso::tensor::tests::parsing::infinite_execution
  231. 20.59 s gammaloop-nextest-spenso> failure: test failure with exit code 101
  232. 20.59 s gammaloop-nextest-spenso> thread 'tensor::tests::parsing::infinite_execution' (836) panicked at /nix/store/5nq6hmff26w9jbhbmba4wsvgnvglj2xd-vendor-cargo-deps/c19b7c6f923b580ac259164a89f2577984ad5ab09ee9d583b888f934adbbe8d0/insta-1.47.2/src/runtime.rs:719:13:
  233. 20.59 s gammaloop-nextest-spenso> snapshot assertion for 'infinite_execution' failed in line 910
  234. 20.59 s gammaloop-nextest-spenso> stack backtrace:
  235. 20.59 s gammaloop-nextest-spenso> 0: __rustc::rust_begin_unwind
  236. 20.59 s gammaloop-nextest-spenso> 1: core::panicking::panic_fmt
  237. 20.59 s gammaloop-nextest-spenso> 2: insta::runtime::assert_snapshot
  238. 20.59 s gammaloop-nextest-spenso> 3: idenso::tensor::tests::parsing::infinite_execution
  239. 20.59 s gammaloop-nextest-spenso> 4: <idenso::tensor::tests::parsing::infinite_execution::{closure#0} as core::ops::function::FnOnce<()>>::call_once
  240. 20.59 s gammaloop-nextest-spenso> note: Some details are omitted, run with `RUST_BACKTRACE=full` for a verbose backtrace.
  241. 20.59 s gammaloop-nextest-spenso> system-out
  242. 20.59 s gammaloop-nextest-spenso> running 1 test
  243. 20.59 s gammaloop-nextest-spenso> ━━━━━━━━━━━━━━━━━━━━━━━━━━━━━━━ Snapshot Summary ━━━━━━━━━━━━━━━━━━━━━━━━━━━━━━━
  244. 20.59 s gammaloop-nextest-spenso> Snapshot: infinite_execution
  245. 20.59 s gammaloop-nextest-spenso> Source: crates/idenso/src/tensor/tests/parsing.rs:910
  246. 20.59 s gammaloop-nextest-spenso> ────────────────────────────────────────────────────────────────────────────────
  247. 20.59 s gammaloop-nextest-spenso> Expression: net_iter.snapshot_dot()
  248. 20.59 s gammaloop-nextest-spenso> ────────────────────────────────────────────────────────────────────────────────
  249. 20.59 s gammaloop-nextest-spenso> -old snapshot
  250. 20.59 s gammaloop-nextest-spenso> +new results
  251. 20.59 s gammaloop-nextest-spenso> ────────────┬───────────────────────────────────────────────────────────────────
  252. 20.59 s gammaloop-nextest-spenso> 8 8 │ 0:0:s-> ext0 [id=0 color="red"];
  253. 20.59 s gammaloop-nextest-spenso> 9 9 │ ext1 [style=invis];
  254. 20.59 s gammaloop-nextest-spenso> 10 10 │ 0:5:s-> ext1 [id=1 dir=none color="red" label="mink4|l_0"];
  255. 20.59 s gammaloop-nextest-spenso> 11 11 │ ext2 [style=invis];
  256. 20.59 s gammaloop-nextest-spenso> 12 │- 0:4:s-> ext2 [id=2 dir=none color="red" label="bis4|l_2"];
  257. 20.59 s gammaloop-nextest-spenso> 12 │+ 0:3:s-> ext2 [id=2 dir=none color="red" label="mink4|l_1"];
  258. 20.59 s gammaloop-nextest-spenso> 13 13 │ ext3 [style=invis];
  259. 20.59 s gammaloop-nextest-spenso> 14 │- 0:3:s-> ext3 [id=3 dir=none color="red" label="bis4|l_3"];
  260. 20.59 s gammaloop-nextest-spenso> 14 │+ 0:1:s-> ext3 [id=3 dir=none color="red" label="bis4|l_2"];
  261. 20.59 s gammaloop-nextest-spenso> 15 15 │ ext4 [style=invis];
  262. 20.59 s gammaloop-nextest-spenso> 16 │- 0:1:s-> ext4 [id=4 dir=none color="red" label="mink4|l_1"];
  263. 20.59 s gammaloop-nextest-spenso> 16 │+ 0:2:s-> ext4 [id=4 dir=none color="red" label="mink4|l_4"];
  264. 20.59 s gammaloop-nextest-spenso> 17 17 │ ext5 [style=invis];
  265. 20.59 s gammaloop-nextest-spenso> 18 │- 0:2:s-> ext5 [id=5 dir=none color="red" label="mink4|l_4"];
  266. 20.59 s gammaloop-nextest-spenso> 18 │+ 0:4:s-> ext5 [id=5 dir=none color="red" label="bis4|l_3"];
  267. 20.59 s gammaloop-nextest-spenso> 19 19 │ }
  268. 20.59 s gammaloop-nextest-spenso> ────────────┴───────────────────────────────────────────────────────────────────
  269. 20.59 s gammaloop-nextest-spenso> To update snapshots run `cargo insta review`
  270. 20.59 s gammaloop-nextest-spenso> Stopped on the first failure. Run `cargo insta test` to run all snapshots.
  271. 20.59 s gammaloop-nextest-spenso> test tensor::tests::parsing::infinite_execution ... FAILED
  272. 20.59 s gammaloop-nextest-spenso>
  273. 20.59 s gammaloop-nextest-spenso> failures:
  274. 20.59 s gammaloop-nextest-spenso>
  275. 20.59 s gammaloop-nextest-spenso> failures:
  276. 20.59 s gammaloop-nextest-spenso> tensor::tests::parsing::infinite_execution
  277. 20.59 s gammaloop-nextest-spenso>
  278. 20.59 s gammaloop-nextest-spenso> test result: FAILED. 0 passed; 1 failed; 0 ignored; 0 measured; 240 filtered out; finished in 0.12s
  279. 20.59 s gammaloop-nextest-spenso> system-err
  280. 20.59 s gammaloop-nextest-spenso> thread 'tensor::tests::parsing::infinite_execution' (836) panicked at /nix/store/5nq6hmff26w9jbhbmba4wsvgnvglj2xd-vendor-cargo-deps/c19b7c6f923b580ac259164a89f2577984ad5ab09ee9d583b888f934adbbe8d0/insta-1.47.2/src/runtime.rs:719:13:
  281. 20.59 s gammaloop-nextest-spenso> snapshot assertion for 'infinite_execution' failed in line 910
  282. 20.59 s gammaloop-nextest-spenso> stack backtrace:
  283. 20.59 s gammaloop-nextest-spenso> 0: __rustc::rust_begin_unwind
  284. 20.59 s gammaloop-nextest-spenso> 1: core::panicking::panic_fmt
  285. 20.59 s gammaloop-nextest-spenso> 2: insta::runtime::assert_snapshot
  286. 20.59 s gammaloop-nextest-spenso> 3: idenso::tensor::tests::parsing::infinite_execution
  287. 20.59 s gammaloop-nextest-spenso> 4: <idenso::tensor::tests::parsing::infinite_execution::{closure#0} as core::ops::function::FnOnce<()>>::call_once
  288. 20.59 s gammaloop-nextest-spenso> note: Some details are omitted, run with `RUST_BACKTRACE=full` for a verbose backtrace.
  289. 20.59 s gammaloop-nextest-spenso> =========================================
  290. 20.60 s gammaloop-nextest-spenso> Extracting 2 binaries and 1 linked path to /build/nextest-archive-CQG4se
  291. 20.68 s gammaloop-nextest-spenso> Extracted 8 files to /build/nextest-archive-CQG4se in 0.08s
  292. 20.69 s gammaloop-nextest-spenso> ------------
  293. 20.69 s gammaloop-nextest-spenso> Nextest run ID a882d236-bad1-4934-852e-62ab722b6d52 with nextest profile: ci_gammaloop
  294. 20.69 s gammaloop-nextest-spenso> Starting 135 tests across 2 binaries
  295. 20.76 s gammaloop-nextest-spenso> ------------
  296. 20.76 s gammaloop-nextest-spenso> Summary [ 0.074s] 135 tests run: 135 passed, 0 skipped
  297. 20.80 s gammaloop-nextest-spenso>
  298. 20.80 s gammaloop-nextest-spenso> ========== nextest test summary ==========
  299. 20.80 s gammaloop-nextest-spenso> report: target/nextest/ci_gammaloop/junit.xml
  300. 20.80 s gammaloop-nextest-spenso> tests: 135, failures: 0, errors: 0
  301. 20.80 s gammaloop-nextest-spenso> No failing testcases found.
  302. 20.80 s gammaloop-nextest-spenso> =========================================
  303. 20.81 s gammaloop-nextest-spenso> Extracting 5 binaries and 2 linked paths to /build/nextest-archive-sk0Ndy
  304. 21.01 s gammaloop-nextest-spenso> Extracted 19 files to /build/nextest-archive-sk0Ndy in 0.20s
  305. 21.02 s gammaloop-nextest-spenso> ------------
  306. 21.02 s gammaloop-nextest-spenso> Nextest run ID a1c13e61-0401-4375-b1ee-3e509062fc19 with nextest profile: ci_gammaloop
  307. 21.02 s gammaloop-nextest-spenso> Starting 25 tests across 5 binaries (1 test skipped via profile.ci_gammaloop.default-filter)
  308. 21.21 s gammaloop-nextest-spenso> ------------
  309. 21.21 s gammaloop-nextest-spenso> Summary [ 0.191s] 25 tests run: 25 passed, 1 skipped
  310. 21.27 s gammaloop-nextest-spenso>
  311. 21.27 s gammaloop-nextest-spenso> ========== nextest test summary ==========
  312. 21.27 s gammaloop-nextest-spenso> report: target/nextest/ci_gammaloop/junit.xml
  313. 21.27 s gammaloop-nextest-spenso> tests: 25, failures: 0, errors: 0
  314. 21.27 s gammaloop-nextest-spenso> No failing testcases found.
  315. 21.27 s gammaloop-nextest-spenso> =========================================
  316. 21.28 s gammaloop-nextest-spenso> Extracting 2 binaries and 1 linked path to /build/nextest-archive-oKk70C
  317. 21.34 s gammaloop-nextest-spenso> Extracted 8 files to /build/nextest-archive-oKk70C in 0.06s
  318. 21.35 s gammaloop-nextest-spenso> ------------
  319. 21.35 s gammaloop-nextest-spenso> Nextest run ID 3f3ddfff-2ea0-49fb-8651-9d14e34e4bbd with nextest profile: ci_gammaloop
  320. 21.35 s gammaloop-nextest-spenso> Starting 1 test across 2 binaries
  321. 21.35 s gammaloop-nextest-spenso> ------------
  322. 21.35 s gammaloop-nextest-spenso> Summary [ 0.005s] 1 test run: 1 passed, 0 skipped
  323. 21.39 s gammaloop-nextest-spenso>
  324. 21.39 s gammaloop-nextest-spenso> ========== nextest test summary ==========
  325. 21.39 s gammaloop-nextest-spenso> report: target/nextest/ci_gammaloop/junit.xml
  326. 21.39 s gammaloop-nextest-spenso> tests: 1, failures: 0, errors: 0
  327. 21.39 s gammaloop-nextest-spenso> No failing testcases found.
  328. 21.39 s gammaloop-nextest-spenso> =========================================
  329. 21.40 s gammaloop-nextest-spenso> Extracting 1 binary and 1 linked path to /build/nextest-archive-bb4wjk
  330. 21.45 s gammaloop-nextest-spenso> Extracted 7 files to /build/nextest-archive-bb4wjk in 0.05s
  331. 21.46 s gammaloop-nextest-spenso> ------------
  332. 21.46 s gammaloop-nextest-spenso> Nextest run ID 0cbd4aa1-50d6-4c73-8bae-e2779881ad2c with nextest profile: ci_gammaloop
  333. 21.46 s gammaloop-nextest-spenso> Starting 0 tests across 1 binary
  334. 21.46 s gammaloop-nextest-spenso> ------------
  335. 21.46 s gammaloop-nextest-spenso> Summary [ 0.000s] 0 tests run: 0 passed, 0 skipped
  336. 21.50 s gammaloop-nextest-spenso>
  337. 21.50 s gammaloop-nextest-spenso> ========== nextest test summary ==========
  338. 21.50 s gammaloop-nextest-spenso> report: target/nextest/ci_gammaloop/junit.xml
  339. 21.50 s gammaloop-nextest-spenso> tests: 0, failures: 0, errors: 0
  340. 21.50 s gammaloop-nextest-spenso> No failing testcases found.
  341. 21.50 s gammaloop-nextest-spenso> =========================================
  342. 21.52 s error: Cannot build '/nix/store/a8c4pj5idcxyzd4f7mjzbgpqsplch99h-gammaloop-nextest-spenso.drv'.
  343. 21.52 s Reason: builder failed with exit code 100.
  344. 21.52 s Output paths:
  345. 21.52 s /nix/store/0ac09738mgqyrr4w556r0sn3jnyda0xd-gammaloop-nextest-spenso
  346. 21.52 s Last 325 log lines:
  347. 21.52 s > Extracting 5 binaries and 2 linked paths to /build/nextest-archive-ahjtCz
  348. 21.52 s > Extracted 19 files to /build/nextest-archive-ahjtCz in 0.18s
  349. 21.52 s > ------------
  350. 21.52 s > Nextest run ID 388f1e9a-fe1d-488a-9e33-6a50361ff8a5 with nextest profile: ci_gammaloop
  351. 21.52 s > Starting 224 tests across 5 binaries (26 tests skipped, including 2 tests via profile.ci_gammaloop.default-filter)
  352. 21.52 s > FAIL [ 0.016s] ( 42/224) idenso color::test::form_reference::metric_contraction_respects_antisymmetric_normalization
  353. 21.52 s > stdout ---
  354. 21.52 s >
  355. 21.52 s > running 1 test
  356. 21.52 s > test color::test::form_reference::metric_contraction_respects_antisymmetric_normalization ... FAILED
  357. 21.52 s >
  358. 21.52 s > failures:
  359. 21.52 s >
  360. 21.52 s > failures:
  361. 21.52 s > color::test::form_reference::metric_contraction_respects_antisymmetric_normalization
  362. 21.52 s >
  363. 21.52 s > test result: FAILED. 0 passed; 1 failed; 0 ignored; 0 measured; 240 filtered out; finished in 0.01s
  364. 21.52 s >
  365. 21.52 s > stderr ---
  366. 21.52 s >
  367. 21.52 s > thread 'color::test::form_reference::metric_contraction_respects_antisymmetric_normalization' (335) panicked at crates/idenso/src/color/test/form_reference.rs:171:5:
  368. 21.52 s > assertion `left == right` failed
  369. 21.52 s > left: "-1*f(coad(8,standalone_metric_j),coad(8,standalone_metric_s),coad(8,standalone_metric_u))"
  370. 21.52 s > right: "f(coad(8,standalone_metric_j),coad(8,standalone_metric_s),coad(8,standalone_metric_u))"
  371. 21.52 s > stack backtrace:
  372. 21.52 s > 0: __rustc::rust_begin_unwind
  373. 21.52 s > 1: core::panicking::panic_fmt
  374. 21.52 s > 2: core::panicking::assert_failed_inner
  375. 21.52 s > 3: core::panicking::assert_failed::<alloc::string::String, alloc::string::String>
  376. 21.52 s > 4: idenso::color::test::form_reference::metric_contraction_respects_antisymmetric_normalization
  377. 21.52 s > 5: <idenso::color::test::form_reference::metric_contraction_respects_antisymmetric_normalization::{closure#0} as core::ops::function::FnOnce<()>>::call_once
  378. 21.52 s > note: Some details are omitted, run with `RUST_BACKTRACE=full` for a verbose backtrace.
  379. 21.52 s >
  380. 21.52 s > FAIL [ 0.121s] (221/224) idenso tensor::tests::parsing::infinite_execution
  381. 21.52 s > stdout ---
  382. 21.52 s >
  383. 21.52 s > running 1 test
  384. 21.52 s > ━━━━━━━━━━━━━━━━━━━━━━━━━━━━━━━ Snapshot Summary ━━━━━━━━━━━━━━━━━━━━━━━━━━━━━━━
  385. 21.52 s > Snapshot: infinite_execution
  386. 21.52 s > Source: crates/idenso/src/tensor/tests/parsing.rs:910
  387. 21.52 s > ────────────────────────────────────────────────────────────────────────────────
  388. 21.52 s > Expression: net_iter.snapshot_dot()
  389. 21.52 s > ────────────────────────────────────────────────────────────────────────────────
  390. 21.52 s > -old snapshot
  391. 21.52 s > +new results
  392. 21.52 s > ────────────┬───────────────────────────────────────────────────────────────────
  393. 21.52 s > 8 8 │ 0:0:s -> ext0 [id=0 color="red"];
  394. 21.52 s > 9 9 │ ext1 [style=invis];
  395. 21.52 s > 10 10 │ 0:5:s -> ext1 [id=1 dir=none color="red" label="mink4|l_0"];
  396. 21.52 s > 11 11 │ ext2 [style=invis];
  397. 21.52 s > 12 │- 0:4:s -> ext2 [id=2 dir=none color="red" label="bis4|l_2"];
  398. 21.52 s > 12 │+ 0:3:s -> ext2 [id=2 dir=none color="red" label="mink4|l_1"];
  399. 21.52 s > 13 13 │ ext3 [style=invis];
  400. 21.52 s > 14 │- 0:3:s -> ext3 [id=3 dir=none color="red" label="bis4|l_3"];
  401. 21.52 s > 14 │+ 0:1:s -> ext3 [id=3 dir=none color="red" label="bis4|l_2"];
  402. 21.52 s > 15 15 │ ext4 [style=invis];
  403. 21.52 s > 16 │- 0:1:s -> ext4 [id=4 dir=none color="red" label="mink4|l_1"];
  404. 21.52 s > 16 │+ 0:2:s -> ext4 [id=4 dir=none color="red" label="mink4|l_4"];
  405. 21.52 s > 17 17 │ ext5 [style=invis];
  406. 21.52 s > 18 │- 0:2:s -> ext5 [id=5 dir=none color="red" label="mink4|l_4"];
  407. 21.52 s > 18 │+ 0:4:s -> ext5 [id=5 dir=none color="red" label="bis4|l_3"];
  408. 21.52 s > 19 19 │ }
  409. 21.52 s > ────────────┴───────────────────────────────────────────────────────────────────
  410. 21.52 s > To update snapshots run `cargo insta review`
  411. 21.52 s > Stopped on the first failure. Run `cargo insta test` to run all snapshots.
  412. 21.52 s > test tensor::tests::parsing::infinite_execution ... FAILED
  413. 21.52 s >
  414. 21.52 s > failures:
  415. 21.52 s >
  416. 21.52 s > failures:
  417. 21.52 s > tensor::tests::parsing::infinite_execution
  418. 21.52 s >
  419. 21.52 s > test result: FAILED. 0 passed; 1 failed; 0 ignored; 0 measured; 240 filtered out; finished in 0.12s
  420. 21.52 s >
  421. 21.52 s > stderr ---
  422. 21.52 s >
  423. 21.52 s > thread 'tensor::tests::parsing::infinite_execution' (836) panicked at /nix/store/5nq6hmff26w9jbhbmba4wsvgnvglj2xd-vendor-cargo-deps/c19b7c6f923b580ac259164a89f2577984ad5ab09ee9d583b888f934adbbe8d0/insta-1.47.2/src/runtime.rs:719:13:
  424. 21.52 s > snapshot assertion for 'infinite_execution' failed in line 910
  425. 21.52 s > stack backtrace:
  426. 21.52 s > 0: __rustc::rust_begin_unwind
  427. 21.52 s > 1: core::panicking::panic_fmt
  428. 21.52 s > 2: insta::runtime::assert_snapshot
  429. 21.52 s > 3: idenso::tensor::tests::parsing::infinite_execution
  430. 21.52 s > 4: <idenso::tensor::tests::parsing::infinite_execution::{closure#0} as core::ops::function::FnOnce<()>>::call_once
  431. 21.52 s > note: Some details are omitted, run with `RUST_BACKTRACE=full` for a verbose backtrace.
  432. 21.52 s >
  433. 21.52 s > ------------
  434. 21.52 s > Summary [ 1.731s] 224 tests run: 222 passed, 2 failed, 26 skipped
  435. 21.52 s > FAIL [ 0.016s] ( 42/224) idenso color::test::form_reference::metric_contraction_respects_antisymmetric_normalization
  436. 21.52 s > stdout ---
  437. 21.52 s >
  438. 21.52 s > running 1 test
  439. 21.52 s > test color::test::form_reference::metric_contraction_respects_antisymmetric_normalization ... FAILED
  440. 21.52 s >
  441. 21.52 s > failures:
  442. 21.52 s >
  443. 21.52 s > failures:
  444. 21.52 s > color::test::form_reference::metric_contraction_respects_antisymmetric_normalization
  445. 21.52 s >
  446. 21.52 s > test result: FAILED. 0 passed; 1 failed; 0 ignored; 0 measured; 240 filtered out; finished in 0.01s
  447. 21.52 s >
  448. 21.52 s > stderr ---
  449. 21.52 s >
  450. 21.52 s > thread 'color::test::form_reference::metric_contraction_respects_antisymmetric_normalization' (335) panicked at crates/idenso/src/color/test/form_reference.rs:171:5:
  451. 21.52 s > assertion `left == right` failed
  452. 21.52 s > left: "-1*f(coad(8,standalone_metric_j),coad(8,standalone_metric_s),coad(8,standalone_metric_u))"
  453. 21.52 s > right: "f(coad(8,standalone_metric_j),coad(8,standalone_metric_s),coad(8,standalone_metric_u))"
  454. 21.52 s > stack backtrace:
  455. 21.52 s > 0: __rustc::rust_begin_unwind
  456. 21.52 s > 1: core::panicking::panic_fmt
  457. 21.52 s > 2: core::panicking::assert_failed_inner
  458. 21.52 s > 3: core::panicking::assert_failed::<alloc::string::String, alloc::string::String>
  459. 21.52 s > 4: idenso::color::test::form_reference::metric_contraction_respects_antisymmetric_normalization
  460. 21.52 s > 5: <idenso::color::test::form_reference::metric_contraction_respects_antisymmetric_normalization::{closure#0} as core::ops::function::FnOnce<()>>::call_once
  461. 21.52 s > note: Some details are omitted, run with `RUST_BACKTRACE=full` for a verbose backtrace.
  462. 21.52 s >
  463. 21.52 s > FAIL [ 0.121s] (221/224) idenso tensor::tests::parsing::infinite_execution
  464. 21.52 s > stdout ---
  465. 21.52 s >
  466. 21.52 s > running 1 test
  467. 21.52 s > ━━━━━━━━━━━━━━━━━━━━━━━━━━━━━━━ Snapshot Summary ━━━━━━━━━━━━━━━━━━━━━━━━━━━━━━━
  468. 21.52 s > Snapshot: infinite_execution
  469. 21.52 s > Source: crates/idenso/src/tensor/tests/parsing.rs:910
  470. 21.52 s > ────────────────────────────────────────────────────────────────────────────────
  471. 21.52 s > Expression: net_iter.snapshot_dot()
  472. 21.52 s > ────────────────────────────────────────────────────────────────────────────────
  473. 21.52 s > -old snapshot
  474. 21.52 s > +new results
  475. 21.52 s > ────────────┬───────────────────────────────────────────────────────────────────
  476. 21.52 s > 8 8 │ 0:0:s -> ext0 [id=0 color="red"];
  477. 21.52 s > 9 9 │ ext1 [style=invis];
  478. 21.52 s > 10 10 │ 0:5:s -> ext1 [id=1 dir=none color="red" label="mink4|l_0"];
  479. 21.52 s > 11 11 │ ext2 [style=invis];
  480. 21.52 s > 12 │- 0:4:s -> ext2 [id=2 dir=none color="red" label="bis4|l_2"];
  481. 21.52 s > 12 │+ 0:3:s -> ext2 [id=2 dir=none color="red" label="mink4|l_1"];
  482. 21.52 s > 13 13 │ ext3 [style=invis];
  483. 21.52 s > 14 │- 0:3:s -> ext3 [id=3 dir=none color="red" label="bis4|l_3"];
  484. 21.52 s > 14 │+ 0:1:s -> ext3 [id=3 dir=none color="red" label="bis4|l_2"];
  485. 21.52 s > 15 15 │ ext4 [style=invis];
  486. 21.52 s > 16 │- 0:1:s -> ext4 [id=4 dir=none color="red" label="mink4|l_1"];
  487. 21.52 s > 16 │+ 0:2:s -> ext4 [id=4 dir=none color="red" label="mink4|l_4"];
  488. 21.52 s > 17 17 │ ext5 [style=invis];
  489. 21.52 s > 18 │- 0:2:s -> ext5 [id=5 dir=none color="red" label="mink4|l_4"];
  490. 21.52 s > 18 │+ 0:4:s -> ext5 [id=5 dir=none color="red" label="bis4|l_3"];
  491. 21.52 s > 19 19 │ }
  492. 21.52 s > ────────────┴───────────────────────────────────────────────────────────────────
  493. 21.52 s > To update snapshots run `cargo insta review`
  494. 21.52 s > Stopped on the first failure. Run `cargo insta test` to run all snapshots.
  495. 21.52 s > test tensor::tests::parsing::infinite_execution ... FAILED
  496. 21.52 s >
  497. 21.52 s > failures:
  498. 21.52 s >
  499. 21.52 s > failures:
  500. 21.52 s > tensor::tests::parsing::infinite_execution
  501. 21.52 s >
  502. 21.52 s > test result: FAILED. 0 passed; 1 failed; 0 ignored; 0 measured; 240 filtered out; finished in 0.12s
  503. 21.52 s >
  504. 21.52 s > stderr ---
  505. 21.52 s >
  506. 21.52 s > thread 'tensor::tests::parsing::infinite_execution' (836) panicked at /nix/store/5nq6hmff26w9jbhbmba4wsvgnvglj2xd-vendor-cargo-deps/c19b7c6f923b580ac259164a89f2577984ad5ab09ee9d583b888f934adbbe8d0/insta-1.47.2/src/runtime.rs:719:13:
  507. 21.52 s > snapshot assertion for 'infinite_execution' failed in line 910
  508. 21.52 s > stack backtrace:
  509. 21.52 s > 0: __rustc::rust_begin_unwind
  510. 21.52 s > 1: core::panicking::panic_fmt
  511. 21.52 s > 2: insta::runtime::assert_snapshot
  512. 21.53 s > 3: idenso::tensor::tests::parsing::infinite_execution
  513. 21.53 s > 4: <idenso::tensor::tests::parsing::infinite_execution::{closure#0} as core::ops::function::FnOnce<()>>::call_once
  514. 21.53 s > note: Some details are omitted, run with `RUST_BACKTRACE=full` for a verbose backtrace.
  515. 21.53 s >
  516. 21.53 s > error: test run failed
  517. 21.53 s >
  518. 21.53 s > ========== nextest test summary ==========
  519. 21.53 s > report: target/nextest/ci_gammaloop/junit.xml
  520. 21.53 s > tests: 224, failures: 2, errors: 0
  521. 21.53 s >
  522. 21.53 s > 1. idenso::color::test::form_reference::metric_contraction_respects_antisymmetric_normalization
  523. 21.53 s > failure: test failure with exit code 101
  524. 21.53 s > thread 'color::test::form_reference::metric_contraction_respects_antisymmetric_normalization' (335) panicked at crates/idenso/src/color/test/form_reference.rs:171:5:
  525. 21.53 s > assertion `left == right` failed
  526. 21.53 s > left: "-1*f(coad(8,standalone_metric_j),coad(8,standalone_metric_s),coad(8,standalone_metric_u))"
  527. 21.53 s > right: "f(coad(8,standalone_metric_j),coad(8,standalone_metric_s),coad(8,standalone_metric_u))"
  528. 21.53 s > stack backtrace:
  529. 21.53 s > 0: __rustc::rust_begin_unwind
  530. 21.53 s > 1: core::panicking::panic_fmt
  531. 21.53 s > 2: core::panicking::assert_failed_inner
  532. 21.53 s > 3: core::panicking::assert_failed::<alloc::string::String, alloc::string::String>
  533. 21.53 s > 4: idenso::color::test::form_reference::metric_contraction_respects_antisymmetric_normalization
  534. 21.53 s > 5: <idenso::color::test::form_reference::metric_contraction_respects_antisymmetric_normalization::{closure#0} as core::ops::function::FnOnce<()>>::call_once
  535. 21.53 s > note: Some details are omitted, run with `RUST_BACKTRACE=full` for a verbose backtrace.
  536. 21.53 s > system-out
  537. 21.53 s > running 1 test
  538. 21.53 s > test color::test::form_reference::metric_contraction_respects_antisymmetric_normalization ... FAILED
  539. 21.53 s >
  540. 21.53 s > failures:
  541. 21.53 s >
  542. 21.53 s > failures:
  543. 21.53 s > color::test::form_reference::metric_contraction_respects_antisymmetric_normalization
  544. 21.53 s >
  545. 21.53 s > test result: FAILED. 0 passed; 1 failed; 0 ignored; 0 measured; 240 filtered out; finished in 0.01s
  546. 21.53 s > system-err
  547. 21.53 s > thread 'color::test::form_reference::metric_contraction_respects_antisymmetric_normalization' (335) panicked at crates/idenso/src/color/test/form_reference.rs:171:5:
  548. 21.53 s > assertion `left == right` failed
  549. 21.53 s > left: "-1*f(coad(8,standalone_metric_j),coad(8,standalone_metric_s),coad(8,standalone_metric_u))"
  550. 21.53 s > right: "f(coad(8,standalone_metric_j),coad(8,standalone_metric_s),coad(8,standalone_metric_u))"
  551. 21.53 s > stack backtrace:
  552. 21.53 s > 0: __rustc::rust_begin_unwind
  553. 21.53 s > 1: core::panicking::panic_fmt
  554. 21.53 s > 2: core::panicking::assert_failed_inner
  555. 21.53 s > 3: core::panicking::assert_failed::<alloc::string::String, alloc::string::String>
  556. 21.53 s > 4: idenso::color::test::form_reference::metric_contraction_respects_antisymmetric_normalization
  557. 21.53 s > 5: <idenso::color::test::form_reference::metric_contraction_respects_antisymmetric_normalization::{closure#0} as core::ops::function::FnOnce<()>>::call_once
  558. 21.53 s > note: Some details are omitted, run with `RUST_BACKTRACE=full` for a verbose backtrace.
  559. 21.53 s >
  560. 21.53 s > 2. idenso::tensor::tests::parsing::infinite_execution
  561. 21.53 s > failure: test failure with exit code 101
  562. 21.53 s > thread 'tensor::tests::parsing::infinite_execution' (836) panicked at /nix/store/5nq6hmff26w9jbhbmba4wsvgnvglj2xd-vendor-cargo-deps/c19b7c6f923b580ac259164a89f2577984ad5ab09ee9d583b888f934adbbe8d0/insta-1.47.2/src/runtime.rs:719:13:
  563. 21.53 s > snapshot assertion for 'infinite_execution' failed in line 910
  564. 21.53 s > stack backtrace:
  565. 21.53 s > 0: __rustc::rust_begin_unwind
  566. 21.53 s > 1: core::panicking::panic_fmt
  567. 21.53 s > 2: insta::runtime::assert_snapshot
  568. 21.53 s > 3: idenso::tensor::tests::parsing::infinite_execution
  569. 21.53 s > 4: <idenso::tensor::tests::parsing::infinite_execution::{closure#0} as core::ops::function::FnOnce<()>>::call_once
  570. 21.53 s > note: Some details are omitted, run with `RUST_BACKTRACE=full` for a verbose backtrace.
  571. 21.53 s > system-out
  572. 21.53 s > running 1 test
  573. 21.53 s > ━━━━━━━━━━━━━━━━━━━━━━━━━━━━━━━ Snapshot Summary ━━━━━━━━━━━━━━━━━━━━━━━━━━━━━━━
  574. 21.53 s > Snapshot: infinite_execution
  575. 21.53 s > Source: crates/idenso/src/tensor/tests/parsing.rs:910
  576. 21.53 s > ────────────────────────────────────────────────────────────────────────────────
  577. 21.53 s > Expression: net_iter.snapshot_dot()
  578. 21.53 s > ────────────────────────────────────────────────────────────────────────────────
  579. 21.53 s > -old snapshot
  580. 21.53 s > +new results
  581. 21.53 s > ────────────┬───────────────────────────────────────────────────────────────────
  582. 21.53 s > 8 8 │ 0:0:s-> ext0 [id=0 color="red"];
  583. 21.53 s > 9 9 │ ext1 [style=invis];
  584. 21.53 s > 10 10 │ 0:5:s-> ext1 [id=1 dir=none color="red" label="mink4|l_0"];
  585. 21.53 s > 11 11 │ ext2 [style=invis];
  586. 21.53 s > 12 │- 0:4:s-> ext2 [id=2 dir=none color="red" label="bis4|l_2"];
  587. 21.53 s > 12 │+ 0:3:s-> ext2 [id=2 dir=none color="red" label="mink4|l_1"];
  588. 21.53 s > 13 13 │ ext3 [style=invis];
  589. 21.53 s > 14 │- 0:3:s-> ext3 [id=3 dir=none color="red" label="bis4|l_3"];
  590. 21.53 s > 14 │+ 0:1:s-> ext3 [id=3 dir=none color="red" label="bis4|l_2"];
  591. 21.53 s > 15 15 │ ext4 [style=invis];
  592. 21.53 s > 16 │- 0:1:s-> ext4 [id=4 dir=none color="red" label="mink4|l_1"];
  593. 21.53 s > 16 │+ 0:2:s-> ext4 [id=4 dir=none color="red" label="mink4|l_4"];
  594. 21.53 s > 17 17 │ ext5 [style=invis];
  595. 21.53 s > 18 │- 0:2:s-> ext5 [id=5 dir=none color="red" label="mink4|l_4"];
  596. 21.53 s > 18 │+ 0:4:s-> ext5 [id=5 dir=none color="red" label="bis4|l_3"];
  597. 21.53 s > 19 19 │ }
  598. 21.53 s > ────────────┴───────────────────────────────────────────────────────────────────
  599. 21.53 s > To update snapshots run `cargo insta review`
  600. 21.53 s > Stopped on the first failure. Run `cargo insta test` to run all snapshots.
  601. 21.53 s > test tensor::tests::parsing::infinite_execution ... FAILED
  602. 21.53 s >
  603. 21.53 s > failures:
  604. 21.53 s >
  605. 21.53 s > failures:
  606. 21.53 s > tensor::tests::parsing::infinite_execution
  607. 21.53 s >
  608. 21.53 s > test result: FAILED. 0 passed; 1 failed; 0 ignored; 0 measured; 240 filtered out; finished in 0.12s
  609. 21.53 s > system-err
  610. 21.53 s > thread 'tensor::tests::parsing::infinite_execution' (836) panicked at /nix/store/5nq6hmff26w9jbhbmba4wsvgnvglj2xd-vendor-cargo-deps/c19b7c6f923b580ac259164a89f2577984ad5ab09ee9d583b888f934adbbe8d0/insta-1.47.2/src/runtime.rs:719:13:
  611. 21.53 s > snapshot assertion for 'infinite_execution' failed in line 910
  612. 21.53 s > stack backtrace:
  613. 21.53 s > 0: __rustc::rust_begin_unwind
  614. 21.53 s > 1: core::panicking::panic_fmt
  615. 21.53 s > 2: insta::runtime::assert_snapshot
  616. 21.53 s > 3: idenso::tensor::tests::parsing::infinite_execution
  617. 21.53 s > 4: <idenso::tensor::tests::parsing::infinite_execution::{closure#0} as core::ops::function::FnOnce<()>>::call_once
  618. 21.53 s > note: Some details are omitted, run with `RUST_BACKTRACE=full` for a verbose backtrace.
  619. 21.53 s > =========================================
  620. 21.53 s > Extracting 2 binaries and 1 linked path to /build/nextest-archive-CQG4se
  621. 21.53 s > Extracted 8 files to /build/nextest-archive-CQG4se in 0.08s
  622. 21.53 s > ------------
  623. 21.53 s > Nextest run ID a882d236-bad1-4934-852e-62ab722b6d52 with nextest profile: ci_gammaloop
  624. 21.53 s > Starting 135 tests across 2 binaries
  625. 21.53 s > ------------
  626. 21.53 s > Summary [ 0.074s] 135 tests run: 135 passed, 0 skipped
  627. 21.53 s >
  628. 21.53 s > ========== nextest test summary ==========
  629. 21.53 s > report: target/nextest/ci_gammaloop/junit.xml
  630. 21.53 s > tests: 135, failures: 0, errors: 0
  631. 21.53 s > No failing testcases found.
  632. 21.53 s > =========================================
  633. 21.53 s > Extracting 5 binaries and 2 linked paths to /build/nextest-archive-sk0Ndy
  634. 21.53 s > Extracted 19 files to /build/nextest-archive-sk0Ndy in 0.20s
  635. 21.53 s > ------------
  636. 21.53 s > Nextest run ID a1c13e61-0401-4375-b1ee-3e509062fc19 with nextest profile: ci_gammaloop
  637. 21.53 s > Starting 25 tests across 5 binaries (1 test skipped via profile.ci_gammaloop.default-filter)
  638. 21.53 s > ------------
  639. 21.53 s > Summary [ 0.191s] 25 tests run: 25 passed, 1 skipped
  640. 21.53 s >
  641. 21.53 s > ========== nextest test summary ==========
  642. 21.53 s > report: target/nextest/ci_gammaloop/junit.xml
  643. 21.53 s > tests: 25, failures: 0, errors: 0
  644. 21.53 s > No failing testcases found.
  645. 21.53 s > =========================================
  646. 21.53 s > Extracting 2 binaries and 1 linked path to /build/nextest-archive-oKk70C
  647. 21.53 s > Extracted 8 files to /build/nextest-archive-oKk70C in 0.06s
  648. 21.53 s > ------------
  649. 21.53 s > Nextest run ID 3f3ddfff-2ea0-49fb-8651-9d14e34e4bbd with nextest profile: ci_gammaloop
  650. 21.53 s > Starting 1 test across 2 binaries
  651. 21.53 s > ------------
  652. 21.53 s > Summary [ 0.005s] 1 test run: 1 passed, 0 skipped
  653. 21.53 s >
  654. 21.53 s > ========== nextest test summary ==========
  655. 21.53 s > report: target/nextest/ci_gammaloop/junit.xml
  656. 21.53 s > tests: 1, failures: 0, errors: 0
  657. 21.53 s > No failing testcases found.
  658. 21.53 s > =========================================
  659. 21.53 s > Extracting 1 binary and 1 linked path to /build/nextest-archive-bb4wjk
  660. 21.53 s > Extracted 7 files to /build/nextest-archive-bb4wjk in 0.05s
  661. 21.53 s > ------------
  662. 21.53 s > Nextest run ID 0cbd4aa1-50d6-4c73-8bae-e2779881ad2c with nextest profile: ci_gammaloop
  663. 21.53 s > Starting 0 tests across 1 binary
  664. 21.53 s > ------------
  665. 21.53 s > Summary [ 0.000s] 0 tests run: 0 passed, 0 skipped
  666. 21.53 s >
  667. 21.53 s > ========== nextest test summary ==========
  668. 21.53 s > report: target/nextest/ci_gammaloop/junit.xml
  669. 21.53 s > tests: 0, failures: 0, errors: 0
  670. 21.53 s > No failing testcases found.
  671. 21.53 s > =========================================
  672. 21.53 s For full logs, run:
  673. 21.53 s nix log /nix/store/a8c4pj5idcxyzd4f7mjzbgpqsplch99h-gammaloop-nextest-spenso.drv
  674. 21.61 s [0 built (1 failed), 1 cRun failed.