test packages.x86_64-linux.nix-ci-check-gammaloop-nextest-core
0.93 s
$ /nix/store/9ypz3flqsrl5xl495mm8h645gadjsxi1-coreutils-9.11/bin/timeout --kill-after=15s 7200s /nix/store/23zk8sgzamrbmj1fday15szf7f2279s8-nix-2.34.7/bin/nix --extra-experimental-features nix-command --extra-experimental-features flakes flake clone git+https://github.com/alphal00p/gammaloop --dest /tmp/nix-ci-worker/stable-pwd/repo/
0.93 s
Cloning into '/tmp/nix-ci-worker/stable-pwd/repo'...
1.33 s
remote: Enumerating objects: 65014, done.
1.45 s
remote: Counting objects: 0% (1/7665)
remote: Counting objects: 1% (77/7665)
remote: Counting objects: 2% (154/7665)
remote: Counting objects: 3% (230/7665)
remote: Counting objects: 4% (307/7665)
remote: Counting objects: 5% (384/7665)
remote: Counting objects: 6% (460/7665)
remote: Counting objects: 7% (537/7665)
remote: Counting objects: 8% (614/7665)
remote: Counting objects: 9% (690/7665)
remote: Counting objects: 10% (767/7665)
remote: Counting objects: 11% (844/7665)
remote: Counting objects: 12% (920/7665)
remote: Counting objects: 13% (997/7665)
remote: Counting objects: 14% (1074/7665)
remote: Counting objects: 15% (1150/7665)
remote: Counting objects: 16% (1227/7665)
remote: Counting objects: 17% (1304/7665)
remote: Counting objects: 18% (1380/7665)
remote: Counting objects: 19% (1457/7665)
remote: Counting objects: 20% (1533/7665)
remote: Counting objects: 21% (1610/7665)
remote: Counting objects: 22% (1687/7665)
remote: Counting objects: 23% (1763/7665)
remote: Counting objects: 24% (1840/7665)
remote: Counting objects: 25% (1917/7665)
remote: Counting objects: 26% (1993/7665)
remote: Counting objects: 27% (2070/7665)
remote: Counting objects: 28% (2147/7665)
remote: Counting objects: 29% (2223/7665)
remote: Counting objects: 30% (2300/7665)
remote: Counting objects: 31% (2377/7665)
remote: Counting objects: 32% (2453/7665)
remote: Counting objects: 33% (2530/7665)
remote: Counting objects: 34% (2607/7665)
remote: Counting objects: 35% (2683/7665)
remote: Counting objects: 36% (2760/7665)
remote: Counting objects: 37% (2837/7665)
remote: Counting objects: 38% (2913/7665)
remote: Counting objects: 39% (2990/7665)
remote: Counting objects: 40% (3066/7665)
remote: Counting objects: 41% (3143/7665)
remote: Counting objects: 42% (3220/7665)
remote: Counting objects: 43% (3296/7665)
remote: Counting objects: 44% (3373/7665)
remote: Counting objects: 45% (3450/7665)
remote: Counting objects: 46% (3526/7665)
remote: Counting objects: 47% (3603/7665)
remote: Counting objects: 48% (3680/7665)
remote: Counting objects: 49% (3756/7665)
remote: Counting objects: 50% (3833/7665)
remote: Counting objects: 51% (3910/7665)
remote: Counting objects: 52% (3986/7665)
remote: Counting objects: 53% (4063/7665)
remote: Counting objects: 54% (4140/7665)
remote: Counting objects: 55% (4216/7665)
remote: Counting objects: 56% (4293/7665)
remote: Counting objects: 57% (4370/7665)
remote: Counting objects: 58% (4446/7665)
remote: Counting objects: 59% (4523/7665)
remote: Counting objects: 60% (4599/7665)
remote: Counting objects: 61% (4676/7665)
remote: Counting objects: 62% (4753/7665)
remote: Counting objects: 63% (4829/7665)
remote: Counting objects: 64% (4906/7665)
remote: Counting objects: 65% (4983/7665)
remote: Counting objects: 66% (5059/7665)
remote: Counting objects: 67% (5136/7665)
remote: Counting objects: 68% (5213/7665)
remote: Counting objects: 69% (5289/7665)
remote: Counting objects: 70% (5366/7665)
remote: Counting objects: 71% (5443/7665)
remote: Counting objects: 72% (5519/7665)
remote: Counting objects: 73% (5596/7665)
remote: Counting objects: 74% (5673/7665)
remote: Counting objects: 75% (5749/7665)
remote: Counting objects: 76% (5826/7665)
remote: Counting objects: 77% (5903/7665)
remote: Counting objects: 78% (5979/7665)
remote: Counting objects: 79% (6056/7665)
remote: Counting objects: 80% (6132/7665)
remote: Counting objects: 81% (6209/7665)
remote: Counting objects: 82% (6286/7665)
remote: Counting objects: 83% (6362/7665)
remote: Counting objects: 84% (6439/7665)
remote: Counting objects: 85% (6516/7665)
remote: Counting objects: 86% (6592/7665)
remote: Counting objects: 87% (6669/7665)
remote: Counting objects: 88% (6746/7665)
remote: Counting objects: 89% (6822/7665)
remote: Counting objects: 90% (6899/7665)
remote: Counting objects: 91% (6976/7665)
remote: Counting objects: 92% (7052/7665)
remote: Counting objects: 93% (7129/7665)
remote: Counting objects: 94% (7206/7665)
remote: Counting objects: 95% (7282/7665)
remote: Counting objects: 96% (7359/7665)
remote: Counting objects: 97% (7436/7665)
remote: Counting objects: 98% (7512/7665)
remote: Counting objects: 99% (7589/7665)
remote: Counting objects: 100% (7665/7665)
remote: Counting objects: 100% (7665/7665), done.
2.83 s
remote: Compressing objects: 0% (1/1400)
remote: Compressing objects: 1% (14/1400)
remote: Compressing objects: 2% (28/1400)
remote: Compressing objects: 3% (42/1400)
remote: Compressing objects: 4% (56/1400)
remote: Compressing objects: 5% (70/1400)
remote: Compressing objects: 6% (84/1400)
remote: Compressing objects: 7% (98/1400)
remote: Compressing objects: 8% (112/1400)
remote: Compressing objects: 9% (126/1400)
remote: Compressing objects: 10% (140/1400)
remote: Compressing objects: 11% (154/1400)
remote: Compressing objects: 12% (168/1400)
remote: Compressing objects: 13% (182/1400)
remote: Compressing objects: 13% (183/1400)
remote: Compressing objects: 14% (196/1400)
remote: Compressing objects: 15% (210/1400)
remote: Compressing objects: 16% (224/1400)
remote: Compressing objects: 17% (238/1400)
remote: Compressing objects: 18% (252/1400)
remote: Compressing objects: 19% (266/1400)
remote: Compressing objects: 20% (280/1400)
remote: Compressing objects: 21% (294/1400)
remote: Compressing objects: 22% (308/1400)
remote: Compressing objects: 23% (322/1400)
remote: Compressing objects: 24% (336/1400)
remote: Compressing objects: 25% (350/1400)
remote: Compressing objects: 26% (364/1400)
remote: Compressing objects: 27% (378/1400)
remote: Compressing objects: 28% (392/1400)
remote: Compressing objects: 29% (406/1400)
remote: Compressing objects: 30% (420/1400)
remote: Compressing objects: 31% (434/1400)
remote: Compressing objects: 32% (448/1400)
remote: Compressing objects: 33% (462/1400)
remote: Compressing objects: 34% (476/1400)
remote: Compressing objects: 35% (490/1400)
remote: Compressing objects: 36% (504/1400)
remote: Compressing objects: 37% (518/1400)
remote: Compressing objects: 38% (532/1400)
remote: Compressing objects: 39% (546/1400)
remote: Compressing objects: 40% (560/1400)
remote: Compressing objects: 41% (574/1400)
remote: Compressing objects: 42% (588/1400)
remote: Compressing objects: 43% (602/1400)
remote: Compressing objects: 44% (616/1400)
remote: Compressing objects: 45% (630/1400)
remote: Compressing objects: 46% (644/1400)
remote: Compressing objects: 47% (658/1400)
remote: Compressing objects: 48% (672/1400)
remote: Compressing objects: 49% (686/1400)
remote: Compressing objects: 50% (700/1400)
remote: Compressing objects: 51% (714/1400)
remote: Compressing objects: 52% (728/1400)
remote: Compressing objects: 53% (742/1400)
remote: Compressing objects: 54% (756/1400)
remote: Compressing objects: 55% (770/1400)
remote: Compressing objects: 56% (784/1400)
remote: Compressing objects: 57% (798/1400)
remote: Compressing objects: 58% (812/1400)
remote: Compressing objects: 59% (826/1400)
remote: Compressing objects: 60% (840/1400)
remote: Compressing objects: 61% (854/1400)
remote: Compressing objects: 62% (868/1400)
remote: Compressing objects: 63% (882/1400)
remote: Compressing objects: 64% (896/1400)
remote: Compressing objects: 65% (910/1400)
remote: Compressing objects: 66% (924/1400)
remote: Compressing objects: 67% (938/1400)
remote: Compressing objects: 68% (952/1400)
remote: Compressing objects: 69% (966/1400)
remote: Compressing objects: 70% (980/1400)
remote: Compressing objects: 71% (994/1400)
remote: Compressing objects: 72% (1008/1400)
remote: Compressing objects: 73% (1022/1400)
remote: Compressing objects: 74% (1036/1400)
remote: Compressing objects: 75% (1050/1400)
remote: Compressing objects: 76% (1064/1400)
remote: Compressing objects: 77% (1078/1400)
remote: Compressing objects: 78% (1092/1400)
remote: Compressing objects: 79% (1106/1400)
remote: Compressing objects: 80% (1120/1400)
remote: Compressing objects: 81% (1134/1400)
remote: Compressing objects: 82% (1148/1400)
remote: Compressing objects: 83% (1162/1400)
remote: Compressing objects: 84% (1176/1400)
remote: Compressing objects: 85% (1190/1400)
remote: Compressing objects: 86% (1204/1400)
remote: Compressing objects: 87% (1218/1400)
remote: Compressing objects: 88% (1232/1400)
remote: Compressing objects: 89% (1246/1400)
remote: Compressing objects: 90% (1260/1400)
remote: Compressing objects: 91% (1274/1400)
remote: Compressing objects: 92% (1288/1400)
remote: Compressing objects: 93% (1302/1400)
remote: Compressing objects: 94% (1316/1400)
remote: Compressing objects: 95% (1330/1400)
remote: Compressing objects: 96% (1344/1400)
remote: Compressing objects: 97% (1358/1400)
remote: Compressing objects: 98% (1372/1400)
remote: Compressing objects: 99% (1386/1400)
remote: Compressing objects: 100% (1400/1400)
remote: Compressing objects: 100% (1400/1400), done.
5.44 s
Receiving objects: 0% (1/65014)
Receiving objects: 1% (651/65014)
Receiving objects: 2% (1301/65014)
Receiving objects: 3% (1951/65014)
Receiving objects: 4% (2601/65014)
Receiving objects: 5% (3251/65014)
Receiving objects: 6% (3901/65014)
Receiving objects: 7% (4551/65014)
Receiving objects: 8% (5202/65014)
Receiving objects: 9% (5852/65014)
Receiving objects: 10% (6502/65014)
Receiving objects: 11% (7152/65014)
Receiving objects: 12% (7802/65014), 15.32 MiB | 30.63 MiB/s
Receiving objects: 13% (8452/65014), 15.32 MiB | 30.63 MiB/s
Receiving objects: 14% (9102/65014), 15.32 MiB | 30.63 MiB/s
Receiving objects: 15% (9753/65014), 15.32 MiB | 30.63 MiB/s
Receiving objects: 16% (10403/65014), 15.32 MiB | 30.63 MiB/s
Receiving objects: 17% (11053/65014), 15.32 MiB | 30.63 MiB/s
Receiving objects: 18% (11703/65014), 15.32 MiB | 30.63 MiB/s
Receiving objects: 19% (12353/65014), 15.32 MiB | 30.63 MiB/s
Receiving objects: 20% (13003/65014), 15.32 MiB | 30.63 MiB/s
Receiving objects: 21% (13653/65014), 15.32 MiB | 30.63 MiB/s
Receiving objects: 22% (14304/65014), 15.32 MiB | 30.63 MiB/s
Receiving objects: 23% (14954/65014), 15.32 MiB | 30.63 MiB/s
Receiving objects: 24% (15604/65014), 15.32 MiB | 30.63 MiB/s
Receiving objects: 25% (16254/65014), 15.32 MiB | 30.63 MiB/s
Receiving objects: 26% (16904/65014), 15.32 MiB | 30.63 MiB/s
Receiving objects: 27% (17554/65014), 15.32 MiB | 30.63 MiB/s
Receiving objects: 28% (18204/65014), 15.32 MiB | 30.63 MiB/s
Receiving objects: 29% (18855/65014), 15.32 MiB | 30.63 MiB/s
Receiving objects: 30% (19505/65014), 15.32 MiB | 30.63 MiB/s
Receiving objects: 31% (20155/65014), 15.32 MiB | 30.63 MiB/s
Receiving objects: 32% (20805/65014), 15.32 MiB | 30.63 MiB/s
Receiving objects: 33% (21455/65014), 15.32 MiB | 30.63 MiB/s
Receiving objects: 34% (22105/65014), 15.32 MiB | 30.63 MiB/s
Receiving objects: 35% (22755/65014), 15.32 MiB | 30.63 MiB/s
Receiving objects: 36% (23406/65014), 15.32 MiB | 30.63 MiB/s
Receiving objects: 37% (24056/65014), 15.32 MiB | 30.63 MiB/s
Receiving objects: 38% (24706/65014), 15.32 MiB | 30.63 MiB/s
Receiving objects: 39% (25356/65014), 15.32 MiB | 30.63 MiB/s
Receiving objects: 40% (26006/65014), 15.32 MiB | 30.63 MiB/s
Receiving objects: 41% (26656/65014), 15.32 MiB | 30.63 MiB/s
Receiving objects: 42% (27306/65014), 15.32 MiB | 30.63 MiB/s
Receiving objects: 43% (27957/65014), 15.32 MiB | 30.63 MiB/s
Receiving objects: 44% (28607/65014), 15.32 MiB | 30.63 MiB/s
Receiving objects: 45% (29257/65014), 15.32 MiB | 30.63 MiB/s
Receiving objects: 46% (29907/65014), 15.32 MiB | 30.63 MiB/s
Receiving objects: 47% (30557/65014), 15.32 MiB | 30.63 MiB/s
Receiving objects: 48% (31207/65014), 15.32 MiB | 30.63 MiB/s
Receiving objects: 49% (31857/65014), 15.32 MiB | 30.63 MiB/s
Receiving objects: 50% (32507/65014), 15.32 MiB | 30.63 MiB/s
Receiving objects: 51% (33158/65014), 15.32 MiB | 30.63 MiB/s
Receiving objects: 52% (33808/65014), 15.32 MiB | 30.63 MiB/s
Receiving objects: 53% (34458/65014), 15.32 MiB | 30.63 MiB/s
Receiving objects: 53% (34925/65014), 34.04 MiB | 33.25 MiB/s
Receiving objects: 54% (35108/65014), 34.04 MiB | 33.25 MiB/s
Receiving objects: 55% (35758/65014), 34.04 MiB | 33.25 MiB/s
Receiving objects: 56% (36408/65014), 34.04 MiB | 33.25 MiB/s
Receiving objects: 57% (37058/65014), 34.04 MiB | 33.25 MiB/s
Receiving objects: 58% (37709/65014), 34.04 MiB | 33.25 MiB/s
Receiving objects: 59% (38359/65014), 34.04 MiB | 33.25 MiB/s
Receiving objects: 60% (39009/65014), 34.04 MiB | 33.25 MiB/s
Receiving objects: 61% (39659/65014), 34.04 MiB | 33.25 MiB/s
Receiving objects: 62% (40309/65014), 34.04 MiB | 33.25 MiB/s
Receiving objects: 63% (40959/65014), 34.04 MiB | 33.25 MiB/s
Receiving objects: 64% (41609/65014), 34.04 MiB | 33.25 MiB/s
Receiving objects: 65% (42260/65014), 50.14 MiB | 32.93 MiB/s
Receiving objects: 66% (42910/65014), 50.14 MiB | 32.93 MiB/s
Receiving objects: 67% (43560/65014), 50.14 MiB | 32.93 MiB/s
Receiving objects: 68% (44210/65014), 50.14 MiB | 32.93 MiB/s
Receiving objects: 69% (44860/65014), 50.14 MiB | 32.93 MiB/s
Receiving objects: 70% (45510/65014), 50.14 MiB | 32.93 MiB/s
Receiving objects: 71% (46160/65014), 50.14 MiB | 32.93 MiB/s
Receiving objects: 72% (46811/65014), 50.14 MiB | 32.93 MiB/s
Receiving objects: 73% (47461/65014), 50.14 MiB | 32.93 MiB/s
Receiving objects: 74% (48111/65014), 50.14 MiB | 32.93 MiB/s
Receiving objects: 75% (48761/65014), 50.14 MiB | 32.93 MiB/s
Receiving objects: 75% (48917/65014), 50.14 MiB | 32.93 MiB/s
Receiving objects: 76% (49411/65014), 67.50 MiB | 33.37 MiB/s
Receiving objects: 77% (50061/65014), 67.50 MiB | 33.37 MiB/s
Receiving objects: 78% (50711/65014), 67.50 MiB | 33.37 MiB/s
Receiving objects: 79% (51362/65014), 67.50 MiB | 33.37 MiB/s
Receiving objects: 80% (52012/65014), 67.50 MiB | 33.37 MiB/s
Receiving objects: 81% (52662/65014), 67.50 MiB | 33.37 MiB/s
Receiving objects: 82% (53312/65014), 67.50 MiB | 33.37 MiB/s
Receiving objects: 83% (53962/65014), 67.50 MiB | 33.37 MiB/s
Receiving objects: 84% (54612/65014), 67.50 MiB | 33.37 MiB/s
Receiving objects: 85% (55262/65014), 67.50 MiB | 33.37 MiB/s
Receiving objects: 86% (55913/65014), 67.50 MiB | 33.37 MiB/s
Receiving objects: 87% (56563/65014), 67.50 MiB | 33.37 MiB/s
Receiving objects: 88% (57213/65014), 67.50 MiB | 33.37 MiB/s
Receiving objects: 89% (57863/65014), 67.50 MiB | 33.37 MiB/s
Receiving objects: 90% (58513/65014), 67.50 MiB | 33.37 MiB/s
Receiving objects: 91% (59163/65014), 67.50 MiB | 33.37 MiB/s
Receiving objects: 92% (59813/65014), 67.50 MiB | 33.37 MiB/s
Receiving objects: 93% (60464/65014), 67.50 MiB | 33.37 MiB/s
Receiving objects: 94% (61114/65014), 83.87 MiB | 33.02 MiB/s
Receiving objects: 95% (61764/65014), 83.87 MiB | 33.02 MiB/s
Receiving objects: 96% (62414/65014), 83.87 MiB | 33.02 MiB/s
Receiving objects: 97% (63064/65014), 83.87 MiB | 33.02 MiB/s
Receiving objects: 98% (63714/65014), 83.87 MiB | 33.02 MiB/s
Receiving objects: 99% (64364/65014), 83.87 MiB | 33.02 MiB/s
remote: Total 65014 (delta 6781), reused 6265 (delta 6265), pack-reused 57349 (from 1)
5.44 s
Receiving objects: 100% (65014/65014), 83.87 MiB | 33.02 MiB/s
Receiving objects: 100% (65014/65014), 86.89 MiB | 33.30 MiB/s, done.
6.17 s
Resolving deltas: 0% (0/45899)
Resolving deltas: 1% (459/45899)
Resolving deltas: 2% (918/45899)
Resolving deltas: 3% (1377/45899)
Resolving deltas: 4% (1836/45899)
Resolving deltas: 5% (2295/45899)
Resolving deltas: 6% (2754/45899)
Resolving deltas: 7% (3213/45899)
Resolving deltas: 8% (3673/45899)
Resolving deltas: 9% (4131/45899)
Resolving deltas: 10% (4590/45899)
Resolving deltas: 11% (5049/45899)
Resolving deltas: 12% (5508/45899)
Resolving deltas: 13% (5969/45899)
Resolving deltas: 14% (6426/45899)
Resolving deltas: 15% (6885/45899)
Resolving deltas: 16% (7344/45899)
Resolving deltas: 17% (7803/45899)
Resolving deltas: 18% (8262/45899)
Resolving deltas: 19% (8721/45899)
Resolving deltas: 20% (9180/45899)
Resolving deltas: 21% (9639/45899)
Resolving deltas: 22% (10098/45899)
Resolving deltas: 23% (10557/45899)
Resolving deltas: 24% (11016/45899)
Resolving deltas: 25% (11475/45899)
Resolving deltas: 26% (11934/45899)
Resolving deltas: 27% (12393/45899)
Resolving deltas: 28% (12852/45899)
Resolving deltas: 29% (13311/45899)
Resolving deltas: 30% (13770/45899)
Resolving deltas: 31% (14229/45899)
Resolving deltas: 32% (14688/45899)
Resolving deltas: 33% (15147/45899)
Resolving deltas: 34% (15606/45899)
Resolving deltas: 35% (16065/45899)
Resolving deltas: 36% (16524/45899)
Resolving deltas: 37% (16984/45899)
Resolving deltas: 38% (17442/45899)
Resolving deltas: 39% (17901/45899)
Resolving deltas: 40% (18360/45899)
Resolving deltas: 41% (18819/45899)
Resolving deltas: 42% (19278/45899)
Resolving deltas: 43% (19737/45899)
Resolving deltas: 44% (20196/45899)
Resolving deltas: 45% (20655/45899)
Resolving deltas: 46% (21115/45899)
Resolving deltas: 47% (21575/45899)
Resolving deltas: 48% (22032/45899)
Resolving deltas: 49% (22491/45899)
Resolving deltas: 50% (22950/45899)
Resolving deltas: 51% (23409/45899)
Resolving deltas: 52% (23868/45899)
Resolving deltas: 53% (24327/45899)
Resolving deltas: 54% (24787/45899)
Resolving deltas: 55% (25245/45899)
Resolving deltas: 56% (25704/45899)
Resolving deltas: 57% (26163/45899)
Resolving deltas: 58% (26622/45899)
Resolving deltas: 59% (27081/45899)
Resolving deltas: 60% (27540/45899)
Resolving deltas: 61% (27999/45899)
Resolving deltas: 62% (28458/45899)
Resolving deltas: 63% (28917/45899)
Resolving deltas: 64% (29377/45899)
Resolving deltas: 65% (29835/45899)
Resolving deltas: 66% (30294/45899)
Resolving deltas: 67% (30753/45899)
Resolving deltas: 68% (31212/45899)
Resolving deltas: 69% (31671/45899)
Resolving deltas: 70% (32130/45899)
Resolving deltas: 71% (32589/45899)
Resolving deltas: 72% (33048/45899)
Resolving deltas: 73% (33507/45899)
Resolving deltas: 74% (33966/45899)
Resolving deltas: 75% (34425/45899)
Resolving deltas: 76% (34884/45899)
Resolving deltas: 77% (35343/45899)
Resolving deltas: 78% (35802/45899)
Resolving deltas: 79% (36261/45899)
Resolving deltas: 80% (36720/45899)
Resolving deltas: 81% (37179/45899)
Resolving deltas: 82% (37638/45899)
Resolving deltas: 83% (38097/45899)
Resolving deltas: 84% (38556/45899)
Resolving deltas: 85% (39015/45899)
Resolving deltas: 86% (39475/45899)
Resolving deltas: 87% (39933/45899)
Resolving deltas: 88% (40392/45899)
Resolving deltas: 89% (40851/45899)
Resolving deltas: 90% (41311/45899)
Resolving deltas: 91% (41769/45899)
Resolving deltas: 92% (42228/45899)
Resolving deltas: 93% (42689/45899)
Resolving deltas: 94% (43146/45899)
Resolving deltas: 95% (43605/45899)
Resolving deltas: 96% (44064/45899)
Resolving deltas: 97% (44523/45899)
Resolving deltas: 98% (44983/45899)
Resolving deltas: 99% (45444/45899)
Resolving deltas: 100% (45899/45899)
Resolving deltas: 100% (45899/45899), done.
6.49 s
Fetching commit 185337f01e5e562fa8f23f8e846b12c2a0cd39cc for vakint_rustred ...
6.49 s
$ /nix/store/bcnisk3ydfgv26v2gw3zlky24g00yww2-git-2.54.0/bin/git fetch origin 185337f01e5e562fa8f23f8e846b12c2a0cd39cc
6.90 s
From https://github.com/alphal00p/gammaloop
6.90 s
* branch 185337f01e5e562fa8f23f8e846b12c2a0cd39cc -> FETCH_HEAD
6.91 s
$ /nix/store/9ypz3flqsrl5xl495mm8h645gadjsxi1-coreutils-9.11/bin/timeout --kill-after=15s 7200s /nix/store/bcnisk3ydfgv26v2gw3zlky24g00yww2-git-2.54.0/bin/git -c advice.detachedHead=false checkout 185337f01e5e562fa8f23f8e846b12c2a0cd39cc
7.07 s
HEAD is now at 185337f0 Add RustRed tensor reduction mode boundary
7.07 s
$ /nix/store/9ypz3flqsrl5xl495mm8h645gadjsxi1-coreutils-9.11/bin/timeout --kill-after=15s 7200s /nix/store/23zk8sgzamrbmj1fday15szf7f2279s8-nix-2.34.7/bin/nix --extra-experimental-features nix-command --extra-experimental-features flakes --log-format internal-json run .#packages.x86_64-linux.nix-ci-check-gammaloop-nextest-core --print-build-logs
10.87 s
15.55 s
evaluating derivation 'g
copying '/nix/store/9ycf
evaluating derivation 'g
copying '/nix/store/9ycf
evaluating derivation 'g
copying '/nix/store/9ycf
evaluating derivation 'g
copying '/nix/store/9ycf
evaluating derivation 'g
copying '/nix/store/9ycf
evaluating derivation 'g
copying '/nix/store/9ycf
evaluating derivation 'g
querying gammaloop-nexte
querying info about miss
querying gammaloop-nexte
[0 /1 built, 1 copied (4.
[1 /0 /1 built, 1 copied (gammaloop-nextest-core> Extracting 3 binaries (including 1 non-test binary), 1 build script output directory, and 2 linked paths to /build/nextest-archive-wc3FDK
15.95 s
gammaloop-nextest-core> Extracted 18 files to /build/nextest-archive-wc3FDK in 0.40s
15.96 s
gammaloop-nextest-core> ------------
15.96 s
gammaloop-nextest-core> Nextest run ID a9408c16-b3e9-4b68-97be-c706e24b68ee with nextest profile: ci_gammaloop
15.96 s
gammaloop-nextest-core> Starting 339 tests across 2 binaries
16.38 s
gammaloop-nextest-core> ------------
16.38 s
gammaloop-nextest-core> Summary [ 0.422s] 339 tests run: 339 passed , 0 skipped
16.46 s
gammaloop-nextest-core>
16.46 s
gammaloop-nextest-core> ========== nextest test summary ==========
16.46 s
gammaloop-nextest-core> report: target/nextest/ci_gammaloop/junit.xml
16.46 s
gammaloop-nextest-core> tests: 339, failures: 0, errors: 0
16.46 s
gammaloop-nextest-core> No failing testcases found.
16.46 s
gammaloop-nextest-core> =========================================
16.48 s
gammaloop-nextest-core> Extracting 1 binary and 1 linked path to /build/nextest-archive-MnLGXq
16.53 s
gammaloop-nextest-core> Extracted 7 files to /build/nextest-archive-MnLGXq in 0.06s
16.54 s
gammaloop-nextest-core> ------------
16.54 s
gammaloop-nextest-core> Nextest run ID 18599266-b990-477b-b835-a548760d2e19 with nextest profile: ci_gammaloop
16.54 s
gammaloop-nextest-core> Starting 19 tests across 1 binary
16.55 s
gammaloop-nextest-core> ------------
16.55 s
gammaloop-nextest-core> Summary [ 0.010s] 19 tests run: 19 passed , 0 skipped
16.58 s
gammaloop-nextest-core>
16.58 s
gammaloop-nextest-core> ========== nextest test summary ==========
16.58 s
gammaloop-nextest-core> report: target/nextest/ci_gammaloop/junit.xml
16.58 s
gammaloop-nextest-core> tests: 19, failures: 0, errors: 0
16.58 s
gammaloop-nextest-core> No failing testcases found.
16.58 s
gammaloop-nextest-core> =========================================
16.60 s
gammaloop-nextest-core> Extracting 1 binary to /build/nextest-archive-pR0GjV
16.62 s
gammaloop-nextest-core> Extracted 4 files to /build/nextest-archive-pR0GjV in 0.03s
16.63 s
gammaloop-nextest-core> ------------
16.63 s
gammaloop-nextest-core> Nextest run ID e4759f32-171b-48b6-bec3-97e9128df0e3 with nextest profile: ci_gammaloop
16.63 s
gammaloop-nextest-core> Starting 0 tests across 1 binary
16.63 s
gammaloop-nextest-core> ------------
16.63 s
gammaloop-nextest-core> Summary [ 0.000s] 0 tests run: 0 passed , 0 skipped
16.66 s
gammaloop-nextest-core>
16.66 s
gammaloop-nextest-core> ========== nextest test summary ==========
16.66 s
gammaloop-nextest-core> report: target/nextest/ci_gammaloop/junit.xml
16.66 s
gammaloop-nextest-core> tests: 0, failures: 0, errors: 0
16.66 s
gammaloop-nextest-core> No failing testcases found.
16.66 s
gammaloop-nextest-core> =========================================
16.67 s
gammaloop-nextest-core> Extracting 4 binaries, 1 build script output directory, and 2 linked paths to /build/nextest-archive-DrHsDI
17.07 s
gammaloop-nextest-core> Extracted 18 files to /build/nextest-archive-DrHsDI in 0.41s
17.09 s
gammaloop-nextest-core> ------------
17.09 s
gammaloop-nextest-core> Nextest run ID 9b7a801a-811a-4856-8d7f-bcbe9c637238 with nextest profile: ci_gammaloop
17.09 s
gammaloop-nextest-core> Starting 456 tests across 4 binaries (61 tests skipped , including 60 tests via profile.ci_gammaloop.default-filter )
18.19 s
gammaloop-nextest-core> FAIL [ 0.336s] (446/456) gammalooprs::test_renormalization finit_part_ghlo
18.19 s
gammaloop-nextest-core> stdout ---
18.19 s
gammaloop-nextest-core>
18.19 s
gammaloop-nextest-core> running 1 test
18.19 s
gammaloop-nextest-core> ren part: 1/2*GC_10^2*dot(P(0,mink (dim)),P(0,mink (dim)))*cas(2,coad (8))/ε
18.19 s
gammaloop-nextest-core> ━━━━━━━━━━━━━━━━━━━━━━━━━━━━━━━ Snapshot Summary ━━━━━━━━━━━━━━━━━━━━━━━━━━━━━━━
18.19 s
gammaloop-nextest-core> Snapshot: finit_part_ghlo
18.19 s
gammaloop-nextest-core> Source: crates/gammalooprs/tests/test_renormalization.rs:557
18.19 s
gammaloop-nextest-core> ────────────────────────────────────────────────────────────────────────────────
18.19 s
gammaloop-nextest-core> Expression: align_to_rqft(&a, &model).to_bare_ordered_string()
18.19 s
gammaloop-nextest-core> ────────────────────────────────────────────────────────────────────────────────
18.19 s
gammaloop-nextest-core> -old snapshot
18.19 s
gammaloop-nextest-core> +new results
18.19 s
gammaloop-nextest-core> ────────────┬───────────────────────────────────────────────────────────────────
18.19 s
gammaloop-nextest-core> 1 │--1/2*cas(2,coad(8))*dot(P(0,mink(4)),P(0,mink(4)))*gs^2*ε^(-1)
18.19 s
gammaloop-nextest-core> 1 │+1/2*cas(2,coad(8))*dot(P(0,mink(4)),P(0,mink(4)))*gs^2*ε^(-1)
18.19 s
gammaloop-nextest-core> ────────────┴───────────────────────────────────────────────────────────────────
18.19 s
gammaloop-nextest-core> To update snapshots run `cargo insta review`
18.19 s
gammaloop-nextest-core> Stopped on the first failure. Run `cargo insta test` to run all snapshots.
18.19 s
gammaloop-nextest-core> test finit_part_ghlo ... FAILED
18.19 s
gammaloop-nextest-core>
18.19 s
gammaloop-nextest-core> failures:
18.19 s
gammaloop-nextest-core>
18.19 s
gammaloop-nextest-core> failures:
18.19 s
gammaloop-nextest-core> finit_part_ghlo
18.19 s
gammaloop-nextest-core>
18.19 s
gammaloop-nextest-core> test result: FAILED. 0 passed; 1 failed; 0 ignored; 0 measured; 5 filtered out; finished in 0.33s
18.19 s
gammaloop-nextest-core>
18.19 s
gammaloop-nextest-core> stderr ---
18.19 s
gammaloop-nextest-core> The application panicked (crashed).
18.19 s
gammaloop-nextest-core> Message: snapshot assertion for 'finit_part_ghlo' failed in line 557
18.19 s
gammaloop-nextest-core> Location: /nix/store/5nq6hmff26w9jbhbmba4wsvgnvglj2xd-vendor-cargo-deps/c19b7c6f923b580ac259164a89f2577984ad5ab09ee9d583b888f934adbbe8d0/insta-1.47.2/src/runtime.rs :719
18.19 s
gammaloop-nextest-core>
18.19 s
gammaloop-nextest-core> ━━━━━━━━━━━━━━━━━━━━━━━━━━━━━━━━━━ BACKTRACE ━━━━━━━━━━━━━━━━━━━━━━━━━━━━━━━━━━━
18.19 s
gammaloop-nextest-core> 1: <color_eyre[51793ea62743adbd]::config::PanicHook>::panic_report <unknown>
18.19 s
gammaloop-nextest-core> at <unknown source file> :<unknown line>
18.19 s
gammaloop-nextest-core> 2: <color_eyre[51793ea62743adbd]::config::PanicHook>::into_panic_hook::{closure#0} <unknown>
18.19 s
gammaloop-nextest-core> at <unknown source file> :<unknown line>
18.19 s
gammaloop-nextest-core> 3: std[bcb96dfbba0ab899]::panicking::panic_with_hook <unknown>
18.19 s
gammaloop-nextest-core> at <unknown source file> :<unknown line>
18.19 s
gammaloop-nextest-core> 4: std[bcb96dfbba0ab899]::panicking::panic_handler::{closure#0} <unknown>
18.19 s
gammaloop-nextest-core> at <unknown source file> :<unknown line>
18.19 s
gammaloop-nextest-core> 5: std[bcb96dfbba0ab899]::sys::backtrace::__rust_end_short_backtrace::<std[bcb96dfbba0ab899]::panicking::panic_handler::{closure#0}, !> <unknown>
18.19 s
gammaloop-nextest-core> at <unknown source file> :<unknown line>
18.19 s
gammaloop-nextest-core> 6: __rustc[6c289b9f9c454d21]::rust_begin_unwind <unknown>
18.19 s
gammaloop-nextest-core> at <unknown source file> :<unknown line>
18.19 s
gammaloop-nextest-core> 7: core[940e698046960fd5]::panicking::panic_fmt <unknown>
18.19 s
gammaloop-nextest-core> at <unknown source file> :<unknown line>
18.19 s
gammaloop-nextest-core> 8: insta[307a548ac79ef4d9]::runtime::assert_snapshot <unknown>
18.19 s
gammaloop-nextest-core> at <unknown source file> :<unknown line>
18.19 s
gammaloop-nextest-core> 9: <test_renormalization[a909d96d00a50d41]::finit_part_ghlo::{closure#0} as core[940e698046960fd5]::ops::function::FnOnce<()>>::call_once <unknown>
18.19 s
gammaloop-nextest-core> at <unknown source file> :<unknown line>
18.19 s
gammaloop-nextest-core> 10: test[75d6903177b1d7e9]::__rust_begin_short_backtrace::<core[940e698046960fd5]::result::Result<(), alloc[2ea6bcb46fca0c42]::string::String>, fn() -> core[940e698046960fd5]::result::Result<(), alloc[2ea6bcb46fca0c42]::string::String>> <unknown>
18.19 s
gammaloop-nextest-core> at <unknown source file> :<unknown line>
18.19 s
gammaloop-nextest-core> 11: test[75d6903177b1d7e9]::run_test::{closure#0} <unknown>
18.19 s
gammaloop-nextest-core> at <unknown source file> :<unknown line>
18.19 s
gammaloop-nextest-core> 12: std[bcb96dfbba0ab899]::sys::backtrace::__rust_begin_short_backtrace::<test[75d6903177b1d7e9]::run_test::{closure#1}, ()> <unknown>
18.19 s
gammaloop-nextest-core> at <unknown source file> :<unknown line>
18.19 s
gammaloop-nextest-core> 13: <std[bcb96dfbba0ab899]::thread::lifecycle::spawn_unchecked<test[75d6903177b1d7e9]::run_test::{closure#1}, ()>::{closure#1} as core[940e698046960fd5]::ops::function::FnOnce<()>>::call_once::{shim:vtable#0} <unknown>
18.19 s
gammaloop-nextest-core> at <unknown source file> :<unknown line>
18.19 s
gammaloop-nextest-core> 14: <std[bcb96dfbba0ab899]::sys::thread::unix::Thread>::new::thread_start <unknown>
18.19 s
gammaloop-nextest-core> at <unknown source file> :<unknown line>
18.19 s
gammaloop-nextest-core> 15: start_thread <unknown>
18.19 s
gammaloop-nextest-core> at <unknown source file> :<unknown line>
18.19 s
gammaloop-nextest-core> 16: __clone3 <unknown>
18.19 s
gammaloop-nextest-core> at <unknown source file> :<unknown line>
18.19 s
gammaloop-nextest-core>
18.19 s
gammaloop-nextest-core> Run with COLORBT_SHOW_HIDDEN=1 environment variable to disable frame filtering.
18.19 s
gammaloop-nextest-core> Run with RUST_BACKTRACE=full to include source snippets.
18.19 s
gammaloop-nextest-core>
19.98 s
gammaloop-nextest-core> FAIL [ 2.110s] (452/456) gammalooprs::test_renormalization finite_part_ghost_2loop
19.98 s
gammaloop-nextest-core> stdout ---
19.98 s
gammaloop-nextest-core>
19.98 s
gammaloop-nextest-core> running 1 test
19.98 s
gammaloop-nextest-core> ━━━━━━━━━━━━━━━━━━━━━━━━━━━━━━━ Snapshot Summary ━━━━━━━━━━━━━━━━━━━━━━━━━━━━━━━
19.98 s
gammaloop-nextest-core> Snapshot: finite_part_ghost_2loop-3
19.98 s
gammaloop-nextest-core> Source: crates/gammalooprs/tests/test_renormalization.rs:464
19.98 s
gammaloop-nextest-core> ────────────────────────────────────────────────────────────────────────────────
19.98 s
gammaloop-nextest-core> Expression: align_to_rqft(&a, &model).to_bare_ordered_string()
19.98 s
gammaloop-nextest-core> ────────────────────────────────────────────────────────────────────────────────
19.98 s
gammaloop-nextest-core> -old snapshot
19.98 s
gammaloop-nextest-core> +new results
19.98 s
gammaloop-nextest-core> ────────────┬───────────────────────────────────────────────────────────────────
19.98 s
gammaloop-nextest-core> 1 │-(-1𝑖/32*ε+1𝑖/16)*(cas(2,coad(8)))^2*dot(P(0,mink(4)),P(0,mink(4)))*gs^4*ε^(-2)
19.98 s
gammaloop-nextest-core> 1 │+(-1𝑖/16+1𝑖/32*ε)*(cas(2,coad(8)))^2*dot(P(0,mink(4)),P(0,mink(4)))*gs^4*ε^(-2)
19.98 s
gammaloop-nextest-core> ────────────┴───────────────────────────────────────────────────────────────────
19.98 s
gammaloop-nextest-core> To update snapshots run `cargo insta review`
19.98 s
gammaloop-nextest-core> Stopped on the first failure. Run `cargo insta test` to run all snapshots.
19.98 s
gammaloop-nextest-core> test finite_part_ghost_2loop ... FAILED
19.98 s
gammaloop-nextest-core>
19.98 s
gammaloop-nextest-core> failures:
19.98 s
gammaloop-nextest-core>
19.98 s
gammaloop-nextest-core> failures:
19.98 s
gammaloop-nextest-core> finite_part_ghost_2loop
19.98 s
gammaloop-nextest-core>
19.98 s
gammaloop-nextest-core> test result: FAILED. 0 passed; 1 failed; 0 ignored; 0 measured; 5 filtered out; finished in 2.10s
19.98 s
gammaloop-nextest-core>
19.98 s
gammaloop-nextest-core> stderr ---
19.98 s
gammaloop-nextest-core> The application panicked (crashed).
19.98 s
gammaloop-nextest-core> Message: snapshot assertion for 'finite_part_ghost_2loop-3' failed in line 464
19.98 s
gammaloop-nextest-core> Location: /nix/store/5nq6hmff26w9jbhbmba4wsvgnvglj2xd-vendor-cargo-deps/c19b7c6f923b580ac259164a89f2577984ad5ab09ee9d583b888f934adbbe8d0/insta-1.47.2/src/runtime.rs :719
19.98 s
gammaloop-nextest-core>
19.98 s
gammaloop-nextest-core> ━━━━━━━━━━━━━━━━━━━━━━━━━━━━━━━━━━ BACKTRACE ━━━━━━━━━━━━━━━━━━━━━━━━━━━━━━━━━━━
19.98 s
gammaloop-nextest-core> 1: <color_eyre[51793ea62743adbd]::config::PanicHook>::panic_report <unknown>
19.98 s
gammaloop-nextest-core> at <unknown source file> :<unknown line>
19.98 s
gammaloop-nextest-core> 2: <color_eyre[51793ea62743adbd]::config::PanicHook>::into_panic_hook::{closure#0} <unknown>
19.98 s
gammaloop-nextest-core> at <unknown source file> :<unknown line>
19.98 s
gammaloop-nextest-core> 3: std[bcb96dfbba0ab899]::panicking::panic_with_hook <unknown>
19.98 s
gammaloop-nextest-core> at <unknown source file> :<unknown line>
19.98 s
gammaloop-nextest-core> 4: std[bcb96dfbba0ab899]::panicking::panic_handler::{closure#0} <unknown>
19.98 s
gammaloop-nextest-core> at <unknown source file> :<unknown line>
19.98 s
gammaloop-nextest-core> 5: std[bcb96dfbba0ab899]::sys::backtrace::__rust_end_short_backtrace::<std[bcb96dfbba0ab899]::panicking::panic_handler::{closure#0}, !> <unknown>
19.98 s
gammaloop-nextest-core> at <unknown source file> :<unknown line>
19.98 s
gammaloop-nextest-core> 6: __rustc[6c289b9f9c454d21]::rust_begin_unwind <unknown>
19.98 s
gammaloop-nextest-core> at <unknown source file> :<unknown line>
19.98 s
gammaloop-nextest-core> 7: core[940e698046960fd5]::panicking::panic_fmt <unknown>
19.98 s
gammaloop-nextest-core> at <unknown source file> :<unknown line>
19.98 s
gammaloop-nextest-core> 8: insta[307a548ac79ef4d9]::runtime::assert_snapshot <unknown>
19.98 s
gammaloop-nextest-core> at <unknown source file> :<unknown line>
19.98 s
gammaloop-nextest-core> 9: test_renormalization[a909d96d00a50d41]::finite_part_ghost_2loop <unknown>
19.98 s
gammaloop-nextest-core> at <unknown source file> :<unknown line>
19.98 s
gammaloop-nextest-core> 10: <test_renormalization[a909d96d00a50d41]::finite_part_ghost_2loop::{closure#0} as core[940e698046960fd5]::ops::function::FnOnce<()>>::call_once <unknown>
19.98 s
gammaloop-nextest-core> at <unknown source file> :<unknown line>
19.98 s
gammaloop-nextest-core> 11: test[75d6903177b1d7e9]::__rust_begin_short_backtrace::<core[940e698046960fd5]::result::Result<(), alloc[2ea6bcb46fca0c42]::string::String>, fn() -> core[940e698046960fd5]::result::Result<(), alloc[2ea6bcb46fca0c42]::string::String>> <unknown>
19.98 s
gammaloop-nextest-core> at <unknown source file> :<unknown line>
19.98 s
gammaloop-nextest-core> 12: test[75d6903177b1d7e9]::run_test::{closure#0} <unknown>
19.98 s
gammaloop-nextest-core> at <unknown source file> :<unknown line>
19.98 s
gammaloop-nextest-core> 13: std[bcb96dfbba0ab899]::sys::backtrace::__rust_begin_short_backtrace::<test[75d6903177b1d7e9]::run_test::{closure#1}, ()> <unknown>
19.98 s
gammaloop-nextest-core> at <unknown source file> :<unknown line>
19.98 s
gammaloop-nextest-core> 14: <std[bcb96dfbba0ab899]::thread::lifecycle::spawn_unchecked<test[75d6903177b1d7e9]::run_test::{closure#1}, ()>::{closure#1} as core[940e698046960fd5]::ops::function::FnOnce<()>>::call_once::{shim:vtable#0} <unknown>
19.98 s
gammaloop-nextest-core> at <unknown source file> :<unknown line>
19.98 s
gammaloop-nextest-core> 15: <std[bcb96dfbba0ab899]::sys::thread::unix::Thread>::new::thread_start <unknown>
19.98 s
gammaloop-nextest-core> at <unknown source file> :<unknown line>
19.98 s
gammaloop-nextest-core> 16: start_thread <unknown>
19.98 s
gammaloop-nextest-core> at <unknown source file> :<unknown line>
19.98 s
gammaloop-nextest-core> 17: __clone3 <unknown>
19.98 s
gammaloop-nextest-core> at <unknown source file> :<unknown line>
19.98 s
gammaloop-nextest-core>
19.98 s
gammaloop-nextest-core> Run with COLORBT_SHOW_HIDDEN=1 environment variable to disable frame filtering.
19.98 s
gammaloop-nextest-core> Run with RUST_BACKTRACE=full to include source snippets.
19.98 s
gammaloop-nextest-core>
25.25 s
gammaloop-nextest-core> ------------
25.27 s
gammaloop-nextest-core> Summary [ 8.169s] 456 tests run: 454 passed , 2 failed , 61 skipped
25.27 s
gammaloop-nextest-core> FAIL [ 0.336s] (446/456) gammalooprs::test_renormalization finit_part_ghlo
25.27 s
gammaloop-nextest-core> stdout ---
25.27 s
gammaloop-nextest-core>
25.27 s
gammaloop-nextest-core> running 1 test
25.27 s
gammaloop-nextest-core> ren part: 1/2*GC_10^2*dot(P(0,mink (dim)),P(0,mink (dim)))*cas(2,coad (8))/ε
25.27 s
gammaloop-nextest-core> ━━━━━━━━━━━━━━━━━━━━━━━━━━━━━━━ Snapshot Summary ━━━━━━━━━━━━━━━━━━━━━━━━━━━━━━━
25.27 s
gammaloop-nextest-core> Snapshot: finit_part_ghlo
25.27 s
gammaloop-nextest-core> Source: crates/gammalooprs/tests/test_renormalization.rs:557
25.27 s
gammaloop-nextest-core> ────────────────────────────────────────────────────────────────────────────────
25.27 s
gammaloop-nextest-core> Expression: align_to_rqft(&a, &model).to_bare_ordered_string()
25.27 s
gammaloop-nextest-core> ────────────────────────────────────────────────────────────────────────────────
25.27 s
gammaloop-nextest-core> -old snapshot
25.27 s
gammaloop-nextest-core> +new results
25.27 s
gammaloop-nextest-core> ────────────┬───────────────────────────────────────────────────────────────────
25.27 s
gammaloop-nextest-core> 1 │--1/2*cas(2,coad(8))*dot(P(0,mink(4)),P(0,mink(4)))*gs^2*ε^(-1)
25.27 s
gammaloop-nextest-core> 1 │+1/2*cas(2,coad(8))*dot(P(0,mink(4)),P(0,mink(4)))*gs^2*ε^(-1)
25.27 s
gammaloop-nextest-core> ────────────┴───────────────────────────────────────────────────────────────────
25.27 s
gammaloop-nextest-core> To update snapshots run `cargo insta review`
25.27 s
gammaloop-nextest-core> Stopped on the first failure. Run `cargo insta test` to run all snapshots.
25.27 s
gammaloop-nextest-core> test finit_part_ghlo ... FAILED
25.27 s
gammaloop-nextest-core>
25.27 s
gammaloop-nextest-core> failures:
25.27 s
gammaloop-nextest-core>
25.27 s
gammaloop-nextest-core> failures:
25.27 s
gammaloop-nextest-core> finit_part_ghlo
25.27 s
gammaloop-nextest-core>
25.27 s
gammaloop-nextest-core> test result: FAILED. 0 passed; 1 failed; 0 ignored; 0 measured; 5 filtered out; finished in 0.33s
25.27 s
gammaloop-nextest-core>
25.27 s
gammaloop-nextest-core> stderr ---
25.27 s
gammaloop-nextest-core> The application panicked (crashed).
25.27 s
gammaloop-nextest-core> Message: snapshot assertion for 'finit_part_ghlo' failed in line 557
25.27 s
gammaloop-nextest-core> Location: /nix/store/5nq6hmff26w9jbhbmba4wsvgnvglj2xd-vendor-cargo-deps/c19b7c6f923b580ac259164a89f2577984ad5ab09ee9d583b888f934adbbe8d0/insta-1.47.2/src/runtime.rs :719
25.27 s
gammaloop-nextest-core>
25.27 s
gammaloop-nextest-core> ━━━━━━━━━━━━━━━━━━━━━━━━━━━━━━━━━━ BACKTRACE ━━━━━━━━━━━━━━━━━━━━━━━━━━━━━━━━━━━
25.27 s
gammaloop-nextest-core> 1: <color_eyre[51793ea62743adbd]::config::PanicHook>::panic_report <unknown>
25.27 s
gammaloop-nextest-core> at <unknown source file> :<unknown line>
25.27 s
gammaloop-nextest-core> 2: <color_eyre[51793ea62743adbd]::config::PanicHook>::into_panic_hook::{closure#0} <unknown>
25.27 s
gammaloop-nextest-core> at <unknown source file> :<unknown line>
25.27 s
gammaloop-nextest-core> 3: std[bcb96dfbba0ab899]::panicking::panic_with_hook <unknown>
25.27 s
gammaloop-nextest-core> at <unknown source file> :<unknown line>
25.27 s
gammaloop-nextest-core> 4: std[bcb96dfbba0ab899]::panicking::panic_handler::{closure#0} <unknown>
25.27 s
gammaloop-nextest-core> at <unknown source file> :<unknown line>
25.27 s
gammaloop-nextest-core> 5: std[bcb96dfbba0ab899]::sys::backtrace::__rust_end_short_backtrace::<std[bcb96dfbba0ab899]::panicking::panic_handler::{closure#0}, !> <unknown>
25.27 s
gammaloop-nextest-core> at <unknown source file> :<unknown line>
25.27 s
gammaloop-nextest-core> 6: __rustc[6c289b9f9c454d21]::rust_begin_unwind <unknown>
25.27 s
gammaloop-nextest-core> at <unknown source file> :<unknown line>
25.27 s
gammaloop-nextest-core> 7: core[940e698046960fd5]::panicking::panic_fmt <unknown>
25.27 s
gammaloop-nextest-core> at <unknown source file> :<unknown line>
25.27 s
gammaloop-nextest-core> 8: insta[307a548ac79ef4d9]::runtime::assert_snapshot <unknown>
25.27 s
gammaloop-nextest-core> at <unknown source file> :<unknown line>
25.27 s
gammaloop-nextest-core> 9: <test_renormalization[a909d96d00a50d41]::finit_part_ghlo::{closure#0} as core[940e698046960fd5]::ops::function::FnOnce<()>>::call_once <unknown>
25.27 s
gammaloop-nextest-core> at <unknown source file> :<unknown line>
25.27 s
gammaloop-nextest-core> 10: test[75d6903177b1d7e9]::__rust_begin_short_backtrace::<core[940e698046960fd5]::result::Result<(), alloc[2ea6bcb46fca0c42]::string::String>, fn() -> core[940e698046960fd5]::result::Result<(), alloc[2ea6bcb46fca0c42]::string::String>> <unknown>
25.27 s
gammaloop-nextest-core> at <unknown source file> :<unknown line>
25.27 s
gammaloop-nextest-core> 11: test[75d6903177b1d7e9]::run_test::{closure#0} <unknown>
25.27 s
gammaloop-nextest-core> at <unknown source file> :<unknown line>
25.27 s
gammaloop-nextest-core> 12: std[bcb96dfbba0ab899]::sys::backtrace::__rust_begin_short_backtrace::<test[75d6903177b1d7e9]::run_test::{closure#1}, ()> <unknown>
25.27 s
gammaloop-nextest-core> at <unknown source file> :<unknown line>
25.27 s
gammaloop-nextest-core> 13: <std[bcb96dfbba0ab899]::thread::lifecycle::spawn_unchecked<test[75d6903177b1d7e9]::run_test::{closure#1}, ()>::{closure#1} as core[940e698046960fd5]::ops::function::FnOnce<()>>::call_once::{shim:vtable#0} <unknown>
25.27 s
gammaloop-nextest-core> at <unknown source file> :<unknown line>
25.27 s
gammaloop-nextest-core> 14: <std[bcb96dfbba0ab899]::sys::thread::unix::Thread>::new::thread_start <unknown>
25.27 s
gammaloop-nextest-core> at <unknown source file> :<unknown line>
25.27 s
gammaloop-nextest-core> 15: start_thread <unknown>
25.27 s
gammaloop-nextest-core> at <unknown source file> :<unknown line>
25.27 s
gammaloop-nextest-core> 16: __clone3 <unknown>
25.27 s
gammaloop-nextest-core> at <unknown source file> :<unknown line>
25.27 s
gammaloop-nextest-core>
25.27 s
gammaloop-nextest-core> Run with COLORBT_SHOW_HIDDEN=1 environment variable to disable frame filtering.
25.27 s
gammaloop-nextest-core> Run with RUST_BACKTRACE=full to include source snippets.
25.27 s
gammaloop-nextest-core>
25.27 s
gammaloop-nextest-core> FAIL [ 2.110s] (452/456) gammalooprs::test_renormalization finite_part_ghost_2loop
25.27 s
gammaloop-nextest-core> stdout ---
25.27 s
gammaloop-nextest-core>
25.27 s
gammaloop-nextest-core> running 1 test
25.27 s
gammaloop-nextest-core> ━━━━━━━━━━━━━━━━━━━━━━━━━━━━━━━ Snapshot Summary ━━━━━━━━━━━━━━━━━━━━━━━━━━━━━━━
25.27 s
gammaloop-nextest-core> Snapshot: finite_part_ghost_2loop-3
25.27 s
gammaloop-nextest-core> Source: crates/gammalooprs/tests/test_renormalization.rs:464
25.27 s
gammaloop-nextest-core> ────────────────────────────────────────────────────────────────────────────────
25.27 s
gammaloop-nextest-core> Expression: align_to_rqft(&a, &model).to_bare_ordered_string()
25.27 s
gammaloop-nextest-core> ────────────────────────────────────────────────────────────────────────────────
25.27 s
gammaloop-nextest-core> -old snapshot
25.27 s
gammaloop-nextest-core> +new results
25.27 s
gammaloop-nextest-core> ────────────┬───────────────────────────────────────────────────────────────────
25.27 s
gammaloop-nextest-core> 1 │-(-1𝑖/32*ε+1𝑖/16)*(cas(2,coad(8)))^2*dot(P(0,mink(4)),P(0,mink(4)))*gs^4*ε^(-2)
25.27 s
gammaloop-nextest-core> 1 │+(-1𝑖/16+1𝑖/32*ε)*(cas(2,coad(8)))^2*dot(P(0,mink(4)),P(0,mink(4)))*gs^4*ε^(-2)
25.27 s
gammaloop-nextest-core> ────────────┴───────────────────────────────────────────────────────────────────
25.27 s
gammaloop-nextest-core> To update snapshots run `cargo insta review`
25.27 s
gammaloop-nextest-core> Stopped on the first failure. Run `cargo insta test` to run all snapshots.
25.27 s
gammaloop-nextest-core> test finite_part_ghost_2loop ... FAILED
25.27 s
gammaloop-nextest-core>
25.27 s
gammaloop-nextest-core> failures:
25.27 s
gammaloop-nextest-core>
25.27 s
gammaloop-nextest-core> failures:
25.27 s
gammaloop-nextest-core> finite_part_ghost_2loop
25.27 s
gammaloop-nextest-core>
25.27 s
gammaloop-nextest-core> test result: FAILED. 0 passed; 1 failed; 0 ignored; 0 measured; 5 filtered out; finished in 2.10s
25.27 s
gammaloop-nextest-core>
25.27 s
gammaloop-nextest-core> stderr ---
25.27 s
gammaloop-nextest-core> The application panicked (crashed).
25.27 s
gammaloop-nextest-core> Message: snapshot assertion for 'finite_part_ghost_2loop-3' failed in line 464
25.27 s
gammaloop-nextest-core> Location: /nix/store/5nq6hmff26w9jbhbmba4wsvgnvglj2xd-vendor-cargo-deps/c19b7c6f923b580ac259164a89f2577984ad5ab09ee9d583b888f934adbbe8d0/insta-1.47.2/src/runtime.rs :719
25.27 s
gammaloop-nextest-core>
25.27 s
gammaloop-nextest-core> ━━━━━━━━━━━━━━━━━━━━━━━━━━━━━━━━━━ BACKTRACE ━━━━━━━━━━━━━━━━━━━━━━━━━━━━━━━━━━━
25.27 s
gammaloop-nextest-core> 1: <color_eyre[51793ea62743adbd]::config::PanicHook>::panic_report <unknown>
25.27 s
gammaloop-nextest-core> at <unknown source file> :<unknown line>
25.27 s
gammaloop-nextest-core> 2: <color_eyre[51793ea62743adbd]::config::PanicHook>::into_panic_hook::{closure#0} <unknown>
25.27 s
gammaloop-nextest-core> at <unknown source file> :<unknown line>
25.27 s
gammaloop-nextest-core> 3: std[bcb96dfbba0ab899]::panicking::panic_with_hook <unknown>
25.27 s
gammaloop-nextest-core> at <unknown source file> :<unknown line>
25.27 s
gammaloop-nextest-core> 4: std[bcb96dfbba0ab899]::panicking::panic_handler::{closure#0} <unknown>
25.27 s
gammaloop-nextest-core> at <unknown source file> :<unknown line>
25.27 s
gammaloop-nextest-core> 5: std[bcb96dfbba0ab899]::sys::backtrace::__rust_end_short_backtrace::<std[bcb96dfbba0ab899]::panicking::panic_handler::{closure#0}, !> <unknown>
25.27 s
gammaloop-nextest-core> at <unknown source file> :<unknown line>
25.27 s
gammaloop-nextest-core> 6: __rustc[6c289b9f9c454d21]::rust_begin_unwind <unknown>
25.27 s
gammaloop-nextest-core> at <unknown source file> :<unknown line>
25.27 s
gammaloop-nextest-core> 7: core[940e698046960fd5]::panicking::panic_fmt <unknown>
25.27 s
gammaloop-nextest-core> at <unknown source file> :<unknown line>
25.27 s
gammaloop-nextest-core> 8: insta[307a548ac79ef4d9]::runtime::assert_snapshot <unknown>
25.27 s
gammaloop-nextest-core> at <unknown source file> :<unknown line>
25.27 s
gammaloop-nextest-core> 9: test_renormalization[a909d96d00a50d41]::finite_part_ghost_2loop <unknown>
25.27 s
gammaloop-nextest-core> at <unknown source file> :<unknown line>
25.27 s
gammaloop-nextest-core> 10: <test_renormalization[a909d96d00a50d41]::finite_part_ghost_2loop::{closure#0} as core[940e698046960fd5]::ops::function::FnOnce<()>>::call_once <unknown>
25.27 s
gammaloop-nextest-core> at <unknown source file> :<unknown line>
25.27 s
gammaloop-nextest-core> 11: test[75d6903177b1d7e9]::__rust_begin_short_backtrace::<core[940e698046960fd5]::result::Result<(), alloc[2ea6bcb46fca0c42]::string::String>, fn() -> core[940e698046960fd5]::result::Result<(), alloc[2ea6bcb46fca0c42]::string::String>> <unknown>
25.27 s
gammaloop-nextest-core> at <unknown source file> :<unknown line>
25.27 s
gammaloop-nextest-core> 12: test[75d6903177b1d7e9]::run_test::{closure#0} <unknown>
25.27 s
gammaloop-nextest-core> at <unknown source file> :<unknown line>
25.27 s
gammaloop-nextest-core> 13: std[bcb96dfbba0ab899]::sys::backtrace::__rust_begin_short_backtrace::<test[75d6903177b1d7e9]::run_test::{closure#1}, ()> <unknown>
25.27 s
gammaloop-nextest-core> at <unknown source file> :<unknown line>
25.27 s
gammaloop-nextest-core> 14: <std[bcb96dfbba0ab899]::thread::lifecycle::spawn_unchecked<test[75d6903177b1d7e9]::run_test::{closure#1}, ()>::{closure#1} as core[940e698046960fd5]::ops::function::FnOnce<()>>::call_once::{shim:vtable#0} <unknown>
25.27 s
gammaloop-nextest-core> at <unknown source file> :<unknown line>
25.27 s
gammaloop-nextest-core> 15: <std[bcb96dfbba0ab899]::sys::thread::unix::Thread>::new::thread_start <unknown>
25.27 s
gammaloop-nextest-core> at <unknown source file> :<unknown line>
25.27 s
gammaloop-nextest-core> 16: start_thread <unknown>
25.27 s
gammaloop-nextest-core> at <unknown source file> :<unknown line>
25.27 s
gammaloop-nextest-core> 17: __clone3 <unknown>
25.27 s
gammaloop-nextest-core> at <unknown source file> :<unknown line>
25.27 s
gammaloop-nextest-core>
25.27 s
gammaloop-nextest-core> Run with COLORBT_SHOW_HIDDEN=1 environment variable to disable frame filtering.
25.27 s
gammaloop-nextest-core> Run with RUST_BACKTRACE=full to include source snippets.
25.27 s
gammaloop-nextest-core>
25.31 s
gammaloop-nextest-core> error : test run failed
25.33 s
gammaloop-nextest-core>
25.33 s
gammaloop-nextest-core> ========== nextest test summary ==========
25.33 s
gammaloop-nextest-core> report: target/nextest/ci_gammaloop/junit.xml
25.33 s
gammaloop-nextest-core> tests: 456, failures: 2, errors: 0
25.33 s
gammaloop-nextest-core>
25.33 s
gammaloop-nextest-core> 1. gammalooprs::test_renormalization::finit_part_ghlo
25.33 s
gammaloop-nextest-core> failure: test failure with exit code 101
25.33 s
gammaloop-nextest-core> system-out
25.33 s
gammaloop-nextest-core> running 1 test
25.33 s
gammaloop-nextest-core> ren part: 1/2*GC_10^2*dot(P(0,mink(dim)),P(0,mink(dim)))*cas(2,coad(8))/ε
25.33 s
gammaloop-nextest-core> ━━━━━━━━━━━━━━━━━━━━━━━━━━━━━━━ Snapshot Summary ━━━━━━━━━━━━━━━━━━━━━━━━━━━━━━━
25.33 s
gammaloop-nextest-core> Snapshot: finit_part_ghlo
25.33 s
gammaloop-nextest-core> Source: crates/gammalooprs/tests/test_renormalization.rs:557
25.33 s
gammaloop-nextest-core> ────────────────────────────────────────────────────────────────────────────────
25.33 s
gammaloop-nextest-core> Expression: align_to_rqft(&a, &model).to_bare_ordered_string()
25.33 s
gammaloop-nextest-core> ────────────────────────────────────────────────────────────────────────────────
25.33 s
gammaloop-nextest-core> -old snapshot
25.33 s
gammaloop-nextest-core> +new results
25.33 s
gammaloop-nextest-core> ────────────┬───────────────────────────────────────────────────────────────────
25.33 s
gammaloop-nextest-core> 1 │--1/2*cas(2,coad(8))*dot(P(0,mink(4)),P(0,mink(4)))*gs^2*ε^(-1)
25.34 s
gammaloop-nextest-core> 1 │+1/2*cas(2,coad(8))*dot(P(0,mink(4)),P(0,mink(4)))*gs^2*ε^(-1)
25.34 s
gammaloop-nextest-core> ────────────┴───────────────────────────────────────────────────────────────────
25.34 s
gammaloop-nextest-core> To update snapshots run `cargo insta review`
25.34 s
gammaloop-nextest-core> Stopped on the first failure. Run `cargo insta test` to run all snapshots.
25.34 s
gammaloop-nextest-core> test finit_part_ghlo ... FAILED
25.34 s
gammaloop-nextest-core>
25.34 s
gammaloop-nextest-core> failures:
25.34 s
gammaloop-nextest-core>
25.34 s
gammaloop-nextest-core> failures:
25.34 s
gammaloop-nextest-core> finit_part_ghlo
25.34 s
gammaloop-nextest-core>
25.34 s
gammaloop-nextest-core> test result: FAILED. 0 passed; 1 failed; 0 ignored; 0 measured; 5 filtered out; finished in 0.33s
25.34 s
gammaloop-nextest-core> system-err
25.34 s
gammaloop-nextest-core> The application panicked (crashed).
25.34 s
gammaloop-nextest-core> Message: snapshot assertion for 'finit_part_ghlo' failed in line 557
25.34 s
gammaloop-nextest-core> Location: /nix/store/5nq6hmff26w9jbhbmba4wsvgnvglj2xd-vendor-cargo-deps/c19b7c6f923b580ac259164a89f2577984ad5ab09ee9d583b888f934adbbe8d0/insta-1.47.2/src/runtime.rs:719
25.34 s
gammaloop-nextest-core>
25.34 s
gammaloop-nextest-core> ━━━━━━━━━━━━━━━━━━━━━━━━━━━━━━━━━━ BACKTRACE ━━━━━━━━━━━━━━━━━━━━━━━━━━━━━━━━━━━
25.34 s
gammaloop-nextest-core> 1: <color_eyre[51793ea62743adbd]::config::PanicHook>::panic_report<unknown>
25.34 s
gammaloop-nextest-core> at <unknown source file>:<unknown line>
25.34 s
gammaloop-nextest-core> 2: <color_eyre[51793ea62743adbd]::config::PanicHook>::into_panic_hook::{closure#0}<unknown>
25.34 s
gammaloop-nextest-core> at <unknown source file>:<unknown line>
25.34 s
gammaloop-nextest-core> 3: std[bcb96dfbba0ab899]::panicking::panic_with_hook<unknown>
25.34 s
gammaloop-nextest-core> at <unknown source file>:<unknown line>
25.34 s
gammaloop-nextest-core> 4: std[bcb96dfbba0ab899]::panicking::panic_handler::{closure#0}<unknown>
25.34 s
gammaloop-nextest-core> at <unknown source file>:<unknown line>
25.34 s
gammaloop-nextest-core> 5: std[bcb96dfbba0ab899]::sys::backtrace::__rust_end_short_backtrace::<std[bcb96dfbba0ab899]::panicking::panic_handler::{closure#0}, !><unknown>
25.34 s
gammaloop-nextest-core> at <unknown source file>:<unknown line>
25.34 s
gammaloop-nextest-core> 6: __rustc[6c289b9f9c454d21]::rust_begin_unwind<unknown>
25.34 s
gammaloop-nextest-core> at <unknown source file>:<unknown line>
25.34 s
gammaloop-nextest-core> 7: core[940e698046960fd5]::panicking::panic_fmt<unknown>
25.34 s
gammaloop-nextest-core> at <unknown source file>:<unknown line>
25.34 s
gammaloop-nextest-core> 8: insta[307a548ac79ef4d9]::runtime::assert_snapshot<unknown>
25.34 s
gammaloop-nextest-core> at <unknown source file>:<unknown line>
25.34 s
gammaloop-nextest-core> 9: <test_renormalization[a909d96d00a50d41]::finit_part_ghlo::{closure#0} as core[940e698046960fd5]::ops::function::FnOnce<()>>::call_once<unknown>
25.34 s
gammaloop-nextest-core> at <unknown source file>:<unknown line>
25.34 s
gammaloop-nextest-core> 10: test[75d6903177b1d7e9]::__rust_begin_short_backtrace::<core[940e698046960fd5]::result::Result<(), alloc[2ea6bcb46fca0c42]::string::String>, fn() -> core[940e698046960fd5]::result::Result<(), alloc[2ea6bcb46fca0c42]::string::String>><unknown>
25.34 s
gammaloop-nextest-core> at <unknown source file>:<unknown line>
25.34 s
gammaloop-nextest-core> 11: test[75d6903177b1d7e9]::run_test::{closure#0}<unknown>
25.34 s
gammaloop-nextest-core> at <unknown source file>:<unknown line>
25.34 s
gammaloop-nextest-core> 12: std[bcb96dfbba0ab899]::sys::backtrace::__rust_begin_short_backtrace::<test[75d6903177b1d7e9]::run_test::{closure#1}, ()><unknown>
25.34 s
gammaloop-nextest-core> at <unknown source file>:<unknown line>
25.34 s
gammaloop-nextest-core> 13: <std[bcb96dfbba0ab899]::thread::lifecycle::spawn_unchecked<test[75d6903177b1d7e9]::run_test::{closure#1}, ()>::{closure#1} as core[940e698046960fd5]::ops::function::FnOnce<()>>::call_once::{shim:vtable#0}<unknown>
25.34 s
gammaloop-nextest-core> at <unknown source file>:<unknown line>
25.34 s
gammaloop-nextest-core> 14: <std[bcb96dfbba0ab899]::sys::thread::unix::Thread>::new::thread_start<unknown>
25.34 s
gammaloop-nextest-core> at <unknown source file>:<unknown line>
25.34 s
gammaloop-nextest-core> 15: start_thread<unknown>
25.34 s
gammaloop-nextest-core> at <unknown source file>:<unknown line>
25.34 s
gammaloop-nextest-core> 16: __clone3<unknown>
25.34 s
gammaloop-nextest-core> at <unknown source file>:<unknown line>
25.34 s
gammaloop-nextest-core>
25.34 s
gammaloop-nextest-core> Run with COLORBT_SHOW_HIDDEN=1 environment variable to disable frame filtering.
25.34 s
gammaloop-nextest-core> Run with RUST_BACKTRACE=full to include source snippets.
25.34 s
gammaloop-nextest-core>
25.34 s
gammaloop-nextest-core> 2. gammalooprs::test_renormalization::finite_part_ghost_2loop
25.34 s
gammaloop-nextest-core> failure: test failure with exit code 101
25.34 s
gammaloop-nextest-core> system-out
25.34 s
gammaloop-nextest-core> running 1 test
25.34 s
gammaloop-nextest-core> ━━━━━━━━━━━━━━━━━━━━━━━━━━━━━━━ Snapshot Summary ━━━━━━━━━━━━━━━━━━━━━━━━━━━━━━━
25.34 s
gammaloop-nextest-core> Snapshot: finite_part_ghost_2loop-3
25.34 s
gammaloop-nextest-core> Source: crates/gammalooprs/tests/test_renormalization.rs:464
25.34 s
gammaloop-nextest-core> ────────────────────────────────────────────────────────────────────────────────
25.34 s
gammaloop-nextest-core> Expression: align_to_rqft(&a, &model).to_bare_ordered_string()
25.34 s
gammaloop-nextest-core> ────────────────────────────────────────────────────────────────────────────────
25.34 s
gammaloop-nextest-core> -old snapshot
25.34 s
gammaloop-nextest-core> +new results
25.34 s
gammaloop-nextest-core> ────────────┬───────────────────────────────────────────────────────────────────
25.34 s
gammaloop-nextest-core> 1 │-(-1𝑖/32*ε+1𝑖/16)*(cas(2,coad(8)))^2*dot(P(0,mink(4)),P(0,mink(4)))*gs^4*ε^(-2)
25.34 s
gammaloop-nextest-core> 1 │+(-1𝑖/16+1𝑖/32*ε)*(cas(2,coad(8)))^2*dot(P(0,mink(4)),P(0,mink(4)))*gs^4*ε^(-2)
25.34 s
gammaloop-nextest-core> ────────────┴───────────────────────────────────────────────────────────────────
25.34 s
gammaloop-nextest-core> To update snapshots run `cargo insta review`
25.34 s
gammaloop-nextest-core> Stopped on the first failure. Run `cargo insta test` to run all snapshots.
25.34 s
gammaloop-nextest-core> test finite_part_ghost_2loop ... FAILED
25.34 s
gammaloop-nextest-core>
25.34 s
gammaloop-nextest-core> failures:
25.34 s
gammaloop-nextest-core>
25.34 s
gammaloop-nextest-core> failures:
25.34 s
gammaloop-nextest-core> finite_part_ghost_2loop
25.34 s
gammaloop-nextest-core>
25.34 s
gammaloop-nextest-core> test result: FAILED. 0 passed; 1 failed; 0 ignored; 0 measured; 5 filtered out; finished in 2.10s
25.34 s
gammaloop-nextest-core> system-err
25.34 s
gammaloop-nextest-core> The application panicked (crashed).
25.34 s
gammaloop-nextest-core> Message: snapshot assertion for 'finite_part_ghost_2loop-3' failed in line 464
25.34 s
gammaloop-nextest-core> Location: /nix/store/5nq6hmff26w9jbhbmba4wsvgnvglj2xd-vendor-cargo-deps/c19b7c6f923b580ac259164a89f2577984ad5ab09ee9d583b888f934adbbe8d0/insta-1.47.2/src/runtime.rs:719
25.34 s
gammaloop-nextest-core>
25.34 s
gammaloop-nextest-core> ━━━━━━━━━━━━━━━━━━━━━━━━━━━━━━━━━━ BACKTRACE ━━━━━━━━━━━━━━━━━━━━━━━━━━━━━━━━━━━
25.34 s
gammaloop-nextest-core> 1: <color_eyre[51793ea62743adbd]::config::PanicHook>::panic_report<unknown>
25.34 s
gammaloop-nextest-core> at <unknown source file>:<unknown line>
25.34 s
gammaloop-nextest-core> 2: <color_eyre[51793ea62743adbd]::config::PanicHook>::into_panic_hook::{closure#0}<unknown>
25.34 s
gammaloop-nextest-core> at <unknown source file>:<unknown line>
25.34 s
gammaloop-nextest-core> 3: std[bcb96dfbba0ab899]::panicking::panic_with_hook<unknown>
25.34 s
gammaloop-nextest-core> at <unknown source file>:<unknown line>
25.34 s
gammaloop-nextest-core> 4: std[bcb96dfbba0ab899]::panicking::panic_handler::{closure#0}<unknown>
25.34 s
gammaloop-nextest-core> at <unknown source file>:<unknown line>
25.34 s
gammaloop-nextest-core> 5: std[bcb96dfbba0ab899]::sys::backtrace::__rust_end_short_backtrace::<std[bcb96dfbba0ab899]::panicking::panic_handler::{closure#0}, !><unknown>
25.34 s
gammaloop-nextest-core> at <unknown source file>:<unknown line>
25.34 s
gammaloop-nextest-core> 6: __rustc[6c289b9f9c454d21]::rust_begin_unwind<unknown>
25.34 s
gammaloop-nextest-core> at <unknown source file>:<unknown line>
25.34 s
gammaloop-nextest-core> 7: core[940e698046960fd5]::panicking::panic_fmt<unknown>
25.34 s
gammaloop-nextest-core> at <unknown source file>:<unknown line>
25.34 s
gammaloop-nextest-core> 8: insta[307a548ac79ef4d9]::runtime::assert_snapshot<unknown>
25.34 s
gammaloop-nextest-core> at <unknown source file>:<unknown line>
25.34 s
gammaloop-nextest-core> 9: test_renormalization[a909d96d00a50d41]::finite_part_ghost_2loop<unknown>
25.34 s
gammaloop-nextest-core> at <unknown source file>:<unknown line>
25.34 s
gammaloop-nextest-core> 10: <test_renormalization[a909d96d00a50d41]::finite_part_ghost_2loop::{closure#0} as core[940e698046960fd5]::ops::function::FnOnce<()>>::call_once<unknown>
25.34 s
gammaloop-nextest-core> at <unknown source file>:<unknown line>
25.34 s
gammaloop-nextest-core> 11: test[75d6903177b1d7e9]::__rust_begin_short_backtrace::<core[940e698046960fd5]::result::Result<(), alloc[2ea6bcb46fca0c42]::string::String>, fn() -> core[940e698046960fd5]::result::Result<(), alloc[2ea6bcb46fca0c42]::string::String>><unknown>
25.34 s
gammaloop-nextest-core> at <unknown source file>:<unknown line>
25.34 s
gammaloop-nextest-core> 12: test[75d6903177b1d7e9]::run_test::{closure#0}<unknown>
25.34 s
gammaloop-nextest-core> at <unknown source file>:<unknown line>
25.34 s
gammaloop-nextest-core> 13: std[bcb96dfbba0ab899]::sys::backtrace::__rust_begin_short_backtrace::<test[75d6903177b1d7e9]::run_test::{closure#1}, ()><unknown>
25.34 s
gammaloop-nextest-core> at <unknown source file>:<unknown line>
25.34 s
gammaloop-nextest-core> 14: <std[bcb96dfbba0ab899]::thread::lifecycle::spawn_unchecked<test[75d6903177b1d7e9]::run_test::{closure#1}, ()>::{closure#1} as core[940e698046960fd5]::ops::function::FnOnce<()>>::call_once::{shim:vtable#0}<unknown>
25.34 s
gammaloop-nextest-core> at <unknown source file>:<unknown line>
25.34 s
gammaloop-nextest-core> 15: <std[bcb96dfbba0ab899]::sys::thread::unix::Thread>::new::thread_start<unknown>
25.34 s
gammaloop-nextest-core> at <unknown source file>:<unknown line>
25.34 s
gammaloop-nextest-core> 16: start_thread<unknown>
25.34 s
gammaloop-nextest-core> at <unknown source file>:<unknown line>
25.34 s
gammaloop-nextest-core> 17: __clone3<unknown>
25.34 s
gammaloop-nextest-core> at <unknown source file>:<unknown line>
25.34 s
gammaloop-nextest-core>
25.34 s
gammaloop-nextest-core> Run with COLORBT_SHOW_HIDDEN=1 environment variable to disable frame filtering.
25.34 s
gammaloop-nextest-core> Run with RUST_BACKTRACE=full to include source snippets.
25.34 s
gammaloop-nextest-core> =========================================
25.37 s
error: Cannot build '/nix/store/bdjz1sm6jpf4ngrik4ql09axygsysbqj-gammaloop-nextest-core.drv '.
25.37 s
Reason: builder failed with exit code 100 .
25.37 s
Output paths:
25.37 s
/nix/store/m6wbas79fxijf98k47qgcx8am2457ykb-gammaloop-nextest-core
25.37 s
Last 473 log lines:
25.37 s
> Extracting 3 binaries (including 1 non-test binary), 1 build script output directory, and 2 linked paths to /build/nextest-archive-wc3FDK
25.37 s
> Extracted 18 files to /build/nextest-archive-wc3FDK in 0.40s
25.37 s
> ------------
25.37 s
> Nextest run ID a9408c16-b3e9-4b68-97be-c706e24b68ee with nextest profile: ci_gammaloop
25.37 s
> Starting 339 tests across 2 binaries
25.37 s
> ------------
25.37 s
> Summary [ 0.422s] 339 tests run: 339 passed , 0 skipped
25.37 s
>
25.37 s
> ========== nextest test summary ==========
25.37 s
> report: target/nextest/ci_gammaloop/junit.xml
25.37 s
> tests: 339, failures: 0, errors: 0
25.37 s
> No failing testcases found.
25.37 s
> =========================================
25.37 s
> Extracting 1 binary and 1 linked path to /build/nextest-archive-MnLGXq
25.37 s
> Extracted 7 files to /build/nextest-archive-MnLGXq in 0.06s
25.37 s
> ------------
25.37 s
> Nextest run ID 18599266-b990-477b-b835-a548760d2e19 with nextest profile: ci_gammaloop
25.37 s
> Starting 19 tests across 1 binary
25.37 s
> ------------
25.37 s
> Summary [ 0.010s] 19 tests run: 19 passed , 0 skipped
25.37 s
>
25.37 s
> ========== nextest test summary ==========
25.37 s
> report: target/nextest/ci_gammaloop/junit.xml
25.37 s
> tests: 19, failures: 0, errors: 0
25.37 s
> No failing testcases found.
25.37 s
> =========================================
25.37 s
> Extracting 1 binary to /build/nextest-archive-pR0GjV
25.37 s
> Extracted 4 files to /build/nextest-archive-pR0GjV in 0.03s
25.37 s
> ------------
25.37 s
> Nextest run ID e4759f32-171b-48b6-bec3-97e9128df0e3 with nextest profile: ci_gammaloop
25.37 s
> Starting 0 tests across 1 binary
25.37 s
> ------------
25.37 s
> Summary [ 0.000s] 0 tests run: 0 passed , 0 skipped
25.37 s
>
25.37 s
> ========== nextest test summary ==========
25.37 s
> report: target/nextest/ci_gammaloop/junit.xml
25.37 s
> tests: 0, failures: 0, errors: 0
25.37 s
> No failing testcases found.
25.37 s
> =========================================
25.37 s
> Extracting 4 binaries, 1 build script output directory, and 2 linked paths to /build/nextest-archive-DrHsDI
25.37 s
> Extracted 18 files to /build/nextest-archive-DrHsDI in 0.41s
25.37 s
> ------------
25.37 s
> Nextest run ID 9b7a801a-811a-4856-8d7f-bcbe9c637238 with nextest profile: ci_gammaloop
25.37 s
> Starting 456 tests across 4 binaries (61 tests skipped , including 60 tests via profile.ci_gammaloop.default-filter )
25.37 s
> FAIL [ 0.336s] (446/456) gammalooprs::test_renormalization finit_part_ghlo
25.37 s
> stdout ---
25.37 s
>
25.37 s
> running 1 test
25.37 s
> ren part: 1/2*GC_10^2*dot(P(0,mink (dim)),P(0,mink (dim)))*cas(2,coad (8))/ε
25.37 s
> ━━━━━━━━━━━━━━━━━━━━━━━━━━━━━━━ Snapshot Summary ━━━━━━━━━━━━━━━━━━━━━━━━━━━━━━━
25.37 s
> Snapshot: finit_part_ghlo
25.37 s
> Source: crates/gammalooprs/tests/test_renormalization.rs:557
25.37 s
> ────────────────────────────────────────────────────────────────────────────────
25.37 s
> Expression: align_to_rqft(&a, &model).to_bare_ordered_string()
25.37 s
> ────────────────────────────────────────────────────────────────────────────────
25.37 s
> -old snapshot
25.37 s
> +new results
25.37 s
> ────────────┬───────────────────────────────────────────────────────────────────
25.37 s
> 1 │--1/2*cas(2,coad(8))*dot(P(0,mink(4)),P(0,mink(4)))*gs^2*ε^(-1)
25.37 s
> 1 │+1/2*cas(2,coad(8))*dot(P(0,mink(4)),P(0,mink(4)))*gs^2*ε^(-1)
25.37 s
> ────────────┴───────────────────────────────────────────────────────────────────
25.37 s
> To update snapshots run `cargo insta review`
25.37 s
> Stopped on the first failure. Run `cargo insta test` to run all snapshots.
25.37 s
> test finit_part_ghlo ... FAILED
25.37 s
>
25.37 s
> failures:
25.37 s
>
25.37 s
> failures:
25.37 s
> finit_part_ghlo
25.37 s
>
25.37 s
> test result: FAILED. 0 passed; 1 failed; 0 ignored; 0 measured; 5 filtered out; finished in 0.33s
25.37 s
>
25.37 s
> stderr ---
25.37 s
> The application panicked (crashed).
25.37 s
> Message: snapshot assertion for 'finit_part_ghlo' failed in line 557
25.37 s
> Location: /nix/store/5nq6hmff26w9jbhbmba4wsvgnvglj2xd-vendor-cargo-deps/c19b7c6f923b580ac259164a89f2577984ad5ab09ee9d583b888f934adbbe8d0/insta-1.47.2/src/runtime.rs :719
25.37 s
>
25.37 s
> ━━━━━━━━━━━━━━━━━━━━━━━━━━━━━━━━━━ BACKTRACE ━━━━━━━━━━━━━━━━━━━━━━━━━━━━━━━━━━━
25.37 s
> 1: <color_eyre[51793ea62743adbd]::config::PanicHook>::panic_report <unknown>
25.37 s
> at <unknown source file> :<unknown line>
25.37 s
> 2: <color_eyre[51793ea62743adbd]::config::PanicHook>::into_panic_hook::{closure#0} <unknown>
25.37 s
> at <unknown source file> :<unknown line>
25.37 s
> 3: std[bcb96dfbba0ab899]::panicking::panic_with_hook <unknown>
25.37 s
> at <unknown source file> :<unknown line>
25.37 s
> 4: std[bcb96dfbba0ab899]::panicking::panic_handler::{closure#0} <unknown>
25.37 s
> at <unknown source file> :<unknown line>
25.37 s
> 5: std[bcb96dfbba0ab899]::sys::backtrace::__rust_end_short_backtrace::<std[bcb96dfbba0ab899]::panicking::panic_handler::{closure#0}, !> <unknown>
25.37 s
> at <unknown source file> :<unknown line>
25.37 s
> 6: __rustc[6c289b9f9c454d21]::rust_begin_unwind <unknown>
25.37 s
> at <unknown source file> :<unknown line>
25.37 s
> 7: core[940e698046960fd5]::panicking::panic_fmt <unknown>
25.37 s
> at <unknown source file> :<unknown line>
25.37 s
> 8: insta[307a548ac79ef4d9]::runtime::assert_snapshot <unknown>
25.37 s
> at <unknown source file> :<unknown line>
25.37 s
> 9: <test_renormalization[a909d96d00a50d41]::finit_part_ghlo::{closure#0} as core[940e698046960fd5]::ops::function::FnOnce<()>>::call_once <unknown>
25.37 s
> at <unknown source file> :<unknown line>
25.37 s
> 10: test[75d6903177b1d7e9]::__rust_begin_short_backtrace::<core[940e698046960fd5]::result::Result<(), alloc[2ea6bcb46fca0c42]::string::String>, fn() -> core[940e698046960fd5]::result::Result<(), alloc[2ea6bcb46fca0c42]::string::String>> <unknown>
25.37 s
> at <unknown source file> :<unknown line>
25.37 s
> 11: test[75d6903177b1d7e9]::run_test::{closure#0} <unknown>
25.37 s
> at <unknown source file> :<unknown line>
25.37 s
> 12: std[bcb96dfbba0ab899]::sys::backtrace::__rust_begin_short_backtrace::<test[75d6903177b1d7e9]::run_test::{closure#1}, ()> <unknown>
25.37 s
> at <unknown source file> :<unknown line>
25.37 s
> 13: <std[bcb96dfbba0ab899]::thread::lifecycle::spawn_unchecked<test[75d6903177b1d7e9]::run_test::{closure#1}, ()>::{closure#1} as core[940e698046960fd5]::ops::function::FnOnce<()>>::call_once::{shim:vtable#0} <unknown>
25.37 s
> at <unknown source file> :<unknown line>
25.37 s
> 14: <std[bcb96dfbba0ab899]::sys::thread::unix::Thread>::new::thread_start <unknown>
25.37 s
> at <unknown source file> :<unknown line>
25.37 s
> 15: start_thread <unknown>
25.37 s
> at <unknown source file> :<unknown line>
25.37 s
> 16: __clone3 <unknown>
25.37 s
> at <unknown source file> :<unknown line>
25.37 s
>
25.37 s
> Run with COLORBT_SHOW_HIDDEN=1 environment variable to disable frame filtering.
25.37 s
> Run with RUST_BACKTRACE=full to include source snippets.
25.37 s
>
25.37 s
> FAIL [ 2.110s] (452/456) gammalooprs::test_renormalization finite_part_ghost_2loop
25.37 s
> stdout ---
25.37 s
>
25.37 s
> running 1 test
25.37 s
> ━━━━━━━━━━━━━━━━━━━━━━━━━━━━━━━ Snapshot Summary ━━━━━━━━━━━━━━━━━━━━━━━━━━━━━━━
25.37 s
> Snapshot: finite_part_ghost_2loop-3
25.37 s
> Source: crates/gammalooprs/tests/test_renormalization.rs:464
25.37 s
> ────────────────────────────────────────────────────────────────────────────────
25.37 s
> Expression: align_to_rqft(&a, &model).to_bare_ordered_string()
25.37 s
> ────────────────────────────────────────────────────────────────────────────────
25.37 s
> -old snapshot
25.37 s
> +new results
25.37 s
> ────────────┬───────────────────────────────────────────────────────────────────
25.37 s
> 1 │-(-1𝑖/32*ε+1𝑖/16)*(cas(2,coad(8)))^2*dot(P(0,mink(4)),P(0,mink(4)))*gs^4*ε^(-2)
25.37 s
> 1 │+(-1𝑖/16+1𝑖/32*ε)*(cas(2,coad(8)))^2*dot(P(0,mink(4)),P(0,mink(4)))*gs^4*ε^(-2)
25.37 s
> ────────────┴───────────────────────────────────────────────────────────────────
25.37 s
> To update snapshots run `cargo insta review`
25.38 s
> Stopped on the first failure. Run `cargo insta test` to run all snapshots.
25.38 s
> test finite_part_ghost_2loop ... FAILED
25.38 s
>
25.38 s
> failures:
25.38 s
>
25.38 s
> failures:
25.38 s
> finite_part_ghost_2loop
25.38 s
>
25.38 s
> test result: FAILED. 0 passed; 1 failed; 0 ignored; 0 measured; 5 filtered out; finished in 2.10s
25.38 s
>
25.38 s
> stderr ---
25.38 s
> The application panicked (crashed).
25.38 s
> Message: snapshot assertion for 'finite_part_ghost_2loop-3' failed in line 464
25.38 s
> Location: /nix/store/5nq6hmff26w9jbhbmba4wsvgnvglj2xd-vendor-cargo-deps/c19b7c6f923b580ac259164a89f2577984ad5ab09ee9d583b888f934adbbe8d0/insta-1.47.2/src/runtime.rs :719
25.38 s
>
25.38 s
> ━━━━━━━━━━━━━━━━━━━━━━━━━━━━━━━━━━ BACKTRACE ━━━━━━━━━━━━━━━━━━━━━━━━━━━━━━━━━━━
25.38 s
> 1: <color_eyre[51793ea62743adbd]::config::PanicHook>::panic_report <unknown>
25.38 s
> at <unknown source file> :<unknown line>
25.38 s
> 2: <color_eyre[51793ea62743adbd]::config::PanicHook>::into_panic_hook::{closure#0} <unknown>
25.38 s
> at <unknown source file> :<unknown line>
25.38 s
> 3: std[bcb96dfbba0ab899]::panicking::panic_with_hook <unknown>
25.38 s
> at <unknown source file> :<unknown line>
25.38 s
> 4: std[bcb96dfbba0ab899]::panicking::panic_handler::{closure#0} <unknown>
25.38 s
> at <unknown source file> :<unknown line>
25.38 s
> 5: std[bcb96dfbba0ab899]::sys::backtrace::__rust_end_short_backtrace::<std[bcb96dfbba0ab899]::panicking::panic_handler::{closure#0}, !> <unknown>
25.38 s
> at <unknown source file> :<unknown line>
25.38 s
> 6: __rustc[6c289b9f9c454d21]::rust_begin_unwind <unknown>
25.38 s
> at <unknown source file> :<unknown line>
25.38 s
> 7: core[940e698046960fd5]::panicking::panic_fmt <unknown>
25.38 s
> at <unknown source file> :<unknown line>
25.38 s
> 8: insta[307a548ac79ef4d9]::runtime::assert_snapshot <unknown>
25.38 s
> at <unknown source file> :<unknown line>
25.38 s
> 9: test_renormalization[a909d96d00a50d41]::finite_part_ghost_2loop <unknown>
25.38 s
> at <unknown source file> :<unknown line>
25.38 s
> 10: <test_renormalization[a909d96d00a50d41]::finite_part_ghost_2loop::{closure#0} as core[940e698046960fd5]::ops::function::FnOnce<()>>::call_once <unknown>
25.38 s
> at <unknown source file> :<unknown line>
25.38 s
> 11: test[75d6903177b1d7e9]::__rust_begin_short_backtrace::<core[940e698046960fd5]::result::Result<(), alloc[2ea6bcb46fca0c42]::string::String>, fn() -> core[940e698046960fd5]::result::Result<(), alloc[2ea6bcb46fca0c42]::string::String>> <unknown>
25.38 s
> at <unknown source file> :<unknown line>
25.38 s
> 12: test[75d6903177b1d7e9]::run_test::{closure#0} <unknown>
25.38 s
> at <unknown source file> :<unknown line>
25.38 s
> 13: std[bcb96dfbba0ab899]::sys::backtrace::__rust_begin_short_backtrace::<test[75d6903177b1d7e9]::run_test::{closure#1}, ()> <unknown>
25.38 s
> at <unknown source file> :<unknown line>
25.38 s
> 14: <std[bcb96dfbba0ab899]::thread::lifecycle::spawn_unchecked<test[75d6903177b1d7e9]::run_test::{closure#1}, ()>::{closure#1} as core[940e698046960fd5]::ops::function::FnOnce<()>>::call_once::{shim:vtable#0} <unknown>
25.38 s
> at <unknown source file> :<unknown line>
25.38 s
> 15: <std[bcb96dfbba0ab899]::sys::thread::unix::Thread>::new::thread_start <unknown>
25.38 s
> at <unknown source file> :<unknown line>
25.38 s
> 16: start_thread <unknown>
25.38 s
> at <unknown source file> :<unknown line>
25.38 s
> 17: __clone3 <unknown>
25.38 s
> at <unknown source file> :<unknown line>
25.38 s
>
25.38 s
> Run with COLORBT_SHOW_HIDDEN=1 environment variable to disable frame filtering.
25.38 s
> Run with RUST_BACKTRACE=full to include source snippets.
25.38 s
>
25.38 s
> ------------
25.38 s
> Summary [ 8.169s] 456 tests run: 454 passed , 2 failed , 61 skipped
25.38 s
> FAIL [ 0.336s] (446/456) gammalooprs::test_renormalization finit_part_ghlo
25.38 s
> stdout ---
25.38 s
>
25.38 s
> running 1 test
25.38 s
> ren part: 1/2*GC_10^2*dot(P(0,mink (dim)),P(0,mink (dim)))*cas(2,coad (8))/ε
25.38 s
> ━━━━━━━━━━━━━━━━━━━━━━━━━━━━━━━ Snapshot Summary ━━━━━━━━━━━━━━━━━━━━━━━━━━━━━━━
25.38 s
> Snapshot: finit_part_ghlo
25.38 s
> Source: crates/gammalooprs/tests/test_renormalization.rs:557
25.38 s
> ────────────────────────────────────────────────────────────────────────────────
25.38 s
> Expression: align_to_rqft(&a, &model).to_bare_ordered_string()
25.38 s
> ────────────────────────────────────────────────────────────────────────────────
25.38 s
> -old snapshot
25.38 s
> +new results
25.38 s
> ────────────┬───────────────────────────────────────────────────────────────────
25.38 s
> 1 │--1/2*cas(2,coad(8))*dot(P(0,mink(4)),P(0,mink(4)))*gs^2*ε^(-1)
25.38 s
> 1 │+1/2*cas(2,coad(8))*dot(P(0,mink(4)),P(0,mink(4)))*gs^2*ε^(-1)
25.38 s
> ────────────┴───────────────────────────────────────────────────────────────────
25.38 s
> To update snapshots run `cargo insta review`
25.38 s
> Stopped on the first failure. Run `cargo insta test` to run all snapshots.
25.38 s
> test finit_part_ghlo ... FAILED
25.38 s
>
25.38 s
> failures:
25.38 s
>
25.38 s
> failures:
25.38 s
> finit_part_ghlo
25.38 s
>
25.38 s
> test result: FAILED. 0 passed; 1 failed; 0 ignored; 0 measured; 5 filtered out; finished in 0.33s
25.38 s
>
25.38 s
> stderr ---
25.38 s
> The application panicked (crashed).
25.38 s
> Message: snapshot assertion for 'finit_part_ghlo' failed in line 557
25.38 s
> Location: /nix/store/5nq6hmff26w9jbhbmba4wsvgnvglj2xd-vendor-cargo-deps/c19b7c6f923b580ac259164a89f2577984ad5ab09ee9d583b888f934adbbe8d0/insta-1.47.2/src/runtime.rs :719
25.38 s
>
25.38 s
> ━━━━━━━━━━━━━━━━━━━━━━━━━━━━━━━━━━ BACKTRACE ━━━━━━━━━━━━━━━━━━━━━━━━━━━━━━━━━━━
25.38 s
> 1: <color_eyre[51793ea62743adbd]::config::PanicHook>::panic_report <unknown>
25.38 s
> at <unknown source file> :<unknown line>
25.38 s
> 2: <color_eyre[51793ea62743adbd]::config::PanicHook>::into_panic_hook::{closure#0} <unknown>
25.38 s
> at <unknown source file> :<unknown line>
25.38 s
> 3: std[bcb96dfbba0ab899]::panicking::panic_with_hook <unknown>
25.38 s
> at <unknown source file> :<unknown line>
25.38 s
> 4: std[bcb96dfbba0ab899]::panicking::panic_handler::{closure#0} <unknown>
25.38 s
> at <unknown source file> :<unknown line>
25.38 s
> 5: std[bcb96dfbba0ab899]::sys::backtrace::__rust_end_short_backtrace::<std[bcb96dfbba0ab899]::panicking::panic_handler::{closure#0}, !> <unknown>
25.38 s
> at <unknown source file> :<unknown line>
25.38 s
> 6: __rustc[6c289b9f9c454d21]::rust_begin_unwind <unknown>
25.38 s
> at <unknown source file> :<unknown line>
25.38 s
> 7: core[940e698046960fd5]::panicking::panic_fmt <unknown>
25.38 s
> at <unknown source file> :<unknown line>
25.38 s
> 8: insta[307a548ac79ef4d9]::runtime::assert_snapshot <unknown>
25.38 s
> at <unknown source file> :<unknown line>
25.38 s
> 9: <test_renormalization[a909d96d00a50d41]::finit_part_ghlo::{closure#0} as core[940e698046960fd5]::ops::function::FnOnce<()>>::call_once <unknown>
25.38 s
> at <unknown source file> :<unknown line>
25.38 s
> 10: test[75d6903177b1d7e9]::__rust_begin_short_backtrace::<core[940e698046960fd5]::result::Result<(), alloc[2ea6bcb46fca0c42]::string::String>, fn() -> core[940e698046960fd5]::result::Result<(), alloc[2ea6bcb46fca0c42]::string::String>> <unknown>
25.38 s
> at <unknown source file> :<unknown line>
25.38 s
> 11: test[75d6903177b1d7e9]::run_test::{closure#0} <unknown>
25.38 s
> at <unknown source file> :<unknown line>
25.38 s
> 12: std[bcb96dfbba0ab899]::sys::backtrace::__rust_begin_short_backtrace::<test[75d6903177b1d7e9]::run_test::{closure#1}, ()> <unknown>
25.38 s
> at <unknown source file> :<unknown line>
25.38 s
> 13: <std[bcb96dfbba0ab899]::thread::lifecycle::spawn_unchecked<test[75d6903177b1d7e9]::run_test::{closure#1}, ()>::{closure#1} as core[940e698046960fd5]::ops::function::FnOnce<()>>::call_once::{shim:vtable#0} <unknown>
25.38 s
> at <unknown source file> :<unknown line>
25.38 s
> 14: <std[bcb96dfbba0ab899]::sys::thread::unix::Thread>::new::thread_start <unknown>
25.38 s
> at <unknown source file> :<unknown line>
25.38 s
> 15: start_thread <unknown>
25.38 s
> at <unknown source file> :<unknown line>
25.38 s
> 16: __clone3 <unknown>
25.38 s
> at <unknown source file> :<unknown line>
25.38 s
>
25.38 s
> Run with COLORBT_SHOW_HIDDEN=1 environment variable to disable frame filtering.
25.38 s
> Run with RUST_BACKTRACE=full to include source snippets.
25.38 s
>
25.38 s
> FAIL [ 2.110s] (452/456) gammalooprs::test_renormalization finite_part_ghost_2loop
25.38 s
> stdout ---
25.38 s
>
25.38 s
> running 1 test
25.38 s
> ━━━━━━━━━━━━━━━━━━━━━━━━━━━━━━━ Snapshot Summary ━━━━━━━━━━━━━━━━━━━━━━━━━━━━━━━
25.38 s
> Snapshot: finite_part_ghost_2loop-3
25.38 s
> Source: crates/gammalooprs/tests/test_renormalization.rs:464
25.38 s
> ────────────────────────────────────────────────────────────────────────────────
25.38 s
> Expression: align_to_rqft(&a, &model).to_bare_ordered_string()
25.38 s
> ────────────────────────────────────────────────────────────────────────────────
25.38 s
> -old snapshot
25.38 s
> +new results
25.38 s
> ────────────┬───────────────────────────────────────────────────────────────────
25.38 s
> 1 │-(-1𝑖/32*ε+1𝑖/16)*(cas(2,coad(8)))^2*dot(P(0,mink(4)),P(0,mink(4)))*gs^4*ε^(-2)
25.38 s
> 1 │+(-1𝑖/16+1𝑖/32*ε)*(cas(2,coad(8)))^2*dot(P(0,mink(4)),P(0,mink(4)))*gs^4*ε^(-2)
25.38 s
> ────────────┴───────────────────────────────────────────────────────────────────
25.38 s
> To update snapshots run `cargo insta review`
25.38 s
> Stopped on the first failure. Run `cargo insta test` to run all snapshots.
25.38 s
> test finite_part_ghost_2loop ... FAILED
25.38 s
>
25.38 s
> failures:
25.38 s
>
25.38 s
> failures:
25.38 s
> finite_part_ghost_2loop
25.38 s
>
25.38 s
> test result: FAILED. 0 passed; 1 failed; 0 ignored; 0 measured; 5 filtered out; finished in 2.10s
25.38 s
>
25.38 s
> stderr ---
25.38 s
> The application panicked (crashed).
25.38 s
> Message: snapshot assertion for 'finite_part_ghost_2loop-3' failed in line 464
25.38 s
> Location: /nix/store/5nq6hmff26w9jbhbmba4wsvgnvglj2xd-vendor-cargo-deps/c19b7c6f923b580ac259164a89f2577984ad5ab09ee9d583b888f934adbbe8d0/insta-1.47.2/src/runtime.rs :719
25.38 s
>
25.38 s
> ━━━━━━━━━━━━━━━━━━━━━━━━━━━━━━━━━━ BACKTRACE ━━━━━━━━━━━━━━━━━━━━━━━━━━━━━━━━━━━
25.38 s
> 1: <color_eyre[51793ea62743adbd]::config::PanicHook>::panic_report <unknown>
25.38 s
> at <unknown source file> :<unknown line>
25.38 s
> 2: <color_eyre[51793ea62743adbd]::config::PanicHook>::into_panic_hook::{closure#0} <unknown>
25.38 s
> at <unknown source file> :<unknown line>
25.38 s
> 3: std[bcb96dfbba0ab899]::panicking::panic_with_hook <unknown>
25.38 s
> at <unknown source file> :<unknown line>
25.38 s
> 4: std[bcb96dfbba0ab899]::panicking::panic_handler::{closure#0} <unknown>
25.38 s
> at <unknown source file> :<unknown line>
25.38 s
> 5: std[bcb96dfbba0ab899]::sys::backtrace::__rust_end_short_backtrace::<std[bcb96dfbba0ab899]::panicking::panic_handler::{closure#0}, !> <unknown>
25.38 s
> at <unknown source file> :<unknown line>
25.38 s
> 6: __rustc[6c289b9f9c454d21]::rust_begin_unwind <unknown>
25.38 s
> at <unknown source file> :<unknown line>
25.38 s
> 7: core[940e698046960fd5]::panicking::panic_fmt <unknown>
25.38 s
> at <unknown source file> :<unknown line>
25.38 s
> 8: insta[307a548ac79ef4d9]::runtime::assert_snapshot <unknown>
25.38 s
> at <unknown source file> :<unknown line>
25.38 s
> 9: test_renormalization[a909d96d00a50d41]::finite_part_ghost_2loop <unknown>
25.38 s
> at <unknown source file> :<unknown line>
25.38 s
> 10: <test_renormalization[a909d96d00a50d41]::finite_part_ghost_2loop::{closure#0} as core[940e698046960fd5]::ops::function::FnOnce<()>>::call_once <unknown>
25.38 s
> at <unknown source file> :<unknown line>
25.38 s
> 11: test[75d6903177b1d7e9]::__rust_begin_short_backtrace::<core[940e698046960fd5]::result::Result<(), alloc[2ea6bcb46fca0c42]::string::String>, fn() -> core[940e698046960fd5]::result::Result<(), alloc[2ea6bcb46fca0c42]::string::String>> <unknown>
25.38 s
> at <unknown source file> :<unknown line>
25.38 s
> 12: test[75d6903177b1d7e9]::run_test::{closure#0} <unknown>
25.38 s
> at <unknown source file> :<unknown line>
25.38 s
> 13: std[bcb96dfbba0ab899]::sys::backtrace::__rust_begin_short_backtrace::<test[75d6903177b1d7e9]::run_test::{closure#1}, ()> <unknown>
25.38 s
> at <unknown source file> :<unknown line>
25.38 s
> 14: <std[bcb96dfbba0ab899]::thread::lifecycle::spawn_unchecked<test[75d6903177b1d7e9]::run_test::{closure#1}, ()>::{closure#1} as core[940e698046960fd5]::ops::function::FnOnce<()>>::call_once::{shim:vtable#0} <unknown>
25.38 s
> at <unknown source file> :<unknown line>
25.38 s
> 15: <std[bcb96dfbba0ab899]::sys::thread::unix::Thread>::new::thread_start <unknown>
25.38 s
> at <unknown source file> :<unknown line>
25.38 s
> 16: start_thread <unknown>
25.38 s
> at <unknown source file> :<unknown line>
25.38 s
> 17: __clone3 <unknown>
25.38 s
> at <unknown source file> :<unknown line>
25.38 s
>
25.38 s
> Run with COLORBT_SHOW_HIDDEN=1 environment variable to disable frame filtering.
25.38 s
> Run with RUST_BACKTRACE=full to include source snippets.
25.38 s
>
25.38 s
> error : test run failed
25.38 s
>
25.38 s
> ========== nextest test summary ==========
25.38 s
> report: target/nextest/ci_gammaloop/junit.xml
25.38 s
> tests: 456, failures: 2, errors: 0
25.38 s
>
25.38 s
> 1. gammalooprs::test_renormalization::finit_part_ghlo
25.38 s
> failure: test failure with exit code 101
25.38 s
> system-out
25.38 s
> running 1 test
25.38 s
> ren part: 1/2*GC_10^2*dot(P(0,mink(dim)),P(0,mink(dim)))*cas(2,coad(8))/ε
25.38 s
> ━━━━━━━━━━━━━━━━━━━━━━━━━━━━━━━ Snapshot Summary ━━━━━━━━━━━━━━━━━━━━━━━━━━━━━━━
25.38 s
> Snapshot: finit_part_ghlo
25.38 s
> Source: crates/gammalooprs/tests/test_renormalization.rs:557
25.38 s
> ────────────────────────────────────────────────────────────────────────────────
25.38 s
> Expression: align_to_rqft(&a, &model).to_bare_ordered_string()
25.38 s
> ────────────────────────────────────────────────────────────────────────────────
25.38 s
> -old snapshot
25.38 s
> +new results
25.38 s
> ────────────┬───────────────────────────────────────────────────────────────────
25.38 s
> 1 │--1/2*cas(2,coad(8))*dot(P(0,mink(4)),P(0,mink(4)))*gs^2*ε^(-1)
25.38 s
> 1 │+1/2*cas(2,coad(8))*dot(P(0,mink(4)),P(0,mink(4)))*gs^2*ε^(-1)
25.38 s
> ────────────┴───────────────────────────────────────────────────────────────────
25.38 s
> To update snapshots run `cargo insta review`
25.38 s
> Stopped on the first failure. Run `cargo insta test` to run all snapshots.
25.38 s
> test finit_part_ghlo ... FAILED
25.38 s
>
25.38 s
> failures:
25.38 s
>
25.38 s
> failures:
25.38 s
> finit_part_ghlo
25.38 s
>
25.38 s
> test result: FAILED. 0 passed; 1 failed; 0 ignored; 0 measured; 5 filtered out; finished in 0.33s
25.38 s
> system-err
25.38 s
> The application panicked (crashed).
25.38 s
> Message: snapshot assertion for 'finit_part_ghlo' failed in line 557
25.38 s
> Location: /nix/store/5nq6hmff26w9jbhbmba4wsvgnvglj2xd-vendor-cargo-deps/c19b7c6f923b580ac259164a89f2577984ad5ab09ee9d583b888f934adbbe8d0/insta-1.47.2/src/runtime.rs:719
25.38 s
>
25.38 s
> ━━━━━━━━━━━━━━━━━━━━━━━━━━━━━━━━━━ BACKTRACE ━━━━━━━━━━━━━━━━━━━━━━━━━━━━━━━━━━━
25.38 s
> 1: <color_eyre[51793ea62743adbd]::config::PanicHook>::panic_report<unknown>
25.38 s
> at <unknown source file>:<unknown line>
25.38 s
> 2: <color_eyre[51793ea62743adbd]::config::PanicHook>::into_panic_hook::{closure#0}<unknown>
25.38 s
> at <unknown source file>:<unknown line>
25.38 s
> 3: std[bcb96dfbba0ab899]::panicking::panic_with_hook<unknown>
25.38 s
> at <unknown source file>:<unknown line>
25.38 s
> 4: std[bcb96dfbba0ab899]::panicking::panic_handler::{closure#0}<unknown>
25.38 s
> at <unknown source file>:<unknown line>
25.38 s
> 5: std[bcb96dfbba0ab899]::sys::backtrace::__rust_end_short_backtrace::<std[bcb96dfbba0ab899]::panicking::panic_handler::{closure#0}, !><unknown>
25.38 s
> at <unknown source file>:<unknown line>
25.38 s
> 6: __rustc[6c289b9f9c454d21]::rust_begin_unwind<unknown>
25.38 s
> at <unknown source file>:<unknown line>
25.38 s
> 7: core[940e698046960fd5]::panicking::panic_fmt<unknown>
25.38 s
> at <unknown source file>:<unknown line>
25.38 s
> 8: insta[307a548ac79ef4d9]::runtime::assert_snapshot<unknown>
25.38 s
> at <unknown source file>:<unknown line>
25.38 s
> 9: <test_renormalization[a909d96d00a50d41]::finit_part_ghlo::{closure#0} as core[940e698046960fd5]::ops::function::FnOnce<()>>::call_once<unknown>
25.38 s
> at <unknown source file>:<unknown line>
25.38 s
> 10: test[75d6903177b1d7e9]::__rust_begin_short_backtrace::<core[940e698046960fd5]::result::Result<(), alloc[2ea6bcb46fca0c42]::string::String>, fn() -> core[940e698046960fd5]::result::Result<(), alloc[2ea6bcb46fca0c42]::string::String>><unknown>
25.38 s
> at <unknown source file>:<unknown line>
25.38 s
> 11: test[75d6903177b1d7e9]::run_test::{closure#0}<unknown>
25.38 s
> at <unknown source file>:<unknown line>
25.38 s
> 12: std[bcb96dfbba0ab899]::sys::backtrace::__rust_begin_short_backtrace::<test[75d6903177b1d7e9]::run_test::{closure#1}, ()><unknown>
25.38 s
> at <unknown source file>:<unknown line>
25.38 s
> 13: <std[bcb96dfbba0ab899]::thread::lifecycle::spawn_unchecked<test[75d6903177b1d7e9]::run_test::{closure#1}, ()>::{closure#1} as core[940e698046960fd5]::ops::function::FnOnce<()>>::call_once::{shim:vtable#0}<unknown>
25.38 s
> at <unknown source file>:<unknown line>
25.38 s
> 14: <std[bcb96dfbba0ab899]::sys::thread::unix::Thread>::new::thread_start<unknown>
25.38 s
> at <unknown source file>:<unknown line>
25.38 s
> 15: start_thread<unknown>
25.38 s
> at <unknown source file>:<unknown line>
25.38 s
> 16: __clone3<unknown>
25.38 s
> at <unknown source file>:<unknown line>
25.38 s
>
25.38 s
> Run with COLORBT_SHOW_HIDDEN=1 environment variable to disable frame filtering.
25.38 s
> Run with RUST_BACKTRACE=full to include source snippets.
25.38 s
>
25.38 s
> 2. gammalooprs::test_renormalization::finite_part_ghost_2loop
25.38 s
> failure: test failure with exit code 101
25.38 s
> system-out
25.38 s
> running 1 test
25.38 s
> ━━━━━━━━━━━━━━━━━━━━━━━━━━━━━━━ Snapshot Summary ━━━━━━━━━━━━━━━━━━━━━━━━━━━━━━━
25.38 s
> Snapshot: finite_part_ghost_2loop-3
25.38 s
> Source: crates/gammalooprs/tests/test_renormalization.rs:464
25.38 s
> ────────────────────────────────────────────────────────────────────────────────
25.38 s
> Expression: align_to_rqft(&a, &model).to_bare_ordered_string()
25.38 s
> ────────────────────────────────────────────────────────────────────────────────
25.38 s
> -old snapshot
25.38 s
> +new results
25.38 s
> ────────────┬───────────────────────────────────────────────────────────────────
25.38 s
> 1 │-(-1𝑖/32*ε+1𝑖/16)*(cas(2,coad(8)))^2*dot(P(0,mink(4)),P(0,mink(4)))*gs^4*ε^(-2)
25.38 s
> 1 │+(-1𝑖/16+1𝑖/32*ε)*(cas(2,coad(8)))^2*dot(P(0,mink(4)),P(0,mink(4)))*gs^4*ε^(-2)
25.38 s
> ────────────┴───────────────────────────────────────────────────────────────────
25.38 s
> To update snapshots run `cargo insta review`
25.38 s
> Stopped on the first failure. Run `cargo insta test` to run all snapshots.
25.38 s
> test finite_part_ghost_2loop ... FAILED
25.38 s
>
25.38 s
> failures:
25.38 s
>
25.38 s
> failures:
25.38 s
> finite_part_ghost_2loop
25.38 s
>
25.38 s
> test result: FAILED. 0 passed; 1 failed; 0 ignored; 0 measured; 5 filtered out; finished in 2.10s
25.38 s
> system-err
25.38 s
> The application panicked (crashed).
25.38 s
> Message: snapshot assertion for 'finite_part_ghost_2loop-3' failed in line 464
25.38 s
> Location: /nix/store/5nq6hmff26w9jbhbmba4wsvgnvglj2xd-vendor-cargo-deps/c19b7c6f923b580ac259164a89f2577984ad5ab09ee9d583b888f934adbbe8d0/insta-1.47.2/src/runtime.rs:719
25.38 s
>
25.38 s
> ━━━━━━━━━━━━━━━━━━━━━━━━━━━━━━━━━━ BACKTRACE ━━━━━━━━━━━━━━━━━━━━━━━━━━━━━━━━━━━
25.38 s
> 1: <color_eyre[51793ea62743adbd]::config::PanicHook>::panic_report<unknown>
25.38 s
> at <unknown source file>:<unknown line>
25.38 s
> 2: <color_eyre[51793ea62743adbd]::config::PanicHook>::into_panic_hook::{closure#0}<unknown>
25.38 s
> at <unknown source file>:<unknown line>
25.38 s
> 3: std[bcb96dfbba0ab899]::panicking::panic_with_hook<unknown>
25.38 s
> at <unknown source file>:<unknown line>
25.38 s
> 4: std[bcb96dfbba0ab899]::panicking::panic_handler::{closure#0}<unknown>
25.38 s
> at <unknown source file>:<unknown line>
25.38 s
> 5: std[bcb96dfbba0ab899]::sys::backtrace::__rust_end_short_backtrace::<std[bcb96dfbba0ab899]::panicking::panic_handler::{closure#0}, !><unknown>
25.38 s
> at <unknown source file>:<unknown line>
25.38 s
> 6: __rustc[6c289b9f9c454d21]::rust_begin_unwind<unknown>
25.38 s
> at <unknown source file>:<unknown line>
25.38 s
> 7: core[940e698046960fd5]::panicking::panic_fmt<unknown>
25.38 s
> at <unknown source file>:<unknown line>
25.38 s
> 8: insta[307a548ac79ef4d9]::runtime::assert_snapshot<unknown>
25.38 s
> at <unknown source file>:<unknown line>
25.38 s
> 9: test_renormalization[a909d96d00a50d41]::finite_part_ghost_2loop<unknown>
25.38 s
> at <unknown source file>:<unknown line>
25.38 s
> 10: <test_renormalization[a909d96d00a50d41]::finite_part_ghost_2loop::{closure#0} as core[940e698046960fd5]::ops::function::FnOnce<()>>::call_once<unknown>
25.38 s
> at <unknown source file>:<unknown line>
25.38 s
> 11: test[75d6903177b1d7e9]::__rust_begin_short_backtrace::<core[940e698046960fd5]::result::Result<(), alloc[2ea6bcb46fca0c42]::string::String>, fn() -> core[940e698046960fd5]::result::Result<(), alloc[2ea6bcb46fca0c42]::string::String>><unknown>
25.38 s
> at <unknown source file>:<unknown line>
25.38 s
> 12: test[75d6903177b1d7e9]::run_test::{closure#0}<unknown>
25.38 s
> at <unknown source file>:<unknown line>
25.38 s
> 13: std[bcb96dfbba0ab899]::sys::backtrace::__rust_begin_short_backtrace::<test[75d6903177b1d7e9]::run_test::{closure#1}, ()><unknown>
25.38 s
> at <unknown source file>:<unknown line>
25.38 s
> 14: <std[bcb96dfbba0ab899]::thread::lifecycle::spawn_unchecked<test[75d6903177b1d7e9]::run_test::{closure#1}, ()>::{closure#1} as core[940e698046960fd5]::ops::function::FnOnce<()>>::call_once::{shim:vtable#0}<unknown>
25.38 s
> at <unknown source file>:<unknown line>
25.38 s
> 15: <std[bcb96dfbba0ab899]::sys::thread::unix::Thread>::new::thread_start<unknown>
25.38 s
> at <unknown source file>:<unknown line>
25.38 s
> 16: start_thread<unknown>
25.38 s
> at <unknown source file>:<unknown line>
25.38 s
> 17: __clone3<unknown>
25.38 s
> at <unknown source file>:<unknown line>
25.38 s
>
25.38 s
> Run with COLORBT_SHOW_HIDDEN=1 environment variable to disable frame filtering.
25.38 s
> Run with RUST_BACKTRACE=full to include source snippets.
25.38 s
> =========================================
25.38 s
For full logs, run:
25.38 s
nix log /nix/store/bdjz1sm6jpf4ngrik4ql09axygsysbqj-gammaloop-nextest-core.drv
25.46 s
[0 built (1 failed ), 1 cRun failed.