1. 0.93 s $ /nix/store/9ypz3flqsrl5xl495mm8h645gadjsxi1-coreutils-9.11/bin/timeout --kill-after=15s 7200s /nix/store/23zk8sgzamrbmj1fday15szf7f2279s8-nix-2.34.7/bin/nix --extra-experimental-features nix-command --extra-experimental-features flakes flake clone git+https://github.com/alphal00p/gammaloop --dest /tmp/nix-ci-worker/stable-pwd/repo/
  2. 0.93 s Cloning into '/tmp/nix-ci-worker/stable-pwd/repo'...
  3. 1.33 s remote: Enumerating objects: 65014, done.
  4. 1.45 s remote: Counting objects: 0% (1/7665) remote: Counting objects: 1% (77/7665) remote: Counting objects: 2% (154/7665) remote: Counting objects: 3% (230/7665) remote: Counting objects: 4% (307/7665) remote: Counting objects: 5% (384/7665) remote: Counting objects: 6% (460/7665) remote: Counting objects: 7% (537/7665) remote: Counting objects: 8% (614/7665) remote: Counting objects: 9% (690/7665) remote: Counting objects: 10% (767/7665) remote: Counting objects: 11% (844/7665) remote: Counting objects: 12% (920/7665) remote: Counting objects: 13% (997/7665) remote: Counting objects: 14% (1074/7665) remote: Counting objects: 15% (1150/7665) remote: Counting objects: 16% (1227/7665) remote: Counting objects: 17% (1304/7665) remote: Counting objects: 18% (1380/7665) remote: Counting objects: 19% (1457/7665) remote: Counting objects: 20% (1533/7665) remote: Counting objects: 21% (1610/7665) remote: Counting objects: 22% (1687/7665) remote: Counting objects: 23% (1763/7665) remote: Counting objects: 24% (1840/7665) remote: Counting objects: 25% (1917/7665) remote: Counting objects: 26% (1993/7665) remote: Counting objects: 27% (2070/7665) remote: Counting objects: 28% (2147/7665) remote: Counting objects: 29% (2223/7665) remote: Counting objects: 30% (2300/7665) remote: Counting objects: 31% (2377/7665) remote: Counting objects: 32% (2453/7665) remote: Counting objects: 33% (2530/7665) remote: Counting objects: 34% (2607/7665) remote: Counting objects: 35% (2683/7665) remote: Counting objects: 36% (2760/7665) remote: Counting objects: 37% (2837/7665) remote: Counting objects: 38% (2913/7665) remote: Counting objects: 39% (2990/7665) remote: Counting objects: 40% (3066/7665) remote: Counting objects: 41% (3143/7665) remote: Counting objects: 42% (3220/7665) remote: Counting objects: 43% (3296/7665) remote: Counting objects: 44% (3373/7665) remote: Counting objects: 45% (3450/7665) remote: Counting objects: 46% (3526/7665) remote: Counting objects: 47% (3603/7665) remote: Counting objects: 48% (3680/7665) remote: Counting objects: 49% (3756/7665) remote: Counting objects: 50% (3833/7665) remote: Counting objects: 51% (3910/7665) remote: Counting objects: 52% (3986/7665) remote: Counting objects: 53% (4063/7665) remote: Counting objects: 54% (4140/7665) remote: Counting objects: 55% (4216/7665) remote: Counting objects: 56% (4293/7665) remote: Counting objects: 57% (4370/7665) remote: Counting objects: 58% (4446/7665) remote: Counting objects: 59% (4523/7665) remote: Counting objects: 60% (4599/7665) remote: Counting objects: 61% (4676/7665) remote: Counting objects: 62% (4753/7665) remote: Counting objects: 63% (4829/7665) remote: Counting objects: 64% (4906/7665) remote: Counting objects: 65% (4983/7665) remote: Counting objects: 66% (5059/7665) remote: Counting objects: 67% (5136/7665) remote: Counting objects: 68% (5213/7665) remote: Counting objects: 69% (5289/7665) remote: Counting objects: 70% (5366/7665) remote: Counting objects: 71% (5443/7665) remote: Counting objects: 72% (5519/7665) remote: Counting objects: 73% (5596/7665) remote: Counting objects: 74% (5673/7665) remote: Counting objects: 75% (5749/7665) remote: Counting objects: 76% (5826/7665) remote: Counting objects: 77% (5903/7665) remote: Counting objects: 78% (5979/7665) remote: Counting objects: 79% (6056/7665) remote: Counting objects: 80% (6132/7665) remote: Counting objects: 81% (6209/7665) remote: Counting objects: 82% (6286/7665) remote: Counting objects: 83% (6362/7665) remote: Counting objects: 84% (6439/7665) remote: Counting objects: 85% (6516/7665) remote: Counting objects: 86% (6592/7665) remote: Counting objects: 87% (6669/7665) remote: Counting objects: 88% (6746/7665) remote: Counting objects: 89% (6822/7665) remote: Counting objects: 90% (6899/7665) remote: Counting objects: 91% (6976/7665) remote: Counting objects: 92% (7052/7665) remote: Counting objects: 93% (7129/7665) remote: Counting objects: 94% (7206/7665) remote: Counting objects: 95% (7282/7665) remote: Counting objects: 96% (7359/7665) remote: Counting objects: 97% (7436/7665) remote: Counting objects: 98% (7512/7665) remote: Counting objects: 99% (7589/7665) remote: Counting objects: 100% (7665/7665) remote: Counting objects: 100% (7665/7665), done.
  5. 2.83 s remote: Compressing objects: 0% (1/1400) remote: Compressing objects: 1% (14/1400) remote: Compressing objects: 2% (28/1400) remote: Compressing objects: 3% (42/1400) remote: Compressing objects: 4% (56/1400) remote: Compressing objects: 5% (70/1400) remote: Compressing objects: 6% (84/1400) remote: Compressing objects: 7% (98/1400) remote: Compressing objects: 8% (112/1400) remote: Compressing objects: 9% (126/1400) remote: Compressing objects: 10% (140/1400) remote: Compressing objects: 11% (154/1400) remote: Compressing objects: 12% (168/1400) remote: Compressing objects: 13% (182/1400) remote: Compressing objects: 13% (183/1400) remote: Compressing objects: 14% (196/1400) remote: Compressing objects: 15% (210/1400) remote: Compressing objects: 16% (224/1400) remote: Compressing objects: 17% (238/1400) remote: Compressing objects: 18% (252/1400) remote: Compressing objects: 19% (266/1400) remote: Compressing objects: 20% (280/1400) remote: Compressing objects: 21% (294/1400) remote: Compressing objects: 22% (308/1400) remote: Compressing objects: 23% (322/1400) remote: Compressing objects: 24% (336/1400) remote: Compressing objects: 25% (350/1400) remote: Compressing objects: 26% (364/1400) remote: Compressing objects: 27% (378/1400) remote: Compressing objects: 28% (392/1400) remote: Compressing objects: 29% (406/1400) remote: Compressing objects: 30% (420/1400) remote: Compressing objects: 31% (434/1400) remote: Compressing objects: 32% (448/1400) remote: Compressing objects: 33% (462/1400) remote: Compressing objects: 34% (476/1400) remote: Compressing objects: 35% (490/1400) remote: Compressing objects: 36% (504/1400) remote: Compressing objects: 37% (518/1400) remote: Compressing objects: 38% (532/1400) remote: Compressing objects: 39% (546/1400) remote: Compressing objects: 40% (560/1400) remote: Compressing objects: 41% (574/1400) remote: Compressing objects: 42% (588/1400) remote: Compressing objects: 43% (602/1400) remote: Compressing objects: 44% (616/1400) remote: Compressing objects: 45% (630/1400) remote: Compressing objects: 46% (644/1400) remote: Compressing objects: 47% (658/1400) remote: Compressing objects: 48% (672/1400) remote: Compressing objects: 49% (686/1400) remote: Compressing objects: 50% (700/1400) remote: Compressing objects: 51% (714/1400) remote: Compressing objects: 52% (728/1400) remote: Compressing objects: 53% (742/1400) remote: Compressing objects: 54% (756/1400) remote: Compressing objects: 55% (770/1400) remote: Compressing objects: 56% (784/1400) remote: Compressing objects: 57% (798/1400) remote: Compressing objects: 58% (812/1400) remote: Compressing objects: 59% (826/1400) remote: Compressing objects: 60% (840/1400) remote: Compressing objects: 61% (854/1400) remote: Compressing objects: 62% (868/1400) remote: Compressing objects: 63% (882/1400) remote: Compressing objects: 64% (896/1400) remote: Compressing objects: 65% (910/1400) remote: Compressing objects: 66% (924/1400) remote: Compressing objects: 67% (938/1400) remote: Compressing objects: 68% (952/1400) remote: Compressing objects: 69% (966/1400) remote: Compressing objects: 70% (980/1400) remote: Compressing objects: 71% (994/1400) remote: Compressing objects: 72% (1008/1400) remote: Compressing objects: 73% (1022/1400) remote: Compressing objects: 74% (1036/1400) remote: Compressing objects: 75% (1050/1400) remote: Compressing objects: 76% (1064/1400) remote: Compressing objects: 77% (1078/1400) remote: Compressing objects: 78% (1092/1400) remote: Compressing objects: 79% (1106/1400) remote: Compressing objects: 80% (1120/1400) remote: Compressing objects: 81% (1134/1400) remote: Compressing objects: 82% (1148/1400) remote: Compressing objects: 83% (1162/1400) remote: Compressing objects: 84% (1176/1400) remote: Compressing objects: 85% (1190/1400) remote: Compressing objects: 86% (1204/1400) remote: Compressing objects: 87% (1218/1400) remote: Compressing objects: 88% (1232/1400) remote: Compressing objects: 89% (1246/1400) remote: Compressing objects: 90% (1260/1400) remote: Compressing objects: 91% (1274/1400) remote: Compressing objects: 92% (1288/1400) remote: Compressing objects: 93% (1302/1400) remote: Compressing objects: 94% (1316/1400) remote: Compressing objects: 95% (1330/1400) remote: Compressing objects: 96% (1344/1400) remote: Compressing objects: 97% (1358/1400) remote: Compressing objects: 98% (1372/1400) remote: Compressing objects: 99% (1386/1400) remote: Compressing objects: 100% (1400/1400) remote: Compressing objects: 100% (1400/1400), done.
  6. 5.44 s Receiving objects: 0% (1/65014) Receiving objects: 1% (651/65014) Receiving objects: 2% (1301/65014) Receiving objects: 3% (1951/65014) Receiving objects: 4% (2601/65014) Receiving objects: 5% (3251/65014) Receiving objects: 6% (3901/65014) Receiving objects: 7% (4551/65014) Receiving objects: 8% (5202/65014) Receiving objects: 9% (5852/65014) Receiving objects: 10% (6502/65014) Receiving objects: 11% (7152/65014) Receiving objects: 12% (7802/65014), 15.32 MiB | 30.63 MiB/s Receiving objects: 13% (8452/65014), 15.32 MiB | 30.63 MiB/s Receiving objects: 14% (9102/65014), 15.32 MiB | 30.63 MiB/s Receiving objects: 15% (9753/65014), 15.32 MiB | 30.63 MiB/s Receiving objects: 16% (10403/65014), 15.32 MiB | 30.63 MiB/s Receiving objects: 17% (11053/65014), 15.32 MiB | 30.63 MiB/s Receiving objects: 18% (11703/65014), 15.32 MiB | 30.63 MiB/s Receiving objects: 19% (12353/65014), 15.32 MiB | 30.63 MiB/s Receiving objects: 20% (13003/65014), 15.32 MiB | 30.63 MiB/s Receiving objects: 21% (13653/65014), 15.32 MiB | 30.63 MiB/s Receiving objects: 22% (14304/65014), 15.32 MiB | 30.63 MiB/s Receiving objects: 23% (14954/65014), 15.32 MiB | 30.63 MiB/s Receiving objects: 24% (15604/65014), 15.32 MiB | 30.63 MiB/s Receiving objects: 25% (16254/65014), 15.32 MiB | 30.63 MiB/s Receiving objects: 26% (16904/65014), 15.32 MiB | 30.63 MiB/s Receiving objects: 27% (17554/65014), 15.32 MiB | 30.63 MiB/s Receiving objects: 28% (18204/65014), 15.32 MiB | 30.63 MiB/s Receiving objects: 29% (18855/65014), 15.32 MiB | 30.63 MiB/s Receiving objects: 30% (19505/65014), 15.32 MiB | 30.63 MiB/s Receiving objects: 31% (20155/65014), 15.32 MiB | 30.63 MiB/s Receiving objects: 32% (20805/65014), 15.32 MiB | 30.63 MiB/s Receiving objects: 33% (21455/65014), 15.32 MiB | 30.63 MiB/s Receiving objects: 34% (22105/65014), 15.32 MiB | 30.63 MiB/s Receiving objects: 35% (22755/65014), 15.32 MiB | 30.63 MiB/s Receiving objects: 36% (23406/65014), 15.32 MiB | 30.63 MiB/s Receiving objects: 37% (24056/65014), 15.32 MiB | 30.63 MiB/s Receiving objects: 38% (24706/65014), 15.32 MiB | 30.63 MiB/s Receiving objects: 39% (25356/65014), 15.32 MiB | 30.63 MiB/s Receiving objects: 40% (26006/65014), 15.32 MiB | 30.63 MiB/s Receiving objects: 41% (26656/65014), 15.32 MiB | 30.63 MiB/s Receiving objects: 42% (27306/65014), 15.32 MiB | 30.63 MiB/s Receiving objects: 43% (27957/65014), 15.32 MiB | 30.63 MiB/s Receiving objects: 44% (28607/65014), 15.32 MiB | 30.63 MiB/s Receiving objects: 45% (29257/65014), 15.32 MiB | 30.63 MiB/s Receiving objects: 46% (29907/65014), 15.32 MiB | 30.63 MiB/s Receiving objects: 47% (30557/65014), 15.32 MiB | 30.63 MiB/s Receiving objects: 48% (31207/65014), 15.32 MiB | 30.63 MiB/s Receiving objects: 49% (31857/65014), 15.32 MiB | 30.63 MiB/s Receiving objects: 50% (32507/65014), 15.32 MiB | 30.63 MiB/s Receiving objects: 51% (33158/65014), 15.32 MiB | 30.63 MiB/s Receiving objects: 52% (33808/65014), 15.32 MiB | 30.63 MiB/s Receiving objects: 53% (34458/65014), 15.32 MiB | 30.63 MiB/s Receiving objects: 53% (34925/65014), 34.04 MiB | 33.25 MiB/s Receiving objects: 54% (35108/65014), 34.04 MiB | 33.25 MiB/s Receiving objects: 55% (35758/65014), 34.04 MiB | 33.25 MiB/s Receiving objects: 56% (36408/65014), 34.04 MiB | 33.25 MiB/s Receiving objects: 57% (37058/65014), 34.04 MiB | 33.25 MiB/s Receiving objects: 58% (37709/65014), 34.04 MiB | 33.25 MiB/s Receiving objects: 59% (38359/65014), 34.04 MiB | 33.25 MiB/s Receiving objects: 60% (39009/65014), 34.04 MiB | 33.25 MiB/s Receiving objects: 61% (39659/65014), 34.04 MiB | 33.25 MiB/s Receiving objects: 62% (40309/65014), 34.04 MiB | 33.25 MiB/s Receiving objects: 63% (40959/65014), 34.04 MiB | 33.25 MiB/s Receiving objects: 64% (41609/65014), 34.04 MiB | 33.25 MiB/s Receiving objects: 65% (42260/65014), 50.14 MiB | 32.93 MiB/s Receiving objects: 66% (42910/65014), 50.14 MiB | 32.93 MiB/s Receiving objects: 67% (43560/65014), 50.14 MiB | 32.93 MiB/s Receiving objects: 68% (44210/65014), 50.14 MiB | 32.93 MiB/s Receiving objects: 69% (44860/65014), 50.14 MiB | 32.93 MiB/s Receiving objects: 70% (45510/65014), 50.14 MiB | 32.93 MiB/s Receiving objects: 71% (46160/65014), 50.14 MiB | 32.93 MiB/s Receiving objects: 72% (46811/65014), 50.14 MiB | 32.93 MiB/s Receiving objects: 73% (47461/65014), 50.14 MiB | 32.93 MiB/s Receiving objects: 74% (48111/65014), 50.14 MiB | 32.93 MiB/s Receiving objects: 75% (48761/65014), 50.14 MiB | 32.93 MiB/s Receiving objects: 75% (48917/65014), 50.14 MiB | 32.93 MiB/s Receiving objects: 76% (49411/65014), 67.50 MiB | 33.37 MiB/s Receiving objects: 77% (50061/65014), 67.50 MiB | 33.37 MiB/s Receiving objects: 78% (50711/65014), 67.50 MiB | 33.37 MiB/s Receiving objects: 79% (51362/65014), 67.50 MiB | 33.37 MiB/s Receiving objects: 80% (52012/65014), 67.50 MiB | 33.37 MiB/s Receiving objects: 81% (52662/65014), 67.50 MiB | 33.37 MiB/s Receiving objects: 82% (53312/65014), 67.50 MiB | 33.37 MiB/s Receiving objects: 83% (53962/65014), 67.50 MiB | 33.37 MiB/s Receiving objects: 84% (54612/65014), 67.50 MiB | 33.37 MiB/s Receiving objects: 85% (55262/65014), 67.50 MiB | 33.37 MiB/s Receiving objects: 86% (55913/65014), 67.50 MiB | 33.37 MiB/s Receiving objects: 87% (56563/65014), 67.50 MiB | 33.37 MiB/s Receiving objects: 88% (57213/65014), 67.50 MiB | 33.37 MiB/s Receiving objects: 89% (57863/65014), 67.50 MiB | 33.37 MiB/s Receiving objects: 90% (58513/65014), 67.50 MiB | 33.37 MiB/s Receiving objects: 91% (59163/65014), 67.50 MiB | 33.37 MiB/s Receiving objects: 92% (59813/65014), 67.50 MiB | 33.37 MiB/s Receiving objects: 93% (60464/65014), 67.50 MiB | 33.37 MiB/s Receiving objects: 94% (61114/65014), 83.87 MiB | 33.02 MiB/s Receiving objects: 95% (61764/65014), 83.87 MiB | 33.02 MiB/s Receiving objects: 96% (62414/65014), 83.87 MiB | 33.02 MiB/s Receiving objects: 97% (63064/65014), 83.87 MiB | 33.02 MiB/s Receiving objects: 98% (63714/65014), 83.87 MiB | 33.02 MiB/s Receiving objects: 99% (64364/65014), 83.87 MiB | 33.02 MiB/s remote: Total 65014 (delta 6781), reused 6265 (delta 6265), pack-reused 57349 (from 1)
  7. 5.44 s Receiving objects: 100% (65014/65014), 83.87 MiB | 33.02 MiB/s Receiving objects: 100% (65014/65014), 86.89 MiB | 33.30 MiB/s, done.
  8. 6.17 s Resolving deltas: 0% (0/45899) Resolving deltas: 1% (459/45899) Resolving deltas: 2% (918/45899) Resolving deltas: 3% (1377/45899) Resolving deltas: 4% (1836/45899) Resolving deltas: 5% (2295/45899) Resolving deltas: 6% (2754/45899) Resolving deltas: 7% (3213/45899) Resolving deltas: 8% (3673/45899) Resolving deltas: 9% (4131/45899) Resolving deltas: 10% (4590/45899) Resolving deltas: 11% (5049/45899) Resolving deltas: 12% (5508/45899) Resolving deltas: 13% (5969/45899) Resolving deltas: 14% (6426/45899) Resolving deltas: 15% (6885/45899) Resolving deltas: 16% (7344/45899) Resolving deltas: 17% (7803/45899) Resolving deltas: 18% (8262/45899) Resolving deltas: 19% (8721/45899) Resolving deltas: 20% (9180/45899) Resolving deltas: 21% (9639/45899) Resolving deltas: 22% (10098/45899) Resolving deltas: 23% (10557/45899) Resolving deltas: 24% (11016/45899) Resolving deltas: 25% (11475/45899) Resolving deltas: 26% (11934/45899) Resolving deltas: 27% (12393/45899) Resolving deltas: 28% (12852/45899) Resolving deltas: 29% (13311/45899) Resolving deltas: 30% (13770/45899) Resolving deltas: 31% (14229/45899) Resolving deltas: 32% (14688/45899) Resolving deltas: 33% (15147/45899) Resolving deltas: 34% (15606/45899) Resolving deltas: 35% (16065/45899) Resolving deltas: 36% (16524/45899) Resolving deltas: 37% (16984/45899) Resolving deltas: 38% (17442/45899) Resolving deltas: 39% (17901/45899) Resolving deltas: 40% (18360/45899) Resolving deltas: 41% (18819/45899) Resolving deltas: 42% (19278/45899) Resolving deltas: 43% (19737/45899) Resolving deltas: 44% (20196/45899) Resolving deltas: 45% (20655/45899) Resolving deltas: 46% (21115/45899) Resolving deltas: 47% (21575/45899) Resolving deltas: 48% (22032/45899) Resolving deltas: 49% (22491/45899) Resolving deltas: 50% (22950/45899) Resolving deltas: 51% (23409/45899) Resolving deltas: 52% (23868/45899) Resolving deltas: 53% (24327/45899) Resolving deltas: 54% (24787/45899) Resolving deltas: 55% (25245/45899) Resolving deltas: 56% (25704/45899) Resolving deltas: 57% (26163/45899) Resolving deltas: 58% (26622/45899) Resolving deltas: 59% (27081/45899) Resolving deltas: 60% (27540/45899) Resolving deltas: 61% (27999/45899) Resolving deltas: 62% (28458/45899) Resolving deltas: 63% (28917/45899) Resolving deltas: 64% (29377/45899) Resolving deltas: 65% (29835/45899) Resolving deltas: 66% (30294/45899) Resolving deltas: 67% (30753/45899) Resolving deltas: 68% (31212/45899) Resolving deltas: 69% (31671/45899) Resolving deltas: 70% (32130/45899) Resolving deltas: 71% (32589/45899) Resolving deltas: 72% (33048/45899) Resolving deltas: 73% (33507/45899) Resolving deltas: 74% (33966/45899) Resolving deltas: 75% (34425/45899) Resolving deltas: 76% (34884/45899) Resolving deltas: 77% (35343/45899) Resolving deltas: 78% (35802/45899) Resolving deltas: 79% (36261/45899) Resolving deltas: 80% (36720/45899) Resolving deltas: 81% (37179/45899) Resolving deltas: 82% (37638/45899) Resolving deltas: 83% (38097/45899) Resolving deltas: 84% (38556/45899) Resolving deltas: 85% (39015/45899) Resolving deltas: 86% (39475/45899) Resolving deltas: 87% (39933/45899) Resolving deltas: 88% (40392/45899) Resolving deltas: 89% (40851/45899) Resolving deltas: 90% (41311/45899) Resolving deltas: 91% (41769/45899) Resolving deltas: 92% (42228/45899) Resolving deltas: 93% (42689/45899) Resolving deltas: 94% (43146/45899) Resolving deltas: 95% (43605/45899) Resolving deltas: 96% (44064/45899) Resolving deltas: 97% (44523/45899) Resolving deltas: 98% (44983/45899) Resolving deltas: 99% (45444/45899) Resolving deltas: 100% (45899/45899) Resolving deltas: 100% (45899/45899), done.
  9. 6.49 s Fetching commit 185337f01e5e562fa8f23f8e846b12c2a0cd39cc for vakint_rustred ...
  10. 6.49 s $ /nix/store/bcnisk3ydfgv26v2gw3zlky24g00yww2-git-2.54.0/bin/git fetch origin 185337f01e5e562fa8f23f8e846b12c2a0cd39cc
  11. 6.90 s From https://github.com/alphal00p/gammaloop
  12. 6.90 s * branch 185337f01e5e562fa8f23f8e846b12c2a0cd39cc -> FETCH_HEAD
  13. 6.91 s $ /nix/store/9ypz3flqsrl5xl495mm8h645gadjsxi1-coreutils-9.11/bin/timeout --kill-after=15s 7200s /nix/store/bcnisk3ydfgv26v2gw3zlky24g00yww2-git-2.54.0/bin/git -c advice.detachedHead=false checkout 185337f01e5e562fa8f23f8e846b12c2a0cd39cc
  14. 7.07 s HEAD is now at 185337f0 Add RustRed tensor reduction mode boundary
  15. 7.07 s $ /nix/store/9ypz3flqsrl5xl495mm8h645gadjsxi1-coreutils-9.11/bin/timeout --kill-after=15s 7200s /nix/store/23zk8sgzamrbmj1fday15szf7f2279s8-nix-2.34.7/bin/nix --extra-experimental-features nix-command --extra-experimental-features flakes --log-format internal-json run .#packages.x86_64-linux.nix-ci-check-gammaloop-nextest-core --print-build-logs
  16. 10.87 s
  17. 15.55 s evaluating derivation 'g copying '/nix/store/9ycf evaluating derivation 'g copying '/nix/store/9ycf evaluating derivation 'g copying '/nix/store/9ycf evaluating derivation 'g copying '/nix/store/9ycf evaluating derivation 'g copying '/nix/store/9ycf evaluating derivation 'g copying '/nix/store/9ycf evaluating derivation 'g querying gammaloop-nexte querying info about miss querying gammaloop-nexte [0/1 built, 1 copied (4. [1/0/1 built, 1 copied (gammaloop-nextest-core> Extracting 3 binaries (including 1 non-test binary), 1 build script output directory, and 2 linked paths to /build/nextest-archive-wc3FDK
  18. 15.95 s gammaloop-nextest-core> Extracted 18 files to /build/nextest-archive-wc3FDK in 0.40s
  19. 15.96 s gammaloop-nextest-core> ------------
  20. 15.96 s gammaloop-nextest-core> Nextest run ID a9408c16-b3e9-4b68-97be-c706e24b68ee with nextest profile: ci_gammaloop
  21. 15.96 s gammaloop-nextest-core> Starting 339 tests across 2 binaries
  22. 16.38 s gammaloop-nextest-core> ------------
  23. 16.38 s gammaloop-nextest-core> Summary [ 0.422s] 339 tests run: 339 passed, 0 skipped
  24. 16.46 s gammaloop-nextest-core>
  25. 16.46 s gammaloop-nextest-core> ========== nextest test summary ==========
  26. 16.46 s gammaloop-nextest-core> report: target/nextest/ci_gammaloop/junit.xml
  27. 16.46 s gammaloop-nextest-core> tests: 339, failures: 0, errors: 0
  28. 16.46 s gammaloop-nextest-core> No failing testcases found.
  29. 16.46 s gammaloop-nextest-core> =========================================
  30. 16.48 s gammaloop-nextest-core> Extracting 1 binary and 1 linked path to /build/nextest-archive-MnLGXq
  31. 16.53 s gammaloop-nextest-core> Extracted 7 files to /build/nextest-archive-MnLGXq in 0.06s
  32. 16.54 s gammaloop-nextest-core> ------------
  33. 16.54 s gammaloop-nextest-core> Nextest run ID 18599266-b990-477b-b835-a548760d2e19 with nextest profile: ci_gammaloop
  34. 16.54 s gammaloop-nextest-core> Starting 19 tests across 1 binary
  35. 16.55 s gammaloop-nextest-core> ------------
  36. 16.55 s gammaloop-nextest-core> Summary [ 0.010s] 19 tests run: 19 passed, 0 skipped
  37. 16.58 s gammaloop-nextest-core>
  38. 16.58 s gammaloop-nextest-core> ========== nextest test summary ==========
  39. 16.58 s gammaloop-nextest-core> report: target/nextest/ci_gammaloop/junit.xml
  40. 16.58 s gammaloop-nextest-core> tests: 19, failures: 0, errors: 0
  41. 16.58 s gammaloop-nextest-core> No failing testcases found.
  42. 16.58 s gammaloop-nextest-core> =========================================
  43. 16.60 s gammaloop-nextest-core> Extracting 1 binary to /build/nextest-archive-pR0GjV
  44. 16.62 s gammaloop-nextest-core> Extracted 4 files to /build/nextest-archive-pR0GjV in 0.03s
  45. 16.63 s gammaloop-nextest-core> ------------
  46. 16.63 s gammaloop-nextest-core> Nextest run ID e4759f32-171b-48b6-bec3-97e9128df0e3 with nextest profile: ci_gammaloop
  47. 16.63 s gammaloop-nextest-core> Starting 0 tests across 1 binary
  48. 16.63 s gammaloop-nextest-core> ------------
  49. 16.63 s gammaloop-nextest-core> Summary [ 0.000s] 0 tests run: 0 passed, 0 skipped
  50. 16.66 s gammaloop-nextest-core>
  51. 16.66 s gammaloop-nextest-core> ========== nextest test summary ==========
  52. 16.66 s gammaloop-nextest-core> report: target/nextest/ci_gammaloop/junit.xml
  53. 16.66 s gammaloop-nextest-core> tests: 0, failures: 0, errors: 0
  54. 16.66 s gammaloop-nextest-core> No failing testcases found.
  55. 16.66 s gammaloop-nextest-core> =========================================
  56. 16.67 s gammaloop-nextest-core> Extracting 4 binaries, 1 build script output directory, and 2 linked paths to /build/nextest-archive-DrHsDI
  57. 17.07 s gammaloop-nextest-core> Extracted 18 files to /build/nextest-archive-DrHsDI in 0.41s
  58. 17.09 s gammaloop-nextest-core> ------------
  59. 17.09 s gammaloop-nextest-core> Nextest run ID 9b7a801a-811a-4856-8d7f-bcbe9c637238 with nextest profile: ci_gammaloop
  60. 17.09 s gammaloop-nextest-core> Starting 456 tests across 4 binaries (61 tests skipped, including 60 tests via profile.ci_gammaloop.default-filter)
  61. 18.19 s gammaloop-nextest-core> FAIL [ 0.336s] (446/456) gammalooprs::test_renormalization finit_part_ghlo
  62. 18.19 s gammaloop-nextest-core> stdout ---
  63. 18.19 s gammaloop-nextest-core>
  64. 18.19 s gammaloop-nextest-core> running 1 test
  65. 18.19 s gammaloop-nextest-core> ren part: 1/2*GC_10^2*dot(P(0,mink(dim)),P(0,mink(dim)))*cas(2,coad(8))/ε
  66. 18.19 s gammaloop-nextest-core> ━━━━━━━━━━━━━━━━━━━━━━━━━━━━━━━ Snapshot Summary ━━━━━━━━━━━━━━━━━━━━━━━━━━━━━━━
  67. 18.19 s gammaloop-nextest-core> Snapshot: finit_part_ghlo
  68. 18.19 s gammaloop-nextest-core> Source: crates/gammalooprs/tests/test_renormalization.rs:557
  69. 18.19 s gammaloop-nextest-core> ────────────────────────────────────────────────────────────────────────────────
  70. 18.19 s gammaloop-nextest-core> Expression: align_to_rqft(&a, &model).to_bare_ordered_string()
  71. 18.19 s gammaloop-nextest-core> ────────────────────────────────────────────────────────────────────────────────
  72. 18.19 s gammaloop-nextest-core> -old snapshot
  73. 18.19 s gammaloop-nextest-core> +new results
  74. 18.19 s gammaloop-nextest-core> ────────────┬───────────────────────────────────────────────────────────────────
  75. 18.19 s gammaloop-nextest-core> 1 │--1/2*cas(2,coad(8))*dot(P(0,mink(4)),P(0,mink(4)))*gs^2*ε^(-1)
  76. 18.19 s gammaloop-nextest-core> 1 │+1/2*cas(2,coad(8))*dot(P(0,mink(4)),P(0,mink(4)))*gs^2*ε^(-1)
  77. 18.19 s gammaloop-nextest-core> ────────────┴───────────────────────────────────────────────────────────────────
  78. 18.19 s gammaloop-nextest-core> To update snapshots run `cargo insta review`
  79. 18.19 s gammaloop-nextest-core> Stopped on the first failure. Run `cargo insta test` to run all snapshots.
  80. 18.19 s gammaloop-nextest-core> test finit_part_ghlo ... FAILED
  81. 18.19 s gammaloop-nextest-core>
  82. 18.19 s gammaloop-nextest-core> failures:
  83. 18.19 s gammaloop-nextest-core>
  84. 18.19 s gammaloop-nextest-core> failures:
  85. 18.19 s gammaloop-nextest-core> finit_part_ghlo
  86. 18.19 s gammaloop-nextest-core>
  87. 18.19 s gammaloop-nextest-core> test result: FAILED. 0 passed; 1 failed; 0 ignored; 0 measured; 5 filtered out; finished in 0.33s
  88. 18.19 s gammaloop-nextest-core>
  89. 18.19 s gammaloop-nextest-core> stderr ---
  90. 18.19 s gammaloop-nextest-core> The application panicked (crashed).
  91. 18.19 s gammaloop-nextest-core> Message: snapshot assertion for 'finit_part_ghlo' failed in line 557
  92. 18.19 s gammaloop-nextest-core> Location: /nix/store/5nq6hmff26w9jbhbmba4wsvgnvglj2xd-vendor-cargo-deps/c19b7c6f923b580ac259164a89f2577984ad5ab09ee9d583b888f934adbbe8d0/insta-1.47.2/src/runtime.rs:719
  93. 18.19 s gammaloop-nextest-core>
  94. 18.19 s gammaloop-nextest-core> ━━━━━━━━━━━━━━━━━━━━━━━━━━━━━━━━━━ BACKTRACE ━━━━━━━━━━━━━━━━━━━━━━━━━━━━━━━━━━━
  95. 18.19 s gammaloop-nextest-core> 1: <color_eyre[51793ea62743adbd]::config::PanicHook>::panic_report<unknown>
  96. 18.19 s gammaloop-nextest-core> at <unknown source file>:<unknown line>
  97. 18.19 s gammaloop-nextest-core> 2: <color_eyre[51793ea62743adbd]::config::PanicHook>::into_panic_hook::{closure#0}<unknown>
  98. 18.19 s gammaloop-nextest-core> at <unknown source file>:<unknown line>
  99. 18.19 s gammaloop-nextest-core> 3: std[bcb96dfbba0ab899]::panicking::panic_with_hook<unknown>
  100. 18.19 s gammaloop-nextest-core> at <unknown source file>:<unknown line>
  101. 18.19 s gammaloop-nextest-core> 4: std[bcb96dfbba0ab899]::panicking::panic_handler::{closure#0}<unknown>
  102. 18.19 s gammaloop-nextest-core> at <unknown source file>:<unknown line>
  103. 18.19 s gammaloop-nextest-core> 5: std[bcb96dfbba0ab899]::sys::backtrace::__rust_end_short_backtrace::<std[bcb96dfbba0ab899]::panicking::panic_handler::{closure#0}, !><unknown>
  104. 18.19 s gammaloop-nextest-core> at <unknown source file>:<unknown line>
  105. 18.19 s gammaloop-nextest-core> 6: __rustc[6c289b9f9c454d21]::rust_begin_unwind<unknown>
  106. 18.19 s gammaloop-nextest-core> at <unknown source file>:<unknown line>
  107. 18.19 s gammaloop-nextest-core> 7: core[940e698046960fd5]::panicking::panic_fmt<unknown>
  108. 18.19 s gammaloop-nextest-core> at <unknown source file>:<unknown line>
  109. 18.19 s gammaloop-nextest-core> 8: insta[307a548ac79ef4d9]::runtime::assert_snapshot<unknown>
  110. 18.19 s gammaloop-nextest-core> at <unknown source file>:<unknown line>
  111. 18.19 s gammaloop-nextest-core> 9: <test_renormalization[a909d96d00a50d41]::finit_part_ghlo::{closure#0} as core[940e698046960fd5]::ops::function::FnOnce<()>>::call_once<unknown>
  112. 18.19 s gammaloop-nextest-core> at <unknown source file>:<unknown line>
  113. 18.19 s gammaloop-nextest-core> 10: test[75d6903177b1d7e9]::__rust_begin_short_backtrace::<core[940e698046960fd5]::result::Result<(), alloc[2ea6bcb46fca0c42]::string::String>, fn() -> core[940e698046960fd5]::result::Result<(), alloc[2ea6bcb46fca0c42]::string::String>><unknown>
  114. 18.19 s gammaloop-nextest-core> at <unknown source file>:<unknown line>
  115. 18.19 s gammaloop-nextest-core> 11: test[75d6903177b1d7e9]::run_test::{closure#0}<unknown>
  116. 18.19 s gammaloop-nextest-core> at <unknown source file>:<unknown line>
  117. 18.19 s gammaloop-nextest-core> 12: std[bcb96dfbba0ab899]::sys::backtrace::__rust_begin_short_backtrace::<test[75d6903177b1d7e9]::run_test::{closure#1}, ()><unknown>
  118. 18.19 s gammaloop-nextest-core> at <unknown source file>:<unknown line>
  119. 18.19 s gammaloop-nextest-core> 13: <std[bcb96dfbba0ab899]::thread::lifecycle::spawn_unchecked<test[75d6903177b1d7e9]::run_test::{closure#1}, ()>::{closure#1} as core[940e698046960fd5]::ops::function::FnOnce<()>>::call_once::{shim:vtable#0}<unknown>
  120. 18.19 s gammaloop-nextest-core> at <unknown source file>:<unknown line>
  121. 18.19 s gammaloop-nextest-core> 14: <std[bcb96dfbba0ab899]::sys::thread::unix::Thread>::new::thread_start<unknown>
  122. 18.19 s gammaloop-nextest-core> at <unknown source file>:<unknown line>
  123. 18.19 s gammaloop-nextest-core> 15: start_thread<unknown>
  124. 18.19 s gammaloop-nextest-core> at <unknown source file>:<unknown line>
  125. 18.19 s gammaloop-nextest-core> 16: __clone3<unknown>
  126. 18.19 s gammaloop-nextest-core> at <unknown source file>:<unknown line>
  127. 18.19 s gammaloop-nextest-core>
  128. 18.19 s gammaloop-nextest-core> Run with COLORBT_SHOW_HIDDEN=1 environment variable to disable frame filtering.
  129. 18.19 s gammaloop-nextest-core> Run with RUST_BACKTRACE=full to include source snippets.
  130. 18.19 s gammaloop-nextest-core>
  131. 19.98 s gammaloop-nextest-core> FAIL [ 2.110s] (452/456) gammalooprs::test_renormalization finite_part_ghost_2loop
  132. 19.98 s gammaloop-nextest-core> stdout ---
  133. 19.98 s gammaloop-nextest-core>
  134. 19.98 s gammaloop-nextest-core> running 1 test
  135. 19.98 s gammaloop-nextest-core> ━━━━━━━━━━━━━━━━━━━━━━━━━━━━━━━ Snapshot Summary ━━━━━━━━━━━━━━━━━━━━━━━━━━━━━━━
  136. 19.98 s gammaloop-nextest-core> Snapshot: finite_part_ghost_2loop-3
  137. 19.98 s gammaloop-nextest-core> Source: crates/gammalooprs/tests/test_renormalization.rs:464
  138. 19.98 s gammaloop-nextest-core> ────────────────────────────────────────────────────────────────────────────────
  139. 19.98 s gammaloop-nextest-core> Expression: align_to_rqft(&a, &model).to_bare_ordered_string()
  140. 19.98 s gammaloop-nextest-core> ────────────────────────────────────────────────────────────────────────────────
  141. 19.98 s gammaloop-nextest-core> -old snapshot
  142. 19.98 s gammaloop-nextest-core> +new results
  143. 19.98 s gammaloop-nextest-core> ────────────┬───────────────────────────────────────────────────────────────────
  144. 19.98 s gammaloop-nextest-core> 1 │-(-1𝑖/32*ε+1𝑖/16)*(cas(2,coad(8)))^2*dot(P(0,mink(4)),P(0,mink(4)))*gs^4*ε^(-2)
  145. 19.98 s gammaloop-nextest-core> 1 │+(-1𝑖/16+1𝑖/32*ε)*(cas(2,coad(8)))^2*dot(P(0,mink(4)),P(0,mink(4)))*gs^4*ε^(-2)
  146. 19.98 s gammaloop-nextest-core> ────────────┴───────────────────────────────────────────────────────────────────
  147. 19.98 s gammaloop-nextest-core> To update snapshots run `cargo insta review`
  148. 19.98 s gammaloop-nextest-core> Stopped on the first failure. Run `cargo insta test` to run all snapshots.
  149. 19.98 s gammaloop-nextest-core> test finite_part_ghost_2loop ... FAILED
  150. 19.98 s gammaloop-nextest-core>
  151. 19.98 s gammaloop-nextest-core> failures:
  152. 19.98 s gammaloop-nextest-core>
  153. 19.98 s gammaloop-nextest-core> failures:
  154. 19.98 s gammaloop-nextest-core> finite_part_ghost_2loop
  155. 19.98 s gammaloop-nextest-core>
  156. 19.98 s gammaloop-nextest-core> test result: FAILED. 0 passed; 1 failed; 0 ignored; 0 measured; 5 filtered out; finished in 2.10s
  157. 19.98 s gammaloop-nextest-core>
  158. 19.98 s gammaloop-nextest-core> stderr ---
  159. 19.98 s gammaloop-nextest-core> The application panicked (crashed).
  160. 19.98 s gammaloop-nextest-core> Message: snapshot assertion for 'finite_part_ghost_2loop-3' failed in line 464
  161. 19.98 s gammaloop-nextest-core> Location: /nix/store/5nq6hmff26w9jbhbmba4wsvgnvglj2xd-vendor-cargo-deps/c19b7c6f923b580ac259164a89f2577984ad5ab09ee9d583b888f934adbbe8d0/insta-1.47.2/src/runtime.rs:719
  162. 19.98 s gammaloop-nextest-core>
  163. 19.98 s gammaloop-nextest-core> ━━━━━━━━━━━━━━━━━━━━━━━━━━━━━━━━━━ BACKTRACE ━━━━━━━━━━━━━━━━━━━━━━━━━━━━━━━━━━━
  164. 19.98 s gammaloop-nextest-core> 1: <color_eyre[51793ea62743adbd]::config::PanicHook>::panic_report<unknown>
  165. 19.98 s gammaloop-nextest-core> at <unknown source file>:<unknown line>
  166. 19.98 s gammaloop-nextest-core> 2: <color_eyre[51793ea62743adbd]::config::PanicHook>::into_panic_hook::{closure#0}<unknown>
  167. 19.98 s gammaloop-nextest-core> at <unknown source file>:<unknown line>
  168. 19.98 s gammaloop-nextest-core> 3: std[bcb96dfbba0ab899]::panicking::panic_with_hook<unknown>
  169. 19.98 s gammaloop-nextest-core> at <unknown source file>:<unknown line>
  170. 19.98 s gammaloop-nextest-core> 4: std[bcb96dfbba0ab899]::panicking::panic_handler::{closure#0}<unknown>
  171. 19.98 s gammaloop-nextest-core> at <unknown source file>:<unknown line>
  172. 19.98 s gammaloop-nextest-core> 5: std[bcb96dfbba0ab899]::sys::backtrace::__rust_end_short_backtrace::<std[bcb96dfbba0ab899]::panicking::panic_handler::{closure#0}, !><unknown>
  173. 19.98 s gammaloop-nextest-core> at <unknown source file>:<unknown line>
  174. 19.98 s gammaloop-nextest-core> 6: __rustc[6c289b9f9c454d21]::rust_begin_unwind<unknown>
  175. 19.98 s gammaloop-nextest-core> at <unknown source file>:<unknown line>
  176. 19.98 s gammaloop-nextest-core> 7: core[940e698046960fd5]::panicking::panic_fmt<unknown>
  177. 19.98 s gammaloop-nextest-core> at <unknown source file>:<unknown line>
  178. 19.98 s gammaloop-nextest-core> 8: insta[307a548ac79ef4d9]::runtime::assert_snapshot<unknown>
  179. 19.98 s gammaloop-nextest-core> at <unknown source file>:<unknown line>
  180. 19.98 s gammaloop-nextest-core> 9: test_renormalization[a909d96d00a50d41]::finite_part_ghost_2loop<unknown>
  181. 19.98 s gammaloop-nextest-core> at <unknown source file>:<unknown line>
  182. 19.98 s gammaloop-nextest-core> 10: <test_renormalization[a909d96d00a50d41]::finite_part_ghost_2loop::{closure#0} as core[940e698046960fd5]::ops::function::FnOnce<()>>::call_once<unknown>
  183. 19.98 s gammaloop-nextest-core> at <unknown source file>:<unknown line>
  184. 19.98 s gammaloop-nextest-core> 11: test[75d6903177b1d7e9]::__rust_begin_short_backtrace::<core[940e698046960fd5]::result::Result<(), alloc[2ea6bcb46fca0c42]::string::String>, fn() -> core[940e698046960fd5]::result::Result<(), alloc[2ea6bcb46fca0c42]::string::String>><unknown>
  185. 19.98 s gammaloop-nextest-core> at <unknown source file>:<unknown line>
  186. 19.98 s gammaloop-nextest-core> 12: test[75d6903177b1d7e9]::run_test::{closure#0}<unknown>
  187. 19.98 s gammaloop-nextest-core> at <unknown source file>:<unknown line>
  188. 19.98 s gammaloop-nextest-core> 13: std[bcb96dfbba0ab899]::sys::backtrace::__rust_begin_short_backtrace::<test[75d6903177b1d7e9]::run_test::{closure#1}, ()><unknown>
  189. 19.98 s gammaloop-nextest-core> at <unknown source file>:<unknown line>
  190. 19.98 s gammaloop-nextest-core> 14: <std[bcb96dfbba0ab899]::thread::lifecycle::spawn_unchecked<test[75d6903177b1d7e9]::run_test::{closure#1}, ()>::{closure#1} as core[940e698046960fd5]::ops::function::FnOnce<()>>::call_once::{shim:vtable#0}<unknown>
  191. 19.98 s gammaloop-nextest-core> at <unknown source file>:<unknown line>
  192. 19.98 s gammaloop-nextest-core> 15: <std[bcb96dfbba0ab899]::sys::thread::unix::Thread>::new::thread_start<unknown>
  193. 19.98 s gammaloop-nextest-core> at <unknown source file>:<unknown line>
  194. 19.98 s gammaloop-nextest-core> 16: start_thread<unknown>
  195. 19.98 s gammaloop-nextest-core> at <unknown source file>:<unknown line>
  196. 19.98 s gammaloop-nextest-core> 17: __clone3<unknown>
  197. 19.98 s gammaloop-nextest-core> at <unknown source file>:<unknown line>
  198. 19.98 s gammaloop-nextest-core>
  199. 19.98 s gammaloop-nextest-core> Run with COLORBT_SHOW_HIDDEN=1 environment variable to disable frame filtering.
  200. 19.98 s gammaloop-nextest-core> Run with RUST_BACKTRACE=full to include source snippets.
  201. 19.98 s gammaloop-nextest-core>
  202. 25.25 s gammaloop-nextest-core> ------------
  203. 25.27 s gammaloop-nextest-core> Summary [ 8.169s] 456 tests run: 454 passed, 2 failed, 61 skipped
  204. 25.27 s gammaloop-nextest-core> FAIL [ 0.336s] (446/456) gammalooprs::test_renormalization finit_part_ghlo
  205. 25.27 s gammaloop-nextest-core> stdout ---
  206. 25.27 s gammaloop-nextest-core>
  207. 25.27 s gammaloop-nextest-core> running 1 test
  208. 25.27 s gammaloop-nextest-core> ren part: 1/2*GC_10^2*dot(P(0,mink(dim)),P(0,mink(dim)))*cas(2,coad(8))/ε
  209. 25.27 s gammaloop-nextest-core> ━━━━━━━━━━━━━━━━━━━━━━━━━━━━━━━ Snapshot Summary ━━━━━━━━━━━━━━━━━━━━━━━━━━━━━━━
  210. 25.27 s gammaloop-nextest-core> Snapshot: finit_part_ghlo
  211. 25.27 s gammaloop-nextest-core> Source: crates/gammalooprs/tests/test_renormalization.rs:557
  212. 25.27 s gammaloop-nextest-core> ────────────────────────────────────────────────────────────────────────────────
  213. 25.27 s gammaloop-nextest-core> Expression: align_to_rqft(&a, &model).to_bare_ordered_string()
  214. 25.27 s gammaloop-nextest-core> ────────────────────────────────────────────────────────────────────────────────
  215. 25.27 s gammaloop-nextest-core> -old snapshot
  216. 25.27 s gammaloop-nextest-core> +new results
  217. 25.27 s gammaloop-nextest-core> ────────────┬───────────────────────────────────────────────────────────────────
  218. 25.27 s gammaloop-nextest-core> 1 │--1/2*cas(2,coad(8))*dot(P(0,mink(4)),P(0,mink(4)))*gs^2*ε^(-1)
  219. 25.27 s gammaloop-nextest-core> 1 │+1/2*cas(2,coad(8))*dot(P(0,mink(4)),P(0,mink(4)))*gs^2*ε^(-1)
  220. 25.27 s gammaloop-nextest-core> ────────────┴───────────────────────────────────────────────────────────────────
  221. 25.27 s gammaloop-nextest-core> To update snapshots run `cargo insta review`
  222. 25.27 s gammaloop-nextest-core> Stopped on the first failure. Run `cargo insta test` to run all snapshots.
  223. 25.27 s gammaloop-nextest-core> test finit_part_ghlo ... FAILED
  224. 25.27 s gammaloop-nextest-core>
  225. 25.27 s gammaloop-nextest-core> failures:
  226. 25.27 s gammaloop-nextest-core>
  227. 25.27 s gammaloop-nextest-core> failures:
  228. 25.27 s gammaloop-nextest-core> finit_part_ghlo
  229. 25.27 s gammaloop-nextest-core>
  230. 25.27 s gammaloop-nextest-core> test result: FAILED. 0 passed; 1 failed; 0 ignored; 0 measured; 5 filtered out; finished in 0.33s
  231. 25.27 s gammaloop-nextest-core>
  232. 25.27 s gammaloop-nextest-core> stderr ---
  233. 25.27 s gammaloop-nextest-core> The application panicked (crashed).
  234. 25.27 s gammaloop-nextest-core> Message: snapshot assertion for 'finit_part_ghlo' failed in line 557
  235. 25.27 s gammaloop-nextest-core> Location: /nix/store/5nq6hmff26w9jbhbmba4wsvgnvglj2xd-vendor-cargo-deps/c19b7c6f923b580ac259164a89f2577984ad5ab09ee9d583b888f934adbbe8d0/insta-1.47.2/src/runtime.rs:719
  236. 25.27 s gammaloop-nextest-core>
  237. 25.27 s gammaloop-nextest-core> ━━━━━━━━━━━━━━━━━━━━━━━━━━━━━━━━━━ BACKTRACE ━━━━━━━━━━━━━━━━━━━━━━━━━━━━━━━━━━━
  238. 25.27 s gammaloop-nextest-core> 1: <color_eyre[51793ea62743adbd]::config::PanicHook>::panic_report<unknown>
  239. 25.27 s gammaloop-nextest-core> at <unknown source file>:<unknown line>
  240. 25.27 s gammaloop-nextest-core> 2: <color_eyre[51793ea62743adbd]::config::PanicHook>::into_panic_hook::{closure#0}<unknown>
  241. 25.27 s gammaloop-nextest-core> at <unknown source file>:<unknown line>
  242. 25.27 s gammaloop-nextest-core> 3: std[bcb96dfbba0ab899]::panicking::panic_with_hook<unknown>
  243. 25.27 s gammaloop-nextest-core> at <unknown source file>:<unknown line>
  244. 25.27 s gammaloop-nextest-core> 4: std[bcb96dfbba0ab899]::panicking::panic_handler::{closure#0}<unknown>
  245. 25.27 s gammaloop-nextest-core> at <unknown source file>:<unknown line>
  246. 25.27 s gammaloop-nextest-core> 5: std[bcb96dfbba0ab899]::sys::backtrace::__rust_end_short_backtrace::<std[bcb96dfbba0ab899]::panicking::panic_handler::{closure#0}, !><unknown>
  247. 25.27 s gammaloop-nextest-core> at <unknown source file>:<unknown line>
  248. 25.27 s gammaloop-nextest-core> 6: __rustc[6c289b9f9c454d21]::rust_begin_unwind<unknown>
  249. 25.27 s gammaloop-nextest-core> at <unknown source file>:<unknown line>
  250. 25.27 s gammaloop-nextest-core> 7: core[940e698046960fd5]::panicking::panic_fmt<unknown>
  251. 25.27 s gammaloop-nextest-core> at <unknown source file>:<unknown line>
  252. 25.27 s gammaloop-nextest-core> 8: insta[307a548ac79ef4d9]::runtime::assert_snapshot<unknown>
  253. 25.27 s gammaloop-nextest-core> at <unknown source file>:<unknown line>
  254. 25.27 s gammaloop-nextest-core> 9: <test_renormalization[a909d96d00a50d41]::finit_part_ghlo::{closure#0} as core[940e698046960fd5]::ops::function::FnOnce<()>>::call_once<unknown>
  255. 25.27 s gammaloop-nextest-core> at <unknown source file>:<unknown line>
  256. 25.27 s gammaloop-nextest-core> 10: test[75d6903177b1d7e9]::__rust_begin_short_backtrace::<core[940e698046960fd5]::result::Result<(), alloc[2ea6bcb46fca0c42]::string::String>, fn() -> core[940e698046960fd5]::result::Result<(), alloc[2ea6bcb46fca0c42]::string::String>><unknown>
  257. 25.27 s gammaloop-nextest-core> at <unknown source file>:<unknown line>
  258. 25.27 s gammaloop-nextest-core> 11: test[75d6903177b1d7e9]::run_test::{closure#0}<unknown>
  259. 25.27 s gammaloop-nextest-core> at <unknown source file>:<unknown line>
  260. 25.27 s gammaloop-nextest-core> 12: std[bcb96dfbba0ab899]::sys::backtrace::__rust_begin_short_backtrace::<test[75d6903177b1d7e9]::run_test::{closure#1}, ()><unknown>
  261. 25.27 s gammaloop-nextest-core> at <unknown source file>:<unknown line>
  262. 25.27 s gammaloop-nextest-core> 13: <std[bcb96dfbba0ab899]::thread::lifecycle::spawn_unchecked<test[75d6903177b1d7e9]::run_test::{closure#1}, ()>::{closure#1} as core[940e698046960fd5]::ops::function::FnOnce<()>>::call_once::{shim:vtable#0}<unknown>
  263. 25.27 s gammaloop-nextest-core> at <unknown source file>:<unknown line>
  264. 25.27 s gammaloop-nextest-core> 14: <std[bcb96dfbba0ab899]::sys::thread::unix::Thread>::new::thread_start<unknown>
  265. 25.27 s gammaloop-nextest-core> at <unknown source file>:<unknown line>
  266. 25.27 s gammaloop-nextest-core> 15: start_thread<unknown>
  267. 25.27 s gammaloop-nextest-core> at <unknown source file>:<unknown line>
  268. 25.27 s gammaloop-nextest-core> 16: __clone3<unknown>
  269. 25.27 s gammaloop-nextest-core> at <unknown source file>:<unknown line>
  270. 25.27 s gammaloop-nextest-core>
  271. 25.27 s gammaloop-nextest-core> Run with COLORBT_SHOW_HIDDEN=1 environment variable to disable frame filtering.
  272. 25.27 s gammaloop-nextest-core> Run with RUST_BACKTRACE=full to include source snippets.
  273. 25.27 s gammaloop-nextest-core>
  274. 25.27 s gammaloop-nextest-core> FAIL [ 2.110s] (452/456) gammalooprs::test_renormalization finite_part_ghost_2loop
  275. 25.27 s gammaloop-nextest-core> stdout ---
  276. 25.27 s gammaloop-nextest-core>
  277. 25.27 s gammaloop-nextest-core> running 1 test
  278. 25.27 s gammaloop-nextest-core> ━━━━━━━━━━━━━━━━━━━━━━━━━━━━━━━ Snapshot Summary ━━━━━━━━━━━━━━━━━━━━━━━━━━━━━━━
  279. 25.27 s gammaloop-nextest-core> Snapshot: finite_part_ghost_2loop-3
  280. 25.27 s gammaloop-nextest-core> Source: crates/gammalooprs/tests/test_renormalization.rs:464
  281. 25.27 s gammaloop-nextest-core> ────────────────────────────────────────────────────────────────────────────────
  282. 25.27 s gammaloop-nextest-core> Expression: align_to_rqft(&a, &model).to_bare_ordered_string()
  283. 25.27 s gammaloop-nextest-core> ────────────────────────────────────────────────────────────────────────────────
  284. 25.27 s gammaloop-nextest-core> -old snapshot
  285. 25.27 s gammaloop-nextest-core> +new results
  286. 25.27 s gammaloop-nextest-core> ────────────┬───────────────────────────────────────────────────────────────────
  287. 25.27 s gammaloop-nextest-core> 1 │-(-1𝑖/32*ε+1𝑖/16)*(cas(2,coad(8)))^2*dot(P(0,mink(4)),P(0,mink(4)))*gs^4*ε^(-2)
  288. 25.27 s gammaloop-nextest-core> 1 │+(-1𝑖/16+1𝑖/32*ε)*(cas(2,coad(8)))^2*dot(P(0,mink(4)),P(0,mink(4)))*gs^4*ε^(-2)
  289. 25.27 s gammaloop-nextest-core> ────────────┴───────────────────────────────────────────────────────────────────
  290. 25.27 s gammaloop-nextest-core> To update snapshots run `cargo insta review`
  291. 25.27 s gammaloop-nextest-core> Stopped on the first failure. Run `cargo insta test` to run all snapshots.
  292. 25.27 s gammaloop-nextest-core> test finite_part_ghost_2loop ... FAILED
  293. 25.27 s gammaloop-nextest-core>
  294. 25.27 s gammaloop-nextest-core> failures:
  295. 25.27 s gammaloop-nextest-core>
  296. 25.27 s gammaloop-nextest-core> failures:
  297. 25.27 s gammaloop-nextest-core> finite_part_ghost_2loop
  298. 25.27 s gammaloop-nextest-core>
  299. 25.27 s gammaloop-nextest-core> test result: FAILED. 0 passed; 1 failed; 0 ignored; 0 measured; 5 filtered out; finished in 2.10s
  300. 25.27 s gammaloop-nextest-core>
  301. 25.27 s gammaloop-nextest-core> stderr ---
  302. 25.27 s gammaloop-nextest-core> The application panicked (crashed).
  303. 25.27 s gammaloop-nextest-core> Message: snapshot assertion for 'finite_part_ghost_2loop-3' failed in line 464
  304. 25.27 s gammaloop-nextest-core> Location: /nix/store/5nq6hmff26w9jbhbmba4wsvgnvglj2xd-vendor-cargo-deps/c19b7c6f923b580ac259164a89f2577984ad5ab09ee9d583b888f934adbbe8d0/insta-1.47.2/src/runtime.rs:719
  305. 25.27 s gammaloop-nextest-core>
  306. 25.27 s gammaloop-nextest-core> ━━━━━━━━━━━━━━━━━━━━━━━━━━━━━━━━━━ BACKTRACE ━━━━━━━━━━━━━━━━━━━━━━━━━━━━━━━━━━━
  307. 25.27 s gammaloop-nextest-core> 1: <color_eyre[51793ea62743adbd]::config::PanicHook>::panic_report<unknown>
  308. 25.27 s gammaloop-nextest-core> at <unknown source file>:<unknown line>
  309. 25.27 s gammaloop-nextest-core> 2: <color_eyre[51793ea62743adbd]::config::PanicHook>::into_panic_hook::{closure#0}<unknown>
  310. 25.27 s gammaloop-nextest-core> at <unknown source file>:<unknown line>
  311. 25.27 s gammaloop-nextest-core> 3: std[bcb96dfbba0ab899]::panicking::panic_with_hook<unknown>
  312. 25.27 s gammaloop-nextest-core> at <unknown source file>:<unknown line>
  313. 25.27 s gammaloop-nextest-core> 4: std[bcb96dfbba0ab899]::panicking::panic_handler::{closure#0}<unknown>
  314. 25.27 s gammaloop-nextest-core> at <unknown source file>:<unknown line>
  315. 25.27 s gammaloop-nextest-core> 5: std[bcb96dfbba0ab899]::sys::backtrace::__rust_end_short_backtrace::<std[bcb96dfbba0ab899]::panicking::panic_handler::{closure#0}, !><unknown>
  316. 25.27 s gammaloop-nextest-core> at <unknown source file>:<unknown line>
  317. 25.27 s gammaloop-nextest-core> 6: __rustc[6c289b9f9c454d21]::rust_begin_unwind<unknown>
  318. 25.27 s gammaloop-nextest-core> at <unknown source file>:<unknown line>
  319. 25.27 s gammaloop-nextest-core> 7: core[940e698046960fd5]::panicking::panic_fmt<unknown>
  320. 25.27 s gammaloop-nextest-core> at <unknown source file>:<unknown line>
  321. 25.27 s gammaloop-nextest-core> 8: insta[307a548ac79ef4d9]::runtime::assert_snapshot<unknown>
  322. 25.27 s gammaloop-nextest-core> at <unknown source file>:<unknown line>
  323. 25.27 s gammaloop-nextest-core> 9: test_renormalization[a909d96d00a50d41]::finite_part_ghost_2loop<unknown>
  324. 25.27 s gammaloop-nextest-core> at <unknown source file>:<unknown line>
  325. 25.27 s gammaloop-nextest-core> 10: <test_renormalization[a909d96d00a50d41]::finite_part_ghost_2loop::{closure#0} as core[940e698046960fd5]::ops::function::FnOnce<()>>::call_once<unknown>
  326. 25.27 s gammaloop-nextest-core> at <unknown source file>:<unknown line>
  327. 25.27 s gammaloop-nextest-core> 11: test[75d6903177b1d7e9]::__rust_begin_short_backtrace::<core[940e698046960fd5]::result::Result<(), alloc[2ea6bcb46fca0c42]::string::String>, fn() -> core[940e698046960fd5]::result::Result<(), alloc[2ea6bcb46fca0c42]::string::String>><unknown>
  328. 25.27 s gammaloop-nextest-core> at <unknown source file>:<unknown line>
  329. 25.27 s gammaloop-nextest-core> 12: test[75d6903177b1d7e9]::run_test::{closure#0}<unknown>
  330. 25.27 s gammaloop-nextest-core> at <unknown source file>:<unknown line>
  331. 25.27 s gammaloop-nextest-core> 13: std[bcb96dfbba0ab899]::sys::backtrace::__rust_begin_short_backtrace::<test[75d6903177b1d7e9]::run_test::{closure#1}, ()><unknown>
  332. 25.27 s gammaloop-nextest-core> at <unknown source file>:<unknown line>
  333. 25.27 s gammaloop-nextest-core> 14: <std[bcb96dfbba0ab899]::thread::lifecycle::spawn_unchecked<test[75d6903177b1d7e9]::run_test::{closure#1}, ()>::{closure#1} as core[940e698046960fd5]::ops::function::FnOnce<()>>::call_once::{shim:vtable#0}<unknown>
  334. 25.27 s gammaloop-nextest-core> at <unknown source file>:<unknown line>
  335. 25.27 s gammaloop-nextest-core> 15: <std[bcb96dfbba0ab899]::sys::thread::unix::Thread>::new::thread_start<unknown>
  336. 25.27 s gammaloop-nextest-core> at <unknown source file>:<unknown line>
  337. 25.27 s gammaloop-nextest-core> 16: start_thread<unknown>
  338. 25.27 s gammaloop-nextest-core> at <unknown source file>:<unknown line>
  339. 25.27 s gammaloop-nextest-core> 17: __clone3<unknown>
  340. 25.27 s gammaloop-nextest-core> at <unknown source file>:<unknown line>
  341. 25.27 s gammaloop-nextest-core>
  342. 25.27 s gammaloop-nextest-core> Run with COLORBT_SHOW_HIDDEN=1 environment variable to disable frame filtering.
  343. 25.27 s gammaloop-nextest-core> Run with RUST_BACKTRACE=full to include source snippets.
  344. 25.27 s gammaloop-nextest-core>
  345. 25.31 s gammaloop-nextest-core> error: test run failed
  346. 25.33 s gammaloop-nextest-core>
  347. 25.33 s gammaloop-nextest-core> ========== nextest test summary ==========
  348. 25.33 s gammaloop-nextest-core> report: target/nextest/ci_gammaloop/junit.xml
  349. 25.33 s gammaloop-nextest-core> tests: 456, failures: 2, errors: 0
  350. 25.33 s gammaloop-nextest-core>
  351. 25.33 s gammaloop-nextest-core> 1. gammalooprs::test_renormalization::finit_part_ghlo
  352. 25.33 s gammaloop-nextest-core> failure: test failure with exit code 101
  353. 25.33 s gammaloop-nextest-core> system-out
  354. 25.33 s gammaloop-nextest-core> running 1 test
  355. 25.33 s gammaloop-nextest-core> ren part: 1/2*GC_10^2*dot(P(0,mink(dim)),P(0,mink(dim)))*cas(2,coad(8))/ε
  356. 25.33 s gammaloop-nextest-core> ━━━━━━━━━━━━━━━━━━━━━━━━━━━━━━━ Snapshot Summary ━━━━━━━━━━━━━━━━━━━━━━━━━━━━━━━
  357. 25.33 s gammaloop-nextest-core> Snapshot: finit_part_ghlo
  358. 25.33 s gammaloop-nextest-core> Source: crates/gammalooprs/tests/test_renormalization.rs:557
  359. 25.33 s gammaloop-nextest-core> ────────────────────────────────────────────────────────────────────────────────
  360. 25.33 s gammaloop-nextest-core> Expression: align_to_rqft(&a, &model).to_bare_ordered_string()
  361. 25.33 s gammaloop-nextest-core> ────────────────────────────────────────────────────────────────────────────────
  362. 25.33 s gammaloop-nextest-core> -old snapshot
  363. 25.33 s gammaloop-nextest-core> +new results
  364. 25.33 s gammaloop-nextest-core> ────────────┬───────────────────────────────────────────────────────────────────
  365. 25.33 s gammaloop-nextest-core> 1 │--1/2*cas(2,coad(8))*dot(P(0,mink(4)),P(0,mink(4)))*gs^2*ε^(-1)
  366. 25.34 s gammaloop-nextest-core> 1 │+1/2*cas(2,coad(8))*dot(P(0,mink(4)),P(0,mink(4)))*gs^2*ε^(-1)
  367. 25.34 s gammaloop-nextest-core> ────────────┴───────────────────────────────────────────────────────────────────
  368. 25.34 s gammaloop-nextest-core> To update snapshots run `cargo insta review`
  369. 25.34 s gammaloop-nextest-core> Stopped on the first failure. Run `cargo insta test` to run all snapshots.
  370. 25.34 s gammaloop-nextest-core> test finit_part_ghlo ... FAILED
  371. 25.34 s gammaloop-nextest-core>
  372. 25.34 s gammaloop-nextest-core> failures:
  373. 25.34 s gammaloop-nextest-core>
  374. 25.34 s gammaloop-nextest-core> failures:
  375. 25.34 s gammaloop-nextest-core> finit_part_ghlo
  376. 25.34 s gammaloop-nextest-core>
  377. 25.34 s gammaloop-nextest-core> test result: FAILED. 0 passed; 1 failed; 0 ignored; 0 measured; 5 filtered out; finished in 0.33s
  378. 25.34 s gammaloop-nextest-core> system-err
  379. 25.34 s gammaloop-nextest-core> The application panicked (crashed).
  380. 25.34 s gammaloop-nextest-core> Message: snapshot assertion for 'finit_part_ghlo' failed in line 557
  381. 25.34 s gammaloop-nextest-core> Location: /nix/store/5nq6hmff26w9jbhbmba4wsvgnvglj2xd-vendor-cargo-deps/c19b7c6f923b580ac259164a89f2577984ad5ab09ee9d583b888f934adbbe8d0/insta-1.47.2/src/runtime.rs:719
  382. 25.34 s gammaloop-nextest-core>
  383. 25.34 s gammaloop-nextest-core> ━━━━━━━━━━━━━━━━━━━━━━━━━━━━━━━━━━ BACKTRACE ━━━━━━━━━━━━━━━━━━━━━━━━━━━━━━━━━━━
  384. 25.34 s gammaloop-nextest-core> 1: <color_eyre[51793ea62743adbd]::config::PanicHook>::panic_report<unknown>
  385. 25.34 s gammaloop-nextest-core> at <unknown source file>:<unknown line>
  386. 25.34 s gammaloop-nextest-core> 2: <color_eyre[51793ea62743adbd]::config::PanicHook>::into_panic_hook::{closure#0}<unknown>
  387. 25.34 s gammaloop-nextest-core> at <unknown source file>:<unknown line>
  388. 25.34 s gammaloop-nextest-core> 3: std[bcb96dfbba0ab899]::panicking::panic_with_hook<unknown>
  389. 25.34 s gammaloop-nextest-core> at <unknown source file>:<unknown line>
  390. 25.34 s gammaloop-nextest-core> 4: std[bcb96dfbba0ab899]::panicking::panic_handler::{closure#0}<unknown>
  391. 25.34 s gammaloop-nextest-core> at <unknown source file>:<unknown line>
  392. 25.34 s gammaloop-nextest-core> 5: std[bcb96dfbba0ab899]::sys::backtrace::__rust_end_short_backtrace::<std[bcb96dfbba0ab899]::panicking::panic_handler::{closure#0}, !><unknown>
  393. 25.34 s gammaloop-nextest-core> at <unknown source file>:<unknown line>
  394. 25.34 s gammaloop-nextest-core> 6: __rustc[6c289b9f9c454d21]::rust_begin_unwind<unknown>
  395. 25.34 s gammaloop-nextest-core> at <unknown source file>:<unknown line>
  396. 25.34 s gammaloop-nextest-core> 7: core[940e698046960fd5]::panicking::panic_fmt<unknown>
  397. 25.34 s gammaloop-nextest-core> at <unknown source file>:<unknown line>
  398. 25.34 s gammaloop-nextest-core> 8: insta[307a548ac79ef4d9]::runtime::assert_snapshot<unknown>
  399. 25.34 s gammaloop-nextest-core> at <unknown source file>:<unknown line>
  400. 25.34 s gammaloop-nextest-core> 9: <test_renormalization[a909d96d00a50d41]::finit_part_ghlo::{closure#0} as core[940e698046960fd5]::ops::function::FnOnce<()>>::call_once<unknown>
  401. 25.34 s gammaloop-nextest-core> at <unknown source file>:<unknown line>
  402. 25.34 s gammaloop-nextest-core> 10: test[75d6903177b1d7e9]::__rust_begin_short_backtrace::<core[940e698046960fd5]::result::Result<(), alloc[2ea6bcb46fca0c42]::string::String>, fn() -> core[940e698046960fd5]::result::Result<(), alloc[2ea6bcb46fca0c42]::string::String>><unknown>
  403. 25.34 s gammaloop-nextest-core> at <unknown source file>:<unknown line>
  404. 25.34 s gammaloop-nextest-core> 11: test[75d6903177b1d7e9]::run_test::{closure#0}<unknown>
  405. 25.34 s gammaloop-nextest-core> at <unknown source file>:<unknown line>
  406. 25.34 s gammaloop-nextest-core> 12: std[bcb96dfbba0ab899]::sys::backtrace::__rust_begin_short_backtrace::<test[75d6903177b1d7e9]::run_test::{closure#1}, ()><unknown>
  407. 25.34 s gammaloop-nextest-core> at <unknown source file>:<unknown line>
  408. 25.34 s gammaloop-nextest-core> 13: <std[bcb96dfbba0ab899]::thread::lifecycle::spawn_unchecked<test[75d6903177b1d7e9]::run_test::{closure#1}, ()>::{closure#1} as core[940e698046960fd5]::ops::function::FnOnce<()>>::call_once::{shim:vtable#0}<unknown>
  409. 25.34 s gammaloop-nextest-core> at <unknown source file>:<unknown line>
  410. 25.34 s gammaloop-nextest-core> 14: <std[bcb96dfbba0ab899]::sys::thread::unix::Thread>::new::thread_start<unknown>
  411. 25.34 s gammaloop-nextest-core> at <unknown source file>:<unknown line>
  412. 25.34 s gammaloop-nextest-core> 15: start_thread<unknown>
  413. 25.34 s gammaloop-nextest-core> at <unknown source file>:<unknown line>
  414. 25.34 s gammaloop-nextest-core> 16: __clone3<unknown>
  415. 25.34 s gammaloop-nextest-core> at <unknown source file>:<unknown line>
  416. 25.34 s gammaloop-nextest-core>
  417. 25.34 s gammaloop-nextest-core> Run with COLORBT_SHOW_HIDDEN=1 environment variable to disable frame filtering.
  418. 25.34 s gammaloop-nextest-core> Run with RUST_BACKTRACE=full to include source snippets.
  419. 25.34 s gammaloop-nextest-core>
  420. 25.34 s gammaloop-nextest-core> 2. gammalooprs::test_renormalization::finite_part_ghost_2loop
  421. 25.34 s gammaloop-nextest-core> failure: test failure with exit code 101
  422. 25.34 s gammaloop-nextest-core> system-out
  423. 25.34 s gammaloop-nextest-core> running 1 test
  424. 25.34 s gammaloop-nextest-core> ━━━━━━━━━━━━━━━━━━━━━━━━━━━━━━━ Snapshot Summary ━━━━━━━━━━━━━━━━━━━━━━━━━━━━━━━
  425. 25.34 s gammaloop-nextest-core> Snapshot: finite_part_ghost_2loop-3
  426. 25.34 s gammaloop-nextest-core> Source: crates/gammalooprs/tests/test_renormalization.rs:464
  427. 25.34 s gammaloop-nextest-core> ────────────────────────────────────────────────────────────────────────────────
  428. 25.34 s gammaloop-nextest-core> Expression: align_to_rqft(&a, &model).to_bare_ordered_string()
  429. 25.34 s gammaloop-nextest-core> ────────────────────────────────────────────────────────────────────────────────
  430. 25.34 s gammaloop-nextest-core> -old snapshot
  431. 25.34 s gammaloop-nextest-core> +new results
  432. 25.34 s gammaloop-nextest-core> ────────────┬───────────────────────────────────────────────────────────────────
  433. 25.34 s gammaloop-nextest-core> 1 │-(-1𝑖/32*ε+1𝑖/16)*(cas(2,coad(8)))^2*dot(P(0,mink(4)),P(0,mink(4)))*gs^4*ε^(-2)
  434. 25.34 s gammaloop-nextest-core> 1 │+(-1𝑖/16+1𝑖/32*ε)*(cas(2,coad(8)))^2*dot(P(0,mink(4)),P(0,mink(4)))*gs^4*ε^(-2)
  435. 25.34 s gammaloop-nextest-core> ────────────┴───────────────────────────────────────────────────────────────────
  436. 25.34 s gammaloop-nextest-core> To update snapshots run `cargo insta review`
  437. 25.34 s gammaloop-nextest-core> Stopped on the first failure. Run `cargo insta test` to run all snapshots.
  438. 25.34 s gammaloop-nextest-core> test finite_part_ghost_2loop ... FAILED
  439. 25.34 s gammaloop-nextest-core>
  440. 25.34 s gammaloop-nextest-core> failures:
  441. 25.34 s gammaloop-nextest-core>
  442. 25.34 s gammaloop-nextest-core> failures:
  443. 25.34 s gammaloop-nextest-core> finite_part_ghost_2loop
  444. 25.34 s gammaloop-nextest-core>
  445. 25.34 s gammaloop-nextest-core> test result: FAILED. 0 passed; 1 failed; 0 ignored; 0 measured; 5 filtered out; finished in 2.10s
  446. 25.34 s gammaloop-nextest-core> system-err
  447. 25.34 s gammaloop-nextest-core> The application panicked (crashed).
  448. 25.34 s gammaloop-nextest-core> Message: snapshot assertion for 'finite_part_ghost_2loop-3' failed in line 464
  449. 25.34 s gammaloop-nextest-core> Location: /nix/store/5nq6hmff26w9jbhbmba4wsvgnvglj2xd-vendor-cargo-deps/c19b7c6f923b580ac259164a89f2577984ad5ab09ee9d583b888f934adbbe8d0/insta-1.47.2/src/runtime.rs:719
  450. 25.34 s gammaloop-nextest-core>
  451. 25.34 s gammaloop-nextest-core> ━━━━━━━━━━━━━━━━━━━━━━━━━━━━━━━━━━ BACKTRACE ━━━━━━━━━━━━━━━━━━━━━━━━━━━━━━━━━━━
  452. 25.34 s gammaloop-nextest-core> 1: <color_eyre[51793ea62743adbd]::config::PanicHook>::panic_report<unknown>
  453. 25.34 s gammaloop-nextest-core> at <unknown source file>:<unknown line>
  454. 25.34 s gammaloop-nextest-core> 2: <color_eyre[51793ea62743adbd]::config::PanicHook>::into_panic_hook::{closure#0}<unknown>
  455. 25.34 s gammaloop-nextest-core> at <unknown source file>:<unknown line>
  456. 25.34 s gammaloop-nextest-core> 3: std[bcb96dfbba0ab899]::panicking::panic_with_hook<unknown>
  457. 25.34 s gammaloop-nextest-core> at <unknown source file>:<unknown line>
  458. 25.34 s gammaloop-nextest-core> 4: std[bcb96dfbba0ab899]::panicking::panic_handler::{closure#0}<unknown>
  459. 25.34 s gammaloop-nextest-core> at <unknown source file>:<unknown line>
  460. 25.34 s gammaloop-nextest-core> 5: std[bcb96dfbba0ab899]::sys::backtrace::__rust_end_short_backtrace::<std[bcb96dfbba0ab899]::panicking::panic_handler::{closure#0}, !><unknown>
  461. 25.34 s gammaloop-nextest-core> at <unknown source file>:<unknown line>
  462. 25.34 s gammaloop-nextest-core> 6: __rustc[6c289b9f9c454d21]::rust_begin_unwind<unknown>
  463. 25.34 s gammaloop-nextest-core> at <unknown source file>:<unknown line>
  464. 25.34 s gammaloop-nextest-core> 7: core[940e698046960fd5]::panicking::panic_fmt<unknown>
  465. 25.34 s gammaloop-nextest-core> at <unknown source file>:<unknown line>
  466. 25.34 s gammaloop-nextest-core> 8: insta[307a548ac79ef4d9]::runtime::assert_snapshot<unknown>
  467. 25.34 s gammaloop-nextest-core> at <unknown source file>:<unknown line>
  468. 25.34 s gammaloop-nextest-core> 9: test_renormalization[a909d96d00a50d41]::finite_part_ghost_2loop<unknown>
  469. 25.34 s gammaloop-nextest-core> at <unknown source file>:<unknown line>
  470. 25.34 s gammaloop-nextest-core> 10: <test_renormalization[a909d96d00a50d41]::finite_part_ghost_2loop::{closure#0} as core[940e698046960fd5]::ops::function::FnOnce<()>>::call_once<unknown>
  471. 25.34 s gammaloop-nextest-core> at <unknown source file>:<unknown line>
  472. 25.34 s gammaloop-nextest-core> 11: test[75d6903177b1d7e9]::__rust_begin_short_backtrace::<core[940e698046960fd5]::result::Result<(), alloc[2ea6bcb46fca0c42]::string::String>, fn() -> core[940e698046960fd5]::result::Result<(), alloc[2ea6bcb46fca0c42]::string::String>><unknown>
  473. 25.34 s gammaloop-nextest-core> at <unknown source file>:<unknown line>
  474. 25.34 s gammaloop-nextest-core> 12: test[75d6903177b1d7e9]::run_test::{closure#0}<unknown>
  475. 25.34 s gammaloop-nextest-core> at <unknown source file>:<unknown line>
  476. 25.34 s gammaloop-nextest-core> 13: std[bcb96dfbba0ab899]::sys::backtrace::__rust_begin_short_backtrace::<test[75d6903177b1d7e9]::run_test::{closure#1}, ()><unknown>
  477. 25.34 s gammaloop-nextest-core> at <unknown source file>:<unknown line>
  478. 25.34 s gammaloop-nextest-core> 14: <std[bcb96dfbba0ab899]::thread::lifecycle::spawn_unchecked<test[75d6903177b1d7e9]::run_test::{closure#1}, ()>::{closure#1} as core[940e698046960fd5]::ops::function::FnOnce<()>>::call_once::{shim:vtable#0}<unknown>
  479. 25.34 s gammaloop-nextest-core> at <unknown source file>:<unknown line>
  480. 25.34 s gammaloop-nextest-core> 15: <std[bcb96dfbba0ab899]::sys::thread::unix::Thread>::new::thread_start<unknown>
  481. 25.34 s gammaloop-nextest-core> at <unknown source file>:<unknown line>
  482. 25.34 s gammaloop-nextest-core> 16: start_thread<unknown>
  483. 25.34 s gammaloop-nextest-core> at <unknown source file>:<unknown line>
  484. 25.34 s gammaloop-nextest-core> 17: __clone3<unknown>
  485. 25.34 s gammaloop-nextest-core> at <unknown source file>:<unknown line>
  486. 25.34 s gammaloop-nextest-core>
  487. 25.34 s gammaloop-nextest-core> Run with COLORBT_SHOW_HIDDEN=1 environment variable to disable frame filtering.
  488. 25.34 s gammaloop-nextest-core> Run with RUST_BACKTRACE=full to include source snippets.
  489. 25.34 s gammaloop-nextest-core> =========================================
  490. 25.37 s error: Cannot build '/nix/store/bdjz1sm6jpf4ngrik4ql09axygsysbqj-gammaloop-nextest-core.drv'.
  491. 25.37 s Reason: builder failed with exit code 100.
  492. 25.37 s Output paths:
  493. 25.37 s /nix/store/m6wbas79fxijf98k47qgcx8am2457ykb-gammaloop-nextest-core
  494. 25.37 s Last 473 log lines:
  495. 25.37 s > Extracting 3 binaries (including 1 non-test binary), 1 build script output directory, and 2 linked paths to /build/nextest-archive-wc3FDK
  496. 25.37 s > Extracted 18 files to /build/nextest-archive-wc3FDK in 0.40s
  497. 25.37 s > ------------
  498. 25.37 s > Nextest run ID a9408c16-b3e9-4b68-97be-c706e24b68ee with nextest profile: ci_gammaloop
  499. 25.37 s > Starting 339 tests across 2 binaries
  500. 25.37 s > ------------
  501. 25.37 s > Summary [ 0.422s] 339 tests run: 339 passed, 0 skipped
  502. 25.37 s >
  503. 25.37 s > ========== nextest test summary ==========
  504. 25.37 s > report: target/nextest/ci_gammaloop/junit.xml
  505. 25.37 s > tests: 339, failures: 0, errors: 0
  506. 25.37 s > No failing testcases found.
  507. 25.37 s > =========================================
  508. 25.37 s > Extracting 1 binary and 1 linked path to /build/nextest-archive-MnLGXq
  509. 25.37 s > Extracted 7 files to /build/nextest-archive-MnLGXq in 0.06s
  510. 25.37 s > ------------
  511. 25.37 s > Nextest run ID 18599266-b990-477b-b835-a548760d2e19 with nextest profile: ci_gammaloop
  512. 25.37 s > Starting 19 tests across 1 binary
  513. 25.37 s > ------------
  514. 25.37 s > Summary [ 0.010s] 19 tests run: 19 passed, 0 skipped
  515. 25.37 s >
  516. 25.37 s > ========== nextest test summary ==========
  517. 25.37 s > report: target/nextest/ci_gammaloop/junit.xml
  518. 25.37 s > tests: 19, failures: 0, errors: 0
  519. 25.37 s > No failing testcases found.
  520. 25.37 s > =========================================
  521. 25.37 s > Extracting 1 binary to /build/nextest-archive-pR0GjV
  522. 25.37 s > Extracted 4 files to /build/nextest-archive-pR0GjV in 0.03s
  523. 25.37 s > ------------
  524. 25.37 s > Nextest run ID e4759f32-171b-48b6-bec3-97e9128df0e3 with nextest profile: ci_gammaloop
  525. 25.37 s > Starting 0 tests across 1 binary
  526. 25.37 s > ------------
  527. 25.37 s > Summary [ 0.000s] 0 tests run: 0 passed, 0 skipped
  528. 25.37 s >
  529. 25.37 s > ========== nextest test summary ==========
  530. 25.37 s > report: target/nextest/ci_gammaloop/junit.xml
  531. 25.37 s > tests: 0, failures: 0, errors: 0
  532. 25.37 s > No failing testcases found.
  533. 25.37 s > =========================================
  534. 25.37 s > Extracting 4 binaries, 1 build script output directory, and 2 linked paths to /build/nextest-archive-DrHsDI
  535. 25.37 s > Extracted 18 files to /build/nextest-archive-DrHsDI in 0.41s
  536. 25.37 s > ------------
  537. 25.37 s > Nextest run ID 9b7a801a-811a-4856-8d7f-bcbe9c637238 with nextest profile: ci_gammaloop
  538. 25.37 s > Starting 456 tests across 4 binaries (61 tests skipped, including 60 tests via profile.ci_gammaloop.default-filter)
  539. 25.37 s > FAIL [ 0.336s] (446/456) gammalooprs::test_renormalization finit_part_ghlo
  540. 25.37 s > stdout ---
  541. 25.37 s >
  542. 25.37 s > running 1 test
  543. 25.37 s > ren part: 1/2*GC_10^2*dot(P(0,mink(dim)),P(0,mink(dim)))*cas(2,coad(8))/ε
  544. 25.37 s > ━━━━━━━━━━━━━━━━━━━━━━━━━━━━━━━ Snapshot Summary ━━━━━━━━━━━━━━━━━━━━━━━━━━━━━━━
  545. 25.37 s > Snapshot: finit_part_ghlo
  546. 25.37 s > Source: crates/gammalooprs/tests/test_renormalization.rs:557
  547. 25.37 s > ────────────────────────────────────────────────────────────────────────────────
  548. 25.37 s > Expression: align_to_rqft(&a, &model).to_bare_ordered_string()
  549. 25.37 s > ────────────────────────────────────────────────────────────────────────────────
  550. 25.37 s > -old snapshot
  551. 25.37 s > +new results
  552. 25.37 s > ────────────┬───────────────────────────────────────────────────────────────────
  553. 25.37 s > 1 │--1/2*cas(2,coad(8))*dot(P(0,mink(4)),P(0,mink(4)))*gs^2*ε^(-1)
  554. 25.37 s > 1 │+1/2*cas(2,coad(8))*dot(P(0,mink(4)),P(0,mink(4)))*gs^2*ε^(-1)
  555. 25.37 s > ────────────┴───────────────────────────────────────────────────────────────────
  556. 25.37 s > To update snapshots run `cargo insta review`
  557. 25.37 s > Stopped on the first failure. Run `cargo insta test` to run all snapshots.
  558. 25.37 s > test finit_part_ghlo ... FAILED
  559. 25.37 s >
  560. 25.37 s > failures:
  561. 25.37 s >
  562. 25.37 s > failures:
  563. 25.37 s > finit_part_ghlo
  564. 25.37 s >
  565. 25.37 s > test result: FAILED. 0 passed; 1 failed; 0 ignored; 0 measured; 5 filtered out; finished in 0.33s
  566. 25.37 s >
  567. 25.37 s > stderr ---
  568. 25.37 s > The application panicked (crashed).
  569. 25.37 s > Message: snapshot assertion for 'finit_part_ghlo' failed in line 557
  570. 25.37 s > Location: /nix/store/5nq6hmff26w9jbhbmba4wsvgnvglj2xd-vendor-cargo-deps/c19b7c6f923b580ac259164a89f2577984ad5ab09ee9d583b888f934adbbe8d0/insta-1.47.2/src/runtime.rs:719
  571. 25.37 s >
  572. 25.37 s > ━━━━━━━━━━━━━━━━━━━━━━━━━━━━━━━━━━ BACKTRACE ━━━━━━━━━━━━━━━━━━━━━━━━━━━━━━━━━━━
  573. 25.37 s > 1: <color_eyre[51793ea62743adbd]::config::PanicHook>::panic_report<unknown>
  574. 25.37 s > at <unknown source file>:<unknown line>
  575. 25.37 s > 2: <color_eyre[51793ea62743adbd]::config::PanicHook>::into_panic_hook::{closure#0}<unknown>
  576. 25.37 s > at <unknown source file>:<unknown line>
  577. 25.37 s > 3: std[bcb96dfbba0ab899]::panicking::panic_with_hook<unknown>
  578. 25.37 s > at <unknown source file>:<unknown line>
  579. 25.37 s > 4: std[bcb96dfbba0ab899]::panicking::panic_handler::{closure#0}<unknown>
  580. 25.37 s > at <unknown source file>:<unknown line>
  581. 25.37 s > 5: std[bcb96dfbba0ab899]::sys::backtrace::__rust_end_short_backtrace::<std[bcb96dfbba0ab899]::panicking::panic_handler::{closure#0}, !><unknown>
  582. 25.37 s > at <unknown source file>:<unknown line>
  583. 25.37 s > 6: __rustc[6c289b9f9c454d21]::rust_begin_unwind<unknown>
  584. 25.37 s > at <unknown source file>:<unknown line>
  585. 25.37 s > 7: core[940e698046960fd5]::panicking::panic_fmt<unknown>
  586. 25.37 s > at <unknown source file>:<unknown line>
  587. 25.37 s > 8: insta[307a548ac79ef4d9]::runtime::assert_snapshot<unknown>
  588. 25.37 s > at <unknown source file>:<unknown line>
  589. 25.37 s > 9: <test_renormalization[a909d96d00a50d41]::finit_part_ghlo::{closure#0} as core[940e698046960fd5]::ops::function::FnOnce<()>>::call_once<unknown>
  590. 25.37 s > at <unknown source file>:<unknown line>
  591. 25.37 s > 10: test[75d6903177b1d7e9]::__rust_begin_short_backtrace::<core[940e698046960fd5]::result::Result<(), alloc[2ea6bcb46fca0c42]::string::String>, fn() -> core[940e698046960fd5]::result::Result<(), alloc[2ea6bcb46fca0c42]::string::String>><unknown>
  592. 25.37 s > at <unknown source file>:<unknown line>
  593. 25.37 s > 11: test[75d6903177b1d7e9]::run_test::{closure#0}<unknown>
  594. 25.37 s > at <unknown source file>:<unknown line>
  595. 25.37 s > 12: std[bcb96dfbba0ab899]::sys::backtrace::__rust_begin_short_backtrace::<test[75d6903177b1d7e9]::run_test::{closure#1}, ()><unknown>
  596. 25.37 s > at <unknown source file>:<unknown line>
  597. 25.37 s > 13: <std[bcb96dfbba0ab899]::thread::lifecycle::spawn_unchecked<test[75d6903177b1d7e9]::run_test::{closure#1}, ()>::{closure#1} as core[940e698046960fd5]::ops::function::FnOnce<()>>::call_once::{shim:vtable#0}<unknown>
  598. 25.37 s > at <unknown source file>:<unknown line>
  599. 25.37 s > 14: <std[bcb96dfbba0ab899]::sys::thread::unix::Thread>::new::thread_start<unknown>
  600. 25.37 s > at <unknown source file>:<unknown line>
  601. 25.37 s > 15: start_thread<unknown>
  602. 25.37 s > at <unknown source file>:<unknown line>
  603. 25.37 s > 16: __clone3<unknown>
  604. 25.37 s > at <unknown source file>:<unknown line>
  605. 25.37 s >
  606. 25.37 s > Run with COLORBT_SHOW_HIDDEN=1 environment variable to disable frame filtering.
  607. 25.37 s > Run with RUST_BACKTRACE=full to include source snippets.
  608. 25.37 s >
  609. 25.37 s > FAIL [ 2.110s] (452/456) gammalooprs::test_renormalization finite_part_ghost_2loop
  610. 25.37 s > stdout ---
  611. 25.37 s >
  612. 25.37 s > running 1 test
  613. 25.37 s > ━━━━━━━━━━━━━━━━━━━━━━━━━━━━━━━ Snapshot Summary ━━━━━━━━━━━━━━━━━━━━━━━━━━━━━━━
  614. 25.37 s > Snapshot: finite_part_ghost_2loop-3
  615. 25.37 s > Source: crates/gammalooprs/tests/test_renormalization.rs:464
  616. 25.37 s > ────────────────────────────────────────────────────────────────────────────────
  617. 25.37 s > Expression: align_to_rqft(&a, &model).to_bare_ordered_string()
  618. 25.37 s > ────────────────────────────────────────────────────────────────────────────────
  619. 25.37 s > -old snapshot
  620. 25.37 s > +new results
  621. 25.37 s > ────────────┬───────────────────────────────────────────────────────────────────
  622. 25.37 s > 1 │-(-1𝑖/32*ε+1𝑖/16)*(cas(2,coad(8)))^2*dot(P(0,mink(4)),P(0,mink(4)))*gs^4*ε^(-2)
  623. 25.37 s > 1 │+(-1𝑖/16+1𝑖/32*ε)*(cas(2,coad(8)))^2*dot(P(0,mink(4)),P(0,mink(4)))*gs^4*ε^(-2)
  624. 25.37 s > ────────────┴───────────────────────────────────────────────────────────────────
  625. 25.37 s > To update snapshots run `cargo insta review`
  626. 25.38 s > Stopped on the first failure. Run `cargo insta test` to run all snapshots.
  627. 25.38 s > test finite_part_ghost_2loop ... FAILED
  628. 25.38 s >
  629. 25.38 s > failures:
  630. 25.38 s >
  631. 25.38 s > failures:
  632. 25.38 s > finite_part_ghost_2loop
  633. 25.38 s >
  634. 25.38 s > test result: FAILED. 0 passed; 1 failed; 0 ignored; 0 measured; 5 filtered out; finished in 2.10s
  635. 25.38 s >
  636. 25.38 s > stderr ---
  637. 25.38 s > The application panicked (crashed).
  638. 25.38 s > Message: snapshot assertion for 'finite_part_ghost_2loop-3' failed in line 464
  639. 25.38 s > Location: /nix/store/5nq6hmff26w9jbhbmba4wsvgnvglj2xd-vendor-cargo-deps/c19b7c6f923b580ac259164a89f2577984ad5ab09ee9d583b888f934adbbe8d0/insta-1.47.2/src/runtime.rs:719
  640. 25.38 s >
  641. 25.38 s > ━━━━━━━━━━━━━━━━━━━━━━━━━━━━━━━━━━ BACKTRACE ━━━━━━━━━━━━━━━━━━━━━━━━━━━━━━━━━━━
  642. 25.38 s > 1: <color_eyre[51793ea62743adbd]::config::PanicHook>::panic_report<unknown>
  643. 25.38 s > at <unknown source file>:<unknown line>
  644. 25.38 s > 2: <color_eyre[51793ea62743adbd]::config::PanicHook>::into_panic_hook::{closure#0}<unknown>
  645. 25.38 s > at <unknown source file>:<unknown line>
  646. 25.38 s > 3: std[bcb96dfbba0ab899]::panicking::panic_with_hook<unknown>
  647. 25.38 s > at <unknown source file>:<unknown line>
  648. 25.38 s > 4: std[bcb96dfbba0ab899]::panicking::panic_handler::{closure#0}<unknown>
  649. 25.38 s > at <unknown source file>:<unknown line>
  650. 25.38 s > 5: std[bcb96dfbba0ab899]::sys::backtrace::__rust_end_short_backtrace::<std[bcb96dfbba0ab899]::panicking::panic_handler::{closure#0}, !><unknown>
  651. 25.38 s > at <unknown source file>:<unknown line>
  652. 25.38 s > 6: __rustc[6c289b9f9c454d21]::rust_begin_unwind<unknown>
  653. 25.38 s > at <unknown source file>:<unknown line>
  654. 25.38 s > 7: core[940e698046960fd5]::panicking::panic_fmt<unknown>
  655. 25.38 s > at <unknown source file>:<unknown line>
  656. 25.38 s > 8: insta[307a548ac79ef4d9]::runtime::assert_snapshot<unknown>
  657. 25.38 s > at <unknown source file>:<unknown line>
  658. 25.38 s > 9: test_renormalization[a909d96d00a50d41]::finite_part_ghost_2loop<unknown>
  659. 25.38 s > at <unknown source file>:<unknown line>
  660. 25.38 s > 10: <test_renormalization[a909d96d00a50d41]::finite_part_ghost_2loop::{closure#0} as core[940e698046960fd5]::ops::function::FnOnce<()>>::call_once<unknown>
  661. 25.38 s > at <unknown source file>:<unknown line>
  662. 25.38 s > 11: test[75d6903177b1d7e9]::__rust_begin_short_backtrace::<core[940e698046960fd5]::result::Result<(), alloc[2ea6bcb46fca0c42]::string::String>, fn() -> core[940e698046960fd5]::result::Result<(), alloc[2ea6bcb46fca0c42]::string::String>><unknown>
  663. 25.38 s > at <unknown source file>:<unknown line>
  664. 25.38 s > 12: test[75d6903177b1d7e9]::run_test::{closure#0}<unknown>
  665. 25.38 s > at <unknown source file>:<unknown line>
  666. 25.38 s > 13: std[bcb96dfbba0ab899]::sys::backtrace::__rust_begin_short_backtrace::<test[75d6903177b1d7e9]::run_test::{closure#1}, ()><unknown>
  667. 25.38 s > at <unknown source file>:<unknown line>
  668. 25.38 s > 14: <std[bcb96dfbba0ab899]::thread::lifecycle::spawn_unchecked<test[75d6903177b1d7e9]::run_test::{closure#1}, ()>::{closure#1} as core[940e698046960fd5]::ops::function::FnOnce<()>>::call_once::{shim:vtable#0}<unknown>
  669. 25.38 s > at <unknown source file>:<unknown line>
  670. 25.38 s > 15: <std[bcb96dfbba0ab899]::sys::thread::unix::Thread>::new::thread_start<unknown>
  671. 25.38 s > at <unknown source file>:<unknown line>
  672. 25.38 s > 16: start_thread<unknown>
  673. 25.38 s > at <unknown source file>:<unknown line>
  674. 25.38 s > 17: __clone3<unknown>
  675. 25.38 s > at <unknown source file>:<unknown line>
  676. 25.38 s >
  677. 25.38 s > Run with COLORBT_SHOW_HIDDEN=1 environment variable to disable frame filtering.
  678. 25.38 s > Run with RUST_BACKTRACE=full to include source snippets.
  679. 25.38 s >
  680. 25.38 s > ------------
  681. 25.38 s > Summary [ 8.169s] 456 tests run: 454 passed, 2 failed, 61 skipped
  682. 25.38 s > FAIL [ 0.336s] (446/456) gammalooprs::test_renormalization finit_part_ghlo
  683. 25.38 s > stdout ---
  684. 25.38 s >
  685. 25.38 s > running 1 test
  686. 25.38 s > ren part: 1/2*GC_10^2*dot(P(0,mink(dim)),P(0,mink(dim)))*cas(2,coad(8))/ε
  687. 25.38 s > ━━━━━━━━━━━━━━━━━━━━━━━━━━━━━━━ Snapshot Summary ━━━━━━━━━━━━━━━━━━━━━━━━━━━━━━━
  688. 25.38 s > Snapshot: finit_part_ghlo
  689. 25.38 s > Source: crates/gammalooprs/tests/test_renormalization.rs:557
  690. 25.38 s > ────────────────────────────────────────────────────────────────────────────────
  691. 25.38 s > Expression: align_to_rqft(&a, &model).to_bare_ordered_string()
  692. 25.38 s > ────────────────────────────────────────────────────────────────────────────────
  693. 25.38 s > -old snapshot
  694. 25.38 s > +new results
  695. 25.38 s > ────────────┬───────────────────────────────────────────────────────────────────
  696. 25.38 s > 1 │--1/2*cas(2,coad(8))*dot(P(0,mink(4)),P(0,mink(4)))*gs^2*ε^(-1)
  697. 25.38 s > 1 │+1/2*cas(2,coad(8))*dot(P(0,mink(4)),P(0,mink(4)))*gs^2*ε^(-1)
  698. 25.38 s > ────────────┴───────────────────────────────────────────────────────────────────
  699. 25.38 s > To update snapshots run `cargo insta review`
  700. 25.38 s > Stopped on the first failure. Run `cargo insta test` to run all snapshots.
  701. 25.38 s > test finit_part_ghlo ... FAILED
  702. 25.38 s >
  703. 25.38 s > failures:
  704. 25.38 s >
  705. 25.38 s > failures:
  706. 25.38 s > finit_part_ghlo
  707. 25.38 s >
  708. 25.38 s > test result: FAILED. 0 passed; 1 failed; 0 ignored; 0 measured; 5 filtered out; finished in 0.33s
  709. 25.38 s >
  710. 25.38 s > stderr ---
  711. 25.38 s > The application panicked (crashed).
  712. 25.38 s > Message: snapshot assertion for 'finit_part_ghlo' failed in line 557
  713. 25.38 s > Location: /nix/store/5nq6hmff26w9jbhbmba4wsvgnvglj2xd-vendor-cargo-deps/c19b7c6f923b580ac259164a89f2577984ad5ab09ee9d583b888f934adbbe8d0/insta-1.47.2/src/runtime.rs:719
  714. 25.38 s >
  715. 25.38 s > ━━━━━━━━━━━━━━━━━━━━━━━━━━━━━━━━━━ BACKTRACE ━━━━━━━━━━━━━━━━━━━━━━━━━━━━━━━━━━━
  716. 25.38 s > 1: <color_eyre[51793ea62743adbd]::config::PanicHook>::panic_report<unknown>
  717. 25.38 s > at <unknown source file>:<unknown line>
  718. 25.38 s > 2: <color_eyre[51793ea62743adbd]::config::PanicHook>::into_panic_hook::{closure#0}<unknown>
  719. 25.38 s > at <unknown source file>:<unknown line>
  720. 25.38 s > 3: std[bcb96dfbba0ab899]::panicking::panic_with_hook<unknown>
  721. 25.38 s > at <unknown source file>:<unknown line>
  722. 25.38 s > 4: std[bcb96dfbba0ab899]::panicking::panic_handler::{closure#0}<unknown>
  723. 25.38 s > at <unknown source file>:<unknown line>
  724. 25.38 s > 5: std[bcb96dfbba0ab899]::sys::backtrace::__rust_end_short_backtrace::<std[bcb96dfbba0ab899]::panicking::panic_handler::{closure#0}, !><unknown>
  725. 25.38 s > at <unknown source file>:<unknown line>
  726. 25.38 s > 6: __rustc[6c289b9f9c454d21]::rust_begin_unwind<unknown>
  727. 25.38 s > at <unknown source file>:<unknown line>
  728. 25.38 s > 7: core[940e698046960fd5]::panicking::panic_fmt<unknown>
  729. 25.38 s > at <unknown source file>:<unknown line>
  730. 25.38 s > 8: insta[307a548ac79ef4d9]::runtime::assert_snapshot<unknown>
  731. 25.38 s > at <unknown source file>:<unknown line>
  732. 25.38 s > 9: <test_renormalization[a909d96d00a50d41]::finit_part_ghlo::{closure#0} as core[940e698046960fd5]::ops::function::FnOnce<()>>::call_once<unknown>
  733. 25.38 s > at <unknown source file>:<unknown line>
  734. 25.38 s > 10: test[75d6903177b1d7e9]::__rust_begin_short_backtrace::<core[940e698046960fd5]::result::Result<(), alloc[2ea6bcb46fca0c42]::string::String>, fn() -> core[940e698046960fd5]::result::Result<(), alloc[2ea6bcb46fca0c42]::string::String>><unknown>
  735. 25.38 s > at <unknown source file>:<unknown line>
  736. 25.38 s > 11: test[75d6903177b1d7e9]::run_test::{closure#0}<unknown>
  737. 25.38 s > at <unknown source file>:<unknown line>
  738. 25.38 s > 12: std[bcb96dfbba0ab899]::sys::backtrace::__rust_begin_short_backtrace::<test[75d6903177b1d7e9]::run_test::{closure#1}, ()><unknown>
  739. 25.38 s > at <unknown source file>:<unknown line>
  740. 25.38 s > 13: <std[bcb96dfbba0ab899]::thread::lifecycle::spawn_unchecked<test[75d6903177b1d7e9]::run_test::{closure#1}, ()>::{closure#1} as core[940e698046960fd5]::ops::function::FnOnce<()>>::call_once::{shim:vtable#0}<unknown>
  741. 25.38 s > at <unknown source file>:<unknown line>
  742. 25.38 s > 14: <std[bcb96dfbba0ab899]::sys::thread::unix::Thread>::new::thread_start<unknown>
  743. 25.38 s > at <unknown source file>:<unknown line>
  744. 25.38 s > 15: start_thread<unknown>
  745. 25.38 s > at <unknown source file>:<unknown line>
  746. 25.38 s > 16: __clone3<unknown>
  747. 25.38 s > at <unknown source file>:<unknown line>
  748. 25.38 s >
  749. 25.38 s > Run with COLORBT_SHOW_HIDDEN=1 environment variable to disable frame filtering.
  750. 25.38 s > Run with RUST_BACKTRACE=full to include source snippets.
  751. 25.38 s >
  752. 25.38 s > FAIL [ 2.110s] (452/456) gammalooprs::test_renormalization finite_part_ghost_2loop
  753. 25.38 s > stdout ---
  754. 25.38 s >
  755. 25.38 s > running 1 test
  756. 25.38 s > ━━━━━━━━━━━━━━━━━━━━━━━━━━━━━━━ Snapshot Summary ━━━━━━━━━━━━━━━━━━━━━━━━━━━━━━━
  757. 25.38 s > Snapshot: finite_part_ghost_2loop-3
  758. 25.38 s > Source: crates/gammalooprs/tests/test_renormalization.rs:464
  759. 25.38 s > ────────────────────────────────────────────────────────────────────────────────
  760. 25.38 s > Expression: align_to_rqft(&a, &model).to_bare_ordered_string()
  761. 25.38 s > ────────────────────────────────────────────────────────────────────────────────
  762. 25.38 s > -old snapshot
  763. 25.38 s > +new results
  764. 25.38 s > ────────────┬───────────────────────────────────────────────────────────────────
  765. 25.38 s > 1 │-(-1𝑖/32*ε+1𝑖/16)*(cas(2,coad(8)))^2*dot(P(0,mink(4)),P(0,mink(4)))*gs^4*ε^(-2)
  766. 25.38 s > 1 │+(-1𝑖/16+1𝑖/32*ε)*(cas(2,coad(8)))^2*dot(P(0,mink(4)),P(0,mink(4)))*gs^4*ε^(-2)
  767. 25.38 s > ────────────┴───────────────────────────────────────────────────────────────────
  768. 25.38 s > To update snapshots run `cargo insta review`
  769. 25.38 s > Stopped on the first failure. Run `cargo insta test` to run all snapshots.
  770. 25.38 s > test finite_part_ghost_2loop ... FAILED
  771. 25.38 s >
  772. 25.38 s > failures:
  773. 25.38 s >
  774. 25.38 s > failures:
  775. 25.38 s > finite_part_ghost_2loop
  776. 25.38 s >
  777. 25.38 s > test result: FAILED. 0 passed; 1 failed; 0 ignored; 0 measured; 5 filtered out; finished in 2.10s
  778. 25.38 s >
  779. 25.38 s > stderr ---
  780. 25.38 s > The application panicked (crashed).
  781. 25.38 s > Message: snapshot assertion for 'finite_part_ghost_2loop-3' failed in line 464
  782. 25.38 s > Location: /nix/store/5nq6hmff26w9jbhbmba4wsvgnvglj2xd-vendor-cargo-deps/c19b7c6f923b580ac259164a89f2577984ad5ab09ee9d583b888f934adbbe8d0/insta-1.47.2/src/runtime.rs:719
  783. 25.38 s >
  784. 25.38 s > ━━━━━━━━━━━━━━━━━━━━━━━━━━━━━━━━━━ BACKTRACE ━━━━━━━━━━━━━━━━━━━━━━━━━━━━━━━━━━━
  785. 25.38 s > 1: <color_eyre[51793ea62743adbd]::config::PanicHook>::panic_report<unknown>
  786. 25.38 s > at <unknown source file>:<unknown line>
  787. 25.38 s > 2: <color_eyre[51793ea62743adbd]::config::PanicHook>::into_panic_hook::{closure#0}<unknown>
  788. 25.38 s > at <unknown source file>:<unknown line>
  789. 25.38 s > 3: std[bcb96dfbba0ab899]::panicking::panic_with_hook<unknown>
  790. 25.38 s > at <unknown source file>:<unknown line>
  791. 25.38 s > 4: std[bcb96dfbba0ab899]::panicking::panic_handler::{closure#0}<unknown>
  792. 25.38 s > at <unknown source file>:<unknown line>
  793. 25.38 s > 5: std[bcb96dfbba0ab899]::sys::backtrace::__rust_end_short_backtrace::<std[bcb96dfbba0ab899]::panicking::panic_handler::{closure#0}, !><unknown>
  794. 25.38 s > at <unknown source file>:<unknown line>
  795. 25.38 s > 6: __rustc[6c289b9f9c454d21]::rust_begin_unwind<unknown>
  796. 25.38 s > at <unknown source file>:<unknown line>
  797. 25.38 s > 7: core[940e698046960fd5]::panicking::panic_fmt<unknown>
  798. 25.38 s > at <unknown source file>:<unknown line>
  799. 25.38 s > 8: insta[307a548ac79ef4d9]::runtime::assert_snapshot<unknown>
  800. 25.38 s > at <unknown source file>:<unknown line>
  801. 25.38 s > 9: test_renormalization[a909d96d00a50d41]::finite_part_ghost_2loop<unknown>
  802. 25.38 s > at <unknown source file>:<unknown line>
  803. 25.38 s > 10: <test_renormalization[a909d96d00a50d41]::finite_part_ghost_2loop::{closure#0} as core[940e698046960fd5]::ops::function::FnOnce<()>>::call_once<unknown>
  804. 25.38 s > at <unknown source file>:<unknown line>
  805. 25.38 s > 11: test[75d6903177b1d7e9]::__rust_begin_short_backtrace::<core[940e698046960fd5]::result::Result<(), alloc[2ea6bcb46fca0c42]::string::String>, fn() -> core[940e698046960fd5]::result::Result<(), alloc[2ea6bcb46fca0c42]::string::String>><unknown>
  806. 25.38 s > at <unknown source file>:<unknown line>
  807. 25.38 s > 12: test[75d6903177b1d7e9]::run_test::{closure#0}<unknown>
  808. 25.38 s > at <unknown source file>:<unknown line>
  809. 25.38 s > 13: std[bcb96dfbba0ab899]::sys::backtrace::__rust_begin_short_backtrace::<test[75d6903177b1d7e9]::run_test::{closure#1}, ()><unknown>
  810. 25.38 s > at <unknown source file>:<unknown line>
  811. 25.38 s > 14: <std[bcb96dfbba0ab899]::thread::lifecycle::spawn_unchecked<test[75d6903177b1d7e9]::run_test::{closure#1}, ()>::{closure#1} as core[940e698046960fd5]::ops::function::FnOnce<()>>::call_once::{shim:vtable#0}<unknown>
  812. 25.38 s > at <unknown source file>:<unknown line>
  813. 25.38 s > 15: <std[bcb96dfbba0ab899]::sys::thread::unix::Thread>::new::thread_start<unknown>
  814. 25.38 s > at <unknown source file>:<unknown line>
  815. 25.38 s > 16: start_thread<unknown>
  816. 25.38 s > at <unknown source file>:<unknown line>
  817. 25.38 s > 17: __clone3<unknown>
  818. 25.38 s > at <unknown source file>:<unknown line>
  819. 25.38 s >
  820. 25.38 s > Run with COLORBT_SHOW_HIDDEN=1 environment variable to disable frame filtering.
  821. 25.38 s > Run with RUST_BACKTRACE=full to include source snippets.
  822. 25.38 s >
  823. 25.38 s > error: test run failed
  824. 25.38 s >
  825. 25.38 s > ========== nextest test summary ==========
  826. 25.38 s > report: target/nextest/ci_gammaloop/junit.xml
  827. 25.38 s > tests: 456, failures: 2, errors: 0
  828. 25.38 s >
  829. 25.38 s > 1. gammalooprs::test_renormalization::finit_part_ghlo
  830. 25.38 s > failure: test failure with exit code 101
  831. 25.38 s > system-out
  832. 25.38 s > running 1 test
  833. 25.38 s > ren part: 1/2*GC_10^2*dot(P(0,mink(dim)),P(0,mink(dim)))*cas(2,coad(8))/ε
  834. 25.38 s > ━━━━━━━━━━━━━━━━━━━━━━━━━━━━━━━ Snapshot Summary ━━━━━━━━━━━━━━━━━━━━━━━━━━━━━━━
  835. 25.38 s > Snapshot: finit_part_ghlo
  836. 25.38 s > Source: crates/gammalooprs/tests/test_renormalization.rs:557
  837. 25.38 s > ────────────────────────────────────────────────────────────────────────────────
  838. 25.38 s > Expression: align_to_rqft(&a, &model).to_bare_ordered_string()
  839. 25.38 s > ────────────────────────────────────────────────────────────────────────────────
  840. 25.38 s > -old snapshot
  841. 25.38 s > +new results
  842. 25.38 s > ────────────┬───────────────────────────────────────────────────────────────────
  843. 25.38 s > 1 │--1/2*cas(2,coad(8))*dot(P(0,mink(4)),P(0,mink(4)))*gs^2*ε^(-1)
  844. 25.38 s > 1 │+1/2*cas(2,coad(8))*dot(P(0,mink(4)),P(0,mink(4)))*gs^2*ε^(-1)
  845. 25.38 s > ────────────┴───────────────────────────────────────────────────────────────────
  846. 25.38 s > To update snapshots run `cargo insta review`
  847. 25.38 s > Stopped on the first failure. Run `cargo insta test` to run all snapshots.
  848. 25.38 s > test finit_part_ghlo ... FAILED
  849. 25.38 s >
  850. 25.38 s > failures:
  851. 25.38 s >
  852. 25.38 s > failures:
  853. 25.38 s > finit_part_ghlo
  854. 25.38 s >
  855. 25.38 s > test result: FAILED. 0 passed; 1 failed; 0 ignored; 0 measured; 5 filtered out; finished in 0.33s
  856. 25.38 s > system-err
  857. 25.38 s > The application panicked (crashed).
  858. 25.38 s > Message: snapshot assertion for 'finit_part_ghlo' failed in line 557
  859. 25.38 s > Location: /nix/store/5nq6hmff26w9jbhbmba4wsvgnvglj2xd-vendor-cargo-deps/c19b7c6f923b580ac259164a89f2577984ad5ab09ee9d583b888f934adbbe8d0/insta-1.47.2/src/runtime.rs:719
  860. 25.38 s >
  861. 25.38 s > ━━━━━━━━━━━━━━━━━━━━━━━━━━━━━━━━━━ BACKTRACE ━━━━━━━━━━━━━━━━━━━━━━━━━━━━━━━━━━━
  862. 25.38 s > 1: <color_eyre[51793ea62743adbd]::config::PanicHook>::panic_report<unknown>
  863. 25.38 s > at <unknown source file>:<unknown line>
  864. 25.38 s > 2: <color_eyre[51793ea62743adbd]::config::PanicHook>::into_panic_hook::{closure#0}<unknown>
  865. 25.38 s > at <unknown source file>:<unknown line>
  866. 25.38 s > 3: std[bcb96dfbba0ab899]::panicking::panic_with_hook<unknown>
  867. 25.38 s > at <unknown source file>:<unknown line>
  868. 25.38 s > 4: std[bcb96dfbba0ab899]::panicking::panic_handler::{closure#0}<unknown>
  869. 25.38 s > at <unknown source file>:<unknown line>
  870. 25.38 s > 5: std[bcb96dfbba0ab899]::sys::backtrace::__rust_end_short_backtrace::<std[bcb96dfbba0ab899]::panicking::panic_handler::{closure#0}, !><unknown>
  871. 25.38 s > at <unknown source file>:<unknown line>
  872. 25.38 s > 6: __rustc[6c289b9f9c454d21]::rust_begin_unwind<unknown>
  873. 25.38 s > at <unknown source file>:<unknown line>
  874. 25.38 s > 7: core[940e698046960fd5]::panicking::panic_fmt<unknown>
  875. 25.38 s > at <unknown source file>:<unknown line>
  876. 25.38 s > 8: insta[307a548ac79ef4d9]::runtime::assert_snapshot<unknown>
  877. 25.38 s > at <unknown source file>:<unknown line>
  878. 25.38 s > 9: <test_renormalization[a909d96d00a50d41]::finit_part_ghlo::{closure#0} as core[940e698046960fd5]::ops::function::FnOnce<()>>::call_once<unknown>
  879. 25.38 s > at <unknown source file>:<unknown line>
  880. 25.38 s > 10: test[75d6903177b1d7e9]::__rust_begin_short_backtrace::<core[940e698046960fd5]::result::Result<(), alloc[2ea6bcb46fca0c42]::string::String>, fn() -> core[940e698046960fd5]::result::Result<(), alloc[2ea6bcb46fca0c42]::string::String>><unknown>
  881. 25.38 s > at <unknown source file>:<unknown line>
  882. 25.38 s > 11: test[75d6903177b1d7e9]::run_test::{closure#0}<unknown>
  883. 25.38 s > at <unknown source file>:<unknown line>
  884. 25.38 s > 12: std[bcb96dfbba0ab899]::sys::backtrace::__rust_begin_short_backtrace::<test[75d6903177b1d7e9]::run_test::{closure#1}, ()><unknown>
  885. 25.38 s > at <unknown source file>:<unknown line>
  886. 25.38 s > 13: <std[bcb96dfbba0ab899]::thread::lifecycle::spawn_unchecked<test[75d6903177b1d7e9]::run_test::{closure#1}, ()>::{closure#1} as core[940e698046960fd5]::ops::function::FnOnce<()>>::call_once::{shim:vtable#0}<unknown>
  887. 25.38 s > at <unknown source file>:<unknown line>
  888. 25.38 s > 14: <std[bcb96dfbba0ab899]::sys::thread::unix::Thread>::new::thread_start<unknown>
  889. 25.38 s > at <unknown source file>:<unknown line>
  890. 25.38 s > 15: start_thread<unknown>
  891. 25.38 s > at <unknown source file>:<unknown line>
  892. 25.38 s > 16: __clone3<unknown>
  893. 25.38 s > at <unknown source file>:<unknown line>
  894. 25.38 s >
  895. 25.38 s > Run with COLORBT_SHOW_HIDDEN=1 environment variable to disable frame filtering.
  896. 25.38 s > Run with RUST_BACKTRACE=full to include source snippets.
  897. 25.38 s >
  898. 25.38 s > 2. gammalooprs::test_renormalization::finite_part_ghost_2loop
  899. 25.38 s > failure: test failure with exit code 101
  900. 25.38 s > system-out
  901. 25.38 s > running 1 test
  902. 25.38 s > ━━━━━━━━━━━━━━━━━━━━━━━━━━━━━━━ Snapshot Summary ━━━━━━━━━━━━━━━━━━━━━━━━━━━━━━━
  903. 25.38 s > Snapshot: finite_part_ghost_2loop-3
  904. 25.38 s > Source: crates/gammalooprs/tests/test_renormalization.rs:464
  905. 25.38 s > ────────────────────────────────────────────────────────────────────────────────
  906. 25.38 s > Expression: align_to_rqft(&a, &model).to_bare_ordered_string()
  907. 25.38 s > ────────────────────────────────────────────────────────────────────────────────
  908. 25.38 s > -old snapshot
  909. 25.38 s > +new results
  910. 25.38 s > ────────────┬───────────────────────────────────────────────────────────────────
  911. 25.38 s > 1 │-(-1𝑖/32*ε+1𝑖/16)*(cas(2,coad(8)))^2*dot(P(0,mink(4)),P(0,mink(4)))*gs^4*ε^(-2)
  912. 25.38 s > 1 │+(-1𝑖/16+1𝑖/32*ε)*(cas(2,coad(8)))^2*dot(P(0,mink(4)),P(0,mink(4)))*gs^4*ε^(-2)
  913. 25.38 s > ────────────┴───────────────────────────────────────────────────────────────────
  914. 25.38 s > To update snapshots run `cargo insta review`
  915. 25.38 s > Stopped on the first failure. Run `cargo insta test` to run all snapshots.
  916. 25.38 s > test finite_part_ghost_2loop ... FAILED
  917. 25.38 s >
  918. 25.38 s > failures:
  919. 25.38 s >
  920. 25.38 s > failures:
  921. 25.38 s > finite_part_ghost_2loop
  922. 25.38 s >
  923. 25.38 s > test result: FAILED. 0 passed; 1 failed; 0 ignored; 0 measured; 5 filtered out; finished in 2.10s
  924. 25.38 s > system-err
  925. 25.38 s > The application panicked (crashed).
  926. 25.38 s > Message: snapshot assertion for 'finite_part_ghost_2loop-3' failed in line 464
  927. 25.38 s > Location: /nix/store/5nq6hmff26w9jbhbmba4wsvgnvglj2xd-vendor-cargo-deps/c19b7c6f923b580ac259164a89f2577984ad5ab09ee9d583b888f934adbbe8d0/insta-1.47.2/src/runtime.rs:719
  928. 25.38 s >
  929. 25.38 s > ━━━━━━━━━━━━━━━━━━━━━━━━━━━━━━━━━━ BACKTRACE ━━━━━━━━━━━━━━━━━━━━━━━━━━━━━━━━━━━
  930. 25.38 s > 1: <color_eyre[51793ea62743adbd]::config::PanicHook>::panic_report<unknown>
  931. 25.38 s > at <unknown source file>:<unknown line>
  932. 25.38 s > 2: <color_eyre[51793ea62743adbd]::config::PanicHook>::into_panic_hook::{closure#0}<unknown>
  933. 25.38 s > at <unknown source file>:<unknown line>
  934. 25.38 s > 3: std[bcb96dfbba0ab899]::panicking::panic_with_hook<unknown>
  935. 25.38 s > at <unknown source file>:<unknown line>
  936. 25.38 s > 4: std[bcb96dfbba0ab899]::panicking::panic_handler::{closure#0}<unknown>
  937. 25.38 s > at <unknown source file>:<unknown line>
  938. 25.38 s > 5: std[bcb96dfbba0ab899]::sys::backtrace::__rust_end_short_backtrace::<std[bcb96dfbba0ab899]::panicking::panic_handler::{closure#0}, !><unknown>
  939. 25.38 s > at <unknown source file>:<unknown line>
  940. 25.38 s > 6: __rustc[6c289b9f9c454d21]::rust_begin_unwind<unknown>
  941. 25.38 s > at <unknown source file>:<unknown line>
  942. 25.38 s > 7: core[940e698046960fd5]::panicking::panic_fmt<unknown>
  943. 25.38 s > at <unknown source file>:<unknown line>
  944. 25.38 s > 8: insta[307a548ac79ef4d9]::runtime::assert_snapshot<unknown>
  945. 25.38 s > at <unknown source file>:<unknown line>
  946. 25.38 s > 9: test_renormalization[a909d96d00a50d41]::finite_part_ghost_2loop<unknown>
  947. 25.38 s > at <unknown source file>:<unknown line>
  948. 25.38 s > 10: <test_renormalization[a909d96d00a50d41]::finite_part_ghost_2loop::{closure#0} as core[940e698046960fd5]::ops::function::FnOnce<()>>::call_once<unknown>
  949. 25.38 s > at <unknown source file>:<unknown line>
  950. 25.38 s > 11: test[75d6903177b1d7e9]::__rust_begin_short_backtrace::<core[940e698046960fd5]::result::Result<(), alloc[2ea6bcb46fca0c42]::string::String>, fn() -> core[940e698046960fd5]::result::Result<(), alloc[2ea6bcb46fca0c42]::string::String>><unknown>
  951. 25.38 s > at <unknown source file>:<unknown line>
  952. 25.38 s > 12: test[75d6903177b1d7e9]::run_test::{closure#0}<unknown>
  953. 25.38 s > at <unknown source file>:<unknown line>
  954. 25.38 s > 13: std[bcb96dfbba0ab899]::sys::backtrace::__rust_begin_short_backtrace::<test[75d6903177b1d7e9]::run_test::{closure#1}, ()><unknown>
  955. 25.38 s > at <unknown source file>:<unknown line>
  956. 25.38 s > 14: <std[bcb96dfbba0ab899]::thread::lifecycle::spawn_unchecked<test[75d6903177b1d7e9]::run_test::{closure#1}, ()>::{closure#1} as core[940e698046960fd5]::ops::function::FnOnce<()>>::call_once::{shim:vtable#0}<unknown>
  957. 25.38 s > at <unknown source file>:<unknown line>
  958. 25.38 s > 15: <std[bcb96dfbba0ab899]::sys::thread::unix::Thread>::new::thread_start<unknown>
  959. 25.38 s > at <unknown source file>:<unknown line>
  960. 25.38 s > 16: start_thread<unknown>
  961. 25.38 s > at <unknown source file>:<unknown line>
  962. 25.38 s > 17: __clone3<unknown>
  963. 25.38 s > at <unknown source file>:<unknown line>
  964. 25.38 s >
  965. 25.38 s > Run with COLORBT_SHOW_HIDDEN=1 environment variable to disable frame filtering.
  966. 25.38 s > Run with RUST_BACKTRACE=full to include source snippets.
  967. 25.38 s > =========================================
  968. 25.38 s For full logs, run:
  969. 25.38 s nix log /nix/store/bdjz1sm6jpf4ngrik4ql09axygsysbqj-gammaloop-nextest-core.drv
  970. 25.46 s [0 built (1 failed), 1 cRun failed.