test packages.x86_64-linux.nix-ci-check-gammaloop-nextest-core

Reproduce this run
Retry Run
  1. 0.14 s $ /nix/store/9ypz3flqsrl5xl495mm8h645gadjsxi1-coreutils-9.11/bin/timeout --kill-after=15s 7200s /nix/store/23zk8sgzamrbmj1fday15szf7f2279s8-nix-2.34.7/bin/nix --extra-experimental-features nix-command --extra-experimental-features flakes flake clone git+https://github.com/alphal00p/gammaloop --dest /tmp/nix-ci-worker/stable-pwd/repo/
  2. 0.17 s Cloning into '/tmp/nix-ci-worker/stable-pwd/repo'...
  3. 1.01 s remote: Enumerating objects: 65034, done.
  4. 1.12 s remote: Counting objects: 0% (1/7685) remote: Counting objects: 1% (77/7685) remote: Counting objects: 2% (154/7685) remote: Counting objects: 3% (231/7685) remote: Counting objects: 4% (308/7685) remote: Counting objects: 5% (385/7685) remote: Counting objects: 6% (462/7685) remote: Counting objects: 7% (538/7685) remote: Counting objects: 8% (615/7685) remote: Counting objects: 9% (692/7685) remote: Counting objects: 10% (769/7685) remote: Counting objects: 11% (846/7685) remote: Counting objects: 12% (923/7685) remote: Counting objects: 13% (1000/7685) remote: Counting objects: 14% (1076/7685) remote: Counting objects: 15% (1153/7685) remote: Counting objects: 16% (1230/7685) remote: Counting objects: 17% (1307/7685) remote: Counting objects: 18% (1384/7685) remote: Counting objects: 19% (1461/7685) remote: Counting objects: 20% (1537/7685) remote: Counting objects: 21% (1614/7685) remote: Counting objects: 22% (1691/7685) remote: Counting objects: 23% (1768/7685) remote: Counting objects: 24% (1845/7685) remote: Counting objects: 25% (1922/7685) remote: Counting objects: 26% (1999/7685) remote: Counting objects: 27% (2075/7685) remote: Counting objects: 28% (2152/7685) remote: Counting objects: 29% (2229/7685) remote: Counting objects: 30% (2306/7685) remote: Counting objects: 31% (2383/7685) remote: Counting objects: 32% (2460/7685) remote: Counting objects: 33% (2537/7685) remote: Counting objects: 34% (2613/7685) remote: Counting objects: 35% (2690/7685) remote: Counting objects: 36% (2767/7685) remote: Counting objects: 37% (2844/7685) remote: Counting objects: 38% (2921/7685) remote: Counting objects: 39% (2998/7685) remote: Counting objects: 40% (3074/7685) remote: Counting objects: 41% (3151/7685) remote: Counting objects: 42% (3228/7685) remote: Counting objects: 43% (3305/7685) remote: Counting objects: 44% (3382/7685) remote: Counting objects: 45% (3459/7685) remote: Counting objects: 46% (3536/7685) remote: Counting objects: 47% (3612/7685) remote: Counting objects: 48% (3689/7685) remote: Counting objects: 49% (3766/7685) remote: Counting objects: 50% (3843/7685) remote: Counting objects: 51% (3920/7685) remote: Counting objects: 52% (3997/7685) remote: Counting objects: 53% (4074/7685) remote: Counting objects: 54% (4150/7685) remote: Counting objects: 55% (4227/7685) remote: Counting objects: 56% (4304/7685) remote: Counting objects: 57% (4381/7685) remote: Counting objects: 58% (4458/7685) remote: Counting objects: 59% (4535/7685) remote: Counting objects: 60% (4611/7685) remote: Counting objects: 61% (4688/7685) remote: Counting objects: 62% (4765/7685) remote: Counting objects: 63% (4842/7685) remote: Counting objects: 64% (4919/7685) remote: Counting objects: 65% (4996/7685) remote: Counting objects: 66% (5073/7685) remote: Counting objects: 67% (5149/7685) remote: Counting objects: 68% (5226/7685) remote: Counting objects: 69% (5303/7685) remote: Counting objects: 70% (5380/7685) remote: Counting objects: 71% (5457/7685) remote: Counting objects: 72% (5534/7685) remote: Counting objects: 73% (5611/7685) remote: Counting objects: 74% (5687/7685) remote: Counting objects: 75% (5764/7685) remote: Counting objects: 76% (5841/7685) remote: Counting objects: 77% (5918/7685) remote: Counting objects: 78% (5995/7685) remote: Counting objects: 79% (6072/7685) remote: Counting objects: 80% (6148/7685) remote: Counting objects: 81% (6225/7685) remote: Counting objects: 82% (6302/7685) remote: Counting objects: 83% (6379/7685) remote: Counting objects: 84% (6456/7685) remote: Counting objects: 85% (6533/7685) remote: Counting objects: 86% (6610/7685) remote: Counting objects: 87% (6686/7685) remote: Counting objects: 88% (6763/7685) remote: Counting objects: 89% (6840/7685) remote: Counting objects: 90% (6917/7685) remote: Counting objects: 91% (6994/7685) remote: Counting objects: 92% (7071/7685) remote: Counting objects: 93% (7148/7685) remote: Counting objects: 94% (7224/7685) remote: Counting objects: 95% (7301/7685) remote: Counting objects: 96% (7378/7685) remote: Counting objects: 97% (7455/7685) remote: Counting objects: 98% (7532/7685) remote: Counting objects: 99% (7609/7685) remote: Counting objects: 100% (7685/7685) remote: Counting objects: 100% (7685/7685), done.
  5. 2.55 s remote: Compressing objects: 0% (1/1415) remote: Compressing objects: 1% (15/1415) remote: Compressing objects: 2% (29/1415) remote: Compressing objects: 3% (43/1415) remote: Compressing objects: 4% (57/1415) remote: Compressing objects: 5% (71/1415) remote: Compressing objects: 6% (85/1415) remote: Compressing objects: 7% (100/1415) remote: Compressing objects: 8% (114/1415) remote: Compressing objects: 9% (128/1415) remote: Compressing objects: 10% (142/1415) remote: Compressing objects: 11% (156/1415) remote: Compressing objects: 12% (170/1415) remote: Compressing objects: 12% (179/1415) remote: Compressing objects: 13% (184/1415) remote: Compressing objects: 14% (199/1415) remote: Compressing objects: 15% (213/1415) remote: Compressing objects: 16% (227/1415) remote: Compressing objects: 17% (241/1415) remote: Compressing objects: 18% (255/1415) remote: Compressing objects: 19% (269/1415) remote: Compressing objects: 20% (283/1415) remote: Compressing objects: 21% (298/1415) remote: Compressing objects: 22% (312/1415) remote: Compressing objects: 23% (326/1415) remote: Compressing objects: 24% (340/1415) remote: Compressing objects: 25% (354/1415) remote: Compressing objects: 26% (368/1415) remote: Compressing objects: 27% (383/1415) remote: Compressing objects: 28% (397/1415) remote: Compressing objects: 29% (411/1415) remote: Compressing objects: 30% (425/1415) remote: Compressing objects: 31% (439/1415) remote: Compressing objects: 32% (453/1415) remote: Compressing objects: 33% (467/1415) remote: Compressing objects: 34% (482/1415) remote: Compressing objects: 35% (496/1415) remote: Compressing objects: 36% (510/1415) remote: Compressing objects: 37% (524/1415) remote: Compressing objects: 38% (538/1415) remote: Compressing objects: 39% (552/1415) remote: Compressing objects: 40% (566/1415) remote: Compressing objects: 41% (581/1415) remote: Compressing objects: 42% (595/1415) remote: Compressing objects: 43% (609/1415) remote: Compressing objects: 44% (623/1415) remote: Compressing objects: 45% (637/1415) remote: Compressing objects: 46% (651/1415) remote: Compressing objects: 47% (666/1415) remote: Compressing objects: 48% (680/1415) remote: Compressing objects: 49% (694/1415) remote: Compressing objects: 50% (708/1415) remote: Compressing objects: 51% (722/1415) remote: Compressing objects: 52% (736/1415) remote: Compressing objects: 53% (750/1415) remote: Compressing objects: 54% (765/1415) remote: Compressing objects: 55% (779/1415) remote: Compressing objects: 56% (793/1415) remote: Compressing objects: 57% (807/1415) remote: Compressing objects: 58% (821/1415) remote: Compressing objects: 59% (835/1415) remote: Compressing objects: 60% (849/1415) remote: Compressing objects: 61% (864/1415) remote: Compressing objects: 62% (878/1415) remote: Compressing objects: 63% (892/1415) remote: Compressing objects: 64% (906/1415) remote: Compressing objects: 65% (920/1415) remote: Compressing objects: 66% (934/1415) remote: Compressing objects: 67% (949/1415) remote: Compressing objects: 68% (963/1415) remote: Compressing objects: 69% (977/1415) remote: Compressing objects: 70% (991/1415) remote: Compressing objects: 71% (1005/1415) remote: Compressing objects: 72% (1019/1415) remote: Compressing objects: 73% (1033/1415) remote: Compressing objects: 74% (1048/1415) remote: Compressing objects: 75% (1062/1415) remote: Compressing objects: 76% (1076/1415) remote: Compressing objects: 77% (1090/1415) remote: Compressing objects: 78% (1104/1415) remote: Compressing objects: 79% (1118/1415) remote: Compressing objects: 80% (1132/1415) remote: Compressing objects: 81% (1147/1415) remote: Compressing objects: 82% (1161/1415) remote: Compressing objects: 83% (1175/1415) remote: Compressing objects: 84% (1189/1415) remote: Compressing objects: 85% (1203/1415) remote: Compressing objects: 86% (1217/1415) remote: Compressing objects: 87% (1232/1415) remote: Compressing objects: 88% (1246/1415) remote: Compressing objects: 89% (1260/1415) remote: Compressing objects: 90% (1274/1415) remote: Compressing objects: 91% (1288/1415) remote: Compressing objects: 92% (1302/1415) remote: Compressing objects: 93% (1316/1415) remote: Compressing objects: 94% (1331/1415) remote: Compressing objects: 95% (1345/1415) remote: Compressing objects: 96% (1359/1415) remote: Compressing objects: 97% (1373/1415) remote: Compressing objects: 98% (1387/1415) remote: Compressing objects: 99% (1401/1415) remote: Compressing objects: 100% (1415/1415) remote: Compressing objects: 100% (1415/1415), done.
  6. 5.30 s Receiving objects: 0% (1/65034) Receiving objects: 1% (651/65034) Receiving objects: 2% (1301/65034) Receiving objects: 3% (1952/65034) Receiving objects: 4% (2602/65034) Receiving objects: 5% (3252/65034) Receiving objects: 6% (3903/65034) Receiving objects: 7% (4553/65034) Receiving objects: 8% (5203/65034) Receiving objects: 9% (5854/65034) Receiving objects: 10% (6504/65034) Receiving objects: 11% (7154/65034) Receiving objects: 12% (7805/65034), 12.66 MiB | 25.30 MiB/s Receiving objects: 13% (8455/65034), 12.66 MiB | 25.30 MiB/s Receiving objects: 14% (9105/65034), 12.66 MiB | 25.30 MiB/s Receiving objects: 15% (9756/65034), 12.66 MiB | 25.30 MiB/s Receiving objects: 16% (10406/65034), 12.66 MiB | 25.30 MiB/s Receiving objects: 17% (11056/65034), 12.66 MiB | 25.30 MiB/s Receiving objects: 18% (11707/65034), 12.66 MiB | 25.30 MiB/s Receiving objects: 19% (12357/65034), 12.66 MiB | 25.30 MiB/s Receiving objects: 20% (13007/65034), 12.66 MiB | 25.30 MiB/s Receiving objects: 21% (13658/65034), 12.66 MiB | 25.30 MiB/s Receiving objects: 22% (14308/65034), 12.66 MiB | 25.30 MiB/s Receiving objects: 23% (14958/65034), 12.66 MiB | 25.30 MiB/s Receiving objects: 24% (15609/65034), 12.66 MiB | 25.30 MiB/s Receiving objects: 25% (16259/65034), 12.66 MiB | 25.30 MiB/s Receiving objects: 26% (16909/65034), 12.66 MiB | 25.30 MiB/s Receiving objects: 27% (17560/65034), 12.66 MiB | 25.30 MiB/s Receiving objects: 28% (18210/65034), 12.66 MiB | 25.30 MiB/s Receiving objects: 29% (18860/65034), 12.66 MiB | 25.30 MiB/s Receiving objects: 30% (19511/65034), 12.66 MiB | 25.30 MiB/s Receiving objects: 31% (20161/65034), 12.66 MiB | 25.30 MiB/s Receiving objects: 32% (20811/65034), 12.66 MiB | 25.30 MiB/s Receiving objects: 33% (21462/65034), 12.66 MiB | 25.30 MiB/s Receiving objects: 34% (22112/65034), 12.66 MiB | 25.30 MiB/s Receiving objects: 35% (22762/65034), 12.66 MiB | 25.30 MiB/s Receiving objects: 36% (23413/65034), 12.66 MiB | 25.30 MiB/s Receiving objects: 37% (24063/65034), 12.66 MiB | 25.30 MiB/s Receiving objects: 38% (24713/65034), 12.66 MiB | 25.30 MiB/s Receiving objects: 39% (25364/65034), 12.66 MiB | 25.30 MiB/s Receiving objects: 40% (26014/65034), 12.66 MiB | 25.30 MiB/s Receiving objects: 41% (26664/65034), 12.66 MiB | 25.30 MiB/s Receiving objects: 42% (27315/65034), 12.66 MiB | 25.30 MiB/s Receiving objects: 43% (27965/65034), 12.66 MiB | 25.30 MiB/s Receiving objects: 44% (28615/65034), 12.66 MiB | 25.30 MiB/s Receiving objects: 45% (29266/65034), 12.66 MiB | 25.30 MiB/s Receiving objects: 46% (29916/65034), 12.66 MiB | 25.30 MiB/s Receiving objects: 47% (30566/65034), 12.66 MiB | 25.30 MiB/s Receiving objects: 48% (31217/65034), 12.66 MiB | 25.30 MiB/s Receiving objects: 49% (31867/65034), 12.66 MiB | 25.30 MiB/s Receiving objects: 50% (32517/65034), 12.66 MiB | 25.30 MiB/s Receiving objects: 50% (32753/65034), 30.37 MiB | 30.36 MiB/s Receiving objects: 51% (33168/65034), 30.37 MiB | 30.36 MiB/s Receiving objects: 52% (33818/65034), 30.37 MiB | 30.36 MiB/s Receiving objects: 53% (34469/65034), 30.37 MiB | 30.36 MiB/s Receiving objects: 54% (35119/65034), 30.37 MiB | 30.36 MiB/s Receiving objects: 55% (35769/65034), 30.37 MiB | 30.36 MiB/s Receiving objects: 56% (36420/65034), 30.37 MiB | 30.36 MiB/s Receiving objects: 57% (37070/65034), 30.37 MiB | 30.36 MiB/s Receiving objects: 58% (37720/65034), 30.37 MiB | 30.36 MiB/s Receiving objects: 59% (38371/65034), 30.37 MiB | 30.36 MiB/s Receiving objects: 60% (39021/65034), 30.37 MiB | 30.36 MiB/s Receiving objects: 61% (39671/65034), 30.37 MiB | 30.36 MiB/s Receiving objects: 62% (40322/65034), 46.69 MiB | 31.12 MiB/s Receiving objects: 63% (40972/65034), 46.69 MiB | 31.12 MiB/s Receiving objects: 64% (41622/65034), 46.69 MiB | 31.12 MiB/s Receiving objects: 65% (42273/65034), 46.69 MiB | 31.12 MiB/s Receiving objects: 66% (42923/65034), 46.69 MiB | 31.12 MiB/s Receiving objects: 67% (43573/65034), 46.69 MiB | 31.12 MiB/s Receiving objects: 68% (44224/65034), 46.69 MiB | 31.12 MiB/s Receiving objects: 69% (44874/65034), 46.69 MiB | 31.12 MiB/s Receiving objects: 70% (45524/65034), 46.69 MiB | 31.12 MiB/s Receiving objects: 71% (46175/65034), 46.69 MiB | 31.12 MiB/s Receiving objects: 72% (46825/65034), 46.69 MiB | 31.12 MiB/s Receiving objects: 73% (47475/65034), 46.69 MiB | 31.12 MiB/s Receiving objects: 74% (48126/65034), 46.69 MiB | 31.12 MiB/s Receiving objects: 75% (48776/65034), 46.69 MiB | 31.12 MiB/s Receiving objects: 75% (48916/65034), 62.46 MiB | 31.23 MiB/s Receiving objects: 76% (49426/65034), 62.46 MiB | 31.23 MiB/s Receiving objects: 77% (50077/65034), 62.46 MiB | 31.23 MiB/s Receiving objects: 78% (50727/65034), 62.46 MiB | 31.23 MiB/s Receiving objects: 79% (51377/65034), 62.46 MiB | 31.23 MiB/s Receiving objects: 80% (52028/65034), 62.46 MiB | 31.23 MiB/s Receiving objects: 81% (52678/65034), 62.46 MiB | 31.23 MiB/s Receiving objects: 82% (53328/65034), 62.46 MiB | 31.23 MiB/s Receiving objects: 83% (53979/65034), 62.46 MiB | 31.23 MiB/s Receiving objects: 84% (54629/65034), 79.19 MiB | 31.54 MiB/s Receiving objects: 85% (55279/65034), 79.19 MiB | 31.54 MiB/s Receiving objects: 86% (55930/65034), 79.19 MiB | 31.54 MiB/s Receiving objects: 87% (56580/65034), 79.19 MiB | 31.54 MiB/s Receiving objects: 88% (57230/65034), 79.19 MiB | 31.54 MiB/s Receiving objects: 89% (57881/65034), 79.19 MiB | 31.54 MiB/s Receiving objects: 90% (58531/65034), 79.19 MiB | 31.54 MiB/s Receiving objects: 91% (59181/65034), 79.19 MiB | 31.54 MiB/s Receiving objects: 92% (59832/65034), 79.19 MiB | 31.54 MiB/s Receiving objects: 93% (60482/65034), 79.19 MiB | 31.54 MiB/s Receiving objects: 94% (61132/65034), 79.19 MiB | 31.54 MiB/s Receiving objects: 95% (61783/65034), 79.19 MiB | 31.54 MiB/s Receiving objects: 96% (62433/65034), 79.19 MiB | 31.54 MiB/s Receiving objects: 97% (63083/65034), 79.19 MiB | 31.54 MiB/s Receiving objects: 98% (63734/65034), 79.19 MiB | 31.54 MiB/s Receiving objects: 99% (64384/65034), 79.19 MiB | 31.54 MiB/s remote: Total 65034 (delta 6786), reused 6277 (delta 6269), pack-reused 57349 (from 1)
  7. 5.36 s Receiving objects: 100% (65034/65034), 79.19 MiB | 31.54 MiB/s Receiving objects: 100% (65034/65034), 86.98 MiB | 31.94 MiB/s, done.
  8. 5.94 s Resolving deltas: 0% (0/45904) Resolving deltas: 1% (460/45904) Resolving deltas: 2% (919/45904) Resolving deltas: 3% (1378/45904) Resolving deltas: 4% (1837/45904) Resolving deltas: 5% (2300/45904) Resolving deltas: 6% (2755/45904) Resolving deltas: 7% (3214/45904) Resolving deltas: 8% (3673/45904) Resolving deltas: 9% (4133/45904) Resolving deltas: 10% (4591/45904) Resolving deltas: 11% (5050/45904) Resolving deltas: 12% (5510/45904) Resolving deltas: 13% (5968/45904) Resolving deltas: 14% (6427/45904) Resolving deltas: 15% (6886/45904) Resolving deltas: 16% (7345/45904) Resolving deltas: 17% (7804/45904) Resolving deltas: 18% (8263/45904) Resolving deltas: 19% (8723/45904) Resolving deltas: 20% (9181/45904) Resolving deltas: 21% (9643/45904) Resolving deltas: 22% (10099/45904) Resolving deltas: 23% (10558/45904) Resolving deltas: 24% (11017/45904) Resolving deltas: 25% (11476/45904) Resolving deltas: 26% (11936/45904) Resolving deltas: 27% (12397/45904) Resolving deltas: 28% (12854/45904) Resolving deltas: 29% (13313/45904) Resolving deltas: 30% (13772/45904) Resolving deltas: 31% (14231/45904) Resolving deltas: 32% (14690/45904) Resolving deltas: 33% (15149/45904) Resolving deltas: 34% (15608/45904) Resolving deltas: 35% (16067/45904) Resolving deltas: 36% (16526/45904) Resolving deltas: 37% (16985/45904) Resolving deltas: 38% (17444/45904) Resolving deltas: 39% (17903/45904) Resolving deltas: 40% (18362/45904) Resolving deltas: 41% (18821/45904) Resolving deltas: 42% (19280/45904) Resolving deltas: 43% (19739/45904) Resolving deltas: 44% (20198/45904) Resolving deltas: 45% (20657/45904) Resolving deltas: 46% (21116/45904) Resolving deltas: 47% (21576/45904) Resolving deltas: 48% (22035/45904) Resolving deltas: 49% (22495/45904) Resolving deltas: 50% (22952/45904) Resolving deltas: 51% (23412/45904) Resolving deltas: 52% (23871/45904) Resolving deltas: 53% (24330/45904) Resolving deltas: 54% (24790/45904) Resolving deltas: 55% (25248/45904) Resolving deltas: 56% (25707/45904) Resolving deltas: 57% (26166/45904) Resolving deltas: 58% (26626/45904) Resolving deltas: 59% (27084/45904) Resolving deltas: 60% (27543/45904) Resolving deltas: 61% (28003/45904) Resolving deltas: 62% (28461/45904) Resolving deltas: 63% (28920/45904) Resolving deltas: 64% (29380/45904) Resolving deltas: 65% (29838/45904) Resolving deltas: 66% (30297/45904) Resolving deltas: 67% (30756/45904) Resolving deltas: 68% (31215/45904) Resolving deltas: 69% (31676/45904) Resolving deltas: 70% (32133/45904) Resolving deltas: 71% (32592/45904) Resolving deltas: 72% (33051/45904) Resolving deltas: 73% (33510/45904) Resolving deltas: 74% (33969/45904) Resolving deltas: 75% (34428/45904) Resolving deltas: 76% (34888/45904) Resolving deltas: 77% (35347/45904) Resolving deltas: 78% (35806/45904) Resolving deltas: 79% (36265/45904) Resolving deltas: 80% (36724/45904) Resolving deltas: 81% (37183/45904) Resolving deltas: 82% (37642/45904) Resolving deltas: 83% (38103/45904) Resolving deltas: 84% (38562/45904) Resolving deltas: 85% (39021/45904) Resolving deltas: 86% (39479/45904) Resolving deltas: 87% (39937/45904) Resolving deltas: 88% (40396/45904) Resolving deltas: 89% (40855/45904) Resolving deltas: 90% (41314/45904) Resolving deltas: 91% (41773/45904) Resolving deltas: 92% (42232/45904) Resolving deltas: 93% (42691/45904) Resolving deltas: 94% (43151/45904) Resolving deltas: 95% (43611/45904) Resolving deltas: 96% (44069/45904) Resolving deltas: 97% (44527/45904) Resolving deltas: 98% (44986/45904) Resolving deltas: 99% (45445/45904) Resolving deltas: 100% (45904/45904) Resolving deltas: 100% (45904/45904), done.
  9. 6.21 s Fetching commit 1de6cf5dc4b80d0f0bf9aa8e901ee6bd43e45b8d for vakint_rustred ...
  10. 6.21 s $ /nix/store/bcnisk3ydfgv26v2gw3zlky24g00yww2-git-2.54.0/bin/git fetch origin 1de6cf5dc4b80d0f0bf9aa8e901ee6bd43e45b8d
  11. 6.67 s From https://github.com/alphal00p/gammaloop
  12. 6.67 s * branch 1de6cf5dc4b80d0f0bf9aa8e901ee6bd43e45b8d -> FETCH_HEAD
  13. 6.68 s $ /nix/store/9ypz3flqsrl5xl495mm8h645gadjsxi1-coreutils-9.11/bin/timeout --kill-after=15s 7200s /nix/store/bcnisk3ydfgv26v2gw3zlky24g00yww2-git-2.54.0/bin/git -c advice.detachedHead=false checkout 1de6cf5dc4b80d0f0bf9aa8e901ee6bd43e45b8d
  14. 6.82 s HEAD is now at 1de6cf5d Implement FORM-less RustRed tensor mode
  15. 6.82 s $ /nix/store/9ypz3flqsrl5xl495mm8h645gadjsxi1-coreutils-9.11/bin/timeout --kill-after=15s 7200s /nix/store/23zk8sgzamrbmj1fday15szf7f2279s8-nix-2.34.7/bin/nix --extra-experimental-features nix-command --extra-experimental-features flakes --log-format internal-json run .#packages.x86_64-linux.nix-ci-check-gammaloop-nextest-core --print-build-logs
  16. 11.53 s
  17. 11.66 s Downloading cached gammaloop-nextest-binaries-core-gammaloop-api from https://cache.nix-ci.com
  18. 11.70 s Downloading cached gammaloop-nextest-binaries-core-gammaloop-tracing-filter from https://cache.nix-ci.com
  19. 11.70 s Downloading cached gammaloop-nextest-binaries-core-gammalooprs from https://cache.nix-ci.com
  20. 11.70 s Downloading cached gammaloop-nextest-binaries-core-gammaloop-tracing-filter-macros from https://cache.nix-ci.com
  21. 11.88 s Downloaded cached gammaloop-nextest-binaries-core-gammaloop-tracing-filter-macros (1.7 MiB) in 175ms
  22. 11.88 s Progress: 0 of 1 built, 1 of 6 downloaded from cache (3 downloading)
  23. 11.95 s Downloaded cached gammaloop-nextest-binaries-core-gammaloop-tracing-filter (6.6 MiB) in 249ms
  24. 11.95 s Progress: 0 of 1 built, 2 of 6 downloaded from cache (2 downloading)
  25. 13.23 s Downloaded cached gammaloop-nextest-binaries-core-gammaloop-api (66.7 MiB) in 1.5s
  26. 13.23 s Progress: 0 of 1 built, 3 of 6 downloaded from cache (1 downloading)
  27. 13.31 s Downloaded cached gammaloop-nextest-binaries-core-gammalooprs (76.8 MiB) in 1.6s
  28. 13.31 s Progress: 0 of 1 built, 4 of 6 downloaded from cache
  29. 13.31 s Downloading cached gammaloop-nextest-binaries-core from https://cache.nix-ci.com
  30. 13.34 s Downloaded cached gammaloop-nextest-binaries-core (1640 B) in 29ms
  31. 13.34 s Progress: 0 of 1 built, 5 of 6 downloaded from cache
  32. 13.34 s Downloading cached nix-ci-check-gammaloop-nextest-core from https://cache.nix-ci.com
  33. 13.37 s Downloaded cached nix-ci-check-gammaloop-nextest-core (1016 B) in 28ms
  34. 13.37 s Progress: 0 of 1 built, 6 of 6 downloaded from cache
  35. 18.45 s evaluating derivation 'g copying '/nix/store/yk26 evaluating derivation 'g copying '/nix/store/yk26 evaluating derivation 'g copying '/nix/store/yk26 evaluating derivation 'g copying '/nix/store/yk26 evaluating derivation 'g copying '/nix/store/yk26 evaluating derivation 'g copying '/nix/store/yk26 evaluating derivation 'g querying gammaloop-nexte [0/1 built, 0.0 KiB DL] [1/0/1 built, 0.0 KiB DLgammaloop-nextest-core> Extracting 3 binaries (including 1 non-test binary), 1 build script output directory, and 2 linked paths to /build/nextest-archive-f3VTRu
  36. 18.82 s gammaloop-nextest-core> Extracted 18 files to /build/nextest-archive-f3VTRu in 0.37s
  37. 18.83 s gammaloop-nextest-core> ------------
  38. 18.83 s gammaloop-nextest-core> Nextest run ID 7c84ddb4-56bc-42eb-969f-5465a8c87c56 with nextest profile: ci_gammaloop
  39. 18.83 s gammaloop-nextest-core> Starting 339 tests across 2 binaries
  40. 19.24 s gammaloop-nextest-core> ------------
  41. 19.24 s gammaloop-nextest-core> Summary [ 0.416s] 339 tests run: 339 passed, 0 skipped
  42. 19.33 s gammaloop-nextest-core>
  43. 19.33 s gammaloop-nextest-core> ========== nextest test summary ==========
  44. 19.33 s gammaloop-nextest-core> report: target/nextest/ci_gammaloop/junit.xml
  45. 19.33 s gammaloop-nextest-core> tests: 339, failures: 0, errors: 0
  46. 19.33 s gammaloop-nextest-core> No failing testcases found.
  47. 19.33 s gammaloop-nextest-core> =========================================
  48. 19.34 s gammaloop-nextest-core> Extracting 1 binary and 1 linked path to /build/nextest-archive-Gdt51g
  49. 19.39 s gammaloop-nextest-core> Extracted 7 files to /build/nextest-archive-Gdt51g in 0.05s
  50. 19.40 s gammaloop-nextest-core> ------------
  51. 19.40 s gammaloop-nextest-core> Nextest run ID 1d6ce669-af29-447a-95c9-fa74cb83575c with nextest profile: ci_gammaloop
  52. 19.40 s gammaloop-nextest-core> Starting 19 tests across 1 binary
  53. 19.42 s gammaloop-nextest-core> ------------
  54. 19.42 s gammaloop-nextest-core> Summary [ 0.013s] 19 tests run: 19 passed, 0 skipped
  55. 19.45 s gammaloop-nextest-core>
  56. 19.45 s gammaloop-nextest-core> ========== nextest test summary ==========
  57. 19.45 s gammaloop-nextest-core> report: target/nextest/ci_gammaloop/junit.xml
  58. 19.45 s gammaloop-nextest-core> tests: 19, failures: 0, errors: 0
  59. 19.45 s gammaloop-nextest-core> No failing testcases found.
  60. 19.45 s gammaloop-nextest-core> =========================================
  61. 19.46 s gammaloop-nextest-core> Extracting 1 binary to /build/nextest-archive-9kC3Fj
  62. 19.49 s gammaloop-nextest-core> Extracted 4 files to /build/nextest-archive-9kC3Fj in 0.03s
  63. 19.49 s gammaloop-nextest-core> ------------
  64. 19.49 s gammaloop-nextest-core> Nextest run ID c12b0ee3-3701-4930-9f51-a94d8199b195 with nextest profile: ci_gammaloop
  65. 19.49 s gammaloop-nextest-core> Starting 0 tests across 1 binary
  66. 19.49 s gammaloop-nextest-core> ------------
  67. 19.49 s gammaloop-nextest-core> Summary [ 0.000s] 0 tests run: 0 passed, 0 skipped
  68. 19.52 s gammaloop-nextest-core>
  69. 19.52 s gammaloop-nextest-core> ========== nextest test summary ==========
  70. 19.52 s gammaloop-nextest-core> report: target/nextest/ci_gammaloop/junit.xml
  71. 19.52 s gammaloop-nextest-core> tests: 0, failures: 0, errors: 0
  72. 19.52 s gammaloop-nextest-core> No failing testcases found.
  73. 19.52 s gammaloop-nextest-core> =========================================
  74. 19.53 s gammaloop-nextest-core> Extracting 4 binaries, 1 build script output directory, and 2 linked paths to /build/nextest-archive-gX6Us7
  75. 19.91 s gammaloop-nextest-core> Extracted 18 files to /build/nextest-archive-gX6Us7 in 0.38s
  76. 19.92 s gammaloop-nextest-core> ------------
  77. 19.92 s gammaloop-nextest-core> Nextest run ID 52def3a5-dfa0-49f8-941d-d859ef1c4077 with nextest profile: ci_gammaloop
  78. 19.92 s gammaloop-nextest-core> Starting 456 tests across 4 binaries (61 tests skipped, including 60 tests via profile.ci_gammaloop.default-filter)
  79. 21.01 s gammaloop-nextest-core> FAIL [ 0.391s] (446/456) gammalooprs::test_renormalization finit_part_ghlo
  80. 21.01 s gammaloop-nextest-core> stdout ---
  81. 21.01 s gammaloop-nextest-core>
  82. 21.01 s gammaloop-nextest-core> running 1 test
  83. 21.01 s gammaloop-nextest-core> ren part: 1/2*GC_10^2*dot(P(0,mink(dim)),P(0,mink(dim)))*cas(2,coad(8))/ε
  84. 21.01 s gammaloop-nextest-core> ━━━━━━━━━━━━━━━━━━━━━━━━━━━━━━━ Snapshot Summary ━━━━━━━━━━━━━━━━━━━━━━━━━━━━━━━
  85. 21.01 s gammaloop-nextest-core> Snapshot: finit_part_ghlo
  86. 21.01 s gammaloop-nextest-core> Source: crates/gammalooprs/tests/test_renormalization.rs:557
  87. 21.01 s gammaloop-nextest-core> ────────────────────────────────────────────────────────────────────────────────
  88. 21.01 s gammaloop-nextest-core> Expression: align_to_rqft(&a, &model).to_bare_ordered_string()
  89. 21.01 s gammaloop-nextest-core> ────────────────────────────────────────────────────────────────────────────────
  90. 21.01 s gammaloop-nextest-core> -old snapshot
  91. 21.01 s gammaloop-nextest-core> +new results
  92. 21.01 s gammaloop-nextest-core> ────────────┬───────────────────────────────────────────────────────────────────
  93. 21.01 s gammaloop-nextest-core> 1 │--1/2*cas(2,coad(8))*dot(P(0,mink(4)),P(0,mink(4)))*gs^2*ε^(-1)
  94. 21.01 s gammaloop-nextest-core> 1 │+1/2*cas(2,coad(8))*dot(P(0,mink(4)),P(0,mink(4)))*gs^2*ε^(-1)
  95. 21.01 s gammaloop-nextest-core> ────────────┴───────────────────────────────────────────────────────────────────
  96. 21.01 s gammaloop-nextest-core> To update snapshots run `cargo insta review`
  97. 21.01 s gammaloop-nextest-core> Stopped on the first failure. Run `cargo insta test` to run all snapshots.
  98. 21.01 s gammaloop-nextest-core> test finit_part_ghlo ... FAILED
  99. 21.01 s gammaloop-nextest-core>
  100. 21.01 s gammaloop-nextest-core> failures:
  101. 21.01 s gammaloop-nextest-core>
  102. 21.01 s gammaloop-nextest-core> failures:
  103. 21.01 s gammaloop-nextest-core> finit_part_ghlo
  104. 21.01 s gammaloop-nextest-core>
  105. 21.01 s gammaloop-nextest-core> test result: FAILED. 0 passed; 1 failed; 0 ignored; 0 measured; 5 filtered out; finished in 0.38s
  106. 21.01 s gammaloop-nextest-core>
  107. 21.01 s gammaloop-nextest-core> stderr ---
  108. 21.01 s gammaloop-nextest-core> The application panicked (crashed).
  109. 21.01 s gammaloop-nextest-core> Message: snapshot assertion for 'finit_part_ghlo' failed in line 557
  110. 21.01 s gammaloop-nextest-core> Location: /nix/store/0f9p2h9240ylfzayilfjv4gr7scagfs3-vendor-cargo-deps/c19b7c6f923b580ac259164a89f2577984ad5ab09ee9d583b888f934adbbe8d0/insta-1.47.2/src/runtime.rs:719
  111. 21.01 s gammaloop-nextest-core>
  112. 21.01 s gammaloop-nextest-core> ━━━━━━━━━━━━━━━━━━━━━━━━━━━━━━━━━━ BACKTRACE ━━━━━━━━━━━━━━━━━━━━━━━━━━━━━━━━━━━
  113. 21.01 s gammaloop-nextest-core> 1: <color_eyre[51793ea62743adbd]::config::PanicHook>::panic_report<unknown>
  114. 21.01 s gammaloop-nextest-core> at <unknown source file>:<unknown line>
  115. 21.01 s gammaloop-nextest-core> 2: <color_eyre[51793ea62743adbd]::config::PanicHook>::into_panic_hook::{closure#0}<unknown>
  116. 21.01 s gammaloop-nextest-core> at <unknown source file>:<unknown line>
  117. 21.01 s gammaloop-nextest-core> 3: std[bcb96dfbba0ab899]::panicking::panic_with_hook<unknown>
  118. 21.01 s gammaloop-nextest-core> at <unknown source file>:<unknown line>
  119. 21.01 s gammaloop-nextest-core> 4: std[bcb96dfbba0ab899]::panicking::panic_handler::{closure#0}<unknown>
  120. 21.01 s gammaloop-nextest-core> at <unknown source file>:<unknown line>
  121. 21.01 s gammaloop-nextest-core> 5: std[bcb96dfbba0ab899]::sys::backtrace::__rust_end_short_backtrace::<std[bcb96dfbba0ab899]::panicking::panic_handler::{closure#0}, !><unknown>
  122. 21.01 s gammaloop-nextest-core> at <unknown source file>:<unknown line>
  123. 21.01 s gammaloop-nextest-core> 6: __rustc[6c289b9f9c454d21]::rust_begin_unwind<unknown>
  124. 21.01 s gammaloop-nextest-core> at <unknown source file>:<unknown line>
  125. 21.01 s gammaloop-nextest-core> 7: core[940e698046960fd5]::panicking::panic_fmt<unknown>
  126. 21.01 s gammaloop-nextest-core> at <unknown source file>:<unknown line>
  127. 21.01 s gammaloop-nextest-core> 8: insta[307a548ac79ef4d9]::runtime::assert_snapshot<unknown>
  128. 21.01 s gammaloop-nextest-core> at <unknown source file>:<unknown line>
  129. 21.01 s gammaloop-nextest-core> 9: <test_renormalization[6420da4f660338c3]::finit_part_ghlo::{closure#0} as core[940e698046960fd5]::ops::function::FnOnce<()>>::call_once<unknown>
  130. 21.01 s gammaloop-nextest-core> at <unknown source file>:<unknown line>
  131. 21.01 s gammaloop-nextest-core> 10: test[75d6903177b1d7e9]::__rust_begin_short_backtrace::<core[940e698046960fd5]::result::Result<(), alloc[2ea6bcb46fca0c42]::string::String>, fn() -> core[940e698046960fd5]::result::Result<(), alloc[2ea6bcb46fca0c42]::string::String>><unknown>
  132. 21.01 s gammaloop-nextest-core> at <unknown source file>:<unknown line>
  133. 21.01 s gammaloop-nextest-core> 11: test[75d6903177b1d7e9]::run_test::{closure#0}<unknown>
  134. 21.01 s gammaloop-nextest-core> at <unknown source file>:<unknown line>
  135. 21.01 s gammaloop-nextest-core> 12: std[bcb96dfbba0ab899]::sys::backtrace::__rust_begin_short_backtrace::<test[75d6903177b1d7e9]::run_test::{closure#1}, ()><unknown>
  136. 21.01 s gammaloop-nextest-core> at <unknown source file>:<unknown line>
  137. 21.01 s gammaloop-nextest-core> 13: <std[bcb96dfbba0ab899]::thread::lifecycle::spawn_unchecked<test[75d6903177b1d7e9]::run_test::{closure#1}, ()>::{closure#1} as core[940e698046960fd5]::ops::function::FnOnce<()>>::call_once::{shim:vtable#0}<unknown>
  138. 21.01 s gammaloop-nextest-core> at <unknown source file>:<unknown line>
  139. 21.01 s gammaloop-nextest-core> 14: <std[bcb96dfbba0ab899]::sys::thread::unix::Thread>::new::thread_start<unknown>
  140. 21.01 s gammaloop-nextest-core> at <unknown source file>:<unknown line>
  141. 21.01 s gammaloop-nextest-core> 15: start_thread<unknown>
  142. 21.01 s gammaloop-nextest-core> at <unknown source file>:<unknown line>
  143. 21.01 s gammaloop-nextest-core> 16: __clone3<unknown>
  144. 21.01 s gammaloop-nextest-core> at <unknown source file>:<unknown line>
  145. 21.01 s gammaloop-nextest-core>
  146. 21.01 s gammaloop-nextest-core> Run with COLORBT_SHOW_HIDDEN=1 environment variable to disable frame filtering.
  147. 21.01 s gammaloop-nextest-core> Run with RUST_BACKTRACE=full to include source snippets.
  148. 21.01 s gammaloop-nextest-core>
  149. 22.62 s gammaloop-nextest-core> FAIL [ 1.998s] (451/456) gammalooprs::test_renormalization finite_part_ghost_2loop
  150. 22.62 s gammaloop-nextest-core> stdout ---
  151. 22.62 s gammaloop-nextest-core>
  152. 22.62 s gammaloop-nextest-core> running 1 test
  153. 22.62 s gammaloop-nextest-core> ━━━━━━━━━━━━━━━━━━━━━━━━━━━━━━━ Snapshot Summary ━━━━━━━━━━━━━━━━━━━━━━━━━━━━━━━
  154. 22.62 s gammaloop-nextest-core> Snapshot: finite_part_ghost_2loop-3
  155. 22.62 s gammaloop-nextest-core> Source: crates/gammalooprs/tests/test_renormalization.rs:464
  156. 22.62 s gammaloop-nextest-core> ────────────────────────────────────────────────────────────────────────────────
  157. 22.62 s gammaloop-nextest-core> Expression: align_to_rqft(&a, &model).to_bare_ordered_string()
  158. 22.62 s gammaloop-nextest-core> ────────────────────────────────────────────────────────────────────────────────
  159. 22.62 s gammaloop-nextest-core> -old snapshot
  160. 22.62 s gammaloop-nextest-core> +new results
  161. 22.62 s gammaloop-nextest-core> ────────────┬───────────────────────────────────────────────────────────────────
  162. 22.62 s gammaloop-nextest-core> 1 │-(-1𝑖/32*ε+1𝑖/16)*(cas(2,coad(8)))^2*dot(P(0,mink(4)),P(0,mink(4)))*gs^4*ε^(-2)
  163. 22.62 s gammaloop-nextest-core> 1 │+(-1𝑖/16+1𝑖/32*ε)*(cas(2,coad(8)))^2*dot(P(0,mink(4)),P(0,mink(4)))*gs^4*ε^(-2)
  164. 22.62 s gammaloop-nextest-core> ────────────┴───────────────────────────────────────────────────────────────────
  165. 22.62 s gammaloop-nextest-core> To update snapshots run `cargo insta review`
  166. 22.62 s gammaloop-nextest-core> Stopped on the first failure. Run `cargo insta test` to run all snapshots.
  167. 22.62 s gammaloop-nextest-core> test finite_part_ghost_2loop ... FAILED
  168. 22.62 s gammaloop-nextest-core>
  169. 22.62 s gammaloop-nextest-core> failures:
  170. 22.62 s gammaloop-nextest-core>
  171. 22.62 s gammaloop-nextest-core> failures:
  172. 22.62 s gammaloop-nextest-core> finite_part_ghost_2loop
  173. 22.62 s gammaloop-nextest-core>
  174. 22.62 s gammaloop-nextest-core> test result: FAILED. 0 passed; 1 failed; 0 ignored; 0 measured; 5 filtered out; finished in 1.99s
  175. 22.62 s gammaloop-nextest-core>
  176. 22.62 s gammaloop-nextest-core> stderr ---
  177. 22.62 s gammaloop-nextest-core> The application panicked (crashed).
  178. 22.62 s gammaloop-nextest-core> Message: snapshot assertion for 'finite_part_ghost_2loop-3' failed in line 464
  179. 22.62 s gammaloop-nextest-core> Location: /nix/store/0f9p2h9240ylfzayilfjv4gr7scagfs3-vendor-cargo-deps/c19b7c6f923b580ac259164a89f2577984ad5ab09ee9d583b888f934adbbe8d0/insta-1.47.2/src/runtime.rs:719
  180. 22.62 s gammaloop-nextest-core>
  181. 22.62 s gammaloop-nextest-core> ━━━━━━━━━━━━━━━━━━━━━━━━━━━━━━━━━━ BACKTRACE ━━━━━━━━━━━━━━━━━━━━━━━━━━━━━━━━━━━
  182. 22.62 s gammaloop-nextest-core> 1: <color_eyre[51793ea62743adbd]::config::PanicHook>::panic_report<unknown>
  183. 22.62 s gammaloop-nextest-core> at <unknown source file>:<unknown line>
  184. 22.62 s gammaloop-nextest-core> 2: <color_eyre[51793ea62743adbd]::config::PanicHook>::into_panic_hook::{closure#0}<unknown>
  185. 22.62 s gammaloop-nextest-core> at <unknown source file>:<unknown line>
  186. 22.62 s gammaloop-nextest-core> 3: std[bcb96dfbba0ab899]::panicking::panic_with_hook<unknown>
  187. 22.62 s gammaloop-nextest-core> at <unknown source file>:<unknown line>
  188. 22.62 s gammaloop-nextest-core> 4: std[bcb96dfbba0ab899]::panicking::panic_handler::{closure#0}<unknown>
  189. 22.62 s gammaloop-nextest-core> at <unknown source file>:<unknown line>
  190. 22.62 s gammaloop-nextest-core> 5: std[bcb96dfbba0ab899]::sys::backtrace::__rust_end_short_backtrace::<std[bcb96dfbba0ab899]::panicking::panic_handler::{closure#0}, !><unknown>
  191. 22.62 s gammaloop-nextest-core> at <unknown source file>:<unknown line>
  192. 22.62 s gammaloop-nextest-core> 6: __rustc[6c289b9f9c454d21]::rust_begin_unwind<unknown>
  193. 22.62 s gammaloop-nextest-core> at <unknown source file>:<unknown line>
  194. 22.62 s gammaloop-nextest-core> 7: core[940e698046960fd5]::panicking::panic_fmt<unknown>
  195. 22.62 s gammaloop-nextest-core> at <unknown source file>:<unknown line>
  196. 22.62 s gammaloop-nextest-core> 8: insta[307a548ac79ef4d9]::runtime::assert_snapshot<unknown>
  197. 22.62 s gammaloop-nextest-core> at <unknown source file>:<unknown line>
  198. 22.62 s gammaloop-nextest-core> 9: test_renormalization[6420da4f660338c3]::finite_part_ghost_2loop<unknown>
  199. 22.62 s gammaloop-nextest-core> at <unknown source file>:<unknown line>
  200. 22.62 s gammaloop-nextest-core> 10: <test_renormalization[6420da4f660338c3]::finite_part_ghost_2loop::{closure#0} as core[940e698046960fd5]::ops::function::FnOnce<()>>::call_once<unknown>
  201. 22.62 s gammaloop-nextest-core> at <unknown source file>:<unknown line>
  202. 22.62 s gammaloop-nextest-core> 11: test[75d6903177b1d7e9]::__rust_begin_short_backtrace::<core[940e698046960fd5]::result::Result<(), alloc[2ea6bcb46fca0c42]::string::String>, fn() -> core[940e698046960fd5]::result::Result<(), alloc[2ea6bcb46fca0c42]::string::String>><unknown>
  203. 22.62 s gammaloop-nextest-core> at <unknown source file>:<unknown line>
  204. 22.62 s gammaloop-nextest-core> 12: test[75d6903177b1d7e9]::run_test::{closure#0}<unknown>
  205. 22.62 s gammaloop-nextest-core> at <unknown source file>:<unknown line>
  206. 22.62 s gammaloop-nextest-core> 13: std[bcb96dfbba0ab899]::sys::backtrace::__rust_begin_short_backtrace::<test[75d6903177b1d7e9]::run_test::{closure#1}, ()><unknown>
  207. 22.62 s gammaloop-nextest-core> at <unknown source file>:<unknown line>
  208. 22.62 s gammaloop-nextest-core> 14: <std[bcb96dfbba0ab899]::thread::lifecycle::spawn_unchecked<test[75d6903177b1d7e9]::run_test::{closure#1}, ()>::{closure#1} as core[940e698046960fd5]::ops::function::FnOnce<()>>::call_once::{shim:vtable#0}<unknown>
  209. 22.62 s gammaloop-nextest-core> at <unknown source file>:<unknown line>
  210. 22.62 s gammaloop-nextest-core> 15: <std[bcb96dfbba0ab899]::sys::thread::unix::Thread>::new::thread_start<unknown>
  211. 22.62 s gammaloop-nextest-core> at <unknown source file>:<unknown line>
  212. 22.62 s gammaloop-nextest-core> 16: start_thread<unknown>
  213. 22.62 s gammaloop-nextest-core> at <unknown source file>:<unknown line>
  214. 22.62 s gammaloop-nextest-core> 17: __clone3<unknown>
  215. 22.62 s gammaloop-nextest-core> at <unknown source file>:<unknown line>
  216. 22.62 s gammaloop-nextest-core>
  217. 22.62 s gammaloop-nextest-core> Run with COLORBT_SHOW_HIDDEN=1 environment variable to disable frame filtering.
  218. 22.62 s gammaloop-nextest-core> Run with RUST_BACKTRACE=full to include source snippets.
  219. 22.62 s gammaloop-nextest-core>
  220. 27.45 s gammaloop-nextest-core> ------------
  221. 27.52 s gammaloop-nextest-core> Summary [ 7.526s] 456 tests run: 454 passed, 2 failed, 61 skipped
  222. 27.52 s gammaloop-nextest-core> FAIL [ 0.391s] (446/456) gammalooprs::test_renormalization finit_part_ghlo
  223. 27.52 s gammaloop-nextest-core> stdout ---
  224. 27.52 s gammaloop-nextest-core>
  225. 27.52 s gammaloop-nextest-core> running 1 test
  226. 27.52 s gammaloop-nextest-core> ren part: 1/2*GC_10^2*dot(P(0,mink(dim)),P(0,mink(dim)))*cas(2,coad(8))/ε
  227. 27.52 s gammaloop-nextest-core> ━━━━━━━━━━━━━━━━━━━━━━━━━━━━━━━ Snapshot Summary ━━━━━━━━━━━━━━━━━━━━━━━━━━━━━━━
  228. 27.52 s gammaloop-nextest-core> Snapshot: finit_part_ghlo
  229. 27.52 s gammaloop-nextest-core> Source: crates/gammalooprs/tests/test_renormalization.rs:557
  230. 27.52 s gammaloop-nextest-core> ────────────────────────────────────────────────────────────────────────────────
  231. 27.52 s gammaloop-nextest-core> Expression: align_to_rqft(&a, &model).to_bare_ordered_string()
  232. 27.52 s gammaloop-nextest-core> ────────────────────────────────────────────────────────────────────────────────
  233. 27.52 s gammaloop-nextest-core> -old snapshot
  234. 27.52 s gammaloop-nextest-core> +new results
  235. 27.52 s gammaloop-nextest-core> ────────────┬───────────────────────────────────────────────────────────────────
  236. 27.52 s gammaloop-nextest-core> 1 │--1/2*cas(2,coad(8))*dot(P(0,mink(4)),P(0,mink(4)))*gs^2*ε^(-1)
  237. 27.52 s gammaloop-nextest-core> 1 │+1/2*cas(2,coad(8))*dot(P(0,mink(4)),P(0,mink(4)))*gs^2*ε^(-1)
  238. 27.52 s gammaloop-nextest-core> ────────────┴───────────────────────────────────────────────────────────────────
  239. 27.52 s gammaloop-nextest-core> To update snapshots run `cargo insta review`
  240. 27.52 s gammaloop-nextest-core> Stopped on the first failure. Run `cargo insta test` to run all snapshots.
  241. 27.52 s gammaloop-nextest-core> test finit_part_ghlo ... FAILED
  242. 27.52 s gammaloop-nextest-core>
  243. 27.52 s gammaloop-nextest-core> failures:
  244. 27.52 s gammaloop-nextest-core>
  245. 27.52 s gammaloop-nextest-core> failures:
  246. 27.52 s gammaloop-nextest-core> finit_part_ghlo
  247. 27.52 s gammaloop-nextest-core>
  248. 27.52 s gammaloop-nextest-core> test result: FAILED. 0 passed; 1 failed; 0 ignored; 0 measured; 5 filtered out; finished in 0.38s
  249. 27.52 s gammaloop-nextest-core>
  250. 27.52 s gammaloop-nextest-core> stderr ---
  251. 27.52 s gammaloop-nextest-core> The application panicked (crashed).
  252. 27.52 s gammaloop-nextest-core> Message: snapshot assertion for 'finit_part_ghlo' failed in line 557
  253. 27.52 s gammaloop-nextest-core> Location: /nix/store/0f9p2h9240ylfzayilfjv4gr7scagfs3-vendor-cargo-deps/c19b7c6f923b580ac259164a89f2577984ad5ab09ee9d583b888f934adbbe8d0/insta-1.47.2/src/runtime.rs:719
  254. 27.52 s gammaloop-nextest-core>
  255. 27.52 s gammaloop-nextest-core> ━━━━━━━━━━━━━━━━━━━━━━━━━━━━━━━━━━ BACKTRACE ━━━━━━━━━━━━━━━━━━━━━━━━━━━━━━━━━━━
  256. 27.52 s gammaloop-nextest-core> 1: <color_eyre[51793ea62743adbd]::config::PanicHook>::panic_report<unknown>
  257. 27.52 s gammaloop-nextest-core> at <unknown source file>:<unknown line>
  258. 27.52 s gammaloop-nextest-core> 2: <color_eyre[51793ea62743adbd]::config::PanicHook>::into_panic_hook::{closure#0}<unknown>
  259. 27.52 s gammaloop-nextest-core> at <unknown source file>:<unknown line>
  260. 27.52 s gammaloop-nextest-core> 3: std[bcb96dfbba0ab899]::panicking::panic_with_hook<unknown>
  261. 27.52 s gammaloop-nextest-core> at <unknown source file>:<unknown line>
  262. 27.52 s gammaloop-nextest-core> 4: std[bcb96dfbba0ab899]::panicking::panic_handler::{closure#0}<unknown>
  263. 27.52 s gammaloop-nextest-core> at <unknown source file>:<unknown line>
  264. 27.52 s gammaloop-nextest-core> 5: std[bcb96dfbba0ab899]::sys::backtrace::__rust_end_short_backtrace::<std[bcb96dfbba0ab899]::panicking::panic_handler::{closure#0}, !><unknown>
  265. 27.52 s gammaloop-nextest-core> at <unknown source file>:<unknown line>
  266. 27.52 s gammaloop-nextest-core> 6: __rustc[6c289b9f9c454d21]::rust_begin_unwind<unknown>
  267. 27.52 s gammaloop-nextest-core> at <unknown source file>:<unknown line>
  268. 27.52 s gammaloop-nextest-core> 7: core[940e698046960fd5]::panicking::panic_fmt<unknown>
  269. 27.52 s gammaloop-nextest-core> at <unknown source file>:<unknown line>
  270. 27.52 s gammaloop-nextest-core> 8: insta[307a548ac79ef4d9]::runtime::assert_snapshot<unknown>
  271. 27.52 s gammaloop-nextest-core> at <unknown source file>:<unknown line>
  272. 27.52 s gammaloop-nextest-core> 9: <test_renormalization[6420da4f660338c3]::finit_part_ghlo::{closure#0} as core[940e698046960fd5]::ops::function::FnOnce<()>>::call_once<unknown>
  273. 27.52 s gammaloop-nextest-core> at <unknown source file>:<unknown line>
  274. 27.52 s gammaloop-nextest-core> 10: test[75d6903177b1d7e9]::__rust_begin_short_backtrace::<core[940e698046960fd5]::result::Result<(), alloc[2ea6bcb46fca0c42]::string::String>, fn() -> core[940e698046960fd5]::result::Result<(), alloc[2ea6bcb46fca0c42]::string::String>><unknown>
  275. 27.52 s gammaloop-nextest-core> at <unknown source file>:<unknown line>
  276. 27.52 s gammaloop-nextest-core> 11: test[75d6903177b1d7e9]::run_test::{closure#0}<unknown>
  277. 27.52 s gammaloop-nextest-core> at <unknown source file>:<unknown line>
  278. 27.52 s gammaloop-nextest-core> 12: std[bcb96dfbba0ab899]::sys::backtrace::__rust_begin_short_backtrace::<test[75d6903177b1d7e9]::run_test::{closure#1}, ()><unknown>
  279. 27.52 s gammaloop-nextest-core> at <unknown source file>:<unknown line>
  280. 27.52 s gammaloop-nextest-core> 13: <std[bcb96dfbba0ab899]::thread::lifecycle::spawn_unchecked<test[75d6903177b1d7e9]::run_test::{closure#1}, ()>::{closure#1} as core[940e698046960fd5]::ops::function::FnOnce<()>>::call_once::{shim:vtable#0}<unknown>
  281. 27.52 s gammaloop-nextest-core> at <unknown source file>:<unknown line>
  282. 27.52 s gammaloop-nextest-core> 14: <std[bcb96dfbba0ab899]::sys::thread::unix::Thread>::new::thread_start<unknown>
  283. 27.52 s gammaloop-nextest-core> at <unknown source file>:<unknown line>
  284. 27.52 s gammaloop-nextest-core> 15: start_thread<unknown>
  285. 27.52 s gammaloop-nextest-core> at <unknown source file>:<unknown line>
  286. 27.52 s gammaloop-nextest-core> 16: __clone3<unknown>
  287. 27.52 s gammaloop-nextest-core> at <unknown source file>:<unknown line>
  288. 27.52 s gammaloop-nextest-core>
  289. 27.52 s gammaloop-nextest-core> Run with COLORBT_SHOW_HIDDEN=1 environment variable to disable frame filtering.
  290. 27.52 s gammaloop-nextest-core> Run with RUST_BACKTRACE=full to include source snippets.
  291. 27.52 s gammaloop-nextest-core>
  292. 27.52 s gammaloop-nextest-core> FAIL [ 1.998s] (451/456) gammalooprs::test_renormalization finite_part_ghost_2loop
  293. 27.52 s gammaloop-nextest-core> stdout ---
  294. 27.52 s gammaloop-nextest-core>
  295. 27.52 s gammaloop-nextest-core> running 1 test
  296. 27.52 s gammaloop-nextest-core> ━━━━━━━━━━━━━━━━━━━━━━━━━━━━━━━ Snapshot Summary ━━━━━━━━━━━━━━━━━━━━━━━━━━━━━━━
  297. 27.52 s gammaloop-nextest-core> Snapshot: finite_part_ghost_2loop-3
  298. 27.52 s gammaloop-nextest-core> Source: crates/gammalooprs/tests/test_renormalization.rs:464
  299. 27.52 s gammaloop-nextest-core> ────────────────────────────────────────────────────────────────────────────────
  300. 27.52 s gammaloop-nextest-core> Expression: align_to_rqft(&a, &model).to_bare_ordered_string()
  301. 27.52 s gammaloop-nextest-core> ────────────────────────────────────────────────────────────────────────────────
  302. 27.52 s gammaloop-nextest-core> -old snapshot
  303. 27.52 s gammaloop-nextest-core> +new results
  304. 27.52 s gammaloop-nextest-core> ────────────┬───────────────────────────────────────────────────────────────────
  305. 27.52 s gammaloop-nextest-core> 1 │-(-1𝑖/32*ε+1𝑖/16)*(cas(2,coad(8)))^2*dot(P(0,mink(4)),P(0,mink(4)))*gs^4*ε^(-2)
  306. 27.52 s gammaloop-nextest-core> 1 │+(-1𝑖/16+1𝑖/32*ε)*(cas(2,coad(8)))^2*dot(P(0,mink(4)),P(0,mink(4)))*gs^4*ε^(-2)
  307. 27.52 s gammaloop-nextest-core> ────────────┴───────────────────────────────────────────────────────────────────
  308. 27.52 s gammaloop-nextest-core> To update snapshots run `cargo insta review`
  309. 27.52 s gammaloop-nextest-core> Stopped on the first failure. Run `cargo insta test` to run all snapshots.
  310. 27.52 s gammaloop-nextest-core> test finite_part_ghost_2loop ... FAILED
  311. 27.52 s gammaloop-nextest-core>
  312. 27.52 s gammaloop-nextest-core> failures:
  313. 27.52 s gammaloop-nextest-core>
  314. 27.52 s gammaloop-nextest-core> failures:
  315. 27.52 s gammaloop-nextest-core> finite_part_ghost_2loop
  316. 27.52 s gammaloop-nextest-core>
  317. 27.52 s gammaloop-nextest-core> test result: FAILED. 0 passed; 1 failed; 0 ignored; 0 measured; 5 filtered out; finished in 1.99s
  318. 27.52 s gammaloop-nextest-core>
  319. 27.52 s gammaloop-nextest-core> stderr ---
  320. 27.52 s gammaloop-nextest-core> The application panicked (crashed).
  321. 27.52 s gammaloop-nextest-core> Message: snapshot assertion for 'finite_part_ghost_2loop-3' failed in line 464
  322. 27.52 s gammaloop-nextest-core> Location: /nix/store/0f9p2h9240ylfzayilfjv4gr7scagfs3-vendor-cargo-deps/c19b7c6f923b580ac259164a89f2577984ad5ab09ee9d583b888f934adbbe8d0/insta-1.47.2/src/runtime.rs:719
  323. 27.52 s gammaloop-nextest-core>
  324. 27.52 s gammaloop-nextest-core> ━━━━━━━━━━━━━━━━━━━━━━━━━━━━━━━━━━ BACKTRACE ━━━━━━━━━━━━━━━━━━━━━━━━━━━━━━━━━━━
  325. 27.52 s gammaloop-nextest-core> 1: <color_eyre[51793ea62743adbd]::config::PanicHook>::panic_report<unknown>
  326. 27.52 s gammaloop-nextest-core> at <unknown source file>:<unknown line>
  327. 27.52 s gammaloop-nextest-core> 2: <color_eyre[51793ea62743adbd]::config::PanicHook>::into_panic_hook::{closure#0}<unknown>
  328. 27.52 s gammaloop-nextest-core> at <unknown source file>:<unknown line>
  329. 27.52 s gammaloop-nextest-core> 3: std[bcb96dfbba0ab899]::panicking::panic_with_hook<unknown>
  330. 27.52 s gammaloop-nextest-core> at <unknown source file>:<unknown line>
  331. 27.52 s gammaloop-nextest-core> 4: std[bcb96dfbba0ab899]::panicking::panic_handler::{closure#0}<unknown>
  332. 27.52 s gammaloop-nextest-core> at <unknown source file>:<unknown line>
  333. 27.52 s gammaloop-nextest-core> 5: std[bcb96dfbba0ab899]::sys::backtrace::__rust_end_short_backtrace::<std[bcb96dfbba0ab899]::panicking::panic_handler::{closure#0}, !><unknown>
  334. 27.52 s gammaloop-nextest-core> at <unknown source file>:<unknown line>
  335. 27.52 s gammaloop-nextest-core> 6: __rustc[6c289b9f9c454d21]::rust_begin_unwind<unknown>
  336. 27.52 s gammaloop-nextest-core> at <unknown source file>:<unknown line>
  337. 27.52 s gammaloop-nextest-core> 7: core[940e698046960fd5]::panicking::panic_fmt<unknown>
  338. 27.52 s gammaloop-nextest-core> at <unknown source file>:<unknown line>
  339. 27.52 s gammaloop-nextest-core> 8: insta[307a548ac79ef4d9]::runtime::assert_snapshot<unknown>
  340. 27.52 s gammaloop-nextest-core> at <unknown source file>:<unknown line>
  341. 27.52 s gammaloop-nextest-core> 9: test_renormalization[6420da4f660338c3]::finite_part_ghost_2loop<unknown>
  342. 27.52 s gammaloop-nextest-core> at <unknown source file>:<unknown line>
  343. 27.52 s gammaloop-nextest-core> 10: <test_renormalization[6420da4f660338c3]::finite_part_ghost_2loop::{closure#0} as core[940e698046960fd5]::ops::function::FnOnce<()>>::call_once<unknown>
  344. 27.52 s gammaloop-nextest-core> at <unknown source file>:<unknown line>
  345. 27.52 s gammaloop-nextest-core> 11: test[75d6903177b1d7e9]::__rust_begin_short_backtrace::<core[940e698046960fd5]::result::Result<(), alloc[2ea6bcb46fca0c42]::string::String>, fn() -> core[940e698046960fd5]::result::Result<(), alloc[2ea6bcb46fca0c42]::string::String>><unknown>
  346. 27.52 s gammaloop-nextest-core> at <unknown source file>:<unknown line>
  347. 27.52 s gammaloop-nextest-core> 12: test[75d6903177b1d7e9]::run_test::{closure#0}<unknown>
  348. 27.52 s gammaloop-nextest-core> at <unknown source file>:<unknown line>
  349. 27.52 s gammaloop-nextest-core> 13: std[bcb96dfbba0ab899]::sys::backtrace::__rust_begin_short_backtrace::<test[75d6903177b1d7e9]::run_test::{closure#1}, ()><unknown>
  350. 27.52 s gammaloop-nextest-core> at <unknown source file>:<unknown line>
  351. 27.52 s gammaloop-nextest-core> 14: <std[bcb96dfbba0ab899]::thread::lifecycle::spawn_unchecked<test[75d6903177b1d7e9]::run_test::{closure#1}, ()>::{closure#1} as core[940e698046960fd5]::ops::function::FnOnce<()>>::call_once::{shim:vtable#0}<unknown>
  352. 27.52 s gammaloop-nextest-core> at <unknown source file>:<unknown line>
  353. 27.52 s gammaloop-nextest-core> 15: <std[bcb96dfbba0ab899]::sys::thread::unix::Thread>::new::thread_start<unknown>
  354. 27.52 s gammaloop-nextest-core> at <unknown source file>:<unknown line>
  355. 27.52 s gammaloop-nextest-core> 16: start_thread<unknown>
  356. 27.52 s gammaloop-nextest-core> at <unknown source file>:<unknown line>
  357. 27.52 s gammaloop-nextest-core> 17: __clone3<unknown>
  358. 27.52 s gammaloop-nextest-core> at <unknown source file>:<unknown line>
  359. 27.52 s gammaloop-nextest-core>
  360. 27.52 s gammaloop-nextest-core> Run with COLORBT_SHOW_HIDDEN=1 environment variable to disable frame filtering.
  361. 27.52 s gammaloop-nextest-core> Run with RUST_BACKTRACE=full to include source snippets.
  362. 27.52 s gammaloop-nextest-core>
  363. 27.52 s gammaloop-nextest-core> error: test run failed
  364. 27.53 s gammaloop-nextest-core>
  365. 27.53 s gammaloop-nextest-core> ========== nextest test summary ==========
  366. 27.53 s gammaloop-nextest-core> report: target/nextest/ci_gammaloop/junit.xml
  367. 27.53 s gammaloop-nextest-core> tests: 456, failures: 2, errors: 0
  368. 27.53 s gammaloop-nextest-core>
  369. 27.53 s gammaloop-nextest-core> 1. gammalooprs::test_renormalization::finit_part_ghlo
  370. 27.53 s gammaloop-nextest-core> failure: test failure with exit code 101
  371. 27.53 s gammaloop-nextest-core> system-out
  372. 27.53 s gammaloop-nextest-core> running 1 test
  373. 27.53 s gammaloop-nextest-core> ren part: 1/2*GC_10^2*dot(P(0,mink(dim)),P(0,mink(dim)))*cas(2,coad(8))/ε
  374. 27.53 s gammaloop-nextest-core> ━━━━━━━━━━━━━━━━━━━━━━━━━━━━━━━ Snapshot Summary ━━━━━━━━━━━━━━━━━━━━━━━━━━━━━━━
  375. 27.53 s gammaloop-nextest-core> Snapshot: finit_part_ghlo
  376. 27.53 s gammaloop-nextest-core> Source: crates/gammalooprs/tests/test_renormalization.rs:557
  377. 27.53 s gammaloop-nextest-core> ────────────────────────────────────────────────────────────────────────────────
  378. 27.53 s gammaloop-nextest-core> Expression: align_to_rqft(&a, &model).to_bare_ordered_string()
  379. 27.53 s gammaloop-nextest-core> ────────────────────────────────────────────────────────────────────────────────
  380. 27.53 s gammaloop-nextest-core> -old snapshot
  381. 27.53 s gammaloop-nextest-core> +new results
  382. 27.53 s gammaloop-nextest-core> ────────────┬───────────────────────────────────────────────────────────────────
  383. 27.53 s gammaloop-nextest-core> 1 │--1/2*cas(2,coad(8))*dot(P(0,mink(4)),P(0,mink(4)))*gs^2*ε^(-1)
  384. 27.53 s gammaloop-nextest-core> 1 │+1/2*cas(2,coad(8))*dot(P(0,mink(4)),P(0,mink(4)))*gs^2*ε^(-1)
  385. 27.53 s gammaloop-nextest-core> ────────────┴───────────────────────────────────────────────────────────────────
  386. 27.53 s gammaloop-nextest-core> To update snapshots run `cargo insta review`
  387. 27.53 s gammaloop-nextest-core> Stopped on the first failure. Run `cargo insta test` to run all snapshots.
  388. 27.53 s gammaloop-nextest-core> test finit_part_ghlo ... FAILED
  389. 27.53 s gammaloop-nextest-core>
  390. 27.53 s gammaloop-nextest-core> failures:
  391. 27.53 s gammaloop-nextest-core>
  392. 27.53 s gammaloop-nextest-core> failures:
  393. 27.53 s gammaloop-nextest-core> finit_part_ghlo
  394. 27.53 s gammaloop-nextest-core>
  395. 27.53 s gammaloop-nextest-core> test result: FAILED. 0 passed; 1 failed; 0 ignored; 0 measured; 5 filtered out; finished in 0.38s
  396. 27.53 s gammaloop-nextest-core> system-err
  397. 27.53 s gammaloop-nextest-core> The application panicked (crashed).
  398. 27.53 s gammaloop-nextest-core> Message: snapshot assertion for 'finit_part_ghlo' failed in line 557
  399. 27.53 s gammaloop-nextest-core> Location: /nix/store/0f9p2h9240ylfzayilfjv4gr7scagfs3-vendor-cargo-deps/c19b7c6f923b580ac259164a89f2577984ad5ab09ee9d583b888f934adbbe8d0/insta-1.47.2/src/runtime.rs:719
  400. 27.53 s gammaloop-nextest-core>
  401. 27.53 s gammaloop-nextest-core> ━━━━━━━━━━━━━━━━━━━━━━━━━━━━━━━━━━ BACKTRACE ━━━━━━━━━━━━━━━━━━━━━━━━━━━━━━━━━━━
  402. 27.53 s gammaloop-nextest-core> 1: <color_eyre[51793ea62743adbd]::config::PanicHook>::panic_report<unknown>
  403. 27.53 s gammaloop-nextest-core> at <unknown source file>:<unknown line>
  404. 27.53 s gammaloop-nextest-core> 2: <color_eyre[51793ea62743adbd]::config::PanicHook>::into_panic_hook::{closure#0}<unknown>
  405. 27.53 s gammaloop-nextest-core> at <unknown source file>:<unknown line>
  406. 27.53 s gammaloop-nextest-core> 3: std[bcb96dfbba0ab899]::panicking::panic_with_hook<unknown>
  407. 27.53 s gammaloop-nextest-core> at <unknown source file>:<unknown line>
  408. 27.53 s gammaloop-nextest-core> 4: std[bcb96dfbba0ab899]::panicking::panic_handler::{closure#0}<unknown>
  409. 27.53 s gammaloop-nextest-core> at <unknown source file>:<unknown line>
  410. 27.53 s gammaloop-nextest-core> 5: std[bcb96dfbba0ab899]::sys::backtrace::__rust_end_short_backtrace::<std[bcb96dfbba0ab899]::panicking::panic_handler::{closure#0}, !><unknown>
  411. 27.53 s gammaloop-nextest-core> at <unknown source file>:<unknown line>
  412. 27.53 s gammaloop-nextest-core> 6: __rustc[6c289b9f9c454d21]::rust_begin_unwind<unknown>
  413. 27.53 s gammaloop-nextest-core> at <unknown source file>:<unknown line>
  414. 27.53 s gammaloop-nextest-core> 7: core[940e698046960fd5]::panicking::panic_fmt<unknown>
  415. 27.53 s gammaloop-nextest-core> at <unknown source file>:<unknown line>
  416. 27.53 s gammaloop-nextest-core> 8: insta[307a548ac79ef4d9]::runtime::assert_snapshot<unknown>
  417. 27.53 s gammaloop-nextest-core> at <unknown source file>:<unknown line>
  418. 27.53 s gammaloop-nextest-core> 9: <test_renormalization[6420da4f660338c3]::finit_part_ghlo::{closure#0} as core[940e698046960fd5]::ops::function::FnOnce<()>>::call_once<unknown>
  419. 27.53 s gammaloop-nextest-core> at <unknown source file>:<unknown line>
  420. 27.53 s gammaloop-nextest-core> 10: test[75d6903177b1d7e9]::__rust_begin_short_backtrace::<core[940e698046960fd5]::result::Result<(), alloc[2ea6bcb46fca0c42]::string::String>, fn() -> core[940e698046960fd5]::result::Result<(), alloc[2ea6bcb46fca0c42]::string::String>><unknown>
  421. 27.53 s gammaloop-nextest-core> at <unknown source file>:<unknown line>
  422. 27.53 s gammaloop-nextest-core> 11: test[75d6903177b1d7e9]::run_test::{closure#0}<unknown>
  423. 27.53 s gammaloop-nextest-core> at <unknown source file>:<unknown line>
  424. 27.53 s gammaloop-nextest-core> 12: std[bcb96dfbba0ab899]::sys::backtrace::__rust_begin_short_backtrace::<test[75d6903177b1d7e9]::run_test::{closure#1}, ()><unknown>
  425. 27.53 s gammaloop-nextest-core> at <unknown source file>:<unknown line>
  426. 27.53 s gammaloop-nextest-core> 13: <std[bcb96dfbba0ab899]::thread::lifecycle::spawn_unchecked<test[75d6903177b1d7e9]::run_test::{closure#1}, ()>::{closure#1} as core[940e698046960fd5]::ops::function::FnOnce<()>>::call_once::{shim:vtable#0}<unknown>
  427. 27.53 s gammaloop-nextest-core> at <unknown source file>:<unknown line>
  428. 27.53 s gammaloop-nextest-core> 14: <std[bcb96dfbba0ab899]::sys::thread::unix::Thread>::new::thread_start<unknown>
  429. 27.53 s gammaloop-nextest-core> at <unknown source file>:<unknown line>
  430. 27.53 s gammaloop-nextest-core> 15: start_thread<unknown>
  431. 27.53 s gammaloop-nextest-core> at <unknown source file>:<unknown line>
  432. 27.53 s gammaloop-nextest-core> 16: __clone3<unknown>
  433. 27.53 s gammaloop-nextest-core> at <unknown source file>:<unknown line>
  434. 27.53 s gammaloop-nextest-core>
  435. 27.53 s gammaloop-nextest-core> Run with COLORBT_SHOW_HIDDEN=1 environment variable to disable frame filtering.
  436. 27.53 s gammaloop-nextest-core> Run with RUST_BACKTRACE=full to include source snippets.
  437. 27.53 s gammaloop-nextest-core>
  438. 27.53 s gammaloop-nextest-core> 2. gammalooprs::test_renormalization::finite_part_ghost_2loop
  439. 27.53 s gammaloop-nextest-core> failure: test failure with exit code 101
  440. 27.53 s gammaloop-nextest-core> system-out
  441. 27.53 s gammaloop-nextest-core> running 1 test
  442. 27.53 s gammaloop-nextest-core> ━━━━━━━━━━━━━━━━━━━━━━━━━━━━━━━ Snapshot Summary ━━━━━━━━━━━━━━━━━━━━━━━━━━━━━━━
  443. 27.53 s gammaloop-nextest-core> Snapshot: finite_part_ghost_2loop-3
  444. 27.53 s gammaloop-nextest-core> Source: crates/gammalooprs/tests/test_renormalization.rs:464
  445. 27.53 s gammaloop-nextest-core> ────────────────────────────────────────────────────────────────────────────────
  446. 27.53 s gammaloop-nextest-core> Expression: align_to_rqft(&a, &model).to_bare_ordered_string()
  447. 27.53 s gammaloop-nextest-core> ────────────────────────────────────────────────────────────────────────────────
  448. 27.53 s gammaloop-nextest-core> -old snapshot
  449. 27.53 s gammaloop-nextest-core> +new results
  450. 27.53 s gammaloop-nextest-core> ────────────┬───────────────────────────────────────────────────────────────────
  451. 27.53 s gammaloop-nextest-core> 1 │-(-1𝑖/32*ε+1𝑖/16)*(cas(2,coad(8)))^2*dot(P(0,mink(4)),P(0,mink(4)))*gs^4*ε^(-2)
  452. 27.53 s gammaloop-nextest-core> 1 │+(-1𝑖/16+1𝑖/32*ε)*(cas(2,coad(8)))^2*dot(P(0,mink(4)),P(0,mink(4)))*gs^4*ε^(-2)
  453. 27.53 s gammaloop-nextest-core> ────────────┴───────────────────────────────────────────────────────────────────
  454. 27.53 s gammaloop-nextest-core> To update snapshots run `cargo insta review`
  455. 27.53 s gammaloop-nextest-core> Stopped on the first failure. Run `cargo insta test` to run all snapshots.
  456. 27.53 s gammaloop-nextest-core> test finite_part_ghost_2loop ... FAILED
  457. 27.53 s gammaloop-nextest-core>
  458. 27.53 s gammaloop-nextest-core> failures:
  459. 27.53 s gammaloop-nextest-core>
  460. 27.53 s gammaloop-nextest-core> failures:
  461. 27.53 s gammaloop-nextest-core> finite_part_ghost_2loop
  462. 27.53 s gammaloop-nextest-core>
  463. 27.53 s gammaloop-nextest-core> test result: FAILED. 0 passed; 1 failed; 0 ignored; 0 measured; 5 filtered out; finished in 1.99s
  464. 27.53 s gammaloop-nextest-core> system-err
  465. 27.53 s gammaloop-nextest-core> The application panicked (crashed).
  466. 27.53 s gammaloop-nextest-core> Message: snapshot assertion for 'finite_part_ghost_2loop-3' failed in line 464
  467. 27.53 s gammaloop-nextest-core> Location: /nix/store/0f9p2h9240ylfzayilfjv4gr7scagfs3-vendor-cargo-deps/c19b7c6f923b580ac259164a89f2577984ad5ab09ee9d583b888f934adbbe8d0/insta-1.47.2/src/runtime.rs:719
  468. 27.53 s gammaloop-nextest-core>
  469. 27.53 s gammaloop-nextest-core> ━━━━━━━━━━━━━━━━━━━━━━━━━━━━━━━━━━ BACKTRACE ━━━━━━━━━━━━━━━━━━━━━━━━━━━━━━━━━━━
  470. 27.53 s gammaloop-nextest-core> 1: <color_eyre[51793ea62743adbd]::config::PanicHook>::panic_report<unknown>
  471. 27.53 s gammaloop-nextest-core> at <unknown source file>:<unknown line>
  472. 27.53 s gammaloop-nextest-core> 2: <color_eyre[51793ea62743adbd]::config::PanicHook>::into_panic_hook::{closure#0}<unknown>
  473. 27.53 s gammaloop-nextest-core> at <unknown source file>:<unknown line>
  474. 27.53 s gammaloop-nextest-core> 3: std[bcb96dfbba0ab899]::panicking::panic_with_hook<unknown>
  475. 27.53 s gammaloop-nextest-core> at <unknown source file>:<unknown line>
  476. 27.53 s gammaloop-nextest-core> 4: std[bcb96dfbba0ab899]::panicking::panic_handler::{closure#0}<unknown>
  477. 27.53 s gammaloop-nextest-core> at <unknown source file>:<unknown line>
  478. 27.53 s gammaloop-nextest-core> 5: std[bcb96dfbba0ab899]::sys::backtrace::__rust_end_short_backtrace::<std[bcb96dfbba0ab899]::panicking::panic_handler::{closure#0}, !><unknown>
  479. 27.53 s gammaloop-nextest-core> at <unknown source file>:<unknown line>
  480. 27.53 s gammaloop-nextest-core> 6: __rustc[6c289b9f9c454d21]::rust_begin_unwind<unknown>
  481. 27.53 s gammaloop-nextest-core> at <unknown source file>:<unknown line>
  482. 27.53 s gammaloop-nextest-core> 7: core[940e698046960fd5]::panicking::panic_fmt<unknown>
  483. 27.53 s gammaloop-nextest-core> at <unknown source file>:<unknown line>
  484. 27.53 s gammaloop-nextest-core> 8: insta[307a548ac79ef4d9]::runtime::assert_snapshot<unknown>
  485. 27.53 s gammaloop-nextest-core> at <unknown source file>:<unknown line>
  486. 27.53 s gammaloop-nextest-core> 9: test_renormalization[6420da4f660338c3]::finite_part_ghost_2loop<unknown>
  487. 27.53 s gammaloop-nextest-core> at <unknown source file>:<unknown line>
  488. 27.53 s gammaloop-nextest-core> 10: <test_renormalization[6420da4f660338c3]::finite_part_ghost_2loop::{closure#0} as core[940e698046960fd5]::ops::function::FnOnce<()>>::call_once<unknown>
  489. 27.53 s gammaloop-nextest-core> at <unknown source file>:<unknown line>
  490. 27.53 s gammaloop-nextest-core> 11: test[75d6903177b1d7e9]::__rust_begin_short_backtrace::<core[940e698046960fd5]::result::Result<(), alloc[2ea6bcb46fca0c42]::string::String>, fn() -> core[940e698046960fd5]::result::Result<(), alloc[2ea6bcb46fca0c42]::string::String>><unknown>
  491. 27.53 s gammaloop-nextest-core> at <unknown source file>:<unknown line>
  492. 27.53 s gammaloop-nextest-core> 12: test[75d6903177b1d7e9]::run_test::{closure#0}<unknown>
  493. 27.53 s gammaloop-nextest-core> at <unknown source file>:<unknown line>
  494. 27.53 s gammaloop-nextest-core> 13: std[bcb96dfbba0ab899]::sys::backtrace::__rust_begin_short_backtrace::<test[75d6903177b1d7e9]::run_test::{closure#1}, ()><unknown>
  495. 27.53 s gammaloop-nextest-core> at <unknown source file>:<unknown line>
  496. 27.53 s gammaloop-nextest-core> 14: <std[bcb96dfbba0ab899]::thread::lifecycle::spawn_unchecked<test[75d6903177b1d7e9]::run_test::{closure#1}, ()>::{closure#1} as core[940e698046960fd5]::ops::function::FnOnce<()>>::call_once::{shim:vtable#0}<unknown>
  497. 27.53 s gammaloop-nextest-core> at <unknown source file>:<unknown line>
  498. 27.53 s gammaloop-nextest-core> 15: <std[bcb96dfbba0ab899]::sys::thread::unix::Thread>::new::thread_start<unknown>
  499. 27.53 s gammaloop-nextest-core> at <unknown source file>:<unknown line>
  500. 27.53 s gammaloop-nextest-core> 16: start_thread<unknown>
  501. 27.53 s gammaloop-nextest-core> at <unknown source file>:<unknown line>
  502. 27.53 s gammaloop-nextest-core> 17: __clone3<unknown>
  503. 27.53 s gammaloop-nextest-core> at <unknown source file>:<unknown line>
  504. 27.53 s gammaloop-nextest-core>
  505. 27.53 s gammaloop-nextest-core> Run with COLORBT_SHOW_HIDDEN=1 environment variable to disable frame filtering.
  506. 27.53 s gammaloop-nextest-core> Run with RUST_BACKTRACE=full to include source snippets.
  507. 27.53 s gammaloop-nextest-core> =========================================
  508. 27.57 s error: Cannot build '/nix/store/350a1r6l54bs31kmzflfk73sprvxq6ih-gammaloop-nextest-core.drv'.
  509. 27.57 s Reason: builder failed with exit code 100.
  510. 27.57 s Output paths:
  511. 27.57 s /nix/store/2ph3azwcfnfcanqmv0c10wycsr5zzz4v-gammaloop-nextest-core
  512. 27.57 s Last 473 log lines:
  513. 27.57 s > Extracting 3 binaries (including 1 non-test binary), 1 build script output directory, and 2 linked paths to /build/nextest-archive-f3VTRu
  514. 27.57 s > Extracted 18 files to /build/nextest-archive-f3VTRu in 0.37s
  515. 27.57 s > ------------
  516. 27.57 s > Nextest run ID 7c84ddb4-56bc-42eb-969f-5465a8c87c56 with nextest profile: ci_gammaloop
  517. 27.57 s > Starting 339 tests across 2 binaries
  518. 27.57 s > ------------
  519. 27.57 s > Summary [ 0.416s] 339 tests run: 339 passed, 0 skipped
  520. 27.57 s >
  521. 27.57 s > ========== nextest test summary ==========
  522. 27.57 s > report: target/nextest/ci_gammaloop/junit.xml
  523. 27.57 s > tests: 339, failures: 0, errors: 0
  524. 27.57 s > No failing testcases found.
  525. 27.57 s > =========================================
  526. 27.57 s > Extracting 1 binary and 1 linked path to /build/nextest-archive-Gdt51g
  527. 27.57 s > Extracted 7 files to /build/nextest-archive-Gdt51g in 0.05s
  528. 27.57 s > ------------
  529. 27.57 s > Nextest run ID 1d6ce669-af29-447a-95c9-fa74cb83575c with nextest profile: ci_gammaloop
  530. 27.57 s > Starting 19 tests across 1 binary
  531. 27.57 s > ------------
  532. 27.57 s > Summary [ 0.013s] 19 tests run: 19 passed, 0 skipped
  533. 27.57 s >
  534. 27.57 s > ========== nextest test summary ==========
  535. 27.57 s > report: target/nextest/ci_gammaloop/junit.xml
  536. 27.57 s > tests: 19, failures: 0, errors: 0
  537. 27.57 s > No failing testcases found.
  538. 27.57 s > =========================================
  539. 27.57 s > Extracting 1 binary to /build/nextest-archive-9kC3Fj
  540. 27.57 s > Extracted 4 files to /build/nextest-archive-9kC3Fj in 0.03s
  541. 27.57 s > ------------
  542. 27.57 s > Nextest run ID c12b0ee3-3701-4930-9f51-a94d8199b195 with nextest profile: ci_gammaloop
  543. 27.57 s > Starting 0 tests across 1 binary
  544. 27.57 s > ------------
  545. 27.57 s > Summary [ 0.000s] 0 tests run: 0 passed, 0 skipped
  546. 27.57 s >
  547. 27.57 s > ========== nextest test summary ==========
  548. 27.57 s > report: target/nextest/ci_gammaloop/junit.xml
  549. 27.57 s > tests: 0, failures: 0, errors: 0
  550. 27.57 s > No failing testcases found.
  551. 27.57 s > =========================================
  552. 27.57 s > Extracting 4 binaries, 1 build script output directory, and 2 linked paths to /build/nextest-archive-gX6Us7
  553. 27.57 s > Extracted 18 files to /build/nextest-archive-gX6Us7 in 0.38s
  554. 27.57 s > ------------
  555. 27.57 s > Nextest run ID 52def3a5-dfa0-49f8-941d-d859ef1c4077 with nextest profile: ci_gammaloop
  556. 27.57 s > Starting 456 tests across 4 binaries (61 tests skipped, including 60 tests via profile.ci_gammaloop.default-filter)
  557. 27.57 s > FAIL [ 0.391s] (446/456) gammalooprs::test_renormalization finit_part_ghlo
  558. 27.57 s > stdout ---
  559. 27.57 s >
  560. 27.57 s > running 1 test
  561. 27.57 s > ren part: 1/2*GC_10^2*dot(P(0,mink(dim)),P(0,mink(dim)))*cas(2,coad(8))/ε
  562. 27.57 s > ━━━━━━━━━━━━━━━━━━━━━━━━━━━━━━━ Snapshot Summary ━━━━━━━━━━━━━━━━━━━━━━━━━━━━━━━
  563. 27.57 s > Snapshot: finit_part_ghlo
  564. 27.57 s > Source: crates/gammalooprs/tests/test_renormalization.rs:557
  565. 27.57 s > ────────────────────────────────────────────────────────────────────────────────
  566. 27.57 s > Expression: align_to_rqft(&a, &model).to_bare_ordered_string()
  567. 27.57 s > ────────────────────────────────────────────────────────────────────────────────
  568. 27.57 s > -old snapshot
  569. 27.57 s > +new results
  570. 27.57 s > ────────────┬───────────────────────────────────────────────────────────────────
  571. 27.57 s > 1 │--1/2*cas(2,coad(8))*dot(P(0,mink(4)),P(0,mink(4)))*gs^2*ε^(-1)
  572. 27.57 s > 1 │+1/2*cas(2,coad(8))*dot(P(0,mink(4)),P(0,mink(4)))*gs^2*ε^(-1)
  573. 27.57 s > ────────────┴───────────────────────────────────────────────────────────────────
  574. 27.57 s > To update snapshots run `cargo insta review`
  575. 27.57 s > Stopped on the first failure. Run `cargo insta test` to run all snapshots.
  576. 27.57 s > test finit_part_ghlo ... FAILED
  577. 27.57 s >
  578. 27.57 s > failures:
  579. 27.57 s >
  580. 27.57 s > failures:
  581. 27.57 s > finit_part_ghlo
  582. 27.57 s >
  583. 27.57 s > test result: FAILED. 0 passed; 1 failed; 0 ignored; 0 measured; 5 filtered out; finished in 0.38s
  584. 27.57 s >
  585. 27.57 s > stderr ---
  586. 27.57 s > The application panicked (crashed).
  587. 27.57 s > Message: snapshot assertion for 'finit_part_ghlo' failed in line 557
  588. 27.57 s > Location: /nix/store/0f9p2h9240ylfzayilfjv4gr7scagfs3-vendor-cargo-deps/c19b7c6f923b580ac259164a89f2577984ad5ab09ee9d583b888f934adbbe8d0/insta-1.47.2/src/runtime.rs:719
  589. 27.57 s >
  590. 27.57 s > ━━━━━━━━━━━━━━━━━━━━━━━━━━━━━━━━━━ BACKTRACE ━━━━━━━━━━━━━━━━━━━━━━━━━━━━━━━━━━━
  591. 27.57 s > 1: <color_eyre[51793ea62743adbd]::config::PanicHook>::panic_report<unknown>
  592. 27.57 s > at <unknown source file>:<unknown line>
  593. 27.57 s > 2: <color_eyre[51793ea62743adbd]::config::PanicHook>::into_panic_hook::{closure#0}<unknown>
  594. 27.57 s > at <unknown source file>:<unknown line>
  595. 27.57 s > 3: std[bcb96dfbba0ab899]::panicking::panic_with_hook<unknown>
  596. 27.57 s > at <unknown source file>:<unknown line>
  597. 27.57 s > 4: std[bcb96dfbba0ab899]::panicking::panic_handler::{closure#0}<unknown>
  598. 27.57 s > at <unknown source file>:<unknown line>
  599. 27.57 s > 5: std[bcb96dfbba0ab899]::sys::backtrace::__rust_end_short_backtrace::<std[bcb96dfbba0ab899]::panicking::panic_handler::{closure#0}, !><unknown>
  600. 27.57 s > at <unknown source file>:<unknown line>
  601. 27.57 s > 6: __rustc[6c289b9f9c454d21]::rust_begin_unwind<unknown>
  602. 27.57 s > at <unknown source file>:<unknown line>
  603. 27.57 s > 7: core[940e698046960fd5]::panicking::panic_fmt<unknown>
  604. 27.57 s > at <unknown source file>:<unknown line>
  605. 27.57 s > 8: insta[307a548ac79ef4d9]::runtime::assert_snapshot<unknown>
  606. 27.57 s > at <unknown source file>:<unknown line>
  607. 27.57 s > 9: <test_renormalization[6420da4f660338c3]::finit_part_ghlo::{closure#0} as core[940e698046960fd5]::ops::function::FnOnce<()>>::call_once<unknown>
  608. 27.57 s > at <unknown source file>:<unknown line>
  609. 27.57 s > 10: test[75d6903177b1d7e9]::__rust_begin_short_backtrace::<core[940e698046960fd5]::result::Result<(), alloc[2ea6bcb46fca0c42]::string::String>, fn() -> core[940e698046960fd5]::result::Result<(), alloc[2ea6bcb46fca0c42]::string::String>><unknown>
  610. 27.57 s > at <unknown source file>:<unknown line>
  611. 27.57 s > 11: test[75d6903177b1d7e9]::run_test::{closure#0}<unknown>
  612. 27.57 s > at <unknown source file>:<unknown line>
  613. 27.57 s > 12: std[bcb96dfbba0ab899]::sys::backtrace::__rust_begin_short_backtrace::<test[75d6903177b1d7e9]::run_test::{closure#1}, ()><unknown>
  614. 27.57 s > at <unknown source file>:<unknown line>
  615. 27.57 s > 13: <std[bcb96dfbba0ab899]::thread::lifecycle::spawn_unchecked<test[75d6903177b1d7e9]::run_test::{closure#1}, ()>::{closure#1} as core[940e698046960fd5]::ops::function::FnOnce<()>>::call_once::{shim:vtable#0}<unknown>
  616. 27.57 s > at <unknown source file>:<unknown line>
  617. 27.57 s > 14: <std[bcb96dfbba0ab899]::sys::thread::unix::Thread>::new::thread_start<unknown>
  618. 27.57 s > at <unknown source file>:<unknown line>
  619. 27.57 s > 15: start_thread<unknown>
  620. 27.57 s > at <unknown source file>:<unknown line>
  621. 27.57 s > 16: __clone3<unknown>
  622. 27.57 s > at <unknown source file>:<unknown line>
  623. 27.57 s >
  624. 27.57 s > Run with COLORBT_SHOW_HIDDEN=1 environment variable to disable frame filtering.
  625. 27.57 s > Run with RUST_BACKTRACE=full to include source snippets.
  626. 27.57 s >
  627. 27.57 s > FAIL [ 1.998s] (451/456) gammalooprs::test_renormalization finite_part_ghost_2loop
  628. 27.57 s > stdout ---
  629. 27.57 s >
  630. 27.57 s > running 1 test
  631. 27.57 s > ━━━━━━━━━━━━━━━━━━━━━━━━━━━━━━━ Snapshot Summary ━━━━━━━━━━━━━━━━━━━━━━━━━━━━━━━
  632. 27.57 s > Snapshot: finite_part_ghost_2loop-3
  633. 27.57 s > Source: crates/gammalooprs/tests/test_renormalization.rs:464
  634. 27.57 s > ────────────────────────────────────────────────────────────────────────────────
  635. 27.57 s > Expression: align_to_rqft(&a, &model).to_bare_ordered_string()
  636. 27.57 s > ────────────────────────────────────────────────────────────────────────────────
  637. 27.57 s > -old snapshot
  638. 27.57 s > +new results
  639. 27.57 s > ────────────┬───────────────────────────────────────────────────────────────────
  640. 27.57 s > 1 │-(-1𝑖/32*ε+1𝑖/16)*(cas(2,coad(8)))^2*dot(P(0,mink(4)),P(0,mink(4)))*gs^4*ε^(-2)
  641. 27.57 s > 1 │+(-1𝑖/16+1𝑖/32*ε)*(cas(2,coad(8)))^2*dot(P(0,mink(4)),P(0,mink(4)))*gs^4*ε^(-2)
  642. 27.57 s > ────────────┴───────────────────────────────────────────────────────────────────
  643. 27.57 s > To update snapshots run `cargo insta review`
  644. 27.57 s > Stopped on the first failure. Run `cargo insta test` to run all snapshots.
  645. 27.57 s > test finite_part_ghost_2loop ... FAILED
  646. 27.57 s >
  647. 27.57 s > failures:
  648. 27.57 s >
  649. 27.57 s > failures:
  650. 27.57 s > finite_part_ghost_2loop
  651. 27.57 s >
  652. 27.57 s > test result: FAILED. 0 passed; 1 failed; 0 ignored; 0 measured; 5 filtered out; finished in 1.99s
  653. 27.57 s >
  654. 27.57 s > stderr ---
  655. 27.57 s > The application panicked (crashed).
  656. 27.57 s > Message: snapshot assertion for 'finite_part_ghost_2loop-3' failed in line 464
  657. 27.57 s > Location: /nix/store/0f9p2h9240ylfzayilfjv4gr7scagfs3-vendor-cargo-deps/c19b7c6f923b580ac259164a89f2577984ad5ab09ee9d583b888f934adbbe8d0/insta-1.47.2/src/runtime.rs:719
  658. 27.57 s >
  659. 27.57 s > ━━━━━━━━━━━━━━━━━━━━━━━━━━━━━━━━━━ BACKTRACE ━━━━━━━━━━━━━━━━━━━━━━━━━━━━━━━━━━━
  660. 27.57 s > 1: <color_eyre[51793ea62743adbd]::config::PanicHook>::panic_report<unknown>
  661. 27.57 s > at <unknown source file>:<unknown line>
  662. 27.57 s > 2: <color_eyre[51793ea62743adbd]::config::PanicHook>::into_panic_hook::{closure#0}<unknown>
  663. 27.57 s > at <unknown source file>:<unknown line>
  664. 27.57 s > 3: std[bcb96dfbba0ab899]::panicking::panic_with_hook<unknown>
  665. 27.57 s > at <unknown source file>:<unknown line>
  666. 27.57 s > 4: std[bcb96dfbba0ab899]::panicking::panic_handler::{closure#0}<unknown>
  667. 27.57 s > at <unknown source file>:<unknown line>
  668. 27.57 s > 5: std[bcb96dfbba0ab899]::sys::backtrace::__rust_end_short_backtrace::<std[bcb96dfbba0ab899]::panicking::panic_handler::{closure#0}, !><unknown>
  669. 27.57 s > at <unknown source file>:<unknown line>
  670. 27.57 s > 6: __rustc[6c289b9f9c454d21]::rust_begin_unwind<unknown>
  671. 27.57 s > at <unknown source file>:<unknown line>
  672. 27.57 s > 7: core[940e698046960fd5]::panicking::panic_fmt<unknown>
  673. 27.57 s > at <unknown source file>:<unknown line>
  674. 27.57 s > 8: insta[307a548ac79ef4d9]::runtime::assert_snapshot<unknown>
  675. 27.57 s > at <unknown source file>:<unknown line>
  676. 27.57 s > 9: test_renormalization[6420da4f660338c3]::finite_part_ghost_2loop<unknown>
  677. 27.57 s > at <unknown source file>:<unknown line>
  678. 27.57 s > 10: <test_renormalization[6420da4f660338c3]::finite_part_ghost_2loop::{closure#0} as core[940e698046960fd5]::ops::function::FnOnce<()>>::call_once<unknown>
  679. 27.57 s > at <unknown source file>:<unknown line>
  680. 27.57 s > 11: test[75d6903177b1d7e9]::__rust_begin_short_backtrace::<core[940e698046960fd5]::result::Result<(), alloc[2ea6bcb46fca0c42]::string::String>, fn() -> core[940e698046960fd5]::result::Result<(), alloc[2ea6bcb46fca0c42]::string::String>><unknown>
  681. 27.57 s > at <unknown source file>:<unknown line>
  682. 27.57 s > 12: test[75d6903177b1d7e9]::run_test::{closure#0}<unknown>
  683. 27.57 s > at <unknown source file>:<unknown line>
  684. 27.57 s > 13: std[bcb96dfbba0ab899]::sys::backtrace::__rust_begin_short_backtrace::<test[75d6903177b1d7e9]::run_test::{closure#1}, ()><unknown>
  685. 27.57 s > at <unknown source file>:<unknown line>
  686. 27.57 s > 14: <std[bcb96dfbba0ab899]::thread::lifecycle::spawn_unchecked<test[75d6903177b1d7e9]::run_test::{closure#1}, ()>::{closure#1} as core[940e698046960fd5]::ops::function::FnOnce<()>>::call_once::{shim:vtable#0}<unknown>
  687. 27.57 s > at <unknown source file>:<unknown line>
  688. 27.57 s > 15: <std[bcb96dfbba0ab899]::sys::thread::unix::Thread>::new::thread_start<unknown>
  689. 27.57 s > at <unknown source file>:<unknown line>
  690. 27.57 s > 16: start_thread<unknown>
  691. 27.57 s > at <unknown source file>:<unknown line>
  692. 27.57 s > 17: __clone3<unknown>
  693. 27.57 s > at <unknown source file>:<unknown line>
  694. 27.57 s >
  695. 27.57 s > Run with COLORBT_SHOW_HIDDEN=1 environment variable to disable frame filtering.
  696. 27.57 s > Run with RUST_BACKTRACE=full to include source snippets.
  697. 27.57 s >
  698. 27.57 s > ------------
  699. 27.57 s > Summary [ 7.526s] 456 tests run: 454 passed, 2 failed, 61 skipped
  700. 27.57 s > FAIL [ 0.391s] (446/456) gammalooprs::test_renormalization finit_part_ghlo
  701. 27.57 s > stdout ---
  702. 27.57 s >
  703. 27.57 s > running 1 test
  704. 27.57 s > ren part: 1/2*GC_10^2*dot(P(0,mink(dim)),P(0,mink(dim)))*cas(2,coad(8))/ε
  705. 27.57 s > ━━━━━━━━━━━━━━━━━━━━━━━━━━━━━━━ Snapshot Summary ━━━━━━━━━━━━━━━━━━━━━━━━━━━━━━━
  706. 27.57 s > Snapshot: finit_part_ghlo
  707. 27.57 s > Source: crates/gammalooprs/tests/test_renormalization.rs:557
  708. 27.57 s > ────────────────────────────────────────────────────────────────────────────────
  709. 27.57 s > Expression: align_to_rqft(&a, &model).to_bare_ordered_string()
  710. 27.57 s > ────────────────────────────────────────────────────────────────────────────────
  711. 27.57 s > -old snapshot
  712. 27.57 s > +new results
  713. 27.57 s > ────────────┬───────────────────────────────────────────────────────────────────
  714. 27.57 s > 1 │--1/2*cas(2,coad(8))*dot(P(0,mink(4)),P(0,mink(4)))*gs^2*ε^(-1)
  715. 27.57 s > 1 │+1/2*cas(2,coad(8))*dot(P(0,mink(4)),P(0,mink(4)))*gs^2*ε^(-1)
  716. 27.57 s > ────────────┴───────────────────────────────────────────────────────────────────
  717. 27.57 s > To update snapshots run `cargo insta review`
  718. 27.57 s > Stopped on the first failure. Run `cargo insta test` to run all snapshots.
  719. 27.57 s > test finit_part_ghlo ... FAILED
  720. 27.57 s >
  721. 27.57 s > failures:
  722. 27.57 s >
  723. 27.57 s > failures:
  724. 27.57 s > finit_part_ghlo
  725. 27.57 s >
  726. 27.57 s > test result: FAILED. 0 passed; 1 failed; 0 ignored; 0 measured; 5 filtered out; finished in 0.38s
  727. 27.57 s >
  728. 27.57 s > stderr ---
  729. 27.57 s > The application panicked (crashed).
  730. 27.57 s > Message: snapshot assertion for 'finit_part_ghlo' failed in line 557
  731. 27.57 s > Location: /nix/store/0f9p2h9240ylfzayilfjv4gr7scagfs3-vendor-cargo-deps/c19b7c6f923b580ac259164a89f2577984ad5ab09ee9d583b888f934adbbe8d0/insta-1.47.2/src/runtime.rs:719
  732. 27.57 s >
  733. 27.57 s > ━━━━━━━━━━━━━━━━━━━━━━━━━━━━━━━━━━ BACKTRACE ━━━━━━━━━━━━━━━━━━━━━━━━━━━━━━━━━━━
  734. 27.57 s > 1: <color_eyre[51793ea62743adbd]::config::PanicHook>::panic_report<unknown>
  735. 27.57 s > at <unknown source file>:<unknown line>
  736. 27.57 s > 2: <color_eyre[51793ea62743adbd]::config::PanicHook>::into_panic_hook::{closure#0}<unknown>
  737. 27.57 s > at <unknown source file>:<unknown line>
  738. 27.57 s > 3: std[bcb96dfbba0ab899]::panicking::panic_with_hook<unknown>
  739. 27.57 s > at <unknown source file>:<unknown line>
  740. 27.57 s > 4: std[bcb96dfbba0ab899]::panicking::panic_handler::{closure#0}<unknown>
  741. 27.57 s > at <unknown source file>:<unknown line>
  742. 27.57 s > 5: std[bcb96dfbba0ab899]::sys::backtrace::__rust_end_short_backtrace::<std[bcb96dfbba0ab899]::panicking::panic_handler::{closure#0}, !><unknown>
  743. 27.57 s > at <unknown source file>:<unknown line>
  744. 27.57 s > 6: __rustc[6c289b9f9c454d21]::rust_begin_unwind<unknown>
  745. 27.57 s > at <unknown source file>:<unknown line>
  746. 27.57 s > 7: core[940e698046960fd5]::panicking::panic_fmt<unknown>
  747. 27.57 s > at <unknown source file>:<unknown line>
  748. 27.57 s > 8: insta[307a548ac79ef4d9]::runtime::assert_snapshot<unknown>
  749. 27.57 s > at <unknown source file>:<unknown line>
  750. 27.57 s > 9: <test_renormalization[6420da4f660338c3]::finit_part_ghlo::{closure#0} as core[940e698046960fd5]::ops::function::FnOnce<()>>::call_once<unknown>
  751. 27.57 s > at <unknown source file>:<unknown line>
  752. 27.57 s > 10: test[75d6903177b1d7e9]::__rust_begin_short_backtrace::<core[940e698046960fd5]::result::Result<(), alloc[2ea6bcb46fca0c42]::string::String>, fn() -> core[940e698046960fd5]::result::Result<(), alloc[2ea6bcb46fca0c42]::string::String>><unknown>
  753. 27.57 s > at <unknown source file>:<unknown line>
  754. 27.57 s > 11: test[75d6903177b1d7e9]::run_test::{closure#0}<unknown>
  755. 27.57 s > at <unknown source file>:<unknown line>
  756. 27.57 s > 12: std[bcb96dfbba0ab899]::sys::backtrace::__rust_begin_short_backtrace::<test[75d6903177b1d7e9]::run_test::{closure#1}, ()><unknown>
  757. 27.57 s > at <unknown source file>:<unknown line>
  758. 27.57 s > 13: <std[bcb96dfbba0ab899]::thread::lifecycle::spawn_unchecked<test[75d6903177b1d7e9]::run_test::{closure#1}, ()>::{closure#1} as core[940e698046960fd5]::ops::function::FnOnce<()>>::call_once::{shim:vtable#0}<unknown>
  759. 27.57 s > at <unknown source file>:<unknown line>
  760. 27.57 s > 14: <std[bcb96dfbba0ab899]::sys::thread::unix::Thread>::new::thread_start<unknown>
  761. 27.57 s > at <unknown source file>:<unknown line>
  762. 27.57 s > 15: start_thread<unknown>
  763. 27.57 s > at <unknown source file>:<unknown line>
  764. 27.57 s > 16: __clone3<unknown>
  765. 27.57 s > at <unknown source file>:<unknown line>
  766. 27.57 s >
  767. 27.57 s > Run with COLORBT_SHOW_HIDDEN=1 environment variable to disable frame filtering.
  768. 27.57 s > Run with RUST_BACKTRACE=full to include source snippets.
  769. 27.57 s >
  770. 27.57 s > FAIL [ 1.998s] (451/456) gammalooprs::test_renormalization finite_part_ghost_2loop
  771. 27.57 s > stdout ---
  772. 27.57 s >
  773. 27.57 s > running 1 test
  774. 27.57 s > ━━━━━━━━━━━━━━━━━━━━━━━━━━━━━━━ Snapshot Summary ━━━━━━━━━━━━━━━━━━━━━━━━━━━━━━━
  775. 27.57 s > Snapshot: finite_part_ghost_2loop-3
  776. 27.57 s > Source: crates/gammalooprs/tests/test_renormalization.rs:464
  777. 27.57 s > ────────────────────────────────────────────────────────────────────────────────
  778. 27.57 s > Expression: align_to_rqft(&a, &model).to_bare_ordered_string()
  779. 27.57 s > ────────────────────────────────────────────────────────────────────────────────
  780. 27.57 s > -old snapshot
  781. 27.57 s > +new results
  782. 27.57 s > ────────────┬───────────────────────────────────────────────────────────────────
  783. 27.57 s > 1 │-(-1𝑖/32*ε+1𝑖/16)*(cas(2,coad(8)))^2*dot(P(0,mink(4)),P(0,mink(4)))*gs^4*ε^(-2)
  784. 27.57 s > 1 │+(-1𝑖/16+1𝑖/32*ε)*(cas(2,coad(8)))^2*dot(P(0,mink(4)),P(0,mink(4)))*gs^4*ε^(-2)
  785. 27.57 s > ────────────┴───────────────────────────────────────────────────────────────────
  786. 27.57 s > To update snapshots run `cargo insta review`
  787. 27.57 s > Stopped on the first failure. Run `cargo insta test` to run all snapshots.
  788. 27.57 s > test finite_part_ghost_2loop ... FAILED
  789. 27.57 s >
  790. 27.57 s > failures:
  791. 27.57 s >
  792. 27.57 s > failures:
  793. 27.57 s > finite_part_ghost_2loop
  794. 27.57 s >
  795. 27.57 s > test result: FAILED. 0 passed; 1 failed; 0 ignored; 0 measured; 5 filtered out; finished in 1.99s
  796. 27.57 s >
  797. 27.57 s > stderr ---
  798. 27.57 s > The application panicked (crashed).
  799. 27.57 s > Message: snapshot assertion for 'finite_part_ghost_2loop-3' failed in line 464
  800. 27.57 s > Location: /nix/store/0f9p2h9240ylfzayilfjv4gr7scagfs3-vendor-cargo-deps/c19b7c6f923b580ac259164a89f2577984ad5ab09ee9d583b888f934adbbe8d0/insta-1.47.2/src/runtime.rs:719
  801. 27.57 s >
  802. 27.57 s > ━━━━━━━━━━━━━━━━━━━━━━━━━━━━━━━━━━ BACKTRACE ━━━━━━━━━━━━━━━━━━━━━━━━━━━━━━━━━━━
  803. 27.57 s > 1: <color_eyre[51793ea62743adbd]::config::PanicHook>::panic_report<unknown>
  804. 27.57 s > at <unknown source file>:<unknown line>
  805. 27.57 s > 2: <color_eyre[51793ea62743adbd]::config::PanicHook>::into_panic_hook::{closure#0}<unknown>
  806. 27.57 s > at <unknown source file>:<unknown line>
  807. 27.57 s > 3: std[bcb96dfbba0ab899]::panicking::panic_with_hook<unknown>
  808. 27.57 s > at <unknown source file>:<unknown line>
  809. 27.57 s > 4: std[bcb96dfbba0ab899]::panicking::panic_handler::{closure#0}<unknown>
  810. 27.57 s > at <unknown source file>:<unknown line>
  811. 27.57 s > 5: std[bcb96dfbba0ab899]::sys::backtrace::__rust_end_short_backtrace::<std[bcb96dfbba0ab899]::panicking::panic_handler::{closure#0}, !><unknown>
  812. 27.57 s > at <unknown source file>:<unknown line>
  813. 27.57 s > 6: __rustc[6c289b9f9c454d21]::rust_begin_unwind<unknown>
  814. 27.57 s > at <unknown source file>:<unknown line>
  815. 27.57 s > 7: core[940e698046960fd5]::panicking::panic_fmt<unknown>
  816. 27.57 s > at <unknown source file>:<unknown line>
  817. 27.57 s > 8: insta[307a548ac79ef4d9]::runtime::assert_snapshot<unknown>
  818. 27.57 s > at <unknown source file>:<unknown line>
  819. 27.57 s > 9: test_renormalization[6420da4f660338c3]::finite_part_ghost_2loop<unknown>
  820. 27.57 s > at <unknown source file>:<unknown line>
  821. 27.57 s > 10: <test_renormalization[6420da4f660338c3]::finite_part_ghost_2loop::{closure#0} as core[940e698046960fd5]::ops::function::FnOnce<()>>::call_once<unknown>
  822. 27.57 s > at <unknown source file>:<unknown line>
  823. 27.57 s > 11: test[75d6903177b1d7e9]::__rust_begin_short_backtrace::<core[940e698046960fd5]::result::Result<(), alloc[2ea6bcb46fca0c42]::string::String>, fn() -> core[940e698046960fd5]::result::Result<(), alloc[2ea6bcb46fca0c42]::string::String>><unknown>
  824. 27.57 s > at <unknown source file>:<unknown line>
  825. 27.57 s > 12: test[75d6903177b1d7e9]::run_test::{closure#0}<unknown>
  826. 27.57 s > at <unknown source file>:<unknown line>
  827. 27.57 s > 13: std[bcb96dfbba0ab899]::sys::backtrace::__rust_begin_short_backtrace::<test[75d6903177b1d7e9]::run_test::{closure#1}, ()><unknown>
  828. 27.57 s > at <unknown source file>:<unknown line>
  829. 27.57 s > 14: <std[bcb96dfbba0ab899]::thread::lifecycle::spawn_unchecked<test[75d6903177b1d7e9]::run_test::{closure#1}, ()>::{closure#1} as core[940e698046960fd5]::ops::function::FnOnce<()>>::call_once::{shim:vtable#0}<unknown>
  830. 27.57 s > at <unknown source file>:<unknown line>
  831. 27.57 s > 15: <std[bcb96dfbba0ab899]::sys::thread::unix::Thread>::new::thread_start<unknown>
  832. 27.57 s > at <unknown source file>:<unknown line>
  833. 27.57 s > 16: start_thread<unknown>
  834. 27.57 s > at <unknown source file>:<unknown line>
  835. 27.57 s > 17: __clone3<unknown>
  836. 27.57 s > at <unknown source file>:<unknown line>
  837. 27.57 s >
  838. 27.57 s > Run with COLORBT_SHOW_HIDDEN=1 environment variable to disable frame filtering.
  839. 27.57 s > Run with RUST_BACKTRACE=full to include source snippets.
  840. 27.57 s >
  841. 27.57 s > error: test run failed
  842. 27.57 s >
  843. 27.57 s > ========== nextest test summary ==========
  844. 27.57 s > report: target/nextest/ci_gammaloop/junit.xml
  845. 27.57 s > tests: 456, failures: 2, errors: 0
  846. 27.57 s >
  847. 27.57 s > 1. gammalooprs::test_renormalization::finit_part_ghlo
  848. 27.57 s > failure: test failure with exit code 101
  849. 27.57 s > system-out
  850. 27.57 s > running 1 test
  851. 27.57 s > ren part: 1/2*GC_10^2*dot(P(0,mink(dim)),P(0,mink(dim)))*cas(2,coad(8))/ε
  852. 27.57 s > ━━━━━━━━━━━━━━━━━━━━━━━━━━━━━━━ Snapshot Summary ━━━━━━━━━━━━━━━━━━━━━━━━━━━━━━━
  853. 27.57 s > Snapshot: finit_part_ghlo
  854. 27.57 s > Source: crates/gammalooprs/tests/test_renormalization.rs:557
  855. 27.57 s > ────────────────────────────────────────────────────────────────────────────────
  856. 27.57 s > Expression: align_to_rqft(&a, &model).to_bare_ordered_string()
  857. 27.57 s > ────────────────────────────────────────────────────────────────────────────────
  858. 27.57 s > -old snapshot
  859. 27.57 s > +new results
  860. 27.57 s > ────────────┬───────────────────────────────────────────────────────────────────
  861. 27.57 s > 1 │--1/2*cas(2,coad(8))*dot(P(0,mink(4)),P(0,mink(4)))*gs^2*ε^(-1)
  862. 27.57 s > 1 │+1/2*cas(2,coad(8))*dot(P(0,mink(4)),P(0,mink(4)))*gs^2*ε^(-1)
  863. 27.57 s > ────────────┴───────────────────────────────────────────────────────────────────
  864. 27.57 s > To update snapshots run `cargo insta review`
  865. 27.57 s > Stopped on the first failure. Run `cargo insta test` to run all snapshots.
  866. 27.57 s > test finit_part_ghlo ... FAILED
  867. 27.57 s >
  868. 27.57 s > failures:
  869. 27.57 s >
  870. 27.57 s > failures:
  871. 27.57 s > finit_part_ghlo
  872. 27.57 s >
  873. 27.57 s > test result: FAILED. 0 passed; 1 failed; 0 ignored; 0 measured; 5 filtered out; finished in 0.38s
  874. 27.57 s > system-err
  875. 27.57 s > The application panicked (crashed).
  876. 27.57 s > Message: snapshot assertion for 'finit_part_ghlo' failed in line 557
  877. 27.57 s > Location: /nix/store/0f9p2h9240ylfzayilfjv4gr7scagfs3-vendor-cargo-deps/c19b7c6f923b580ac259164a89f2577984ad5ab09ee9d583b888f934adbbe8d0/insta-1.47.2/src/runtime.rs:719
  878. 27.57 s >
  879. 27.57 s > ━━━━━━━━━━━━━━━━━━━━━━━━━━━━━━━━━━ BACKTRACE ━━━━━━━━━━━━━━━━━━━━━━━━━━━━━━━━━━━
  880. 27.57 s > 1: <color_eyre[51793ea62743adbd]::config::PanicHook>::panic_report<unknown>
  881. 27.57 s > at <unknown source file>:<unknown line>
  882. 27.57 s > 2: <color_eyre[51793ea62743adbd]::config::PanicHook>::into_panic_hook::{closure#0}<unknown>
  883. 27.57 s > at <unknown source file>:<unknown line>
  884. 27.57 s > 3: std[bcb96dfbba0ab899]::panicking::panic_with_hook<unknown>
  885. 27.57 s > at <unknown source file>:<unknown line>
  886. 27.57 s > 4: std[bcb96dfbba0ab899]::panicking::panic_handler::{closure#0}<unknown>
  887. 27.57 s > at <unknown source file>:<unknown line>
  888. 27.57 s > 5: std[bcb96dfbba0ab899]::sys::backtrace::__rust_end_short_backtrace::<std[bcb96dfbba0ab899]::panicking::panic_handler::{closure#0}, !><unknown>
  889. 27.57 s > at <unknown source file>:<unknown line>
  890. 27.57 s > 6: __rustc[6c289b9f9c454d21]::rust_begin_unwind<unknown>
  891. 27.57 s > at <unknown source file>:<unknown line>
  892. 27.57 s > 7: core[940e698046960fd5]::panicking::panic_fmt<unknown>
  893. 27.57 s > at <unknown source file>:<unknown line>
  894. 27.57 s > 8: insta[307a548ac79ef4d9]::runtime::assert_snapshot<unknown>
  895. 27.57 s > at <unknown source file>:<unknown line>
  896. 27.57 s > 9: <test_renormalization[6420da4f660338c3]::finit_part_ghlo::{closure#0} as core[940e698046960fd5]::ops::function::FnOnce<()>>::call_once<unknown>
  897. 27.57 s > at <unknown source file>:<unknown line>
  898. 27.57 s > 10: test[75d6903177b1d7e9]::__rust_begin_short_backtrace::<core[940e698046960fd5]::result::Result<(), alloc[2ea6bcb46fca0c42]::string::String>, fn() -> core[940e698046960fd5]::result::Result<(), alloc[2ea6bcb46fca0c42]::string::String>><unknown>
  899. 27.57 s > at <unknown source file>:<unknown line>
  900. 27.57 s > 11: test[75d6903177b1d7e9]::run_test::{closure#0}<unknown>
  901. 27.57 s > at <unknown source file>:<unknown line>
  902. 27.57 s > 12: std[bcb96dfbba0ab899]::sys::backtrace::__rust_begin_short_backtrace::<test[75d6903177b1d7e9]::run_test::{closure#1}, ()><unknown>
  903. 27.57 s > at <unknown source file>:<unknown line>
  904. 27.57 s > 13: <std[bcb96dfbba0ab899]::thread::lifecycle::spawn_unchecked<test[75d6903177b1d7e9]::run_test::{closure#1}, ()>::{closure#1} as core[940e698046960fd5]::ops::function::FnOnce<()>>::call_once::{shim:vtable#0}<unknown>
  905. 27.57 s > at <unknown source file>:<unknown line>
  906. 27.57 s > 14: <std[bcb96dfbba0ab899]::sys::thread::unix::Thread>::new::thread_start<unknown>
  907. 27.57 s > at <unknown source file>:<unknown line>
  908. 27.57 s > 15: start_thread<unknown>
  909. 27.57 s > at <unknown source file>:<unknown line>
  910. 27.57 s > 16: __clone3<unknown>
  911. 27.57 s > at <unknown source file>:<unknown line>
  912. 27.57 s >
  913. 27.57 s > Run with COLORBT_SHOW_HIDDEN=1 environment variable to disable frame filtering.
  914. 27.57 s > Run with RUST_BACKTRACE=full to include source snippets.
  915. 27.57 s >
  916. 27.57 s > 2. gammalooprs::test_renormalization::finite_part_ghost_2loop
  917. 27.57 s > failure: test failure with exit code 101
  918. 27.57 s > system-out
  919. 27.57 s > running 1 test
  920. 27.57 s > ━━━━━━━━━━━━━━━━━━━━━━━━━━━━━━━ Snapshot Summary ━━━━━━━━━━━━━━━━━━━━━━━━━━━━━━━
  921. 27.57 s > Snapshot: finite_part_ghost_2loop-3
  922. 27.57 s > Source: crates/gammalooprs/tests/test_renormalization.rs:464
  923. 27.57 s > ────────────────────────────────────────────────────────────────────────────────
  924. 27.57 s > Expression: align_to_rqft(&a, &model).to_bare_ordered_string()
  925. 27.57 s > ────────────────────────────────────────────────────────────────────────────────
  926. 27.57 s > -old snapshot
  927. 27.57 s > +new results
  928. 27.57 s > ────────────┬───────────────────────────────────────────────────────────────────
  929. 27.57 s > 1 │-(-1𝑖/32*ε+1𝑖/16)*(cas(2,coad(8)))^2*dot(P(0,mink(4)),P(0,mink(4)))*gs^4*ε^(-2)
  930. 27.57 s > 1 │+(-1𝑖/16+1𝑖/32*ε)*(cas(2,coad(8)))^2*dot(P(0,mink(4)),P(0,mink(4)))*gs^4*ε^(-2)
  931. 27.57 s > ────────────┴───────────────────────────────────────────────────────────────────
  932. 27.57 s > To update snapshots run `cargo insta review`
  933. 27.57 s > Stopped on the first failure. Run `cargo insta test` to run all snapshots.
  934. 27.57 s > test finite_part_ghost_2loop ... FAILED
  935. 27.57 s >
  936. 27.57 s > failures:
  937. 27.57 s >
  938. 27.57 s > failures:
  939. 27.57 s > finite_part_ghost_2loop
  940. 27.57 s >
  941. 27.57 s > test result: FAILED. 0 passed; 1 failed; 0 ignored; 0 measured; 5 filtered out; finished in 1.99s
  942. 27.57 s > system-err
  943. 27.57 s > The application panicked (crashed).
  944. 27.57 s > Message: snapshot assertion for 'finite_part_ghost_2loop-3' failed in line 464
  945. 27.57 s > Location: /nix/store/0f9p2h9240ylfzayilfjv4gr7scagfs3-vendor-cargo-deps/c19b7c6f923b580ac259164a89f2577984ad5ab09ee9d583b888f934adbbe8d0/insta-1.47.2/src/runtime.rs:719
  946. 27.57 s >
  947. 27.57 s > ━━━━━━━━━━━━━━━━━━━━━━━━━━━━━━━━━━ BACKTRACE ━━━━━━━━━━━━━━━━━━━━━━━━━━━━━━━━━━━
  948. 27.57 s > 1: <color_eyre[51793ea62743adbd]::config::PanicHook>::panic_report<unknown>
  949. 27.57 s > at <unknown source file>:<unknown line>
  950. 27.57 s > 2: <color_eyre[51793ea62743adbd]::config::PanicHook>::into_panic_hook::{closure#0}<unknown>
  951. 27.57 s > at <unknown source file>:<unknown line>
  952. 27.57 s > 3: std[bcb96dfbba0ab899]::panicking::panic_with_hook<unknown>
  953. 27.57 s > at <unknown source file>:<unknown line>
  954. 27.57 s > 4: std[bcb96dfbba0ab899]::panicking::panic_handler::{closure#0}<unknown>
  955. 27.57 s > at <unknown source file>:<unknown line>
  956. 27.57 s > 5: std[bcb96dfbba0ab899]::sys::backtrace::__rust_end_short_backtrace::<std[bcb96dfbba0ab899]::panicking::panic_handler::{closure#0}, !><unknown>
  957. 27.57 s > at <unknown source file>:<unknown line>
  958. 27.57 s > 6: __rustc[6c289b9f9c454d21]::rust_begin_unwind<unknown>
  959. 27.57 s > at <unknown source file>:<unknown line>
  960. 27.57 s > 7: core[940e698046960fd5]::panicking::panic_fmt<unknown>
  961. 27.57 s > at <unknown source file>:<unknown line>
  962. 27.57 s > 8: insta[307a548ac79ef4d9]::runtime::assert_snapshot<unknown>
  963. 27.57 s > at <unknown source file>:<unknown line>
  964. 27.57 s > 9: test_renormalization[6420da4f660338c3]::finite_part_ghost_2loop<unknown>
  965. 27.57 s > at <unknown source file>:<unknown line>
  966. 27.57 s > 10: <test_renormalization[6420da4f660338c3]::finite_part_ghost_2loop::{closure#0} as core[940e698046960fd5]::ops::function::FnOnce<()>>::call_once<unknown>
  967. 27.57 s > at <unknown source file>:<unknown line>
  968. 27.57 s > 11: test[75d6903177b1d7e9]::__rust_begin_short_backtrace::<core[940e698046960fd5]::result::Result<(), alloc[2ea6bcb46fca0c42]::string::String>, fn() -> core[940e698046960fd5]::result::Result<(), alloc[2ea6bcb46fca0c42]::string::String>><unknown>
  969. 27.57 s > at <unknown source file>:<unknown line>
  970. 27.57 s > 12: test[75d6903177b1d7e9]::run_test::{closure#0}<unknown>
  971. 27.57 s > at <unknown source file>:<unknown line>
  972. 27.57 s > 13: std[bcb96dfbba0ab899]::sys::backtrace::__rust_begin_short_backtrace::<test[75d6903177b1d7e9]::run_test::{closure#1}, ()><unknown>
  973. 27.57 s > at <unknown source file>:<unknown line>
  974. 27.57 s > 14: <std[bcb96dfbba0ab899]::thread::lifecycle::spawn_unchecked<test[75d6903177b1d7e9]::run_test::{closure#1}, ()>::{closure#1} as core[940e698046960fd5]::ops::function::FnOnce<()>>::call_once::{shim:vtable#0}<unknown>
  975. 27.57 s > at <unknown source file>:<unknown line>
  976. 27.57 s > 15: <std[bcb96dfbba0ab899]::sys::thread::unix::Thread>::new::thread_start<unknown>
  977. 27.57 s > at <unknown source file>:<unknown line>
  978. 27.57 s > 16: start_thread<unknown>
  979. 27.57 s > at <unknown source file>:<unknown line>
  980. 27.57 s > 17: __clone3<unknown>
  981. 27.57 s > at <unknown source file>:<unknown line>
  982. 27.57 s >
  983. 27.57 s > Run with COLORBT_SHOW_HIDDEN=1 environment variable to disable frame filtering.
  984. 27.57 s > Run with RUST_BACKTRACE=full to include source snippets.
  985. 27.57 s > =========================================
  986. 27.57 s For full logs, run:
  987. 27.57 s nix log /nix/store/350a1r6l54bs31kmzflfk73sprvxq6ih-gammaloop-nextest-core.drv
  988. 27.66 s [0 built (1 failed), 0.0Run failed.