0.14 s
$ /nix/store/9ypz3flqsrl5xl495mm8h645gadjsxi1-coreutils-9.11/bin/timeout --kill-after=15s 7200s /nix/store/23zk8sgzamrbmj1fday15szf7f2279s8-nix-2.34.7/bin/nix --extra-experimental-features nix-command --extra-experimental-features flakes flake clone git+https://github.com/alphal00p/gammaloop --dest /tmp/nix-ci-worker/stable-pwd/repo/
0.17 s
Cloning into '/tmp/nix-ci-worker/stable-pwd/repo'...
1.01 s
remote: Enumerating objects: 65034, done.
1.12 s
remote: Counting objects: 0% (1/7685)
remote: Counting objects: 1% (77/7685)
remote: Counting objects: 2% (154/7685)
remote: Counting objects: 3% (231/7685)
remote: Counting objects: 4% (308/7685)
remote: Counting objects: 5% (385/7685)
remote: Counting objects: 6% (462/7685)
remote: Counting objects: 7% (538/7685)
remote: Counting objects: 8% (615/7685)
remote: Counting objects: 9% (692/7685)
remote: Counting objects: 10% (769/7685)
remote: Counting objects: 11% (846/7685)
remote: Counting objects: 12% (923/7685)
remote: Counting objects: 13% (1000/7685)
remote: Counting objects: 14% (1076/7685)
remote: Counting objects: 15% (1153/7685)
remote: Counting objects: 16% (1230/7685)
remote: Counting objects: 17% (1307/7685)
remote: Counting objects: 18% (1384/7685)
remote: Counting objects: 19% (1461/7685)
remote: Counting objects: 20% (1537/7685)
remote: Counting objects: 21% (1614/7685)
remote: Counting objects: 22% (1691/7685)
remote: Counting objects: 23% (1768/7685)
remote: Counting objects: 24% (1845/7685)
remote: Counting objects: 25% (1922/7685)
remote: Counting objects: 26% (1999/7685)
remote: Counting objects: 27% (2075/7685)
remote: Counting objects: 28% (2152/7685)
remote: Counting objects: 29% (2229/7685)
remote: Counting objects: 30% (2306/7685)
remote: Counting objects: 31% (2383/7685)
remote: Counting objects: 32% (2460/7685)
remote: Counting objects: 33% (2537/7685)
remote: Counting objects: 34% (2613/7685)
remote: Counting objects: 35% (2690/7685)
remote: Counting objects: 36% (2767/7685)
remote: Counting objects: 37% (2844/7685)
remote: Counting objects: 38% (2921/7685)
remote: Counting objects: 39% (2998/7685)
remote: Counting objects: 40% (3074/7685)
remote: Counting objects: 41% (3151/7685)
remote: Counting objects: 42% (3228/7685)
remote: Counting objects: 43% (3305/7685)
remote: Counting objects: 44% (3382/7685)
remote: Counting objects: 45% (3459/7685)
remote: Counting objects: 46% (3536/7685)
remote: Counting objects: 47% (3612/7685)
remote: Counting objects: 48% (3689/7685)
remote: Counting objects: 49% (3766/7685)
remote: Counting objects: 50% (3843/7685)
remote: Counting objects: 51% (3920/7685)
remote: Counting objects: 52% (3997/7685)
remote: Counting objects: 53% (4074/7685)
remote: Counting objects: 54% (4150/7685)
remote: Counting objects: 55% (4227/7685)
remote: Counting objects: 56% (4304/7685)
remote: Counting objects: 57% (4381/7685)
remote: Counting objects: 58% (4458/7685)
remote: Counting objects: 59% (4535/7685)
remote: Counting objects: 60% (4611/7685)
remote: Counting objects: 61% (4688/7685)
remote: Counting objects: 62% (4765/7685)
remote: Counting objects: 63% (4842/7685)
remote: Counting objects: 64% (4919/7685)
remote: Counting objects: 65% (4996/7685)
remote: Counting objects: 66% (5073/7685)
remote: Counting objects: 67% (5149/7685)
remote: Counting objects: 68% (5226/7685)
remote: Counting objects: 69% (5303/7685)
remote: Counting objects: 70% (5380/7685)
remote: Counting objects: 71% (5457/7685)
remote: Counting objects: 72% (5534/7685)
remote: Counting objects: 73% (5611/7685)
remote: Counting objects: 74% (5687/7685)
remote: Counting objects: 75% (5764/7685)
remote: Counting objects: 76% (5841/7685)
remote: Counting objects: 77% (5918/7685)
remote: Counting objects: 78% (5995/7685)
remote: Counting objects: 79% (6072/7685)
remote: Counting objects: 80% (6148/7685)
remote: Counting objects: 81% (6225/7685)
remote: Counting objects: 82% (6302/7685)
remote: Counting objects: 83% (6379/7685)
remote: Counting objects: 84% (6456/7685)
remote: Counting objects: 85% (6533/7685)
remote: Counting objects: 86% (6610/7685)
remote: Counting objects: 87% (6686/7685)
remote: Counting objects: 88% (6763/7685)
remote: Counting objects: 89% (6840/7685)
remote: Counting objects: 90% (6917/7685)
remote: Counting objects: 91% (6994/7685)
remote: Counting objects: 92% (7071/7685)
remote: Counting objects: 93% (7148/7685)
remote: Counting objects: 94% (7224/7685)
remote: Counting objects: 95% (7301/7685)
remote: Counting objects: 96% (7378/7685)
remote: Counting objects: 97% (7455/7685)
remote: Counting objects: 98% (7532/7685)
remote: Counting objects: 99% (7609/7685)
remote: Counting objects: 100% (7685/7685)
remote: Counting objects: 100% (7685/7685), done.
2.55 s
remote: Compressing objects: 0% (1/1415)
remote: Compressing objects: 1% (15/1415)
remote: Compressing objects: 2% (29/1415)
remote: Compressing objects: 3% (43/1415)
remote: Compressing objects: 4% (57/1415)
remote: Compressing objects: 5% (71/1415)
remote: Compressing objects: 6% (85/1415)
remote: Compressing objects: 7% (100/1415)
remote: Compressing objects: 8% (114/1415)
remote: Compressing objects: 9% (128/1415)
remote: Compressing objects: 10% (142/1415)
remote: Compressing objects: 11% (156/1415)
remote: Compressing objects: 12% (170/1415)
remote: Compressing objects: 12% (179/1415)
remote: Compressing objects: 13% (184/1415)
remote: Compressing objects: 14% (199/1415)
remote: Compressing objects: 15% (213/1415)
remote: Compressing objects: 16% (227/1415)
remote: Compressing objects: 17% (241/1415)
remote: Compressing objects: 18% (255/1415)
remote: Compressing objects: 19% (269/1415)
remote: Compressing objects: 20% (283/1415)
remote: Compressing objects: 21% (298/1415)
remote: Compressing objects: 22% (312/1415)
remote: Compressing objects: 23% (326/1415)
remote: Compressing objects: 24% (340/1415)
remote: Compressing objects: 25% (354/1415)
remote: Compressing objects: 26% (368/1415)
remote: Compressing objects: 27% (383/1415)
remote: Compressing objects: 28% (397/1415)
remote: Compressing objects: 29% (411/1415)
remote: Compressing objects: 30% (425/1415)
remote: Compressing objects: 31% (439/1415)
remote: Compressing objects: 32% (453/1415)
remote: Compressing objects: 33% (467/1415)
remote: Compressing objects: 34% (482/1415)
remote: Compressing objects: 35% (496/1415)
remote: Compressing objects: 36% (510/1415)
remote: Compressing objects: 37% (524/1415)
remote: Compressing objects: 38% (538/1415)
remote: Compressing objects: 39% (552/1415)
remote: Compressing objects: 40% (566/1415)
remote: Compressing objects: 41% (581/1415)
remote: Compressing objects: 42% (595/1415)
remote: Compressing objects: 43% (609/1415)
remote: Compressing objects: 44% (623/1415)
remote: Compressing objects: 45% (637/1415)
remote: Compressing objects: 46% (651/1415)
remote: Compressing objects: 47% (666/1415)
remote: Compressing objects: 48% (680/1415)
remote: Compressing objects: 49% (694/1415)
remote: Compressing objects: 50% (708/1415)
remote: Compressing objects: 51% (722/1415)
remote: Compressing objects: 52% (736/1415)
remote: Compressing objects: 53% (750/1415)
remote: Compressing objects: 54% (765/1415)
remote: Compressing objects: 55% (779/1415)
remote: Compressing objects: 56% (793/1415)
remote: Compressing objects: 57% (807/1415)
remote: Compressing objects: 58% (821/1415)
remote: Compressing objects: 59% (835/1415)
remote: Compressing objects: 60% (849/1415)
remote: Compressing objects: 61% (864/1415)
remote: Compressing objects: 62% (878/1415)
remote: Compressing objects: 63% (892/1415)
remote: Compressing objects: 64% (906/1415)
remote: Compressing objects: 65% (920/1415)
remote: Compressing objects: 66% (934/1415)
remote: Compressing objects: 67% (949/1415)
remote: Compressing objects: 68% (963/1415)
remote: Compressing objects: 69% (977/1415)
remote: Compressing objects: 70% (991/1415)
remote: Compressing objects: 71% (1005/1415)
remote: Compressing objects: 72% (1019/1415)
remote: Compressing objects: 73% (1033/1415)
remote: Compressing objects: 74% (1048/1415)
remote: Compressing objects: 75% (1062/1415)
remote: Compressing objects: 76% (1076/1415)
remote: Compressing objects: 77% (1090/1415)
remote: Compressing objects: 78% (1104/1415)
remote: Compressing objects: 79% (1118/1415)
remote: Compressing objects: 80% (1132/1415)
remote: Compressing objects: 81% (1147/1415)
remote: Compressing objects: 82% (1161/1415)
remote: Compressing objects: 83% (1175/1415)
remote: Compressing objects: 84% (1189/1415)
remote: Compressing objects: 85% (1203/1415)
remote: Compressing objects: 86% (1217/1415)
remote: Compressing objects: 87% (1232/1415)
remote: Compressing objects: 88% (1246/1415)
remote: Compressing objects: 89% (1260/1415)
remote: Compressing objects: 90% (1274/1415)
remote: Compressing objects: 91% (1288/1415)
remote: Compressing objects: 92% (1302/1415)
remote: Compressing objects: 93% (1316/1415)
remote: Compressing objects: 94% (1331/1415)
remote: Compressing objects: 95% (1345/1415)
remote: Compressing objects: 96% (1359/1415)
remote: Compressing objects: 97% (1373/1415)
remote: Compressing objects: 98% (1387/1415)
remote: Compressing objects: 99% (1401/1415)
remote: Compressing objects: 100% (1415/1415)
remote: Compressing objects: 100% (1415/1415), done.
5.30 s
Receiving objects: 0% (1/65034)
Receiving objects: 1% (651/65034)
Receiving objects: 2% (1301/65034)
Receiving objects: 3% (1952/65034)
Receiving objects: 4% (2602/65034)
Receiving objects: 5% (3252/65034)
Receiving objects: 6% (3903/65034)
Receiving objects: 7% (4553/65034)
Receiving objects: 8% (5203/65034)
Receiving objects: 9% (5854/65034)
Receiving objects: 10% (6504/65034)
Receiving objects: 11% (7154/65034)
Receiving objects: 12% (7805/65034), 12.66 MiB | 25.30 MiB/s
Receiving objects: 13% (8455/65034), 12.66 MiB | 25.30 MiB/s
Receiving objects: 14% (9105/65034), 12.66 MiB | 25.30 MiB/s
Receiving objects: 15% (9756/65034), 12.66 MiB | 25.30 MiB/s
Receiving objects: 16% (10406/65034), 12.66 MiB | 25.30 MiB/s
Receiving objects: 17% (11056/65034), 12.66 MiB | 25.30 MiB/s
Receiving objects: 18% (11707/65034), 12.66 MiB | 25.30 MiB/s
Receiving objects: 19% (12357/65034), 12.66 MiB | 25.30 MiB/s
Receiving objects: 20% (13007/65034), 12.66 MiB | 25.30 MiB/s
Receiving objects: 21% (13658/65034), 12.66 MiB | 25.30 MiB/s
Receiving objects: 22% (14308/65034), 12.66 MiB | 25.30 MiB/s
Receiving objects: 23% (14958/65034), 12.66 MiB | 25.30 MiB/s
Receiving objects: 24% (15609/65034), 12.66 MiB | 25.30 MiB/s
Receiving objects: 25% (16259/65034), 12.66 MiB | 25.30 MiB/s
Receiving objects: 26% (16909/65034), 12.66 MiB | 25.30 MiB/s
Receiving objects: 27% (17560/65034), 12.66 MiB | 25.30 MiB/s
Receiving objects: 28% (18210/65034), 12.66 MiB | 25.30 MiB/s
Receiving objects: 29% (18860/65034), 12.66 MiB | 25.30 MiB/s
Receiving objects: 30% (19511/65034), 12.66 MiB | 25.30 MiB/s
Receiving objects: 31% (20161/65034), 12.66 MiB | 25.30 MiB/s
Receiving objects: 32% (20811/65034), 12.66 MiB | 25.30 MiB/s
Receiving objects: 33% (21462/65034), 12.66 MiB | 25.30 MiB/s
Receiving objects: 34% (22112/65034), 12.66 MiB | 25.30 MiB/s
Receiving objects: 35% (22762/65034), 12.66 MiB | 25.30 MiB/s
Receiving objects: 36% (23413/65034), 12.66 MiB | 25.30 MiB/s
Receiving objects: 37% (24063/65034), 12.66 MiB | 25.30 MiB/s
Receiving objects: 38% (24713/65034), 12.66 MiB | 25.30 MiB/s
Receiving objects: 39% (25364/65034), 12.66 MiB | 25.30 MiB/s
Receiving objects: 40% (26014/65034), 12.66 MiB | 25.30 MiB/s
Receiving objects: 41% (26664/65034), 12.66 MiB | 25.30 MiB/s
Receiving objects: 42% (27315/65034), 12.66 MiB | 25.30 MiB/s
Receiving objects: 43% (27965/65034), 12.66 MiB | 25.30 MiB/s
Receiving objects: 44% (28615/65034), 12.66 MiB | 25.30 MiB/s
Receiving objects: 45% (29266/65034), 12.66 MiB | 25.30 MiB/s
Receiving objects: 46% (29916/65034), 12.66 MiB | 25.30 MiB/s
Receiving objects: 47% (30566/65034), 12.66 MiB | 25.30 MiB/s
Receiving objects: 48% (31217/65034), 12.66 MiB | 25.30 MiB/s
Receiving objects: 49% (31867/65034), 12.66 MiB | 25.30 MiB/s
Receiving objects: 50% (32517/65034), 12.66 MiB | 25.30 MiB/s
Receiving objects: 50% (32753/65034), 30.37 MiB | 30.36 MiB/s
Receiving objects: 51% (33168/65034), 30.37 MiB | 30.36 MiB/s
Receiving objects: 52% (33818/65034), 30.37 MiB | 30.36 MiB/s
Receiving objects: 53% (34469/65034), 30.37 MiB | 30.36 MiB/s
Receiving objects: 54% (35119/65034), 30.37 MiB | 30.36 MiB/s
Receiving objects: 55% (35769/65034), 30.37 MiB | 30.36 MiB/s
Receiving objects: 56% (36420/65034), 30.37 MiB | 30.36 MiB/s
Receiving objects: 57% (37070/65034), 30.37 MiB | 30.36 MiB/s
Receiving objects: 58% (37720/65034), 30.37 MiB | 30.36 MiB/s
Receiving objects: 59% (38371/65034), 30.37 MiB | 30.36 MiB/s
Receiving objects: 60% (39021/65034), 30.37 MiB | 30.36 MiB/s
Receiving objects: 61% (39671/65034), 30.37 MiB | 30.36 MiB/s
Receiving objects: 62% (40322/65034), 46.69 MiB | 31.12 MiB/s
Receiving objects: 63% (40972/65034), 46.69 MiB | 31.12 MiB/s
Receiving objects: 64% (41622/65034), 46.69 MiB | 31.12 MiB/s
Receiving objects: 65% (42273/65034), 46.69 MiB | 31.12 MiB/s
Receiving objects: 66% (42923/65034), 46.69 MiB | 31.12 MiB/s
Receiving objects: 67% (43573/65034), 46.69 MiB | 31.12 MiB/s
Receiving objects: 68% (44224/65034), 46.69 MiB | 31.12 MiB/s
Receiving objects: 69% (44874/65034), 46.69 MiB | 31.12 MiB/s
Receiving objects: 70% (45524/65034), 46.69 MiB | 31.12 MiB/s
Receiving objects: 71% (46175/65034), 46.69 MiB | 31.12 MiB/s
Receiving objects: 72% (46825/65034), 46.69 MiB | 31.12 MiB/s
Receiving objects: 73% (47475/65034), 46.69 MiB | 31.12 MiB/s
Receiving objects: 74% (48126/65034), 46.69 MiB | 31.12 MiB/s
Receiving objects: 75% (48776/65034), 46.69 MiB | 31.12 MiB/s
Receiving objects: 75% (48916/65034), 62.46 MiB | 31.23 MiB/s
Receiving objects: 76% (49426/65034), 62.46 MiB | 31.23 MiB/s
Receiving objects: 77% (50077/65034), 62.46 MiB | 31.23 MiB/s
Receiving objects: 78% (50727/65034), 62.46 MiB | 31.23 MiB/s
Receiving objects: 79% (51377/65034), 62.46 MiB | 31.23 MiB/s
Receiving objects: 80% (52028/65034), 62.46 MiB | 31.23 MiB/s
Receiving objects: 81% (52678/65034), 62.46 MiB | 31.23 MiB/s
Receiving objects: 82% (53328/65034), 62.46 MiB | 31.23 MiB/s
Receiving objects: 83% (53979/65034), 62.46 MiB | 31.23 MiB/s
Receiving objects: 84% (54629/65034), 79.19 MiB | 31.54 MiB/s
Receiving objects: 85% (55279/65034), 79.19 MiB | 31.54 MiB/s
Receiving objects: 86% (55930/65034), 79.19 MiB | 31.54 MiB/s
Receiving objects: 87% (56580/65034), 79.19 MiB | 31.54 MiB/s
Receiving objects: 88% (57230/65034), 79.19 MiB | 31.54 MiB/s
Receiving objects: 89% (57881/65034), 79.19 MiB | 31.54 MiB/s
Receiving objects: 90% (58531/65034), 79.19 MiB | 31.54 MiB/s
Receiving objects: 91% (59181/65034), 79.19 MiB | 31.54 MiB/s
Receiving objects: 92% (59832/65034), 79.19 MiB | 31.54 MiB/s
Receiving objects: 93% (60482/65034), 79.19 MiB | 31.54 MiB/s
Receiving objects: 94% (61132/65034), 79.19 MiB | 31.54 MiB/s
Receiving objects: 95% (61783/65034), 79.19 MiB | 31.54 MiB/s
Receiving objects: 96% (62433/65034), 79.19 MiB | 31.54 MiB/s
Receiving objects: 97% (63083/65034), 79.19 MiB | 31.54 MiB/s
Receiving objects: 98% (63734/65034), 79.19 MiB | 31.54 MiB/s
Receiving objects: 99% (64384/65034), 79.19 MiB | 31.54 MiB/s
remote: Total 65034 (delta 6786), reused 6277 (delta 6269), pack-reused 57349 (from 1)
5.36 s
Receiving objects: 100% (65034/65034), 79.19 MiB | 31.54 MiB/s
Receiving objects: 100% (65034/65034), 86.98 MiB | 31.94 MiB/s, done.
5.94 s
Resolving deltas: 0% (0/45904)
Resolving deltas: 1% (460/45904)
Resolving deltas: 2% (919/45904)
Resolving deltas: 3% (1378/45904)
Resolving deltas: 4% (1837/45904)
Resolving deltas: 5% (2300/45904)
Resolving deltas: 6% (2755/45904)
Resolving deltas: 7% (3214/45904)
Resolving deltas: 8% (3673/45904)
Resolving deltas: 9% (4133/45904)
Resolving deltas: 10% (4591/45904)
Resolving deltas: 11% (5050/45904)
Resolving deltas: 12% (5510/45904)
Resolving deltas: 13% (5968/45904)
Resolving deltas: 14% (6427/45904)
Resolving deltas: 15% (6886/45904)
Resolving deltas: 16% (7345/45904)
Resolving deltas: 17% (7804/45904)
Resolving deltas: 18% (8263/45904)
Resolving deltas: 19% (8723/45904)
Resolving deltas: 20% (9181/45904)
Resolving deltas: 21% (9643/45904)
Resolving deltas: 22% (10099/45904)
Resolving deltas: 23% (10558/45904)
Resolving deltas: 24% (11017/45904)
Resolving deltas: 25% (11476/45904)
Resolving deltas: 26% (11936/45904)
Resolving deltas: 27% (12397/45904)
Resolving deltas: 28% (12854/45904)
Resolving deltas: 29% (13313/45904)
Resolving deltas: 30% (13772/45904)
Resolving deltas: 31% (14231/45904)
Resolving deltas: 32% (14690/45904)
Resolving deltas: 33% (15149/45904)
Resolving deltas: 34% (15608/45904)
Resolving deltas: 35% (16067/45904)
Resolving deltas: 36% (16526/45904)
Resolving deltas: 37% (16985/45904)
Resolving deltas: 38% (17444/45904)
Resolving deltas: 39% (17903/45904)
Resolving deltas: 40% (18362/45904)
Resolving deltas: 41% (18821/45904)
Resolving deltas: 42% (19280/45904)
Resolving deltas: 43% (19739/45904)
Resolving deltas: 44% (20198/45904)
Resolving deltas: 45% (20657/45904)
Resolving deltas: 46% (21116/45904)
Resolving deltas: 47% (21576/45904)
Resolving deltas: 48% (22035/45904)
Resolving deltas: 49% (22495/45904)
Resolving deltas: 50% (22952/45904)
Resolving deltas: 51% (23412/45904)
Resolving deltas: 52% (23871/45904)
Resolving deltas: 53% (24330/45904)
Resolving deltas: 54% (24790/45904)
Resolving deltas: 55% (25248/45904)
Resolving deltas: 56% (25707/45904)
Resolving deltas: 57% (26166/45904)
Resolving deltas: 58% (26626/45904)
Resolving deltas: 59% (27084/45904)
Resolving deltas: 60% (27543/45904)
Resolving deltas: 61% (28003/45904)
Resolving deltas: 62% (28461/45904)
Resolving deltas: 63% (28920/45904)
Resolving deltas: 64% (29380/45904)
Resolving deltas: 65% (29838/45904)
Resolving deltas: 66% (30297/45904)
Resolving deltas: 67% (30756/45904)
Resolving deltas: 68% (31215/45904)
Resolving deltas: 69% (31676/45904)
Resolving deltas: 70% (32133/45904)
Resolving deltas: 71% (32592/45904)
Resolving deltas: 72% (33051/45904)
Resolving deltas: 73% (33510/45904)
Resolving deltas: 74% (33969/45904)
Resolving deltas: 75% (34428/45904)
Resolving deltas: 76% (34888/45904)
Resolving deltas: 77% (35347/45904)
Resolving deltas: 78% (35806/45904)
Resolving deltas: 79% (36265/45904)
Resolving deltas: 80% (36724/45904)
Resolving deltas: 81% (37183/45904)
Resolving deltas: 82% (37642/45904)
Resolving deltas: 83% (38103/45904)
Resolving deltas: 84% (38562/45904)
Resolving deltas: 85% (39021/45904)
Resolving deltas: 86% (39479/45904)
Resolving deltas: 87% (39937/45904)
Resolving deltas: 88% (40396/45904)
Resolving deltas: 89% (40855/45904)
Resolving deltas: 90% (41314/45904)
Resolving deltas: 91% (41773/45904)
Resolving deltas: 92% (42232/45904)
Resolving deltas: 93% (42691/45904)
Resolving deltas: 94% (43151/45904)
Resolving deltas: 95% (43611/45904)
Resolving deltas: 96% (44069/45904)
Resolving deltas: 97% (44527/45904)
Resolving deltas: 98% (44986/45904)
Resolving deltas: 99% (45445/45904)
Resolving deltas: 100% (45904/45904)
Resolving deltas: 100% (45904/45904), done.
6.21 s
Fetching commit 1de6cf5dc4b80d0f0bf9aa8e901ee6bd43e45b8d for vakint_rustred ...
6.21 s
$ /nix/store/bcnisk3ydfgv26v2gw3zlky24g00yww2-git-2.54.0/bin/git fetch origin 1de6cf5dc4b80d0f0bf9aa8e901ee6bd43e45b8d
6.67 s
From https://github.com/alphal00p/gammaloop
6.67 s
* branch 1de6cf5dc4b80d0f0bf9aa8e901ee6bd43e45b8d -> FETCH_HEAD
6.68 s
$ /nix/store/9ypz3flqsrl5xl495mm8h645gadjsxi1-coreutils-9.11/bin/timeout --kill-after=15s 7200s /nix/store/bcnisk3ydfgv26v2gw3zlky24g00yww2-git-2.54.0/bin/git -c advice.detachedHead=false checkout 1de6cf5dc4b80d0f0bf9aa8e901ee6bd43e45b8d
6.82 s
HEAD is now at 1de6cf5d Implement FORM-less RustRed tensor mode
6.82 s
$ /nix/store/9ypz3flqsrl5xl495mm8h645gadjsxi1-coreutils-9.11/bin/timeout --kill-after=15s 7200s /nix/store/23zk8sgzamrbmj1fday15szf7f2279s8-nix-2.34.7/bin/nix --extra-experimental-features nix-command --extra-experimental-features flakes --log-format internal-json run .#packages.x86_64-linux.nix-ci-check-gammaloop-nextest-core --print-build-logs
11.53 s
11.66 s
Downloading cached gammaloop-nextest-binaries-core-gammaloop-api from https://cache.nix-ci.com
11.70 s
Downloading cached gammaloop-nextest-binaries-core-gammaloop-tracing-filter from https://cache.nix-ci.com
11.70 s
Downloading cached gammaloop-nextest-binaries-core-gammalooprs from https://cache.nix-ci.com
11.70 s
Downloading cached gammaloop-nextest-binaries-core-gammaloop-tracing-filter-macros from https://cache.nix-ci.com
11.88 s
Downloaded cached gammaloop-nextest-binaries-core-gammaloop-tracing-filter-macros (1.7 MiB) in 175ms
11.88 s
Progress: 0 of 1 built, 1 of 6 downloaded from cache (3 downloading)
11.95 s
Downloaded cached gammaloop-nextest-binaries-core-gammaloop-tracing-filter (6.6 MiB) in 249ms
11.95 s
Progress: 0 of 1 built, 2 of 6 downloaded from cache (2 downloading)
13.23 s
Downloaded cached gammaloop-nextest-binaries-core-gammaloop-api (66.7 MiB) in 1.5s
13.23 s
Progress: 0 of 1 built, 3 of 6 downloaded from cache (1 downloading)
13.31 s
Downloaded cached gammaloop-nextest-binaries-core-gammalooprs (76.8 MiB) in 1.6s
13.31 s
Progress: 0 of 1 built, 4 of 6 downloaded from cache
13.31 s
Downloading cached gammaloop-nextest-binaries-core from https://cache.nix-ci.com
13.34 s
Downloaded cached gammaloop-nextest-binaries-core (1640 B) in 29ms
13.34 s
Progress: 0 of 1 built, 5 of 6 downloaded from cache
13.34 s
Downloading cached nix-ci-check-gammaloop-nextest-core from https://cache.nix-ci.com
13.37 s
Downloaded cached nix-ci-check-gammaloop-nextest-core (1016 B) in 28ms
13.37 s
Progress: 0 of 1 built, 6 of 6 downloaded from cache
18.45 s
evaluating derivation 'g
copying '/nix/store/yk26
evaluating derivation 'g
copying '/nix/store/yk26
evaluating derivation 'g
copying '/nix/store/yk26
evaluating derivation 'g
copying '/nix/store/yk26
evaluating derivation 'g
copying '/nix/store/yk26
evaluating derivation 'g
copying '/nix/store/yk26
evaluating derivation 'g
querying gammaloop-nexte
[0 /1 built, 0.0 KiB DL]
[1 /0 /1 built, 0.0 KiB DLgammaloop-nextest-core> Extracting 3 binaries (including 1 non-test binary), 1 build script output directory, and 2 linked paths to /build/nextest-archive-f3VTRu
18.82 s
gammaloop-nextest-core> Extracted 18 files to /build/nextest-archive-f3VTRu in 0.37s
18.83 s
gammaloop-nextest-core> ------------
18.83 s
gammaloop-nextest-core> Nextest run ID 7c84ddb4-56bc-42eb-969f-5465a8c87c56 with nextest profile: ci_gammaloop
18.83 s
gammaloop-nextest-core> Starting 339 tests across 2 binaries
19.24 s
gammaloop-nextest-core> ------------
19.24 s
gammaloop-nextest-core> Summary [ 0.416s] 339 tests run: 339 passed , 0 skipped
19.33 s
gammaloop-nextest-core>
19.33 s
gammaloop-nextest-core> ========== nextest test summary ==========
19.33 s
gammaloop-nextest-core> report: target/nextest/ci_gammaloop/junit.xml
19.33 s
gammaloop-nextest-core> tests: 339, failures: 0, errors: 0
19.33 s
gammaloop-nextest-core> No failing testcases found.
19.33 s
gammaloop-nextest-core> =========================================
19.34 s
gammaloop-nextest-core> Extracting 1 binary and 1 linked path to /build/nextest-archive-Gdt51g
19.39 s
gammaloop-nextest-core> Extracted 7 files to /build/nextest-archive-Gdt51g in 0.05s
19.40 s
gammaloop-nextest-core> ------------
19.40 s
gammaloop-nextest-core> Nextest run ID 1d6ce669-af29-447a-95c9-fa74cb83575c with nextest profile: ci_gammaloop
19.40 s
gammaloop-nextest-core> Starting 19 tests across 1 binary
19.42 s
gammaloop-nextest-core> ------------
19.42 s
gammaloop-nextest-core> Summary [ 0.013s] 19 tests run: 19 passed , 0 skipped
19.45 s
gammaloop-nextest-core>
19.45 s
gammaloop-nextest-core> ========== nextest test summary ==========
19.45 s
gammaloop-nextest-core> report: target/nextest/ci_gammaloop/junit.xml
19.45 s
gammaloop-nextest-core> tests: 19, failures: 0, errors: 0
19.45 s
gammaloop-nextest-core> No failing testcases found.
19.45 s
gammaloop-nextest-core> =========================================
19.46 s
gammaloop-nextest-core> Extracting 1 binary to /build/nextest-archive-9kC3Fj
19.49 s
gammaloop-nextest-core> Extracted 4 files to /build/nextest-archive-9kC3Fj in 0.03s
19.49 s
gammaloop-nextest-core> ------------
19.49 s
gammaloop-nextest-core> Nextest run ID c12b0ee3-3701-4930-9f51-a94d8199b195 with nextest profile: ci_gammaloop
19.49 s
gammaloop-nextest-core> Starting 0 tests across 1 binary
19.49 s
gammaloop-nextest-core> ------------
19.49 s
gammaloop-nextest-core> Summary [ 0.000s] 0 tests run: 0 passed , 0 skipped
19.52 s
gammaloop-nextest-core>
19.52 s
gammaloop-nextest-core> ========== nextest test summary ==========
19.52 s
gammaloop-nextest-core> report: target/nextest/ci_gammaloop/junit.xml
19.52 s
gammaloop-nextest-core> tests: 0, failures: 0, errors: 0
19.52 s
gammaloop-nextest-core> No failing testcases found.
19.52 s
gammaloop-nextest-core> =========================================
19.53 s
gammaloop-nextest-core> Extracting 4 binaries, 1 build script output directory, and 2 linked paths to /build/nextest-archive-gX6Us7
19.91 s
gammaloop-nextest-core> Extracted 18 files to /build/nextest-archive-gX6Us7 in 0.38s
19.92 s
gammaloop-nextest-core> ------------
19.92 s
gammaloop-nextest-core> Nextest run ID 52def3a5-dfa0-49f8-941d-d859ef1c4077 with nextest profile: ci_gammaloop
19.92 s
gammaloop-nextest-core> Starting 456 tests across 4 binaries (61 tests skipped , including 60 tests via profile.ci_gammaloop.default-filter )
21.01 s
gammaloop-nextest-core> FAIL [ 0.391s] (446/456) gammalooprs::test_renormalization finit_part_ghlo
21.01 s
gammaloop-nextest-core> stdout ---
21.01 s
gammaloop-nextest-core>
21.01 s
gammaloop-nextest-core> running 1 test
21.01 s
gammaloop-nextest-core> ren part: 1/2*GC_10^2*dot(P(0,mink (dim)),P(0,mink (dim)))*cas(2,coad (8))/ε
21.01 s
gammaloop-nextest-core> ━━━━━━━━━━━━━━━━━━━━━━━━━━━━━━━ Snapshot Summary ━━━━━━━━━━━━━━━━━━━━━━━━━━━━━━━
21.01 s
gammaloop-nextest-core> Snapshot: finit_part_ghlo
21.01 s
gammaloop-nextest-core> Source: crates/gammalooprs/tests/test_renormalization.rs:557
21.01 s
gammaloop-nextest-core> ────────────────────────────────────────────────────────────────────────────────
21.01 s
gammaloop-nextest-core> Expression: align_to_rqft(&a, &model).to_bare_ordered_string()
21.01 s
gammaloop-nextest-core> ────────────────────────────────────────────────────────────────────────────────
21.01 s
gammaloop-nextest-core> -old snapshot
21.01 s
gammaloop-nextest-core> +new results
21.01 s
gammaloop-nextest-core> ────────────┬───────────────────────────────────────────────────────────────────
21.01 s
gammaloop-nextest-core> 1 │--1/2*cas(2,coad(8))*dot(P(0,mink(4)),P(0,mink(4)))*gs^2*ε^(-1)
21.01 s
gammaloop-nextest-core> 1 │+1/2*cas(2,coad(8))*dot(P(0,mink(4)),P(0,mink(4)))*gs^2*ε^(-1)
21.01 s
gammaloop-nextest-core> ────────────┴───────────────────────────────────────────────────────────────────
21.01 s
gammaloop-nextest-core> To update snapshots run `cargo insta review`
21.01 s
gammaloop-nextest-core> Stopped on the first failure. Run `cargo insta test` to run all snapshots.
21.01 s
gammaloop-nextest-core> test finit_part_ghlo ... FAILED
21.01 s
gammaloop-nextest-core>
21.01 s
gammaloop-nextest-core> failures:
21.01 s
gammaloop-nextest-core>
21.01 s
gammaloop-nextest-core> failures:
21.01 s
gammaloop-nextest-core> finit_part_ghlo
21.01 s
gammaloop-nextest-core>
21.01 s
gammaloop-nextest-core> test result: FAILED. 0 passed; 1 failed; 0 ignored; 0 measured; 5 filtered out; finished in 0.38s
21.01 s
gammaloop-nextest-core>
21.01 s
gammaloop-nextest-core> stderr ---
21.01 s
gammaloop-nextest-core> The application panicked (crashed).
21.01 s
gammaloop-nextest-core> Message: snapshot assertion for 'finit_part_ghlo' failed in line 557
21.01 s
gammaloop-nextest-core> Location: /nix/store/0f9p2h9240ylfzayilfjv4gr7scagfs3-vendor-cargo-deps/c19b7c6f923b580ac259164a89f2577984ad5ab09ee9d583b888f934adbbe8d0/insta-1.47.2/src/runtime.rs :719
21.01 s
gammaloop-nextest-core>
21.01 s
gammaloop-nextest-core> ━━━━━━━━━━━━━━━━━━━━━━━━━━━━━━━━━━ BACKTRACE ━━━━━━━━━━━━━━━━━━━━━━━━━━━━━━━━━━━
21.01 s
gammaloop-nextest-core> 1: <color_eyre[51793ea62743adbd]::config::PanicHook>::panic_report <unknown>
21.01 s
gammaloop-nextest-core> at <unknown source file> :<unknown line>
21.01 s
gammaloop-nextest-core> 2: <color_eyre[51793ea62743adbd]::config::PanicHook>::into_panic_hook::{closure#0} <unknown>
21.01 s
gammaloop-nextest-core> at <unknown source file> :<unknown line>
21.01 s
gammaloop-nextest-core> 3: std[bcb96dfbba0ab899]::panicking::panic_with_hook <unknown>
21.01 s
gammaloop-nextest-core> at <unknown source file> :<unknown line>
21.01 s
gammaloop-nextest-core> 4: std[bcb96dfbba0ab899]::panicking::panic_handler::{closure#0} <unknown>
21.01 s
gammaloop-nextest-core> at <unknown source file> :<unknown line>
21.01 s
gammaloop-nextest-core> 5: std[bcb96dfbba0ab899]::sys::backtrace::__rust_end_short_backtrace::<std[bcb96dfbba0ab899]::panicking::panic_handler::{closure#0}, !> <unknown>
21.01 s
gammaloop-nextest-core> at <unknown source file> :<unknown line>
21.01 s
gammaloop-nextest-core> 6: __rustc[6c289b9f9c454d21]::rust_begin_unwind <unknown>
21.01 s
gammaloop-nextest-core> at <unknown source file> :<unknown line>
21.01 s
gammaloop-nextest-core> 7: core[940e698046960fd5]::panicking::panic_fmt <unknown>
21.01 s
gammaloop-nextest-core> at <unknown source file> :<unknown line>
21.01 s
gammaloop-nextest-core> 8: insta[307a548ac79ef4d9]::runtime::assert_snapshot <unknown>
21.01 s
gammaloop-nextest-core> at <unknown source file> :<unknown line>
21.01 s
gammaloop-nextest-core> 9: <test_renormalization[6420da4f660338c3]::finit_part_ghlo::{closure#0} as core[940e698046960fd5]::ops::function::FnOnce<()>>::call_once <unknown>
21.01 s
gammaloop-nextest-core> at <unknown source file> :<unknown line>
21.01 s
gammaloop-nextest-core> 10: test[75d6903177b1d7e9]::__rust_begin_short_backtrace::<core[940e698046960fd5]::result::Result<(), alloc[2ea6bcb46fca0c42]::string::String>, fn() -> core[940e698046960fd5]::result::Result<(), alloc[2ea6bcb46fca0c42]::string::String>> <unknown>
21.01 s
gammaloop-nextest-core> at <unknown source file> :<unknown line>
21.01 s
gammaloop-nextest-core> 11: test[75d6903177b1d7e9]::run_test::{closure#0} <unknown>
21.01 s
gammaloop-nextest-core> at <unknown source file> :<unknown line>
21.01 s
gammaloop-nextest-core> 12: std[bcb96dfbba0ab899]::sys::backtrace::__rust_begin_short_backtrace::<test[75d6903177b1d7e9]::run_test::{closure#1}, ()> <unknown>
21.01 s
gammaloop-nextest-core> at <unknown source file> :<unknown line>
21.01 s
gammaloop-nextest-core> 13: <std[bcb96dfbba0ab899]::thread::lifecycle::spawn_unchecked<test[75d6903177b1d7e9]::run_test::{closure#1}, ()>::{closure#1} as core[940e698046960fd5]::ops::function::FnOnce<()>>::call_once::{shim:vtable#0} <unknown>
21.01 s
gammaloop-nextest-core> at <unknown source file> :<unknown line>
21.01 s
gammaloop-nextest-core> 14: <std[bcb96dfbba0ab899]::sys::thread::unix::Thread>::new::thread_start <unknown>
21.01 s
gammaloop-nextest-core> at <unknown source file> :<unknown line>
21.01 s
gammaloop-nextest-core> 15: start_thread <unknown>
21.01 s
gammaloop-nextest-core> at <unknown source file> :<unknown line>
21.01 s
gammaloop-nextest-core> 16: __clone3 <unknown>
21.01 s
gammaloop-nextest-core> at <unknown source file> :<unknown line>
21.01 s
gammaloop-nextest-core>
21.01 s
gammaloop-nextest-core> Run with COLORBT_SHOW_HIDDEN=1 environment variable to disable frame filtering.
21.01 s
gammaloop-nextest-core> Run with RUST_BACKTRACE=full to include source snippets.
21.01 s
gammaloop-nextest-core>
22.62 s
gammaloop-nextest-core> FAIL [ 1.998s] (451/456) gammalooprs::test_renormalization finite_part_ghost_2loop
22.62 s
gammaloop-nextest-core> stdout ---
22.62 s
gammaloop-nextest-core>
22.62 s
gammaloop-nextest-core> running 1 test
22.62 s
gammaloop-nextest-core> ━━━━━━━━━━━━━━━━━━━━━━━━━━━━━━━ Snapshot Summary ━━━━━━━━━━━━━━━━━━━━━━━━━━━━━━━
22.62 s
gammaloop-nextest-core> Snapshot: finite_part_ghost_2loop-3
22.62 s
gammaloop-nextest-core> Source: crates/gammalooprs/tests/test_renormalization.rs:464
22.62 s
gammaloop-nextest-core> ────────────────────────────────────────────────────────────────────────────────
22.62 s
gammaloop-nextest-core> Expression: align_to_rqft(&a, &model).to_bare_ordered_string()
22.62 s
gammaloop-nextest-core> ────────────────────────────────────────────────────────────────────────────────
22.62 s
gammaloop-nextest-core> -old snapshot
22.62 s
gammaloop-nextest-core> +new results
22.62 s
gammaloop-nextest-core> ────────────┬───────────────────────────────────────────────────────────────────
22.62 s
gammaloop-nextest-core> 1 │-(-1𝑖/32*ε+1𝑖/16)*(cas(2,coad(8)))^2*dot(P(0,mink(4)),P(0,mink(4)))*gs^4*ε^(-2)
22.62 s
gammaloop-nextest-core> 1 │+(-1𝑖/16+1𝑖/32*ε)*(cas(2,coad(8)))^2*dot(P(0,mink(4)),P(0,mink(4)))*gs^4*ε^(-2)
22.62 s
gammaloop-nextest-core> ────────────┴───────────────────────────────────────────────────────────────────
22.62 s
gammaloop-nextest-core> To update snapshots run `cargo insta review`
22.62 s
gammaloop-nextest-core> Stopped on the first failure. Run `cargo insta test` to run all snapshots.
22.62 s
gammaloop-nextest-core> test finite_part_ghost_2loop ... FAILED
22.62 s
gammaloop-nextest-core>
22.62 s
gammaloop-nextest-core> failures:
22.62 s
gammaloop-nextest-core>
22.62 s
gammaloop-nextest-core> failures:
22.62 s
gammaloop-nextest-core> finite_part_ghost_2loop
22.62 s
gammaloop-nextest-core>
22.62 s
gammaloop-nextest-core> test result: FAILED. 0 passed; 1 failed; 0 ignored; 0 measured; 5 filtered out; finished in 1.99s
22.62 s
gammaloop-nextest-core>
22.62 s
gammaloop-nextest-core> stderr ---
22.62 s
gammaloop-nextest-core> The application panicked (crashed).
22.62 s
gammaloop-nextest-core> Message: snapshot assertion for 'finite_part_ghost_2loop-3' failed in line 464
22.62 s
gammaloop-nextest-core> Location: /nix/store/0f9p2h9240ylfzayilfjv4gr7scagfs3-vendor-cargo-deps/c19b7c6f923b580ac259164a89f2577984ad5ab09ee9d583b888f934adbbe8d0/insta-1.47.2/src/runtime.rs :719
22.62 s
gammaloop-nextest-core>
22.62 s
gammaloop-nextest-core> ━━━━━━━━━━━━━━━━━━━━━━━━━━━━━━━━━━ BACKTRACE ━━━━━━━━━━━━━━━━━━━━━━━━━━━━━━━━━━━
22.62 s
gammaloop-nextest-core> 1: <color_eyre[51793ea62743adbd]::config::PanicHook>::panic_report <unknown>
22.62 s
gammaloop-nextest-core> at <unknown source file> :<unknown line>
22.62 s
gammaloop-nextest-core> 2: <color_eyre[51793ea62743adbd]::config::PanicHook>::into_panic_hook::{closure#0} <unknown>
22.62 s
gammaloop-nextest-core> at <unknown source file> :<unknown line>
22.62 s
gammaloop-nextest-core> 3: std[bcb96dfbba0ab899]::panicking::panic_with_hook <unknown>
22.62 s
gammaloop-nextest-core> at <unknown source file> :<unknown line>
22.62 s
gammaloop-nextest-core> 4: std[bcb96dfbba0ab899]::panicking::panic_handler::{closure#0} <unknown>
22.62 s
gammaloop-nextest-core> at <unknown source file> :<unknown line>
22.62 s
gammaloop-nextest-core> 5: std[bcb96dfbba0ab899]::sys::backtrace::__rust_end_short_backtrace::<std[bcb96dfbba0ab899]::panicking::panic_handler::{closure#0}, !> <unknown>
22.62 s
gammaloop-nextest-core> at <unknown source file> :<unknown line>
22.62 s
gammaloop-nextest-core> 6: __rustc[6c289b9f9c454d21]::rust_begin_unwind <unknown>
22.62 s
gammaloop-nextest-core> at <unknown source file> :<unknown line>
22.62 s
gammaloop-nextest-core> 7: core[940e698046960fd5]::panicking::panic_fmt <unknown>
22.62 s
gammaloop-nextest-core> at <unknown source file> :<unknown line>
22.62 s
gammaloop-nextest-core> 8: insta[307a548ac79ef4d9]::runtime::assert_snapshot <unknown>
22.62 s
gammaloop-nextest-core> at <unknown source file> :<unknown line>
22.62 s
gammaloop-nextest-core> 9: test_renormalization[6420da4f660338c3]::finite_part_ghost_2loop <unknown>
22.62 s
gammaloop-nextest-core> at <unknown source file> :<unknown line>
22.62 s
gammaloop-nextest-core> 10: <test_renormalization[6420da4f660338c3]::finite_part_ghost_2loop::{closure#0} as core[940e698046960fd5]::ops::function::FnOnce<()>>::call_once <unknown>
22.62 s
gammaloop-nextest-core> at <unknown source file> :<unknown line>
22.62 s
gammaloop-nextest-core> 11: test[75d6903177b1d7e9]::__rust_begin_short_backtrace::<core[940e698046960fd5]::result::Result<(), alloc[2ea6bcb46fca0c42]::string::String>, fn() -> core[940e698046960fd5]::result::Result<(), alloc[2ea6bcb46fca0c42]::string::String>> <unknown>
22.62 s
gammaloop-nextest-core> at <unknown source file> :<unknown line>
22.62 s
gammaloop-nextest-core> 12: test[75d6903177b1d7e9]::run_test::{closure#0} <unknown>
22.62 s
gammaloop-nextest-core> at <unknown source file> :<unknown line>
22.62 s
gammaloop-nextest-core> 13: std[bcb96dfbba0ab899]::sys::backtrace::__rust_begin_short_backtrace::<test[75d6903177b1d7e9]::run_test::{closure#1}, ()> <unknown>
22.62 s
gammaloop-nextest-core> at <unknown source file> :<unknown line>
22.62 s
gammaloop-nextest-core> 14: <std[bcb96dfbba0ab899]::thread::lifecycle::spawn_unchecked<test[75d6903177b1d7e9]::run_test::{closure#1}, ()>::{closure#1} as core[940e698046960fd5]::ops::function::FnOnce<()>>::call_once::{shim:vtable#0} <unknown>
22.62 s
gammaloop-nextest-core> at <unknown source file> :<unknown line>
22.62 s
gammaloop-nextest-core> 15: <std[bcb96dfbba0ab899]::sys::thread::unix::Thread>::new::thread_start <unknown>
22.62 s
gammaloop-nextest-core> at <unknown source file> :<unknown line>
22.62 s
gammaloop-nextest-core> 16: start_thread <unknown>
22.62 s
gammaloop-nextest-core> at <unknown source file> :<unknown line>
22.62 s
gammaloop-nextest-core> 17: __clone3 <unknown>
22.62 s
gammaloop-nextest-core> at <unknown source file> :<unknown line>
22.62 s
gammaloop-nextest-core>
22.62 s
gammaloop-nextest-core> Run with COLORBT_SHOW_HIDDEN=1 environment variable to disable frame filtering.
22.62 s
gammaloop-nextest-core> Run with RUST_BACKTRACE=full to include source snippets.
22.62 s
gammaloop-nextest-core>
27.45 s
gammaloop-nextest-core> ------------
27.52 s
gammaloop-nextest-core> Summary [ 7.526s] 456 tests run: 454 passed , 2 failed , 61 skipped
27.52 s
gammaloop-nextest-core> FAIL [ 0.391s] (446/456) gammalooprs::test_renormalization finit_part_ghlo
27.52 s
gammaloop-nextest-core> stdout ---
27.52 s
gammaloop-nextest-core>
27.52 s
gammaloop-nextest-core> running 1 test
27.52 s
gammaloop-nextest-core> ren part: 1/2*GC_10^2*dot(P(0,mink (dim)),P(0,mink (dim)))*cas(2,coad (8))/ε
27.52 s
gammaloop-nextest-core> ━━━━━━━━━━━━━━━━━━━━━━━━━━━━━━━ Snapshot Summary ━━━━━━━━━━━━━━━━━━━━━━━━━━━━━━━
27.52 s
gammaloop-nextest-core> Snapshot: finit_part_ghlo
27.52 s
gammaloop-nextest-core> Source: crates/gammalooprs/tests/test_renormalization.rs:557
27.52 s
gammaloop-nextest-core> ────────────────────────────────────────────────────────────────────────────────
27.52 s
gammaloop-nextest-core> Expression: align_to_rqft(&a, &model).to_bare_ordered_string()
27.52 s
gammaloop-nextest-core> ────────────────────────────────────────────────────────────────────────────────
27.52 s
gammaloop-nextest-core> -old snapshot
27.52 s
gammaloop-nextest-core> +new results
27.52 s
gammaloop-nextest-core> ────────────┬───────────────────────────────────────────────────────────────────
27.52 s
gammaloop-nextest-core> 1 │--1/2*cas(2,coad(8))*dot(P(0,mink(4)),P(0,mink(4)))*gs^2*ε^(-1)
27.52 s
gammaloop-nextest-core> 1 │+1/2*cas(2,coad(8))*dot(P(0,mink(4)),P(0,mink(4)))*gs^2*ε^(-1)
27.52 s
gammaloop-nextest-core> ────────────┴───────────────────────────────────────────────────────────────────
27.52 s
gammaloop-nextest-core> To update snapshots run `cargo insta review`
27.52 s
gammaloop-nextest-core> Stopped on the first failure. Run `cargo insta test` to run all snapshots.
27.52 s
gammaloop-nextest-core> test finit_part_ghlo ... FAILED
27.52 s
gammaloop-nextest-core>
27.52 s
gammaloop-nextest-core> failures:
27.52 s
gammaloop-nextest-core>
27.52 s
gammaloop-nextest-core> failures:
27.52 s
gammaloop-nextest-core> finit_part_ghlo
27.52 s
gammaloop-nextest-core>
27.52 s
gammaloop-nextest-core> test result: FAILED. 0 passed; 1 failed; 0 ignored; 0 measured; 5 filtered out; finished in 0.38s
27.52 s
gammaloop-nextest-core>
27.52 s
gammaloop-nextest-core> stderr ---
27.52 s
gammaloop-nextest-core> The application panicked (crashed).
27.52 s
gammaloop-nextest-core> Message: snapshot assertion for 'finit_part_ghlo' failed in line 557
27.52 s
gammaloop-nextest-core> Location: /nix/store/0f9p2h9240ylfzayilfjv4gr7scagfs3-vendor-cargo-deps/c19b7c6f923b580ac259164a89f2577984ad5ab09ee9d583b888f934adbbe8d0/insta-1.47.2/src/runtime.rs :719
27.52 s
gammaloop-nextest-core>
27.52 s
gammaloop-nextest-core> ━━━━━━━━━━━━━━━━━━━━━━━━━━━━━━━━━━ BACKTRACE ━━━━━━━━━━━━━━━━━━━━━━━━━━━━━━━━━━━
27.52 s
gammaloop-nextest-core> 1: <color_eyre[51793ea62743adbd]::config::PanicHook>::panic_report <unknown>
27.52 s
gammaloop-nextest-core> at <unknown source file> :<unknown line>
27.52 s
gammaloop-nextest-core> 2: <color_eyre[51793ea62743adbd]::config::PanicHook>::into_panic_hook::{closure#0} <unknown>
27.52 s
gammaloop-nextest-core> at <unknown source file> :<unknown line>
27.52 s
gammaloop-nextest-core> 3: std[bcb96dfbba0ab899]::panicking::panic_with_hook <unknown>
27.52 s
gammaloop-nextest-core> at <unknown source file> :<unknown line>
27.52 s
gammaloop-nextest-core> 4: std[bcb96dfbba0ab899]::panicking::panic_handler::{closure#0} <unknown>
27.52 s
gammaloop-nextest-core> at <unknown source file> :<unknown line>
27.52 s
gammaloop-nextest-core> 5: std[bcb96dfbba0ab899]::sys::backtrace::__rust_end_short_backtrace::<std[bcb96dfbba0ab899]::panicking::panic_handler::{closure#0}, !> <unknown>
27.52 s
gammaloop-nextest-core> at <unknown source file> :<unknown line>
27.52 s
gammaloop-nextest-core> 6: __rustc[6c289b9f9c454d21]::rust_begin_unwind <unknown>
27.52 s
gammaloop-nextest-core> at <unknown source file> :<unknown line>
27.52 s
gammaloop-nextest-core> 7: core[940e698046960fd5]::panicking::panic_fmt <unknown>
27.52 s
gammaloop-nextest-core> at <unknown source file> :<unknown line>
27.52 s
gammaloop-nextest-core> 8: insta[307a548ac79ef4d9]::runtime::assert_snapshot <unknown>
27.52 s
gammaloop-nextest-core> at <unknown source file> :<unknown line>
27.52 s
gammaloop-nextest-core> 9: <test_renormalization[6420da4f660338c3]::finit_part_ghlo::{closure#0} as core[940e698046960fd5]::ops::function::FnOnce<()>>::call_once <unknown>
27.52 s
gammaloop-nextest-core> at <unknown source file> :<unknown line>
27.52 s
gammaloop-nextest-core> 10: test[75d6903177b1d7e9]::__rust_begin_short_backtrace::<core[940e698046960fd5]::result::Result<(), alloc[2ea6bcb46fca0c42]::string::String>, fn() -> core[940e698046960fd5]::result::Result<(), alloc[2ea6bcb46fca0c42]::string::String>> <unknown>
27.52 s
gammaloop-nextest-core> at <unknown source file> :<unknown line>
27.52 s
gammaloop-nextest-core> 11: test[75d6903177b1d7e9]::run_test::{closure#0} <unknown>
27.52 s
gammaloop-nextest-core> at <unknown source file> :<unknown line>
27.52 s
gammaloop-nextest-core> 12: std[bcb96dfbba0ab899]::sys::backtrace::__rust_begin_short_backtrace::<test[75d6903177b1d7e9]::run_test::{closure#1}, ()> <unknown>
27.52 s
gammaloop-nextest-core> at <unknown source file> :<unknown line>
27.52 s
gammaloop-nextest-core> 13: <std[bcb96dfbba0ab899]::thread::lifecycle::spawn_unchecked<test[75d6903177b1d7e9]::run_test::{closure#1}, ()>::{closure#1} as core[940e698046960fd5]::ops::function::FnOnce<()>>::call_once::{shim:vtable#0} <unknown>
27.52 s
gammaloop-nextest-core> at <unknown source file> :<unknown line>
27.52 s
gammaloop-nextest-core> 14: <std[bcb96dfbba0ab899]::sys::thread::unix::Thread>::new::thread_start <unknown>
27.52 s
gammaloop-nextest-core> at <unknown source file> :<unknown line>
27.52 s
gammaloop-nextest-core> 15: start_thread <unknown>
27.52 s
gammaloop-nextest-core> at <unknown source file> :<unknown line>
27.52 s
gammaloop-nextest-core> 16: __clone3 <unknown>
27.52 s
gammaloop-nextest-core> at <unknown source file> :<unknown line>
27.52 s
gammaloop-nextest-core>
27.52 s
gammaloop-nextest-core> Run with COLORBT_SHOW_HIDDEN=1 environment variable to disable frame filtering.
27.52 s
gammaloop-nextest-core> Run with RUST_BACKTRACE=full to include source snippets.
27.52 s
gammaloop-nextest-core>
27.52 s
gammaloop-nextest-core> FAIL [ 1.998s] (451/456) gammalooprs::test_renormalization finite_part_ghost_2loop
27.52 s
gammaloop-nextest-core> stdout ---
27.52 s
gammaloop-nextest-core>
27.52 s
gammaloop-nextest-core> running 1 test
27.52 s
gammaloop-nextest-core> ━━━━━━━━━━━━━━━━━━━━━━━━━━━━━━━ Snapshot Summary ━━━━━━━━━━━━━━━━━━━━━━━━━━━━━━━
27.52 s
gammaloop-nextest-core> Snapshot: finite_part_ghost_2loop-3
27.52 s
gammaloop-nextest-core> Source: crates/gammalooprs/tests/test_renormalization.rs:464
27.52 s
gammaloop-nextest-core> ────────────────────────────────────────────────────────────────────────────────
27.52 s
gammaloop-nextest-core> Expression: align_to_rqft(&a, &model).to_bare_ordered_string()
27.52 s
gammaloop-nextest-core> ────────────────────────────────────────────────────────────────────────────────
27.52 s
gammaloop-nextest-core> -old snapshot
27.52 s
gammaloop-nextest-core> +new results
27.52 s
gammaloop-nextest-core> ────────────┬───────────────────────────────────────────────────────────────────
27.52 s
gammaloop-nextest-core> 1 │-(-1𝑖/32*ε+1𝑖/16)*(cas(2,coad(8)))^2*dot(P(0,mink(4)),P(0,mink(4)))*gs^4*ε^(-2)
27.52 s
gammaloop-nextest-core> 1 │+(-1𝑖/16+1𝑖/32*ε)*(cas(2,coad(8)))^2*dot(P(0,mink(4)),P(0,mink(4)))*gs^4*ε^(-2)
27.52 s
gammaloop-nextest-core> ────────────┴───────────────────────────────────────────────────────────────────
27.52 s
gammaloop-nextest-core> To update snapshots run `cargo insta review`
27.52 s
gammaloop-nextest-core> Stopped on the first failure. Run `cargo insta test` to run all snapshots.
27.52 s
gammaloop-nextest-core> test finite_part_ghost_2loop ... FAILED
27.52 s
gammaloop-nextest-core>
27.52 s
gammaloop-nextest-core> failures:
27.52 s
gammaloop-nextest-core>
27.52 s
gammaloop-nextest-core> failures:
27.52 s
gammaloop-nextest-core> finite_part_ghost_2loop
27.52 s
gammaloop-nextest-core>
27.52 s
gammaloop-nextest-core> test result: FAILED. 0 passed; 1 failed; 0 ignored; 0 measured; 5 filtered out; finished in 1.99s
27.52 s
gammaloop-nextest-core>
27.52 s
gammaloop-nextest-core> stderr ---
27.52 s
gammaloop-nextest-core> The application panicked (crashed).
27.52 s
gammaloop-nextest-core> Message: snapshot assertion for 'finite_part_ghost_2loop-3' failed in line 464
27.52 s
gammaloop-nextest-core> Location: /nix/store/0f9p2h9240ylfzayilfjv4gr7scagfs3-vendor-cargo-deps/c19b7c6f923b580ac259164a89f2577984ad5ab09ee9d583b888f934adbbe8d0/insta-1.47.2/src/runtime.rs :719
27.52 s
gammaloop-nextest-core>
27.52 s
gammaloop-nextest-core> ━━━━━━━━━━━━━━━━━━━━━━━━━━━━━━━━━━ BACKTRACE ━━━━━━━━━━━━━━━━━━━━━━━━━━━━━━━━━━━
27.52 s
gammaloop-nextest-core> 1: <color_eyre[51793ea62743adbd]::config::PanicHook>::panic_report <unknown>
27.52 s
gammaloop-nextest-core> at <unknown source file> :<unknown line>
27.52 s
gammaloop-nextest-core> 2: <color_eyre[51793ea62743adbd]::config::PanicHook>::into_panic_hook::{closure#0} <unknown>
27.52 s
gammaloop-nextest-core> at <unknown source file> :<unknown line>
27.52 s
gammaloop-nextest-core> 3: std[bcb96dfbba0ab899]::panicking::panic_with_hook <unknown>
27.52 s
gammaloop-nextest-core> at <unknown source file> :<unknown line>
27.52 s
gammaloop-nextest-core> 4: std[bcb96dfbba0ab899]::panicking::panic_handler::{closure#0} <unknown>
27.52 s
gammaloop-nextest-core> at <unknown source file> :<unknown line>
27.52 s
gammaloop-nextest-core> 5: std[bcb96dfbba0ab899]::sys::backtrace::__rust_end_short_backtrace::<std[bcb96dfbba0ab899]::panicking::panic_handler::{closure#0}, !> <unknown>
27.52 s
gammaloop-nextest-core> at <unknown source file> :<unknown line>
27.52 s
gammaloop-nextest-core> 6: __rustc[6c289b9f9c454d21]::rust_begin_unwind <unknown>
27.52 s
gammaloop-nextest-core> at <unknown source file> :<unknown line>
27.52 s
gammaloop-nextest-core> 7: core[940e698046960fd5]::panicking::panic_fmt <unknown>
27.52 s
gammaloop-nextest-core> at <unknown source file> :<unknown line>
27.52 s
gammaloop-nextest-core> 8: insta[307a548ac79ef4d9]::runtime::assert_snapshot <unknown>
27.52 s
gammaloop-nextest-core> at <unknown source file> :<unknown line>
27.52 s
gammaloop-nextest-core> 9: test_renormalization[6420da4f660338c3]::finite_part_ghost_2loop <unknown>
27.52 s
gammaloop-nextest-core> at <unknown source file> :<unknown line>
27.52 s
gammaloop-nextest-core> 10: <test_renormalization[6420da4f660338c3]::finite_part_ghost_2loop::{closure#0} as core[940e698046960fd5]::ops::function::FnOnce<()>>::call_once <unknown>
27.52 s
gammaloop-nextest-core> at <unknown source file> :<unknown line>
27.52 s
gammaloop-nextest-core> 11: test[75d6903177b1d7e9]::__rust_begin_short_backtrace::<core[940e698046960fd5]::result::Result<(), alloc[2ea6bcb46fca0c42]::string::String>, fn() -> core[940e698046960fd5]::result::Result<(), alloc[2ea6bcb46fca0c42]::string::String>> <unknown>
27.52 s
gammaloop-nextest-core> at <unknown source file> :<unknown line>
27.52 s
gammaloop-nextest-core> 12: test[75d6903177b1d7e9]::run_test::{closure#0} <unknown>
27.52 s
gammaloop-nextest-core> at <unknown source file> :<unknown line>
27.52 s
gammaloop-nextest-core> 13: std[bcb96dfbba0ab899]::sys::backtrace::__rust_begin_short_backtrace::<test[75d6903177b1d7e9]::run_test::{closure#1}, ()> <unknown>
27.52 s
gammaloop-nextest-core> at <unknown source file> :<unknown line>
27.52 s
gammaloop-nextest-core> 14: <std[bcb96dfbba0ab899]::thread::lifecycle::spawn_unchecked<test[75d6903177b1d7e9]::run_test::{closure#1}, ()>::{closure#1} as core[940e698046960fd5]::ops::function::FnOnce<()>>::call_once::{shim:vtable#0} <unknown>
27.52 s
gammaloop-nextest-core> at <unknown source file> :<unknown line>
27.52 s
gammaloop-nextest-core> 15: <std[bcb96dfbba0ab899]::sys::thread::unix::Thread>::new::thread_start <unknown>
27.52 s
gammaloop-nextest-core> at <unknown source file> :<unknown line>
27.52 s
gammaloop-nextest-core> 16: start_thread <unknown>
27.52 s
gammaloop-nextest-core> at <unknown source file> :<unknown line>
27.52 s
gammaloop-nextest-core> 17: __clone3 <unknown>
27.52 s
gammaloop-nextest-core> at <unknown source file> :<unknown line>
27.52 s
gammaloop-nextest-core>
27.52 s
gammaloop-nextest-core> Run with COLORBT_SHOW_HIDDEN=1 environment variable to disable frame filtering.
27.52 s
gammaloop-nextest-core> Run with RUST_BACKTRACE=full to include source snippets.
27.52 s
gammaloop-nextest-core>
27.52 s
gammaloop-nextest-core> error : test run failed
27.53 s
gammaloop-nextest-core>
27.53 s
gammaloop-nextest-core> ========== nextest test summary ==========
27.53 s
gammaloop-nextest-core> report: target/nextest/ci_gammaloop/junit.xml
27.53 s
gammaloop-nextest-core> tests: 456, failures: 2, errors: 0
27.53 s
gammaloop-nextest-core>
27.53 s
gammaloop-nextest-core> 1. gammalooprs::test_renormalization::finit_part_ghlo
27.53 s
gammaloop-nextest-core> failure: test failure with exit code 101
27.53 s
gammaloop-nextest-core> system-out
27.53 s
gammaloop-nextest-core> running 1 test
27.53 s
gammaloop-nextest-core> ren part: 1/2*GC_10^2*dot(P(0,mink(dim)),P(0,mink(dim)))*cas(2,coad(8))/ε
27.53 s
gammaloop-nextest-core> ━━━━━━━━━━━━━━━━━━━━━━━━━━━━━━━ Snapshot Summary ━━━━━━━━━━━━━━━━━━━━━━━━━━━━━━━
27.53 s
gammaloop-nextest-core> Snapshot: finit_part_ghlo
27.53 s
gammaloop-nextest-core> Source: crates/gammalooprs/tests/test_renormalization.rs:557
27.53 s
gammaloop-nextest-core> ────────────────────────────────────────────────────────────────────────────────
27.53 s
gammaloop-nextest-core> Expression: align_to_rqft(&a, &model).to_bare_ordered_string()
27.53 s
gammaloop-nextest-core> ────────────────────────────────────────────────────────────────────────────────
27.53 s
gammaloop-nextest-core> -old snapshot
27.53 s
gammaloop-nextest-core> +new results
27.53 s
gammaloop-nextest-core> ────────────┬───────────────────────────────────────────────────────────────────
27.53 s
gammaloop-nextest-core> 1 │--1/2*cas(2,coad(8))*dot(P(0,mink(4)),P(0,mink(4)))*gs^2*ε^(-1)
27.53 s
gammaloop-nextest-core> 1 │+1/2*cas(2,coad(8))*dot(P(0,mink(4)),P(0,mink(4)))*gs^2*ε^(-1)
27.53 s
gammaloop-nextest-core> ────────────┴───────────────────────────────────────────────────────────────────
27.53 s
gammaloop-nextest-core> To update snapshots run `cargo insta review`
27.53 s
gammaloop-nextest-core> Stopped on the first failure. Run `cargo insta test` to run all snapshots.
27.53 s
gammaloop-nextest-core> test finit_part_ghlo ... FAILED
27.53 s
gammaloop-nextest-core>
27.53 s
gammaloop-nextest-core> failures:
27.53 s
gammaloop-nextest-core>
27.53 s
gammaloop-nextest-core> failures:
27.53 s
gammaloop-nextest-core> finit_part_ghlo
27.53 s
gammaloop-nextest-core>
27.53 s
gammaloop-nextest-core> test result: FAILED. 0 passed; 1 failed; 0 ignored; 0 measured; 5 filtered out; finished in 0.38s
27.53 s
gammaloop-nextest-core> system-err
27.53 s
gammaloop-nextest-core> The application panicked (crashed).
27.53 s
gammaloop-nextest-core> Message: snapshot assertion for 'finit_part_ghlo' failed in line 557
27.53 s
gammaloop-nextest-core> Location: /nix/store/0f9p2h9240ylfzayilfjv4gr7scagfs3-vendor-cargo-deps/c19b7c6f923b580ac259164a89f2577984ad5ab09ee9d583b888f934adbbe8d0/insta-1.47.2/src/runtime.rs:719
27.53 s
gammaloop-nextest-core>
27.53 s
gammaloop-nextest-core> ━━━━━━━━━━━━━━━━━━━━━━━━━━━━━━━━━━ BACKTRACE ━━━━━━━━━━━━━━━━━━━━━━━━━━━━━━━━━━━
27.53 s
gammaloop-nextest-core> 1: <color_eyre[51793ea62743adbd]::config::PanicHook>::panic_report<unknown>
27.53 s
gammaloop-nextest-core> at <unknown source file>:<unknown line>
27.53 s
gammaloop-nextest-core> 2: <color_eyre[51793ea62743adbd]::config::PanicHook>::into_panic_hook::{closure#0}<unknown>
27.53 s
gammaloop-nextest-core> at <unknown source file>:<unknown line>
27.53 s
gammaloop-nextest-core> 3: std[bcb96dfbba0ab899]::panicking::panic_with_hook<unknown>
27.53 s
gammaloop-nextest-core> at <unknown source file>:<unknown line>
27.53 s
gammaloop-nextest-core> 4: std[bcb96dfbba0ab899]::panicking::panic_handler::{closure#0}<unknown>
27.53 s
gammaloop-nextest-core> at <unknown source file>:<unknown line>
27.53 s
gammaloop-nextest-core> 5: std[bcb96dfbba0ab899]::sys::backtrace::__rust_end_short_backtrace::<std[bcb96dfbba0ab899]::panicking::panic_handler::{closure#0}, !><unknown>
27.53 s
gammaloop-nextest-core> at <unknown source file>:<unknown line>
27.53 s
gammaloop-nextest-core> 6: __rustc[6c289b9f9c454d21]::rust_begin_unwind<unknown>
27.53 s
gammaloop-nextest-core> at <unknown source file>:<unknown line>
27.53 s
gammaloop-nextest-core> 7: core[940e698046960fd5]::panicking::panic_fmt<unknown>
27.53 s
gammaloop-nextest-core> at <unknown source file>:<unknown line>
27.53 s
gammaloop-nextest-core> 8: insta[307a548ac79ef4d9]::runtime::assert_snapshot<unknown>
27.53 s
gammaloop-nextest-core> at <unknown source file>:<unknown line>
27.53 s
gammaloop-nextest-core> 9: <test_renormalization[6420da4f660338c3]::finit_part_ghlo::{closure#0} as core[940e698046960fd5]::ops::function::FnOnce<()>>::call_once<unknown>
27.53 s
gammaloop-nextest-core> at <unknown source file>:<unknown line>
27.53 s
gammaloop-nextest-core> 10: test[75d6903177b1d7e9]::__rust_begin_short_backtrace::<core[940e698046960fd5]::result::Result<(), alloc[2ea6bcb46fca0c42]::string::String>, fn() -> core[940e698046960fd5]::result::Result<(), alloc[2ea6bcb46fca0c42]::string::String>><unknown>
27.53 s
gammaloop-nextest-core> at <unknown source file>:<unknown line>
27.53 s
gammaloop-nextest-core> 11: test[75d6903177b1d7e9]::run_test::{closure#0}<unknown>
27.53 s
gammaloop-nextest-core> at <unknown source file>:<unknown line>
27.53 s
gammaloop-nextest-core> 12: std[bcb96dfbba0ab899]::sys::backtrace::__rust_begin_short_backtrace::<test[75d6903177b1d7e9]::run_test::{closure#1}, ()><unknown>
27.53 s
gammaloop-nextest-core> at <unknown source file>:<unknown line>
27.53 s
gammaloop-nextest-core> 13: <std[bcb96dfbba0ab899]::thread::lifecycle::spawn_unchecked<test[75d6903177b1d7e9]::run_test::{closure#1}, ()>::{closure#1} as core[940e698046960fd5]::ops::function::FnOnce<()>>::call_once::{shim:vtable#0}<unknown>
27.53 s
gammaloop-nextest-core> at <unknown source file>:<unknown line>
27.53 s
gammaloop-nextest-core> 14: <std[bcb96dfbba0ab899]::sys::thread::unix::Thread>::new::thread_start<unknown>
27.53 s
gammaloop-nextest-core> at <unknown source file>:<unknown line>
27.53 s
gammaloop-nextest-core> 15: start_thread<unknown>
27.53 s
gammaloop-nextest-core> at <unknown source file>:<unknown line>
27.53 s
gammaloop-nextest-core> 16: __clone3<unknown>
27.53 s
gammaloop-nextest-core> at <unknown source file>:<unknown line>
27.53 s
gammaloop-nextest-core>
27.53 s
gammaloop-nextest-core> Run with COLORBT_SHOW_HIDDEN=1 environment variable to disable frame filtering.
27.53 s
gammaloop-nextest-core> Run with RUST_BACKTRACE=full to include source snippets.
27.53 s
gammaloop-nextest-core>
27.53 s
gammaloop-nextest-core> 2. gammalooprs::test_renormalization::finite_part_ghost_2loop
27.53 s
gammaloop-nextest-core> failure: test failure with exit code 101
27.53 s
gammaloop-nextest-core> system-out
27.53 s
gammaloop-nextest-core> running 1 test
27.53 s
gammaloop-nextest-core> ━━━━━━━━━━━━━━━━━━━━━━━━━━━━━━━ Snapshot Summary ━━━━━━━━━━━━━━━━━━━━━━━━━━━━━━━
27.53 s
gammaloop-nextest-core> Snapshot: finite_part_ghost_2loop-3
27.53 s
gammaloop-nextest-core> Source: crates/gammalooprs/tests/test_renormalization.rs:464
27.53 s
gammaloop-nextest-core> ────────────────────────────────────────────────────────────────────────────────
27.53 s
gammaloop-nextest-core> Expression: align_to_rqft(&a, &model).to_bare_ordered_string()
27.53 s
gammaloop-nextest-core> ────────────────────────────────────────────────────────────────────────────────
27.53 s
gammaloop-nextest-core> -old snapshot
27.53 s
gammaloop-nextest-core> +new results
27.53 s
gammaloop-nextest-core> ────────────┬───────────────────────────────────────────────────────────────────
27.53 s
gammaloop-nextest-core> 1 │-(-1𝑖/32*ε+1𝑖/16)*(cas(2,coad(8)))^2*dot(P(0,mink(4)),P(0,mink(4)))*gs^4*ε^(-2)
27.53 s
gammaloop-nextest-core> 1 │+(-1𝑖/16+1𝑖/32*ε)*(cas(2,coad(8)))^2*dot(P(0,mink(4)),P(0,mink(4)))*gs^4*ε^(-2)
27.53 s
gammaloop-nextest-core> ────────────┴───────────────────────────────────────────────────────────────────
27.53 s
gammaloop-nextest-core> To update snapshots run `cargo insta review`
27.53 s
gammaloop-nextest-core> Stopped on the first failure. Run `cargo insta test` to run all snapshots.
27.53 s
gammaloop-nextest-core> test finite_part_ghost_2loop ... FAILED
27.53 s
gammaloop-nextest-core>
27.53 s
gammaloop-nextest-core> failures:
27.53 s
gammaloop-nextest-core>
27.53 s
gammaloop-nextest-core> failures:
27.53 s
gammaloop-nextest-core> finite_part_ghost_2loop
27.53 s
gammaloop-nextest-core>
27.53 s
gammaloop-nextest-core> test result: FAILED. 0 passed; 1 failed; 0 ignored; 0 measured; 5 filtered out; finished in 1.99s
27.53 s
gammaloop-nextest-core> system-err
27.53 s
gammaloop-nextest-core> The application panicked (crashed).
27.53 s
gammaloop-nextest-core> Message: snapshot assertion for 'finite_part_ghost_2loop-3' failed in line 464
27.53 s
gammaloop-nextest-core> Location: /nix/store/0f9p2h9240ylfzayilfjv4gr7scagfs3-vendor-cargo-deps/c19b7c6f923b580ac259164a89f2577984ad5ab09ee9d583b888f934adbbe8d0/insta-1.47.2/src/runtime.rs:719
27.53 s
gammaloop-nextest-core>
27.53 s
gammaloop-nextest-core> ━━━━━━━━━━━━━━━━━━━━━━━━━━━━━━━━━━ BACKTRACE ━━━━━━━━━━━━━━━━━━━━━━━━━━━━━━━━━━━
27.53 s
gammaloop-nextest-core> 1: <color_eyre[51793ea62743adbd]::config::PanicHook>::panic_report<unknown>
27.53 s
gammaloop-nextest-core> at <unknown source file>:<unknown line>
27.53 s
gammaloop-nextest-core> 2: <color_eyre[51793ea62743adbd]::config::PanicHook>::into_panic_hook::{closure#0}<unknown>
27.53 s
gammaloop-nextest-core> at <unknown source file>:<unknown line>
27.53 s
gammaloop-nextest-core> 3: std[bcb96dfbba0ab899]::panicking::panic_with_hook<unknown>
27.53 s
gammaloop-nextest-core> at <unknown source file>:<unknown line>
27.53 s
gammaloop-nextest-core> 4: std[bcb96dfbba0ab899]::panicking::panic_handler::{closure#0}<unknown>
27.53 s
gammaloop-nextest-core> at <unknown source file>:<unknown line>
27.53 s
gammaloop-nextest-core> 5: std[bcb96dfbba0ab899]::sys::backtrace::__rust_end_short_backtrace::<std[bcb96dfbba0ab899]::panicking::panic_handler::{closure#0}, !><unknown>
27.53 s
gammaloop-nextest-core> at <unknown source file>:<unknown line>
27.53 s
gammaloop-nextest-core> 6: __rustc[6c289b9f9c454d21]::rust_begin_unwind<unknown>
27.53 s
gammaloop-nextest-core> at <unknown source file>:<unknown line>
27.53 s
gammaloop-nextest-core> 7: core[940e698046960fd5]::panicking::panic_fmt<unknown>
27.53 s
gammaloop-nextest-core> at <unknown source file>:<unknown line>
27.53 s
gammaloop-nextest-core> 8: insta[307a548ac79ef4d9]::runtime::assert_snapshot<unknown>
27.53 s
gammaloop-nextest-core> at <unknown source file>:<unknown line>
27.53 s
gammaloop-nextest-core> 9: test_renormalization[6420da4f660338c3]::finite_part_ghost_2loop<unknown>
27.53 s
gammaloop-nextest-core> at <unknown source file>:<unknown line>
27.53 s
gammaloop-nextest-core> 10: <test_renormalization[6420da4f660338c3]::finite_part_ghost_2loop::{closure#0} as core[940e698046960fd5]::ops::function::FnOnce<()>>::call_once<unknown>
27.53 s
gammaloop-nextest-core> at <unknown source file>:<unknown line>
27.53 s
gammaloop-nextest-core> 11: test[75d6903177b1d7e9]::__rust_begin_short_backtrace::<core[940e698046960fd5]::result::Result<(), alloc[2ea6bcb46fca0c42]::string::String>, fn() -> core[940e698046960fd5]::result::Result<(), alloc[2ea6bcb46fca0c42]::string::String>><unknown>
27.53 s
gammaloop-nextest-core> at <unknown source file>:<unknown line>
27.53 s
gammaloop-nextest-core> 12: test[75d6903177b1d7e9]::run_test::{closure#0}<unknown>
27.53 s
gammaloop-nextest-core> at <unknown source file>:<unknown line>
27.53 s
gammaloop-nextest-core> 13: std[bcb96dfbba0ab899]::sys::backtrace::__rust_begin_short_backtrace::<test[75d6903177b1d7e9]::run_test::{closure#1}, ()><unknown>
27.53 s
gammaloop-nextest-core> at <unknown source file>:<unknown line>
27.53 s
gammaloop-nextest-core> 14: <std[bcb96dfbba0ab899]::thread::lifecycle::spawn_unchecked<test[75d6903177b1d7e9]::run_test::{closure#1}, ()>::{closure#1} as core[940e698046960fd5]::ops::function::FnOnce<()>>::call_once::{shim:vtable#0}<unknown>
27.53 s
gammaloop-nextest-core> at <unknown source file>:<unknown line>
27.53 s
gammaloop-nextest-core> 15: <std[bcb96dfbba0ab899]::sys::thread::unix::Thread>::new::thread_start<unknown>
27.53 s
gammaloop-nextest-core> at <unknown source file>:<unknown line>
27.53 s
gammaloop-nextest-core> 16: start_thread<unknown>
27.53 s
gammaloop-nextest-core> at <unknown source file>:<unknown line>
27.53 s
gammaloop-nextest-core> 17: __clone3<unknown>
27.53 s
gammaloop-nextest-core> at <unknown source file>:<unknown line>
27.53 s
gammaloop-nextest-core>
27.53 s
gammaloop-nextest-core> Run with COLORBT_SHOW_HIDDEN=1 environment variable to disable frame filtering.
27.53 s
gammaloop-nextest-core> Run with RUST_BACKTRACE=full to include source snippets.
27.53 s
gammaloop-nextest-core> =========================================
27.57 s
error: Cannot build '/nix/store/350a1r6l54bs31kmzflfk73sprvxq6ih-gammaloop-nextest-core.drv '.
27.57 s
Reason: builder failed with exit code 100 .
27.57 s
Output paths:
27.57 s
/nix/store/2ph3azwcfnfcanqmv0c10wycsr5zzz4v-gammaloop-nextest-core
27.57 s
Last 473 log lines:
27.57 s
> Extracting 3 binaries (including 1 non-test binary), 1 build script output directory, and 2 linked paths to /build/nextest-archive-f3VTRu
27.57 s
> Extracted 18 files to /build/nextest-archive-f3VTRu in 0.37s
27.57 s
> ------------
27.57 s
> Nextest run ID 7c84ddb4-56bc-42eb-969f-5465a8c87c56 with nextest profile: ci_gammaloop
27.57 s
> Starting 339 tests across 2 binaries
27.57 s
> ------------
27.57 s
> Summary [ 0.416s] 339 tests run: 339 passed , 0 skipped
27.57 s
>
27.57 s
> ========== nextest test summary ==========
27.57 s
> report: target/nextest/ci_gammaloop/junit.xml
27.57 s
> tests: 339, failures: 0, errors: 0
27.57 s
> No failing testcases found.
27.57 s
> =========================================
27.57 s
> Extracting 1 binary and 1 linked path to /build/nextest-archive-Gdt51g
27.57 s
> Extracted 7 files to /build/nextest-archive-Gdt51g in 0.05s
27.57 s
> ------------
27.57 s
> Nextest run ID 1d6ce669-af29-447a-95c9-fa74cb83575c with nextest profile: ci_gammaloop
27.57 s
> Starting 19 tests across 1 binary
27.57 s
> ------------
27.57 s
> Summary [ 0.013s] 19 tests run: 19 passed , 0 skipped
27.57 s
>
27.57 s
> ========== nextest test summary ==========
27.57 s
> report: target/nextest/ci_gammaloop/junit.xml
27.57 s
> tests: 19, failures: 0, errors: 0
27.57 s
> No failing testcases found.
27.57 s
> =========================================
27.57 s
> Extracting 1 binary to /build/nextest-archive-9kC3Fj
27.57 s
> Extracted 4 files to /build/nextest-archive-9kC3Fj in 0.03s
27.57 s
> ------------
27.57 s
> Nextest run ID c12b0ee3-3701-4930-9f51-a94d8199b195 with nextest profile: ci_gammaloop
27.57 s
> Starting 0 tests across 1 binary
27.57 s
> ------------
27.57 s
> Summary [ 0.000s] 0 tests run: 0 passed , 0 skipped
27.57 s
>
27.57 s
> ========== nextest test summary ==========
27.57 s
> report: target/nextest/ci_gammaloop/junit.xml
27.57 s
> tests: 0, failures: 0, errors: 0
27.57 s
> No failing testcases found.
27.57 s
> =========================================
27.57 s
> Extracting 4 binaries, 1 build script output directory, and 2 linked paths to /build/nextest-archive-gX6Us7
27.57 s
> Extracted 18 files to /build/nextest-archive-gX6Us7 in 0.38s
27.57 s
> ------------
27.57 s
> Nextest run ID 52def3a5-dfa0-49f8-941d-d859ef1c4077 with nextest profile: ci_gammaloop
27.57 s
> Starting 456 tests across 4 binaries (61 tests skipped , including 60 tests via profile.ci_gammaloop.default-filter )
27.57 s
> FAIL [ 0.391s] (446/456) gammalooprs::test_renormalization finit_part_ghlo
27.57 s
> stdout ---
27.57 s
>
27.57 s
> running 1 test
27.57 s
> ren part: 1/2*GC_10^2*dot(P(0,mink (dim)),P(0,mink (dim)))*cas(2,coad (8))/ε
27.57 s
> ━━━━━━━━━━━━━━━━━━━━━━━━━━━━━━━ Snapshot Summary ━━━━━━━━━━━━━━━━━━━━━━━━━━━━━━━
27.57 s
> Snapshot: finit_part_ghlo
27.57 s
> Source: crates/gammalooprs/tests/test_renormalization.rs:557
27.57 s
> ────────────────────────────────────────────────────────────────────────────────
27.57 s
> Expression: align_to_rqft(&a, &model).to_bare_ordered_string()
27.57 s
> ────────────────────────────────────────────────────────────────────────────────
27.57 s
> -old snapshot
27.57 s
> +new results
27.57 s
> ────────────┬───────────────────────────────────────────────────────────────────
27.57 s
> 1 │--1/2*cas(2,coad(8))*dot(P(0,mink(4)),P(0,mink(4)))*gs^2*ε^(-1)
27.57 s
> 1 │+1/2*cas(2,coad(8))*dot(P(0,mink(4)),P(0,mink(4)))*gs^2*ε^(-1)
27.57 s
> ────────────┴───────────────────────────────────────────────────────────────────
27.57 s
> To update snapshots run `cargo insta review`
27.57 s
> Stopped on the first failure. Run `cargo insta test` to run all snapshots.
27.57 s
> test finit_part_ghlo ... FAILED
27.57 s
>
27.57 s
> failures:
27.57 s
>
27.57 s
> failures:
27.57 s
> finit_part_ghlo
27.57 s
>
27.57 s
> test result: FAILED. 0 passed; 1 failed; 0 ignored; 0 measured; 5 filtered out; finished in 0.38s
27.57 s
>
27.57 s
> stderr ---
27.57 s
> The application panicked (crashed).
27.57 s
> Message: snapshot assertion for 'finit_part_ghlo' failed in line 557
27.57 s
> Location: /nix/store/0f9p2h9240ylfzayilfjv4gr7scagfs3-vendor-cargo-deps/c19b7c6f923b580ac259164a89f2577984ad5ab09ee9d583b888f934adbbe8d0/insta-1.47.2/src/runtime.rs :719
27.57 s
>
27.57 s
> ━━━━━━━━━━━━━━━━━━━━━━━━━━━━━━━━━━ BACKTRACE ━━━━━━━━━━━━━━━━━━━━━━━━━━━━━━━━━━━
27.57 s
> 1: <color_eyre[51793ea62743adbd]::config::PanicHook>::panic_report <unknown>
27.57 s
> at <unknown source file> :<unknown line>
27.57 s
> 2: <color_eyre[51793ea62743adbd]::config::PanicHook>::into_panic_hook::{closure#0} <unknown>
27.57 s
> at <unknown source file> :<unknown line>
27.57 s
> 3: std[bcb96dfbba0ab899]::panicking::panic_with_hook <unknown>
27.57 s
> at <unknown source file> :<unknown line>
27.57 s
> 4: std[bcb96dfbba0ab899]::panicking::panic_handler::{closure#0} <unknown>
27.57 s
> at <unknown source file> :<unknown line>
27.57 s
> 5: std[bcb96dfbba0ab899]::sys::backtrace::__rust_end_short_backtrace::<std[bcb96dfbba0ab899]::panicking::panic_handler::{closure#0}, !> <unknown>
27.57 s
> at <unknown source file> :<unknown line>
27.57 s
> 6: __rustc[6c289b9f9c454d21]::rust_begin_unwind <unknown>
27.57 s
> at <unknown source file> :<unknown line>
27.57 s
> 7: core[940e698046960fd5]::panicking::panic_fmt <unknown>
27.57 s
> at <unknown source file> :<unknown line>
27.57 s
> 8: insta[307a548ac79ef4d9]::runtime::assert_snapshot <unknown>
27.57 s
> at <unknown source file> :<unknown line>
27.57 s
> 9: <test_renormalization[6420da4f660338c3]::finit_part_ghlo::{closure#0} as core[940e698046960fd5]::ops::function::FnOnce<()>>::call_once <unknown>
27.57 s
> at <unknown source file> :<unknown line>
27.57 s
> 10: test[75d6903177b1d7e9]::__rust_begin_short_backtrace::<core[940e698046960fd5]::result::Result<(), alloc[2ea6bcb46fca0c42]::string::String>, fn() -> core[940e698046960fd5]::result::Result<(), alloc[2ea6bcb46fca0c42]::string::String>> <unknown>
27.57 s
> at <unknown source file> :<unknown line>
27.57 s
> 11: test[75d6903177b1d7e9]::run_test::{closure#0} <unknown>
27.57 s
> at <unknown source file> :<unknown line>
27.57 s
> 12: std[bcb96dfbba0ab899]::sys::backtrace::__rust_begin_short_backtrace::<test[75d6903177b1d7e9]::run_test::{closure#1}, ()> <unknown>
27.57 s
> at <unknown source file> :<unknown line>
27.57 s
> 13: <std[bcb96dfbba0ab899]::thread::lifecycle::spawn_unchecked<test[75d6903177b1d7e9]::run_test::{closure#1}, ()>::{closure#1} as core[940e698046960fd5]::ops::function::FnOnce<()>>::call_once::{shim:vtable#0} <unknown>
27.57 s
> at <unknown source file> :<unknown line>
27.57 s
> 14: <std[bcb96dfbba0ab899]::sys::thread::unix::Thread>::new::thread_start <unknown>
27.57 s
> at <unknown source file> :<unknown line>
27.57 s
> 15: start_thread <unknown>
27.57 s
> at <unknown source file> :<unknown line>
27.57 s
> 16: __clone3 <unknown>
27.57 s
> at <unknown source file> :<unknown line>
27.57 s
>
27.57 s
> Run with COLORBT_SHOW_HIDDEN=1 environment variable to disable frame filtering.
27.57 s
> Run with RUST_BACKTRACE=full to include source snippets.
27.57 s
>
27.57 s
> FAIL [ 1.998s] (451/456) gammalooprs::test_renormalization finite_part_ghost_2loop
27.57 s
> stdout ---
27.57 s
>
27.57 s
> running 1 test
27.57 s
> ━━━━━━━━━━━━━━━━━━━━━━━━━━━━━━━ Snapshot Summary ━━━━━━━━━━━━━━━━━━━━━━━━━━━━━━━
27.57 s
> Snapshot: finite_part_ghost_2loop-3
27.57 s
> Source: crates/gammalooprs/tests/test_renormalization.rs:464
27.57 s
> ────────────────────────────────────────────────────────────────────────────────
27.57 s
> Expression: align_to_rqft(&a, &model).to_bare_ordered_string()
27.57 s
> ────────────────────────────────────────────────────────────────────────────────
27.57 s
> -old snapshot
27.57 s
> +new results
27.57 s
> ────────────┬───────────────────────────────────────────────────────────────────
27.57 s
> 1 │-(-1𝑖/32*ε+1𝑖/16)*(cas(2,coad(8)))^2*dot(P(0,mink(4)),P(0,mink(4)))*gs^4*ε^(-2)
27.57 s
> 1 │+(-1𝑖/16+1𝑖/32*ε)*(cas(2,coad(8)))^2*dot(P(0,mink(4)),P(0,mink(4)))*gs^4*ε^(-2)
27.57 s
> ────────────┴───────────────────────────────────────────────────────────────────
27.57 s
> To update snapshots run `cargo insta review`
27.57 s
> Stopped on the first failure. Run `cargo insta test` to run all snapshots.
27.57 s
> test finite_part_ghost_2loop ... FAILED
27.57 s
>
27.57 s
> failures:
27.57 s
>
27.57 s
> failures:
27.57 s
> finite_part_ghost_2loop
27.57 s
>
27.57 s
> test result: FAILED. 0 passed; 1 failed; 0 ignored; 0 measured; 5 filtered out; finished in 1.99s
27.57 s
>
27.57 s
> stderr ---
27.57 s
> The application panicked (crashed).
27.57 s
> Message: snapshot assertion for 'finite_part_ghost_2loop-3' failed in line 464
27.57 s
> Location: /nix/store/0f9p2h9240ylfzayilfjv4gr7scagfs3-vendor-cargo-deps/c19b7c6f923b580ac259164a89f2577984ad5ab09ee9d583b888f934adbbe8d0/insta-1.47.2/src/runtime.rs :719
27.57 s
>
27.57 s
> ━━━━━━━━━━━━━━━━━━━━━━━━━━━━━━━━━━ BACKTRACE ━━━━━━━━━━━━━━━━━━━━━━━━━━━━━━━━━━━
27.57 s
> 1: <color_eyre[51793ea62743adbd]::config::PanicHook>::panic_report <unknown>
27.57 s
> at <unknown source file> :<unknown line>
27.57 s
> 2: <color_eyre[51793ea62743adbd]::config::PanicHook>::into_panic_hook::{closure#0} <unknown>
27.57 s
> at <unknown source file> :<unknown line>
27.57 s
> 3: std[bcb96dfbba0ab899]::panicking::panic_with_hook <unknown>
27.57 s
> at <unknown source file> :<unknown line>
27.57 s
> 4: std[bcb96dfbba0ab899]::panicking::panic_handler::{closure#0} <unknown>
27.57 s
> at <unknown source file> :<unknown line>
27.57 s
> 5: std[bcb96dfbba0ab899]::sys::backtrace::__rust_end_short_backtrace::<std[bcb96dfbba0ab899]::panicking::panic_handler::{closure#0}, !> <unknown>
27.57 s
> at <unknown source file> :<unknown line>
27.57 s
> 6: __rustc[6c289b9f9c454d21]::rust_begin_unwind <unknown>
27.57 s
> at <unknown source file> :<unknown line>
27.57 s
> 7: core[940e698046960fd5]::panicking::panic_fmt <unknown>
27.57 s
> at <unknown source file> :<unknown line>
27.57 s
> 8: insta[307a548ac79ef4d9]::runtime::assert_snapshot <unknown>
27.57 s
> at <unknown source file> :<unknown line>
27.57 s
> 9: test_renormalization[6420da4f660338c3]::finite_part_ghost_2loop <unknown>
27.57 s
> at <unknown source file> :<unknown line>
27.57 s
> 10: <test_renormalization[6420da4f660338c3]::finite_part_ghost_2loop::{closure#0} as core[940e698046960fd5]::ops::function::FnOnce<()>>::call_once <unknown>
27.57 s
> at <unknown source file> :<unknown line>
27.57 s
> 11: test[75d6903177b1d7e9]::__rust_begin_short_backtrace::<core[940e698046960fd5]::result::Result<(), alloc[2ea6bcb46fca0c42]::string::String>, fn() -> core[940e698046960fd5]::result::Result<(), alloc[2ea6bcb46fca0c42]::string::String>> <unknown>
27.57 s
> at <unknown source file> :<unknown line>
27.57 s
> 12: test[75d6903177b1d7e9]::run_test::{closure#0} <unknown>
27.57 s
> at <unknown source file> :<unknown line>
27.57 s
> 13: std[bcb96dfbba0ab899]::sys::backtrace::__rust_begin_short_backtrace::<test[75d6903177b1d7e9]::run_test::{closure#1}, ()> <unknown>
27.57 s
> at <unknown source file> :<unknown line>
27.57 s
> 14: <std[bcb96dfbba0ab899]::thread::lifecycle::spawn_unchecked<test[75d6903177b1d7e9]::run_test::{closure#1}, ()>::{closure#1} as core[940e698046960fd5]::ops::function::FnOnce<()>>::call_once::{shim:vtable#0} <unknown>
27.57 s
> at <unknown source file> :<unknown line>
27.57 s
> 15: <std[bcb96dfbba0ab899]::sys::thread::unix::Thread>::new::thread_start <unknown>
27.57 s
> at <unknown source file> :<unknown line>
27.57 s
> 16: start_thread <unknown>
27.57 s
> at <unknown source file> :<unknown line>
27.57 s
> 17: __clone3 <unknown>
27.57 s
> at <unknown source file> :<unknown line>
27.57 s
>
27.57 s
> Run with COLORBT_SHOW_HIDDEN=1 environment variable to disable frame filtering.
27.57 s
> Run with RUST_BACKTRACE=full to include source snippets.
27.57 s
>
27.57 s
> ------------
27.57 s
> Summary [ 7.526s] 456 tests run: 454 passed , 2 failed , 61 skipped
27.57 s
> FAIL [ 0.391s] (446/456) gammalooprs::test_renormalization finit_part_ghlo
27.57 s
> stdout ---
27.57 s
>
27.57 s
> running 1 test
27.57 s
> ren part: 1/2*GC_10^2*dot(P(0,mink (dim)),P(0,mink (dim)))*cas(2,coad (8))/ε
27.57 s
> ━━━━━━━━━━━━━━━━━━━━━━━━━━━━━━━ Snapshot Summary ━━━━━━━━━━━━━━━━━━━━━━━━━━━━━━━
27.57 s
> Snapshot: finit_part_ghlo
27.57 s
> Source: crates/gammalooprs/tests/test_renormalization.rs:557
27.57 s
> ────────────────────────────────────────────────────────────────────────────────
27.57 s
> Expression: align_to_rqft(&a, &model).to_bare_ordered_string()
27.57 s
> ────────────────────────────────────────────────────────────────────────────────
27.57 s
> -old snapshot
27.57 s
> +new results
27.57 s
> ────────────┬───────────────────────────────────────────────────────────────────
27.57 s
> 1 │--1/2*cas(2,coad(8))*dot(P(0,mink(4)),P(0,mink(4)))*gs^2*ε^(-1)
27.57 s
> 1 │+1/2*cas(2,coad(8))*dot(P(0,mink(4)),P(0,mink(4)))*gs^2*ε^(-1)
27.57 s
> ────────────┴───────────────────────────────────────────────────────────────────
27.57 s
> To update snapshots run `cargo insta review`
27.57 s
> Stopped on the first failure. Run `cargo insta test` to run all snapshots.
27.57 s
> test finit_part_ghlo ... FAILED
27.57 s
>
27.57 s
> failures:
27.57 s
>
27.57 s
> failures:
27.57 s
> finit_part_ghlo
27.57 s
>
27.57 s
> test result: FAILED. 0 passed; 1 failed; 0 ignored; 0 measured; 5 filtered out; finished in 0.38s
27.57 s
>
27.57 s
> stderr ---
27.57 s
> The application panicked (crashed).
27.57 s
> Message: snapshot assertion for 'finit_part_ghlo' failed in line 557
27.57 s
> Location: /nix/store/0f9p2h9240ylfzayilfjv4gr7scagfs3-vendor-cargo-deps/c19b7c6f923b580ac259164a89f2577984ad5ab09ee9d583b888f934adbbe8d0/insta-1.47.2/src/runtime.rs :719
27.57 s
>
27.57 s
> ━━━━━━━━━━━━━━━━━━━━━━━━━━━━━━━━━━ BACKTRACE ━━━━━━━━━━━━━━━━━━━━━━━━━━━━━━━━━━━
27.57 s
> 1: <color_eyre[51793ea62743adbd]::config::PanicHook>::panic_report <unknown>
27.57 s
> at <unknown source file> :<unknown line>
27.57 s
> 2: <color_eyre[51793ea62743adbd]::config::PanicHook>::into_panic_hook::{closure#0} <unknown>
27.57 s
> at <unknown source file> :<unknown line>
27.57 s
> 3: std[bcb96dfbba0ab899]::panicking::panic_with_hook <unknown>
27.57 s
> at <unknown source file> :<unknown line>
27.57 s
> 4: std[bcb96dfbba0ab899]::panicking::panic_handler::{closure#0} <unknown>
27.57 s
> at <unknown source file> :<unknown line>
27.57 s
> 5: std[bcb96dfbba0ab899]::sys::backtrace::__rust_end_short_backtrace::<std[bcb96dfbba0ab899]::panicking::panic_handler::{closure#0}, !> <unknown>
27.57 s
> at <unknown source file> :<unknown line>
27.57 s
> 6: __rustc[6c289b9f9c454d21]::rust_begin_unwind <unknown>
27.57 s
> at <unknown source file> :<unknown line>
27.57 s
> 7: core[940e698046960fd5]::panicking::panic_fmt <unknown>
27.57 s
> at <unknown source file> :<unknown line>
27.57 s
> 8: insta[307a548ac79ef4d9]::runtime::assert_snapshot <unknown>
27.57 s
> at <unknown source file> :<unknown line>
27.57 s
> 9: <test_renormalization[6420da4f660338c3]::finit_part_ghlo::{closure#0} as core[940e698046960fd5]::ops::function::FnOnce<()>>::call_once <unknown>
27.57 s
> at <unknown source file> :<unknown line>
27.57 s
> 10: test[75d6903177b1d7e9]::__rust_begin_short_backtrace::<core[940e698046960fd5]::result::Result<(), alloc[2ea6bcb46fca0c42]::string::String>, fn() -> core[940e698046960fd5]::result::Result<(), alloc[2ea6bcb46fca0c42]::string::String>> <unknown>
27.57 s
> at <unknown source file> :<unknown line>
27.57 s
> 11: test[75d6903177b1d7e9]::run_test::{closure#0} <unknown>
27.57 s
> at <unknown source file> :<unknown line>
27.57 s
> 12: std[bcb96dfbba0ab899]::sys::backtrace::__rust_begin_short_backtrace::<test[75d6903177b1d7e9]::run_test::{closure#1}, ()> <unknown>
27.57 s
> at <unknown source file> :<unknown line>
27.57 s
> 13: <std[bcb96dfbba0ab899]::thread::lifecycle::spawn_unchecked<test[75d6903177b1d7e9]::run_test::{closure#1}, ()>::{closure#1} as core[940e698046960fd5]::ops::function::FnOnce<()>>::call_once::{shim:vtable#0} <unknown>
27.57 s
> at <unknown source file> :<unknown line>
27.57 s
> 14: <std[bcb96dfbba0ab899]::sys::thread::unix::Thread>::new::thread_start <unknown>
27.57 s
> at <unknown source file> :<unknown line>
27.57 s
> 15: start_thread <unknown>
27.57 s
> at <unknown source file> :<unknown line>
27.57 s
> 16: __clone3 <unknown>
27.57 s
> at <unknown source file> :<unknown line>
27.57 s
>
27.57 s
> Run with COLORBT_SHOW_HIDDEN=1 environment variable to disable frame filtering.
27.57 s
> Run with RUST_BACKTRACE=full to include source snippets.
27.57 s
>
27.57 s
> FAIL [ 1.998s] (451/456) gammalooprs::test_renormalization finite_part_ghost_2loop
27.57 s
> stdout ---
27.57 s
>
27.57 s
> running 1 test
27.57 s
> ━━━━━━━━━━━━━━━━━━━━━━━━━━━━━━━ Snapshot Summary ━━━━━━━━━━━━━━━━━━━━━━━━━━━━━━━
27.57 s
> Snapshot: finite_part_ghost_2loop-3
27.57 s
> Source: crates/gammalooprs/tests/test_renormalization.rs:464
27.57 s
> ────────────────────────────────────────────────────────────────────────────────
27.57 s
> Expression: align_to_rqft(&a, &model).to_bare_ordered_string()
27.57 s
> ────────────────────────────────────────────────────────────────────────────────
27.57 s
> -old snapshot
27.57 s
> +new results
27.57 s
> ────────────┬───────────────────────────────────────────────────────────────────
27.57 s
> 1 │-(-1𝑖/32*ε+1𝑖/16)*(cas(2,coad(8)))^2*dot(P(0,mink(4)),P(0,mink(4)))*gs^4*ε^(-2)
27.57 s
> 1 │+(-1𝑖/16+1𝑖/32*ε)*(cas(2,coad(8)))^2*dot(P(0,mink(4)),P(0,mink(4)))*gs^4*ε^(-2)
27.57 s
> ────────────┴───────────────────────────────────────────────────────────────────
27.57 s
> To update snapshots run `cargo insta review`
27.57 s
> Stopped on the first failure. Run `cargo insta test` to run all snapshots.
27.57 s
> test finite_part_ghost_2loop ... FAILED
27.57 s
>
27.57 s
> failures:
27.57 s
>
27.57 s
> failures:
27.57 s
> finite_part_ghost_2loop
27.57 s
>
27.57 s
> test result: FAILED. 0 passed; 1 failed; 0 ignored; 0 measured; 5 filtered out; finished in 1.99s
27.57 s
>
27.57 s
> stderr ---
27.57 s
> The application panicked (crashed).
27.57 s
> Message: snapshot assertion for 'finite_part_ghost_2loop-3' failed in line 464
27.57 s
> Location: /nix/store/0f9p2h9240ylfzayilfjv4gr7scagfs3-vendor-cargo-deps/c19b7c6f923b580ac259164a89f2577984ad5ab09ee9d583b888f934adbbe8d0/insta-1.47.2/src/runtime.rs :719
27.57 s
>
27.57 s
> ━━━━━━━━━━━━━━━━━━━━━━━━━━━━━━━━━━ BACKTRACE ━━━━━━━━━━━━━━━━━━━━━━━━━━━━━━━━━━━
27.57 s
> 1: <color_eyre[51793ea62743adbd]::config::PanicHook>::panic_report <unknown>
27.57 s
> at <unknown source file> :<unknown line>
27.57 s
> 2: <color_eyre[51793ea62743adbd]::config::PanicHook>::into_panic_hook::{closure#0} <unknown>
27.57 s
> at <unknown source file> :<unknown line>
27.57 s
> 3: std[bcb96dfbba0ab899]::panicking::panic_with_hook <unknown>
27.57 s
> at <unknown source file> :<unknown line>
27.57 s
> 4: std[bcb96dfbba0ab899]::panicking::panic_handler::{closure#0} <unknown>
27.57 s
> at <unknown source file> :<unknown line>
27.57 s
> 5: std[bcb96dfbba0ab899]::sys::backtrace::__rust_end_short_backtrace::<std[bcb96dfbba0ab899]::panicking::panic_handler::{closure#0}, !> <unknown>
27.57 s
> at <unknown source file> :<unknown line>
27.57 s
> 6: __rustc[6c289b9f9c454d21]::rust_begin_unwind <unknown>
27.57 s
> at <unknown source file> :<unknown line>
27.57 s
> 7: core[940e698046960fd5]::panicking::panic_fmt <unknown>
27.57 s
> at <unknown source file> :<unknown line>
27.57 s
> 8: insta[307a548ac79ef4d9]::runtime::assert_snapshot <unknown>
27.57 s
> at <unknown source file> :<unknown line>
27.57 s
> 9: test_renormalization[6420da4f660338c3]::finite_part_ghost_2loop <unknown>
27.57 s
> at <unknown source file> :<unknown line>
27.57 s
> 10: <test_renormalization[6420da4f660338c3]::finite_part_ghost_2loop::{closure#0} as core[940e698046960fd5]::ops::function::FnOnce<()>>::call_once <unknown>
27.57 s
> at <unknown source file> :<unknown line>
27.57 s
> 11: test[75d6903177b1d7e9]::__rust_begin_short_backtrace::<core[940e698046960fd5]::result::Result<(), alloc[2ea6bcb46fca0c42]::string::String>, fn() -> core[940e698046960fd5]::result::Result<(), alloc[2ea6bcb46fca0c42]::string::String>> <unknown>
27.57 s
> at <unknown source file> :<unknown line>
27.57 s
> 12: test[75d6903177b1d7e9]::run_test::{closure#0} <unknown>
27.57 s
> at <unknown source file> :<unknown line>
27.57 s
> 13: std[bcb96dfbba0ab899]::sys::backtrace::__rust_begin_short_backtrace::<test[75d6903177b1d7e9]::run_test::{closure#1}, ()> <unknown>
27.57 s
> at <unknown source file> :<unknown line>
27.57 s
> 14: <std[bcb96dfbba0ab899]::thread::lifecycle::spawn_unchecked<test[75d6903177b1d7e9]::run_test::{closure#1}, ()>::{closure#1} as core[940e698046960fd5]::ops::function::FnOnce<()>>::call_once::{shim:vtable#0} <unknown>
27.57 s
> at <unknown source file> :<unknown line>
27.57 s
> 15: <std[bcb96dfbba0ab899]::sys::thread::unix::Thread>::new::thread_start <unknown>
27.57 s
> at <unknown source file> :<unknown line>
27.57 s
> 16: start_thread <unknown>
27.57 s
> at <unknown source file> :<unknown line>
27.57 s
> 17: __clone3 <unknown>
27.57 s
> at <unknown source file> :<unknown line>
27.57 s
>
27.57 s
> Run with COLORBT_SHOW_HIDDEN=1 environment variable to disable frame filtering.
27.57 s
> Run with RUST_BACKTRACE=full to include source snippets.
27.57 s
>
27.57 s
> error : test run failed
27.57 s
>
27.57 s
> ========== nextest test summary ==========
27.57 s
> report: target/nextest/ci_gammaloop/junit.xml
27.57 s
> tests: 456, failures: 2, errors: 0
27.57 s
>
27.57 s
> 1. gammalooprs::test_renormalization::finit_part_ghlo
27.57 s
> failure: test failure with exit code 101
27.57 s
> system-out
27.57 s
> running 1 test
27.57 s
> ren part: 1/2*GC_10^2*dot(P(0,mink(dim)),P(0,mink(dim)))*cas(2,coad(8))/ε
27.57 s
> ━━━━━━━━━━━━━━━━━━━━━━━━━━━━━━━ Snapshot Summary ━━━━━━━━━━━━━━━━━━━━━━━━━━━━━━━
27.57 s
> Snapshot: finit_part_ghlo
27.57 s
> Source: crates/gammalooprs/tests/test_renormalization.rs:557
27.57 s
> ────────────────────────────────────────────────────────────────────────────────
27.57 s
> Expression: align_to_rqft(&a, &model).to_bare_ordered_string()
27.57 s
> ────────────────────────────────────────────────────────────────────────────────
27.57 s
> -old snapshot
27.57 s
> +new results
27.57 s
> ────────────┬───────────────────────────────────────────────────────────────────
27.57 s
> 1 │--1/2*cas(2,coad(8))*dot(P(0,mink(4)),P(0,mink(4)))*gs^2*ε^(-1)
27.57 s
> 1 │+1/2*cas(2,coad(8))*dot(P(0,mink(4)),P(0,mink(4)))*gs^2*ε^(-1)
27.57 s
> ────────────┴───────────────────────────────────────────────────────────────────
27.57 s
> To update snapshots run `cargo insta review`
27.57 s
> Stopped on the first failure. Run `cargo insta test` to run all snapshots.
27.57 s
> test finit_part_ghlo ... FAILED
27.57 s
>
27.57 s
> failures:
27.57 s
>
27.57 s
> failures:
27.57 s
> finit_part_ghlo
27.57 s
>
27.57 s
> test result: FAILED. 0 passed; 1 failed; 0 ignored; 0 measured; 5 filtered out; finished in 0.38s
27.57 s
> system-err
27.57 s
> The application panicked (crashed).
27.57 s
> Message: snapshot assertion for 'finit_part_ghlo' failed in line 557
27.57 s
> Location: /nix/store/0f9p2h9240ylfzayilfjv4gr7scagfs3-vendor-cargo-deps/c19b7c6f923b580ac259164a89f2577984ad5ab09ee9d583b888f934adbbe8d0/insta-1.47.2/src/runtime.rs:719
27.57 s
>
27.57 s
> ━━━━━━━━━━━━━━━━━━━━━━━━━━━━━━━━━━ BACKTRACE ━━━━━━━━━━━━━━━━━━━━━━━━━━━━━━━━━━━
27.57 s
> 1: <color_eyre[51793ea62743adbd]::config::PanicHook>::panic_report<unknown>
27.57 s
> at <unknown source file>:<unknown line>
27.57 s
> 2: <color_eyre[51793ea62743adbd]::config::PanicHook>::into_panic_hook::{closure#0}<unknown>
27.57 s
> at <unknown source file>:<unknown line>
27.57 s
> 3: std[bcb96dfbba0ab899]::panicking::panic_with_hook<unknown>
27.57 s
> at <unknown source file>:<unknown line>
27.57 s
> 4: std[bcb96dfbba0ab899]::panicking::panic_handler::{closure#0}<unknown>
27.57 s
> at <unknown source file>:<unknown line>
27.57 s
> 5: std[bcb96dfbba0ab899]::sys::backtrace::__rust_end_short_backtrace::<std[bcb96dfbba0ab899]::panicking::panic_handler::{closure#0}, !><unknown>
27.57 s
> at <unknown source file>:<unknown line>
27.57 s
> 6: __rustc[6c289b9f9c454d21]::rust_begin_unwind<unknown>
27.57 s
> at <unknown source file>:<unknown line>
27.57 s
> 7: core[940e698046960fd5]::panicking::panic_fmt<unknown>
27.57 s
> at <unknown source file>:<unknown line>
27.57 s
> 8: insta[307a548ac79ef4d9]::runtime::assert_snapshot<unknown>
27.57 s
> at <unknown source file>:<unknown line>
27.57 s
> 9: <test_renormalization[6420da4f660338c3]::finit_part_ghlo::{closure#0} as core[940e698046960fd5]::ops::function::FnOnce<()>>::call_once<unknown>
27.57 s
> at <unknown source file>:<unknown line>
27.57 s
> 10: test[75d6903177b1d7e9]::__rust_begin_short_backtrace::<core[940e698046960fd5]::result::Result<(), alloc[2ea6bcb46fca0c42]::string::String>, fn() -> core[940e698046960fd5]::result::Result<(), alloc[2ea6bcb46fca0c42]::string::String>><unknown>
27.57 s
> at <unknown source file>:<unknown line>
27.57 s
> 11: test[75d6903177b1d7e9]::run_test::{closure#0}<unknown>
27.57 s
> at <unknown source file>:<unknown line>
27.57 s
> 12: std[bcb96dfbba0ab899]::sys::backtrace::__rust_begin_short_backtrace::<test[75d6903177b1d7e9]::run_test::{closure#1}, ()><unknown>
27.57 s
> at <unknown source file>:<unknown line>
27.57 s
> 13: <std[bcb96dfbba0ab899]::thread::lifecycle::spawn_unchecked<test[75d6903177b1d7e9]::run_test::{closure#1}, ()>::{closure#1} as core[940e698046960fd5]::ops::function::FnOnce<()>>::call_once::{shim:vtable#0}<unknown>
27.57 s
> at <unknown source file>:<unknown line>
27.57 s
> 14: <std[bcb96dfbba0ab899]::sys::thread::unix::Thread>::new::thread_start<unknown>
27.57 s
> at <unknown source file>:<unknown line>
27.57 s
> 15: start_thread<unknown>
27.57 s
> at <unknown source file>:<unknown line>
27.57 s
> 16: __clone3<unknown>
27.57 s
> at <unknown source file>:<unknown line>
27.57 s
>
27.57 s
> Run with COLORBT_SHOW_HIDDEN=1 environment variable to disable frame filtering.
27.57 s
> Run with RUST_BACKTRACE=full to include source snippets.
27.57 s
>
27.57 s
> 2. gammalooprs::test_renormalization::finite_part_ghost_2loop
27.57 s
> failure: test failure with exit code 101
27.57 s
> system-out
27.57 s
> running 1 test
27.57 s
> ━━━━━━━━━━━━━━━━━━━━━━━━━━━━━━━ Snapshot Summary ━━━━━━━━━━━━━━━━━━━━━━━━━━━━━━━
27.57 s
> Snapshot: finite_part_ghost_2loop-3
27.57 s
> Source: crates/gammalooprs/tests/test_renormalization.rs:464
27.57 s
> ────────────────────────────────────────────────────────────────────────────────
27.57 s
> Expression: align_to_rqft(&a, &model).to_bare_ordered_string()
27.57 s
> ────────────────────────────────────────────────────────────────────────────────
27.57 s
> -old snapshot
27.57 s
> +new results
27.57 s
> ────────────┬───────────────────────────────────────────────────────────────────
27.57 s
> 1 │-(-1𝑖/32*ε+1𝑖/16)*(cas(2,coad(8)))^2*dot(P(0,mink(4)),P(0,mink(4)))*gs^4*ε^(-2)
27.57 s
> 1 │+(-1𝑖/16+1𝑖/32*ε)*(cas(2,coad(8)))^2*dot(P(0,mink(4)),P(0,mink(4)))*gs^4*ε^(-2)
27.57 s
> ────────────┴───────────────────────────────────────────────────────────────────
27.57 s
> To update snapshots run `cargo insta review`
27.57 s
> Stopped on the first failure. Run `cargo insta test` to run all snapshots.
27.57 s
> test finite_part_ghost_2loop ... FAILED
27.57 s
>
27.57 s
> failures:
27.57 s
>
27.57 s
> failures:
27.57 s
> finite_part_ghost_2loop
27.57 s
>
27.57 s
> test result: FAILED. 0 passed; 1 failed; 0 ignored; 0 measured; 5 filtered out; finished in 1.99s
27.57 s
> system-err
27.57 s
> The application panicked (crashed).
27.57 s
> Message: snapshot assertion for 'finite_part_ghost_2loop-3' failed in line 464
27.57 s
> Location: /nix/store/0f9p2h9240ylfzayilfjv4gr7scagfs3-vendor-cargo-deps/c19b7c6f923b580ac259164a89f2577984ad5ab09ee9d583b888f934adbbe8d0/insta-1.47.2/src/runtime.rs:719
27.57 s
>
27.57 s
> ━━━━━━━━━━━━━━━━━━━━━━━━━━━━━━━━━━ BACKTRACE ━━━━━━━━━━━━━━━━━━━━━━━━━━━━━━━━━━━
27.57 s
> 1: <color_eyre[51793ea62743adbd]::config::PanicHook>::panic_report<unknown>
27.57 s
> at <unknown source file>:<unknown line>
27.57 s
> 2: <color_eyre[51793ea62743adbd]::config::PanicHook>::into_panic_hook::{closure#0}<unknown>
27.57 s
> at <unknown source file>:<unknown line>
27.57 s
> 3: std[bcb96dfbba0ab899]::panicking::panic_with_hook<unknown>
27.57 s
> at <unknown source file>:<unknown line>
27.57 s
> 4: std[bcb96dfbba0ab899]::panicking::panic_handler::{closure#0}<unknown>
27.57 s
> at <unknown source file>:<unknown line>
27.57 s
> 5: std[bcb96dfbba0ab899]::sys::backtrace::__rust_end_short_backtrace::<std[bcb96dfbba0ab899]::panicking::panic_handler::{closure#0}, !><unknown>
27.57 s
> at <unknown source file>:<unknown line>
27.57 s
> 6: __rustc[6c289b9f9c454d21]::rust_begin_unwind<unknown>
27.57 s
> at <unknown source file>:<unknown line>
27.57 s
> 7: core[940e698046960fd5]::panicking::panic_fmt<unknown>
27.57 s
> at <unknown source file>:<unknown line>
27.57 s
> 8: insta[307a548ac79ef4d9]::runtime::assert_snapshot<unknown>
27.57 s
> at <unknown source file>:<unknown line>
27.57 s
> 9: test_renormalization[6420da4f660338c3]::finite_part_ghost_2loop<unknown>
27.57 s
> at <unknown source file>:<unknown line>
27.57 s
> 10: <test_renormalization[6420da4f660338c3]::finite_part_ghost_2loop::{closure#0} as core[940e698046960fd5]::ops::function::FnOnce<()>>::call_once<unknown>
27.57 s
> at <unknown source file>:<unknown line>
27.57 s
> 11: test[75d6903177b1d7e9]::__rust_begin_short_backtrace::<core[940e698046960fd5]::result::Result<(), alloc[2ea6bcb46fca0c42]::string::String>, fn() -> core[940e698046960fd5]::result::Result<(), alloc[2ea6bcb46fca0c42]::string::String>><unknown>
27.57 s
> at <unknown source file>:<unknown line>
27.57 s
> 12: test[75d6903177b1d7e9]::run_test::{closure#0}<unknown>
27.57 s
> at <unknown source file>:<unknown line>
27.57 s
> 13: std[bcb96dfbba0ab899]::sys::backtrace::__rust_begin_short_backtrace::<test[75d6903177b1d7e9]::run_test::{closure#1}, ()><unknown>
27.57 s
> at <unknown source file>:<unknown line>
27.57 s
> 14: <std[bcb96dfbba0ab899]::thread::lifecycle::spawn_unchecked<test[75d6903177b1d7e9]::run_test::{closure#1}, ()>::{closure#1} as core[940e698046960fd5]::ops::function::FnOnce<()>>::call_once::{shim:vtable#0}<unknown>
27.57 s
> at <unknown source file>:<unknown line>
27.57 s
> 15: <std[bcb96dfbba0ab899]::sys::thread::unix::Thread>::new::thread_start<unknown>
27.57 s
> at <unknown source file>:<unknown line>
27.57 s
> 16: start_thread<unknown>
27.57 s
> at <unknown source file>:<unknown line>
27.57 s
> 17: __clone3<unknown>
27.57 s
> at <unknown source file>:<unknown line>
27.57 s
>
27.57 s
> Run with COLORBT_SHOW_HIDDEN=1 environment variable to disable frame filtering.
27.57 s
> Run with RUST_BACKTRACE=full to include source snippets.
27.57 s
> =========================================
27.57 s
For full logs, run:
27.57 s
nix log /nix/store/350a1r6l54bs31kmzflfk73sprvxq6ih-gammaloop-nextest-core.drv
27.66 s
[0 built (1 failed ), 0.0 Run failed.