test packages.x86_64-linux.nix-ci-check-gammaloop-nextest-spenso

Reproduce this run
Original Run
  1. 1.52 s $ /nix/store/9ypz3flqsrl5xl495mm8h645gadjsxi1-coreutils-9.11/bin/timeout --kill-after=15s 7200s /nix/store/23zk8sgzamrbmj1fday15szf7f2279s8-nix-2.34.7/bin/nix --extra-experimental-features nix-command --extra-experimental-features flakes flake clone git+https://github.com/alphal00p/gammaloop --dest /tmp/nix-ci-worker/stable-pwd/repo/
  2. 2.23 s Cloning into '/tmp/nix-ci-worker/stable-pwd/repo'...
  3. 2.23 s remote: Enumerating objects: 65018, done.
  4. 2.23 s remote: Counting objects: 0% (1/7690) remote: Counting objects: 1% (77/7690) remote: Counting objects: 2% (154/7690) remote: Counting objects: 3% (231/7690) remote: Counting objects: 4% (308/7690) remote: Counting objects: 5% (385/7690) remote: Counting objects: 6% (462/7690) remote: Counting objects: 7% (539/7690) remote: Counting objects: 8% (616/7690) remote: Counting objects: 9% (693/7690) remote: Counting objects: 10% (769/7690) remote: Counting objects: 11% (846/7690) remote: Counting objects: 12% (923/7690) remote: Counting objects: 13% (1000/7690) remote: Counting objects: 14% (1077/7690) remote: Counting objects: 15% (1154/7690) remote: Counting objects: 16% (1231/7690) remote: Counting objects: 17% (1308/7690) remote: Counting objects: 18% (1385/7690) remote: Counting objects: 19% (1462/7690) remote: Counting objects: 20% (1538/7690) remote: Counting objects: 21% (1615/7690) remote: Counting objects: 22% (1692/7690) remote: Counting objects: 23% (1769/7690) remote: Counting objects: 24% (1846/7690) remote: Counting objects: 25% (1923/7690) remote: Counting objects: 26% (2000/7690) remote: Counting objects: 27% (2077/7690) remote: Counting objects: 28% (2154/7690) remote: Counting objects: 29% (2231/7690) remote: Counting objects: 30% (2307/7690) remote: Counting objects: 31% (2384/7690) remote: Counting objects: 32% (2461/7690) remote: Counting objects: 33% (2538/7690) remote: Counting objects: 34% (2615/7690) remote: Counting objects: 35% (2692/7690) remote: Counting objects: 36% (2769/7690) remote: Counting objects: 37% (2846/7690) remote: Counting objects: 38% (2923/7690) remote: Counting objects: 39% (3000/7690) remote: Counting objects: 40% (3076/7690) remote: Counting objects: 41% (3153/7690) remote: Counting objects: 42% (3230/7690) remote: Counting objects: 43% (3307/7690) remote: Counting objects: 44% (3384/7690) remote: Counting objects: 45% (3461/7690) remote: Counting objects: 46% (3538/7690) remote: Counting objects: 47% (3615/7690) remote: Counting objects: 48% (3692/7690) remote: Counting objects: 49% (3769/7690) remote: Counting objects: 50% (3845/7690) remote: Counting objects: 51% (3922/7690) remote: Counting objects: 52% (3999/7690) remote: Counting objects: 53% (4076/7690) remote: Counting objects: 54% (4153/7690) remote: Counting objects: 55% (4230/7690) remote: Counting objects: 56% (4307/7690) remote: Counting objects: 57% (4384/7690) remote: Counting objects: 58% (4461/7690) remote: Counting objects: 59% (4538/7690) remote: Counting objects: 60% (4614/7690) remote: Counting objects: 61% (4691/7690) remote: Counting objects: 62% (4768/7690) remote: Counting objects: 63% (4845/7690) remote: Counting objects: 64% (4922/7690) remote: Counting objects: 65% (4999/7690) remote: Counting objects: 66% (5076/7690) remote: Counting objects: 67% (5153/7690) remote: Counting objects: 68% (5230/7690) remote: Counting objects: 69% (5307/7690) remote: Counting objects: 70% (5383/7690) remote: Counting objects: 71% (5460/7690) remote: Counting objects: 72% (5537/7690) remote: Counting objects: 73% (5614/7690) remote: Counting objects: 74% (5691/7690) remote: Counting objects: 75% (5768/7690) remote: Counting objects: 76% (5845/7690) remote: Counting objects: 77% (5922/7690) remote: Counting objects: 78% (5999/7690) remote: Counting objects: 79% (6076/7690) remote: Counting objects: 80% (6152/7690) remote: Counting objects: 81% (6229/7690) remote: Counting objects: 82% (6306/7690) remote: Counting objects: 83% (6383/7690) remote: Counting objects: 84% (6460/7690) remote: Counting objects: 85% (6537/7690) remote: Counting objects: 86% (6614/7690) remote: Counting objects: 87% (6691/7690) remote: Counting objects: 88% (6768/7690) remote: Counting objects: 89% (6845/7690) remote: Counting objects: 90% (6921/7690) remote: Counting objects: 91% (6998/7690) remote: Counting objects: 92% (7075/7690) remote: Counting objects: 93% (7152/7690) remote: Counting objects: 94% (7229/7690) remote: Counting objects: 95% (7306/7690) remote: Counting objects: 96% (7383/7690) remote: Counting objects: 97% (7460/7690) remote: Counting objects: 98% (7537/7690) remote: Counting objects: 99% (7614/7690) remote: Counting objects: 100% (7690/7690) remote: Counting objects: 100% (7690/7690), done.
  5. 2.23 s remote: Compressing objects: 0% (1/1405) remote: Compressing objects: 1% (15/1405) remote: Compressing objects: 2% (29/1405) remote: Compressing objects: 3% (43/1405) remote: Compressing objects: 4% (57/1405) remote: Compressing objects: 5% (71/1405) remote: Compressing objects: 6% (85/1405) remote: Compressing objects: 7% (99/1405) remote: Compressing objects: 8% (113/1405) remote: Compressing objects: 9% (127/1405) remote: Compressing objects: 10% (141/1405) remote: Compressing objects: 11% (155/1405) remote: Compressing objects: 12% (169/1405) remote: Compressing objects: 13% (183/1405) remote: Compressing objects: 13% (190/1405) remote: Compressing objects: 14% (197/1405) remote: Compressing objects: 15% (211/1405) remote: Compressing objects: 16% (225/1405) remote: Compressing objects: 17% (239/1405) remote: Compressing objects: 18% (253/1405) remote: Compressing objects: 19% (267/1405) remote: Compressing objects: 20% (281/1405) remote: Compressing objects: 21% (296/1405) remote: Compressing objects: 22% (310/1405) remote: Compressing objects: 23% (324/1405) remote: Compressing objects: 24% (338/1405) remote: Compressing objects: 25% (352/1405) remote: Compressing objects: 26% (366/1405) remote: Compressing objects: 27% (380/1405) remote: Compressing objects: 28% (394/1405) remote: Compressing objects: 29% (408/1405) remote: Compressing objects: 30% (422/1405) remote: Compressing objects: 31% (436/1405) remote: Compressing objects: 32% (450/1405) remote: Compressing objects: 33% (464/1405) remote: Compressing objects: 34% (478/1405) remote: Compressing objects: 35% (492/1405) remote: Compressing objects: 36% (506/1405) remote: Compressing objects: 37% (520/1405) remote: Compressing objects: 38% (534/1405) remote: Compressing objects: 39% (548/1405) remote: Compressing objects: 40% (562/1405) remote: Compressing objects: 41% (577/1405) remote: Compressing objects: 42% (591/1405) remote: Compressing objects: 43% (605/1405) remote: Compressing objects: 44% (619/1405) remote: Compressing objects: 45% (633/1405) remote: Compressing objects: 46% (647/1405) remote: Compressing objects: 47% (661/1405) remote: Compressing objects: 48% (675/1405) remote: Compressing objects: 49% (689/1405) remote: Compressing objects: 50% (703/1405) remote: Compressing objects: 51% (717/1405) remote: Compressing objects: 52% (731/1405) remote: Compressing objects: 53% (745/1405) remote: Compressing objects: 54% (759/1405) remote: Compressing objects: 55% (773/1405) remote: Compressing objects: 56% (787/1405) remote: Compressing objects: 57% (801/1405) remote: Compressing objects: 58% (815/1405) remote: Compressing objects: 59% (829/1405) remote: Compressing objects: 60% (843/1405) remote: Compressing objects: 61% (858/1405) remote: Compressing objects: 62% (872/1405) remote: Compressing objects: 63% (886/1405) remote: Compressing objects: 64% (900/1405) remote: Compressing objects: 65% (914/1405) remote: Compressing objects: 66% (928/1405) remote: Compressing objects: 67% (942/1405) remote: Compressing objects: 68% (956/1405) remote: Compressing objects: 69% (970/1405) remote: Compressing objects: 70% (984/1405) remote: Compressing objects: 71% (998/1405) remote: Compressing objects: 72% (1012/1405) remote: Compressing objects: 73% (1026/1405) remote: Compressing objects: 74% (1040/1405) remote: Compressing objects: 75% (1054/1405) remote: Compressing objects: 76% (1068/1405) remote: Compressing objects: 77% (1082/1405) remote: Compressing objects: 78% (1096/1405) remote: Compressing objects: 79% (1110/1405) remote: Compressing objects: 80% (1124/1405) remote: Compressing objects: 81% (1139/1405) remote: Compressing objects: 82% (1153/1405) remote: Compressing objects: 83% (1167/1405) remote: Compressing objects: 84% (1181/1405) remote: Compressing objects: 85% (1195/1405) remote: Compressing objects: 86% (1209/1405) remote: Compressing objects: 87% (1223/1405) remote: Compressing objects: 88% (1237/1405) remote: Compressing objects: 89% (1251/1405) remote: Compressing objects: 90% (1265/1405) remote: Compressing objects: 91% (1279/1405) remote: Compressing objects: 92% (1293/1405) remote: Compressing objects: 93% (1307/1405) remote: Compressing objects: 94% (1321/1405) remote: Compressing objects: 95% (1335/1405) remote: Compressing objects: 96% (1349/1405) remote: Compressing objects: 97% (1363/1405) remote: Compressing objects: 98% (1377/1405) remote: Compressing objects: 99% (1391/1405) remote: Compressing objects: 100% (1405/1405) remote: Compressing objects: 100% (1405/1405), done.
  6. 4.84 s Receiving objects: 0% (1/65018) Receiving objects: 1% (651/65018) Receiving objects: 2% (1301/65018) Receiving objects: 3% (1951/65018) Receiving objects: 4% (2601/65018) Receiving objects: 5% (3251/65018) Receiving objects: 6% (3902/65018) Receiving objects: 7% (4552/65018) Receiving objects: 8% (5202/65018) Receiving objects: 9% (5852/65018) Receiving objects: 10% (6502/65018) Receiving objects: 11% (7152/65018) Receiving objects: 12% (7803/65018), 16.07 MiB | 32.12 MiB/s Receiving objects: 13% (8453/65018), 16.07 MiB | 32.12 MiB/s Receiving objects: 14% (9103/65018), 16.07 MiB | 32.12 MiB/s Receiving objects: 15% (9753/65018), 16.07 MiB | 32.12 MiB/s Receiving objects: 16% (10403/65018), 16.07 MiB | 32.12 MiB/s Receiving objects: 17% (11054/65018), 16.07 MiB | 32.12 MiB/s Receiving objects: 18% (11704/65018), 16.07 MiB | 32.12 MiB/s Receiving objects: 19% (12354/65018), 16.07 MiB | 32.12 MiB/s Receiving objects: 20% (13004/65018), 16.07 MiB | 32.12 MiB/s Receiving objects: 21% (13654/65018), 16.07 MiB | 32.12 MiB/s Receiving objects: 22% (14304/65018), 16.07 MiB | 32.12 MiB/s Receiving objects: 23% (14955/65018), 16.07 MiB | 32.12 MiB/s Receiving objects: 24% (15605/65018), 16.07 MiB | 32.12 MiB/s Receiving objects: 25% (16255/65018), 16.07 MiB | 32.12 MiB/s Receiving objects: 26% (16905/65018), 16.07 MiB | 32.12 MiB/s Receiving objects: 27% (17555/65018), 16.07 MiB | 32.12 MiB/s Receiving objects: 28% (18206/65018), 16.07 MiB | 32.12 MiB/s Receiving objects: 29% (18856/65018), 16.07 MiB | 32.12 MiB/s Receiving objects: 30% (19506/65018), 16.07 MiB | 32.12 MiB/s Receiving objects: 31% (20156/65018), 16.07 MiB | 32.12 MiB/s Receiving objects: 32% (20806/65018), 16.07 MiB | 32.12 MiB/s Receiving objects: 33% (21456/65018), 16.07 MiB | 32.12 MiB/s Receiving objects: 34% (22107/65018), 16.07 MiB | 32.12 MiB/s Receiving objects: 35% (22757/65018), 16.07 MiB | 32.12 MiB/s Receiving objects: 36% (23407/65018), 16.07 MiB | 32.12 MiB/s Receiving objects: 37% (24057/65018), 16.07 MiB | 32.12 MiB/s Receiving objects: 38% (24707/65018), 16.07 MiB | 32.12 MiB/s Receiving objects: 39% (25358/65018), 16.07 MiB | 32.12 MiB/s Receiving objects: 40% (26008/65018), 16.07 MiB | 32.12 MiB/s Receiving objects: 41% (26658/65018), 16.07 MiB | 32.12 MiB/s Receiving objects: 42% (27308/65018), 16.07 MiB | 32.12 MiB/s Receiving objects: 43% (27958/65018), 16.07 MiB | 32.12 MiB/s Receiving objects: 44% (28608/65018), 16.07 MiB | 32.12 MiB/s Receiving objects: 45% (29259/65018), 16.07 MiB | 32.12 MiB/s Receiving objects: 46% (29909/65018), 16.07 MiB | 32.12 MiB/s Receiving objects: 47% (30559/65018), 16.07 MiB | 32.12 MiB/s Receiving objects: 48% (31209/65018), 16.07 MiB | 32.12 MiB/s Receiving objects: 49% (31859/65018), 16.07 MiB | 32.12 MiB/s Receiving objects: 50% (32509/65018), 16.07 MiB | 32.12 MiB/s Receiving objects: 51% (33160/65018), 16.07 MiB | 32.12 MiB/s Receiving objects: 51% (33603/65018), 31.93 MiB | 31.50 MiB/s Receiving objects: 52% (33810/65018), 31.93 MiB | 31.50 MiB/s Receiving objects: 53% (34460/65018), 31.93 MiB | 31.50 MiB/s Receiving objects: 54% (35110/65018), 31.93 MiB | 31.50 MiB/s Receiving objects: 55% (35760/65018), 31.93 MiB | 31.50 MiB/s Receiving objects: 56% (36411/65018), 31.93 MiB | 31.50 MiB/s Receiving objects: 57% (37061/65018), 31.93 MiB | 31.50 MiB/s Receiving objects: 58% (37711/65018), 31.93 MiB | 31.50 MiB/s Receiving objects: 59% (38361/65018), 31.93 MiB | 31.50 MiB/s Receiving objects: 60% (39011/65018), 31.93 MiB | 31.50 MiB/s Receiving objects: 61% (39661/65018), 31.93 MiB | 31.50 MiB/s Receiving objects: 62% (40312/65018), 31.93 MiB | 31.50 MiB/s Receiving objects: 63% (40962/65018), 31.93 MiB | 31.50 MiB/s Receiving objects: 64% (41612/65018), 31.93 MiB | 31.50 MiB/s Receiving objects: 65% (42262/65018), 31.93 MiB | 31.50 MiB/s Receiving objects: 66% (42912/65018), 50.69 MiB | 33.48 MiB/s Receiving objects: 67% (43563/65018), 50.69 MiB | 33.48 MiB/s Receiving objects: 68% (44213/65018), 50.69 MiB | 33.48 MiB/s Receiving objects: 69% (44863/65018), 50.69 MiB | 33.48 MiB/s Receiving objects: 70% (45513/65018), 50.69 MiB | 33.48 MiB/s Receiving objects: 71% (46163/65018), 50.69 MiB | 33.48 MiB/s Receiving objects: 72% (46813/65018), 50.69 MiB | 33.48 MiB/s Receiving objects: 73% (47464/65018), 50.69 MiB | 33.48 MiB/s Receiving objects: 74% (48114/65018), 50.69 MiB | 33.48 MiB/s Receiving objects: 75% (48764/65018), 50.69 MiB | 33.48 MiB/s Receiving objects: 75% (48902/65018), 66.24 MiB | 32.67 MiB/s Receiving objects: 76% (49414/65018), 66.24 MiB | 32.67 MiB/s Receiving objects: 77% (50064/65018), 66.24 MiB | 32.67 MiB/s Receiving objects: 78% (50715/65018), 66.24 MiB | 32.67 MiB/s Receiving objects: 79% (51365/65018), 66.24 MiB | 32.67 MiB/s Receiving objects: 80% (52015/65018), 66.24 MiB | 32.67 MiB/s Receiving objects: 81% (52665/65018), 66.24 MiB | 32.67 MiB/s Receiving objects: 82% (53315/65018), 66.24 MiB | 32.67 MiB/s Receiving objects: 83% (53965/65018), 66.24 MiB | 32.67 MiB/s Receiving objects: 84% (54616/65018), 66.24 MiB | 32.67 MiB/s Receiving objects: 85% (55266/65018), 66.24 MiB | 32.67 MiB/s Receiving objects: 86% (55916/65018), 66.24 MiB | 32.67 MiB/s Receiving objects: 87% (56566/65018), 66.24 MiB | 32.67 MiB/s Receiving objects: 88% (57216/65018), 66.24 MiB | 32.67 MiB/s Receiving objects: 89% (57867/65018), 66.24 MiB | 32.67 MiB/s Receiving objects: 90% (58517/65018), 66.24 MiB | 32.67 MiB/s Receiving objects: 91% (59167/65018), 66.24 MiB | 32.67 MiB/s Receiving objects: 92% (59817/65018), 66.24 MiB | 32.67 MiB/s Receiving objects: 93% (60467/65018), 66.24 MiB | 32.67 MiB/s Receiving objects: 94% (61117/65018), 84.03 MiB | 33.25 MiB/s Receiving objects: 95% (61768/65018), 84.03 MiB | 33.25 MiB/s Receiving objects: 96% (62418/65018), 84.03 MiB | 33.25 MiB/s Receiving objects: 97% (63068/65018), 84.03 MiB | 33.25 MiB/s Receiving objects: 98% (63718/65018), 84.03 MiB | 33.25 MiB/s Receiving objects: 99% (64368/65018), 84.03 MiB | 33.25 MiB/s remote: Total 65018 (delta 6803), reused 6286 (delta 6285), pack-reused 57328 (from 1)
  7. 4.84 s Receiving objects: 100% (65018/65018), 84.03 MiB | 33.25 MiB/s Receiving objects: 100% (65018/65018), 86.93 MiB | 33.14 MiB/s, done.
  8. 5.48 s Resolving deltas: 0% (0/45900) Resolving deltas: 1% (459/45900) Resolving deltas: 2% (918/45900) Resolving deltas: 3% (1377/45900) Resolving deltas: 4% (1836/45900) Resolving deltas: 5% (2295/45900) Resolving deltas: 6% (2754/45900) Resolving deltas: 7% (3213/45900) Resolving deltas: 8% (3673/45900) Resolving deltas: 9% (4131/45900) Resolving deltas: 10% (4593/45900) Resolving deltas: 11% (5054/45900) Resolving deltas: 12% (5508/45900) Resolving deltas: 13% (5967/45900) Resolving deltas: 14% (6430/45900) Resolving deltas: 15% (6885/45900) Resolving deltas: 16% (7344/45900) Resolving deltas: 17% (7803/45900) Resolving deltas: 18% (8262/45900) Resolving deltas: 19% (8722/45900) Resolving deltas: 20% (9180/45900) Resolving deltas: 21% (9639/45900) Resolving deltas: 22% (10099/45900) Resolving deltas: 23% (10557/45900) Resolving deltas: 24% (11016/45900) Resolving deltas: 25% (11476/45900) Resolving deltas: 26% (11934/45900) Resolving deltas: 27% (12393/45900) Resolving deltas: 28% (12852/45900) Resolving deltas: 29% (13311/45900) Resolving deltas: 30% (13775/45900) Resolving deltas: 31% (14229/45900) Resolving deltas: 32% (14688/45900) Resolving deltas: 33% (15147/45900) Resolving deltas: 34% (15606/45900) Resolving deltas: 35% (16065/45900) Resolving deltas: 36% (16524/45900) Resolving deltas: 37% (16983/45900) Resolving deltas: 38% (17442/45900) Resolving deltas: 39% (17901/45900) Resolving deltas: 40% (18360/45900) Resolving deltas: 41% (18819/45900) Resolving deltas: 42% (19278/45900) Resolving deltas: 43% (19737/45900) Resolving deltas: 44% (20196/45900) Resolving deltas: 45% (20655/45900) Resolving deltas: 46% (21114/45900) Resolving deltas: 47% (21574/45900) Resolving deltas: 48% (22033/45900) Resolving deltas: 49% (22491/45900) Resolving deltas: 50% (22950/45900) Resolving deltas: 51% (23409/45900) Resolving deltas: 52% (23868/45900) Resolving deltas: 53% (24327/45900) Resolving deltas: 54% (24786/45900) Resolving deltas: 55% (25245/45900) Resolving deltas: 56% (25704/45900) Resolving deltas: 57% (26163/45900) Resolving deltas: 58% (26624/45900) Resolving deltas: 59% (27081/45900) Resolving deltas: 60% (27541/45900) Resolving deltas: 61% (28000/45900) Resolving deltas: 62% (28459/45900) Resolving deltas: 63% (28917/45900) Resolving deltas: 64% (29376/45900) Resolving deltas: 65% (29835/45900) Resolving deltas: 66% (30294/45900) Resolving deltas: 67% (30753/45900) Resolving deltas: 68% (31213/45900) Resolving deltas: 69% (31671/45900) Resolving deltas: 70% (32130/45900) Resolving deltas: 71% (32589/45900) Resolving deltas: 72% (33048/45900) Resolving deltas: 73% (33507/45900) Resolving deltas: 74% (33966/45900) Resolving deltas: 75% (34425/45900) Resolving deltas: 76% (34885/45900) Resolving deltas: 77% (35343/45900) Resolving deltas: 78% (35802/45900) Resolving deltas: 79% (36261/45900) Resolving deltas: 80% (36720/45900) Resolving deltas: 81% (37179/45900) Resolving deltas: 82% (37638/45900) Resolving deltas: 83% (38097/45900) Resolving deltas: 84% (38556/45900) Resolving deltas: 85% (39015/45900) Resolving deltas: 86% (39474/45900) Resolving deltas: 87% (39933/45900) Resolving deltas: 88% (40392/45900) Resolving deltas: 89% (40851/45900) Resolving deltas: 90% (41310/45900) Resolving deltas: 91% (41769/45900) Resolving deltas: 92% (42228/45900) Resolving deltas: 93% (42687/45900) Resolving deltas: 94% (43146/45900) Resolving deltas: 95% (43605/45900) Resolving deltas: 96% (44068/45900) Resolving deltas: 97% (44523/45900) Resolving deltas: 98% (44982/45900) Resolving deltas: 99% (45442/45900) Resolving deltas: 100% (45900/45900) Resolving deltas: 100% (45900/45900), done.
  9. 5.78 s Fetching commit 5c37e36355998a98df0d7791c7daeeae576fd7ee for vakint_rustred ...
  10. 5.78 s $ /nix/store/bcnisk3ydfgv26v2gw3zlky24g00yww2-git-2.54.0/bin/git fetch origin 5c37e36355998a98df0d7791c7daeeae576fd7ee
  11. 6.19 s From https://github.com/alphal00p/gammaloop
  12. 6.19 s * branch 5c37e36355998a98df0d7791c7daeeae576fd7ee -> FETCH_HEAD
  13. 6.20 s $ /nix/store/9ypz3flqsrl5xl495mm8h645gadjsxi1-coreutils-9.11/bin/timeout --kill-after=15s 7200s /nix/store/bcnisk3ydfgv26v2gw3zlky24g00yww2-git-2.54.0/bin/git -c advice.detachedHead=false checkout 5c37e36355998a98df0d7791c7daeeae576fd7ee
  14. 6.37 s HEAD is now at 5c37e363 Advance RustRed dependency to refactored core
  15. 6.37 s $ /nix/store/9ypz3flqsrl5xl495mm8h645gadjsxi1-coreutils-9.11/bin/timeout --kill-after=15s 7200s /nix/store/23zk8sgzamrbmj1fday15szf7f2279s8-nix-2.34.7/bin/nix --extra-experimental-features nix-command --extra-experimental-features flakes --log-format internal-json run .#packages.x86_64-linux.nix-ci-check-gammaloop-nextest-spenso --print-build-logs
  16. 10.45 s
  17. 14.95 s evaluating derivation 'g copying '/nix/store/p93a evaluating derivation 'g querying gammaloop-nexte [0/1 built, 0.0 KiB DL] [1/0/1 built, 0.0 KiB DLgammaloop-nextest-spenso> Extracting 5 binaries and 2 linked paths to /build/nextest-archive-ZdbtV2
  18. 15.12 s gammaloop-nextest-spenso> Extracted 19 files to /build/nextest-archive-ZdbtV2 in 0.17s
  19. 15.13 s gammaloop-nextest-spenso> ------------
  20. 15.13 s gammaloop-nextest-spenso> Nextest run ID 89778efb-206a-44eb-b0e7-e9c61040686e with nextest profile: ci_gammaloop
  21. 15.13 s gammaloop-nextest-spenso> Starting 224 tests across 5 binaries (26 tests skipped, including 2 tests via profile.ci_gammaloop.default-filter)
  22. 15.22 s gammaloop-nextest-spenso> FAIL [ 0.011s] ( 45/224) idenso color::test::form_reference::metric_contraction_respects_antisymmetric_normalization
  23. 15.22 s gammaloop-nextest-spenso> stdout ---
  24. 15.22 s gammaloop-nextest-spenso>
  25. 15.22 s gammaloop-nextest-spenso> running 1 test
  26. 15.22 s gammaloop-nextest-spenso> test color::test::form_reference::metric_contraction_respects_antisymmetric_normalization ... FAILED
  27. 15.22 s gammaloop-nextest-spenso>
  28. 15.22 s gammaloop-nextest-spenso> failures:
  29. 15.22 s gammaloop-nextest-spenso>
  30. 15.22 s gammaloop-nextest-spenso> failures:
  31. 15.22 s gammaloop-nextest-spenso> color::test::form_reference::metric_contraction_respects_antisymmetric_normalization
  32. 15.22 s gammaloop-nextest-spenso>
  33. 15.22 s gammaloop-nextest-spenso> test result: FAILED. 0 passed; 1 failed; 0 ignored; 0 measured; 240 filtered out; finished in 0.00s
  34. 15.22 s gammaloop-nextest-spenso>
  35. 15.22 s gammaloop-nextest-spenso> stderr ---
  36. 15.22 s gammaloop-nextest-spenso>
  37. 15.22 s gammaloop-nextest-spenso> thread 'color::test::form_reference::metric_contraction_respects_antisymmetric_normalization' (333) panicked at crates/idenso/src/color/test/form_reference.rs:171:5:
  38. 15.22 s gammaloop-nextest-spenso> assertion `left == right` failed
  39. 15.22 s gammaloop-nextest-spenso> left: "-1*f(coad(8,standalone_metric_j),coad(8,standalone_metric_s),coad(8,standalone_metric_u))"
  40. 15.22 s gammaloop-nextest-spenso> right: "f(coad(8,standalone_metric_j),coad(8,standalone_metric_s),coad(8,standalone_metric_u))"
  41. 15.22 s gammaloop-nextest-spenso> stack backtrace:
  42. 15.22 s gammaloop-nextest-spenso> 0: __rustc::rust_begin_unwind
  43. 15.22 s gammaloop-nextest-spenso> 1: core::panicking::panic_fmt
  44. 15.22 s gammaloop-nextest-spenso> 2: core::panicking::assert_failed_inner
  45. 15.22 s gammaloop-nextest-spenso> 3: core::panicking::assert_failed::<alloc::string::String, alloc::string::String>
  46. 15.22 s gammaloop-nextest-spenso> 4: idenso::color::test::form_reference::metric_contraction_respects_antisymmetric_normalization
  47. 15.22 s gammaloop-nextest-spenso> 5: <idenso::color::test::form_reference::metric_contraction_respects_antisymmetric_normalization::{closure#0} as core::ops::function::FnOnce<()>>::call_once
  48. 15.22 s gammaloop-nextest-spenso> note: Some details are omitted, run with `RUST_BACKTRACE=full` for a verbose backtrace.
  49. 15.22 s gammaloop-nextest-spenso>
  50. 15.50 s gammaloop-nextest-spenso> FAIL [ 0.091s] (221/224) idenso tensor::tests::parsing::infinite_execution
  51. 15.50 s gammaloop-nextest-spenso> stdout ---
  52. 15.50 s gammaloop-nextest-spenso>
  53. 15.50 s gammaloop-nextest-spenso> running 1 test
  54. 15.50 s gammaloop-nextest-spenso> ━━━━━━━━━━━━━━━━━━━━━━━━━━━━━━━ Snapshot Summary ━━━━━━━━━━━━━━━━━━━━━━━━━━━━━━━
  55. 15.50 s gammaloop-nextest-spenso> Snapshot: infinite_execution
  56. 15.50 s gammaloop-nextest-spenso> Source: crates/idenso/src/tensor/tests/parsing.rs:910
  57. 15.50 s gammaloop-nextest-spenso> ────────────────────────────────────────────────────────────────────────────────
  58. 15.50 s gammaloop-nextest-spenso> Expression: net_iter.snapshot_dot()
  59. 15.50 s gammaloop-nextest-spenso> ────────────────────────────────────────────────────────────────────────────────
  60. 15.50 s gammaloop-nextest-spenso> -old snapshot
  61. 15.50 s gammaloop-nextest-spenso> +new results
  62. 15.50 s gammaloop-nextest-spenso> ────────────┬───────────────────────────────────────────────────────────────────
  63. 15.50 s gammaloop-nextest-spenso> 8 8 │ 0:0:s -> ext0 [id=0 color="red"];
  64. 15.50 s gammaloop-nextest-spenso> 9 9 │ ext1 [style=invis];
  65. 15.50 s gammaloop-nextest-spenso> 10 10 │ 0:5:s -> ext1 [id=1 dir=none color="red" label="mink4|l_0"];
  66. 15.50 s gammaloop-nextest-spenso> 11 11 │ ext2 [style=invis];
  67. 15.50 s gammaloop-nextest-spenso> 12 │- 0:4:s -> ext2 [id=2 dir=none color="red" label="bis4|l_2"];
  68. 15.50 s gammaloop-nextest-spenso> 12 │+ 0:3:s -> ext2 [id=2 dir=none color="red" label="mink4|l_1"];
  69. 15.50 s gammaloop-nextest-spenso> 13 13 │ ext3 [style=invis];
  70. 15.50 s gammaloop-nextest-spenso> 14 │- 0:3:s -> ext3 [id=3 dir=none color="red" label="bis4|l_3"];
  71. 15.50 s gammaloop-nextest-spenso> 14 │+ 0:1:s -> ext3 [id=3 dir=none color="red" label="bis4|l_2"];
  72. 15.50 s gammaloop-nextest-spenso> 15 15 │ ext4 [style=invis];
  73. 15.50 s gammaloop-nextest-spenso> 16 │- 0:1:s -> ext4 [id=4 dir=none color="red" label="mink4|l_1"];
  74. 15.50 s gammaloop-nextest-spenso> 16 │+ 0:2:s -> ext4 [id=4 dir=none color="red" label="mink4|l_4"];
  75. 15.50 s gammaloop-nextest-spenso> 17 17 │ ext5 [style=invis];
  76. 15.50 s gammaloop-nextest-spenso> 18 │- 0:2:s -> ext5 [id=5 dir=none color="red" label="mink4|l_4"];
  77. 15.50 s gammaloop-nextest-spenso> 18 │+ 0:4:s -> ext5 [id=5 dir=none color="red" label="bis4|l_3"];
  78. 15.50 s gammaloop-nextest-spenso> 19 19 │ }
  79. 15.50 s gammaloop-nextest-spenso> ────────────┴───────────────────────────────────────────────────────────────────
  80. 15.50 s gammaloop-nextest-spenso> To update snapshots run `cargo insta review`
  81. 15.50 s gammaloop-nextest-spenso> Stopped on the first failure. Run `cargo insta test` to run all snapshots.
  82. 15.50 s gammaloop-nextest-spenso> test tensor::tests::parsing::infinite_execution ... FAILED
  83. 15.50 s gammaloop-nextest-spenso>
  84. 15.50 s gammaloop-nextest-spenso> failures:
  85. 15.50 s gammaloop-nextest-spenso>
  86. 15.50 s gammaloop-nextest-spenso> failures:
  87. 15.50 s gammaloop-nextest-spenso> tensor::tests::parsing::infinite_execution
  88. 15.50 s gammaloop-nextest-spenso>
  89. 15.50 s gammaloop-nextest-spenso> test result: FAILED. 0 passed; 1 failed; 0 ignored; 0 measured; 240 filtered out; finished in 0.09s
  90. 15.50 s gammaloop-nextest-spenso>
  91. 15.50 s gammaloop-nextest-spenso> stderr ---
  92. 15.50 s gammaloop-nextest-spenso>
  93. 15.50 s gammaloop-nextest-spenso> thread 'tensor::tests::parsing::infinite_execution' (832) panicked at /nix/store/9a12dww58xis3an3kmn597llpijv83b1-vendor-cargo-deps/c19b7c6f923b580ac259164a89f2577984ad5ab09ee9d583b888f934adbbe8d0/insta-1.47.2/src/runtime.rs:719:13:
  94. 15.50 s gammaloop-nextest-spenso> snapshot assertion for 'infinite_execution' failed in line 910
  95. 15.50 s gammaloop-nextest-spenso> stack backtrace:
  96. 15.50 s gammaloop-nextest-spenso> 0: __rustc::rust_begin_unwind
  97. 15.50 s gammaloop-nextest-spenso> 1: core::panicking::panic_fmt
  98. 15.50 s gammaloop-nextest-spenso> 2: insta::runtime::assert_snapshot
  99. 15.50 s gammaloop-nextest-spenso> 3: idenso::tensor::tests::parsing::infinite_execution
  100. 15.50 s gammaloop-nextest-spenso> 4: <idenso::tensor::tests::parsing::infinite_execution::{closure#0} as core::ops::function::FnOnce<()>>::call_once
  101. 15.50 s gammaloop-nextest-spenso> note: Some details are omitted, run with `RUST_BACKTRACE=full` for a verbose backtrace.
  102. 15.50 s gammaloop-nextest-spenso>
  103. 16.71 s gammaloop-nextest-spenso> ------------
  104. 16.71 s gammaloop-nextest-spenso> Summary [ 1.579s] 224 tests run: 222 passed, 2 failed, 26 skipped
  105. 16.71 s gammaloop-nextest-spenso> FAIL [ 0.011s] ( 45/224) idenso color::test::form_reference::metric_contraction_respects_antisymmetric_normalization
  106. 16.71 s gammaloop-nextest-spenso> stdout ---
  107. 16.71 s gammaloop-nextest-spenso>
  108. 16.71 s gammaloop-nextest-spenso> running 1 test
  109. 16.71 s gammaloop-nextest-spenso> test color::test::form_reference::metric_contraction_respects_antisymmetric_normalization ... FAILED
  110. 16.71 s gammaloop-nextest-spenso>
  111. 16.71 s gammaloop-nextest-spenso> failures:
  112. 16.71 s gammaloop-nextest-spenso>
  113. 16.71 s gammaloop-nextest-spenso> failures:
  114. 16.71 s gammaloop-nextest-spenso> color::test::form_reference::metric_contraction_respects_antisymmetric_normalization
  115. 16.71 s gammaloop-nextest-spenso>
  116. 16.71 s gammaloop-nextest-spenso> test result: FAILED. 0 passed; 1 failed; 0 ignored; 0 measured; 240 filtered out; finished in 0.00s
  117. 16.71 s gammaloop-nextest-spenso>
  118. 16.71 s gammaloop-nextest-spenso> stderr ---
  119. 16.71 s gammaloop-nextest-spenso>
  120. 16.71 s gammaloop-nextest-spenso> thread 'color::test::form_reference::metric_contraction_respects_antisymmetric_normalization' (333) panicked at crates/idenso/src/color/test/form_reference.rs:171:5:
  121. 16.71 s gammaloop-nextest-spenso> assertion `left == right` failed
  122. 16.71 s gammaloop-nextest-spenso> left: "-1*f(coad(8,standalone_metric_j),coad(8,standalone_metric_s),coad(8,standalone_metric_u))"
  123. 16.71 s gammaloop-nextest-spenso> right: "f(coad(8,standalone_metric_j),coad(8,standalone_metric_s),coad(8,standalone_metric_u))"
  124. 16.71 s gammaloop-nextest-spenso> stack backtrace:
  125. 16.71 s gammaloop-nextest-spenso> 0: __rustc::rust_begin_unwind
  126. 16.71 s gammaloop-nextest-spenso> 1: core::panicking::panic_fmt
  127. 16.71 s gammaloop-nextest-spenso> 2: core::panicking::assert_failed_inner
  128. 16.71 s gammaloop-nextest-spenso> 3: core::panicking::assert_failed::<alloc::string::String, alloc::string::String>
  129. 16.71 s gammaloop-nextest-spenso> 4: idenso::color::test::form_reference::metric_contraction_respects_antisymmetric_normalization
  130. 16.71 s gammaloop-nextest-spenso> 5: <idenso::color::test::form_reference::metric_contraction_respects_antisymmetric_normalization::{closure#0} as core::ops::function::FnOnce<()>>::call_once
  131. 16.71 s gammaloop-nextest-spenso> note: Some details are omitted, run with `RUST_BACKTRACE=full` for a verbose backtrace.
  132. 16.71 s gammaloop-nextest-spenso>
  133. 16.71 s gammaloop-nextest-spenso> FAIL [ 0.091s] (221/224) idenso tensor::tests::parsing::infinite_execution
  134. 16.71 s gammaloop-nextest-spenso> stdout ---
  135. 16.71 s gammaloop-nextest-spenso>
  136. 16.71 s gammaloop-nextest-spenso> running 1 test
  137. 16.71 s gammaloop-nextest-spenso> ━━━━━━━━━━━━━━━━━━━━━━━━━━━━━━━ Snapshot Summary ━━━━━━━━━━━━━━━━━━━━━━━━━━━━━━━
  138. 16.71 s gammaloop-nextest-spenso> Snapshot: infinite_execution
  139. 16.71 s gammaloop-nextest-spenso> Source: crates/idenso/src/tensor/tests/parsing.rs:910
  140. 16.71 s gammaloop-nextest-spenso> ────────────────────────────────────────────────────────────────────────────────
  141. 16.71 s gammaloop-nextest-spenso> Expression: net_iter.snapshot_dot()
  142. 16.71 s gammaloop-nextest-spenso> ────────────────────────────────────────────────────────────────────────────────
  143. 16.71 s gammaloop-nextest-spenso> -old snapshot
  144. 16.71 s gammaloop-nextest-spenso> +new results
  145. 16.71 s gammaloop-nextest-spenso> ────────────┬───────────────────────────────────────────────────────────────────
  146. 16.71 s gammaloop-nextest-spenso> 8 8 │ 0:0:s -> ext0 [id=0 color="red"];
  147. 16.71 s gammaloop-nextest-spenso> 9 9 │ ext1 [style=invis];
  148. 16.71 s gammaloop-nextest-spenso> 10 10 │ 0:5:s -> ext1 [id=1 dir=none color="red" label="mink4|l_0"];
  149. 16.71 s gammaloop-nextest-spenso> 11 11 │ ext2 [style=invis];
  150. 16.71 s gammaloop-nextest-spenso> 12 │- 0:4:s -> ext2 [id=2 dir=none color="red" label="bis4|l_2"];
  151. 16.71 s gammaloop-nextest-spenso> 12 │+ 0:3:s -> ext2 [id=2 dir=none color="red" label="mink4|l_1"];
  152. 16.71 s gammaloop-nextest-spenso> 13 13 │ ext3 [style=invis];
  153. 16.71 s gammaloop-nextest-spenso> 14 │- 0:3:s -> ext3 [id=3 dir=none color="red" label="bis4|l_3"];
  154. 16.71 s gammaloop-nextest-spenso> 14 │+ 0:1:s -> ext3 [id=3 dir=none color="red" label="bis4|l_2"];
  155. 16.71 s gammaloop-nextest-spenso> 15 15 │ ext4 [style=invis];
  156. 16.71 s gammaloop-nextest-spenso> 16 │- 0:1:s -> ext4 [id=4 dir=none color="red" label="mink4|l_1"];
  157. 16.71 s gammaloop-nextest-spenso> 16 │+ 0:2:s -> ext4 [id=4 dir=none color="red" label="mink4|l_4"];
  158. 16.71 s gammaloop-nextest-spenso> 17 17 │ ext5 [style=invis];
  159. 16.71 s gammaloop-nextest-spenso> 18 │- 0:2:s -> ext5 [id=5 dir=none color="red" label="mink4|l_4"];
  160. 16.71 s gammaloop-nextest-spenso> 18 │+ 0:4:s -> ext5 [id=5 dir=none color="red" label="bis4|l_3"];
  161. 16.71 s gammaloop-nextest-spenso> 19 19 │ }
  162. 16.71 s gammaloop-nextest-spenso> ────────────┴───────────────────────────────────────────────────────────────────
  163. 16.71 s gammaloop-nextest-spenso> To update snapshots run `cargo insta review`
  164. 16.71 s gammaloop-nextest-spenso> Stopped on the first failure. Run `cargo insta test` to run all snapshots.
  165. 16.71 s gammaloop-nextest-spenso> test tensor::tests::parsing::infinite_execution ... FAILED
  166. 16.71 s gammaloop-nextest-spenso>
  167. 16.71 s gammaloop-nextest-spenso> failures:
  168. 16.71 s gammaloop-nextest-spenso>
  169. 16.71 s gammaloop-nextest-spenso> failures:
  170. 16.71 s gammaloop-nextest-spenso> tensor::tests::parsing::infinite_execution
  171. 16.71 s gammaloop-nextest-spenso>
  172. 16.71 s gammaloop-nextest-spenso> test result: FAILED. 0 passed; 1 failed; 0 ignored; 0 measured; 240 filtered out; finished in 0.09s
  173. 16.71 s gammaloop-nextest-spenso>
  174. 16.71 s gammaloop-nextest-spenso> stderr ---
  175. 16.71 s gammaloop-nextest-spenso>
  176. 16.71 s gammaloop-nextest-spenso> thread 'tensor::tests::parsing::infinite_execution' (832) panicked at /nix/store/9a12dww58xis3an3kmn597llpijv83b1-vendor-cargo-deps/c19b7c6f923b580ac259164a89f2577984ad5ab09ee9d583b888f934adbbe8d0/insta-1.47.2/src/runtime.rs:719:13:
  177. 16.71 s gammaloop-nextest-spenso> snapshot assertion for 'infinite_execution' failed in line 910
  178. 16.71 s gammaloop-nextest-spenso> stack backtrace:
  179. 16.71 s gammaloop-nextest-spenso> 0: __rustc::rust_begin_unwind
  180. 16.71 s gammaloop-nextest-spenso> 1: core::panicking::panic_fmt
  181. 16.71 s gammaloop-nextest-spenso> 2: insta::runtime::assert_snapshot
  182. 16.71 s gammaloop-nextest-spenso> 3: idenso::tensor::tests::parsing::infinite_execution
  183. 16.71 s gammaloop-nextest-spenso> 4: <idenso::tensor::tests::parsing::infinite_execution::{closure#0} as core::ops::function::FnOnce<()>>::call_once
  184. 16.71 s gammaloop-nextest-spenso> note: Some details are omitted, run with `RUST_BACKTRACE=full` for a verbose backtrace.
  185. 16.71 s gammaloop-nextest-spenso>
  186. 16.73 s gammaloop-nextest-spenso> error: test run failed
  187. 16.76 s gammaloop-nextest-spenso>
  188. 16.76 s gammaloop-nextest-spenso> ========== nextest test summary ==========
  189. 16.76 s gammaloop-nextest-spenso> report: target/nextest/ci_gammaloop/junit.xml
  190. 16.76 s gammaloop-nextest-spenso> tests: 224, failures: 2, errors: 0
  191. 16.76 s gammaloop-nextest-spenso>
  192. 16.76 s gammaloop-nextest-spenso> 1. idenso::color::test::form_reference::metric_contraction_respects_antisymmetric_normalization
  193. 16.76 s gammaloop-nextest-spenso> failure: test failure with exit code 101
  194. 16.76 s gammaloop-nextest-spenso> thread 'color::test::form_reference::metric_contraction_respects_antisymmetric_normalization' (333) panicked at crates/idenso/src/color/test/form_reference.rs:171:5:
  195. 16.76 s gammaloop-nextest-spenso> assertion `left == right` failed
  196. 16.76 s gammaloop-nextest-spenso> left: "-1*f(coad(8,standalone_metric_j),coad(8,standalone_metric_s),coad(8,standalone_metric_u))"
  197. 16.76 s gammaloop-nextest-spenso> right: "f(coad(8,standalone_metric_j),coad(8,standalone_metric_s),coad(8,standalone_metric_u))"
  198. 16.76 s gammaloop-nextest-spenso> stack backtrace:
  199. 16.76 s gammaloop-nextest-spenso> 0: __rustc::rust_begin_unwind
  200. 16.76 s gammaloop-nextest-spenso> 1: core::panicking::panic_fmt
  201. 16.76 s gammaloop-nextest-spenso> 2: core::panicking::assert_failed_inner
  202. 16.76 s gammaloop-nextest-spenso> 3: core::panicking::assert_failed::<alloc::string::String, alloc::string::String>
  203. 16.76 s gammaloop-nextest-spenso> 4: idenso::color::test::form_reference::metric_contraction_respects_antisymmetric_normalization
  204. 16.76 s gammaloop-nextest-spenso> 5: <idenso::color::test::form_reference::metric_contraction_respects_antisymmetric_normalization::{closure#0} as core::ops::function::FnOnce<()>>::call_once
  205. 16.76 s gammaloop-nextest-spenso> note: Some details are omitted, run with `RUST_BACKTRACE=full` for a verbose backtrace.
  206. 16.76 s gammaloop-nextest-spenso> system-out
  207. 16.76 s gammaloop-nextest-spenso> running 1 test
  208. 16.76 s gammaloop-nextest-spenso> test color::test::form_reference::metric_contraction_respects_antisymmetric_normalization ... FAILED
  209. 16.76 s gammaloop-nextest-spenso>
  210. 16.76 s gammaloop-nextest-spenso> failures:
  211. 16.76 s gammaloop-nextest-spenso>
  212. 16.76 s gammaloop-nextest-spenso> failures:
  213. 16.76 s gammaloop-nextest-spenso> color::test::form_reference::metric_contraction_respects_antisymmetric_normalization
  214. 16.76 s gammaloop-nextest-spenso>
  215. 16.76 s gammaloop-nextest-spenso> test result: FAILED. 0 passed; 1 failed; 0 ignored; 0 measured; 240 filtered out; finished in 0.00s
  216. 16.76 s gammaloop-nextest-spenso> system-err
  217. 16.76 s gammaloop-nextest-spenso> thread 'color::test::form_reference::metric_contraction_respects_antisymmetric_normalization' (333) panicked at crates/idenso/src/color/test/form_reference.rs:171:5:
  218. 16.76 s gammaloop-nextest-spenso> assertion `left == right` failed
  219. 16.76 s gammaloop-nextest-spenso> left: "-1*f(coad(8,standalone_metric_j),coad(8,standalone_metric_s),coad(8,standalone_metric_u))"
  220. 16.76 s gammaloop-nextest-spenso> right: "f(coad(8,standalone_metric_j),coad(8,standalone_metric_s),coad(8,standalone_metric_u))"
  221. 16.76 s gammaloop-nextest-spenso> stack backtrace:
  222. 16.76 s gammaloop-nextest-spenso> 0: __rustc::rust_begin_unwind
  223. 16.76 s gammaloop-nextest-spenso> 1: core::panicking::panic_fmt
  224. 16.76 s gammaloop-nextest-spenso> 2: core::panicking::assert_failed_inner
  225. 16.76 s gammaloop-nextest-spenso> 3: core::panicking::assert_failed::<alloc::string::String, alloc::string::String>
  226. 16.76 s gammaloop-nextest-spenso> 4: idenso::color::test::form_reference::metric_contraction_respects_antisymmetric_normalization
  227. 16.76 s gammaloop-nextest-spenso> 5: <idenso::color::test::form_reference::metric_contraction_respects_antisymmetric_normalization::{closure#0} as core::ops::function::FnOnce<()>>::call_once
  228. 16.76 s gammaloop-nextest-spenso> note: Some details are omitted, run with `RUST_BACKTRACE=full` for a verbose backtrace.
  229. 16.76 s gammaloop-nextest-spenso>
  230. 16.76 s gammaloop-nextest-spenso> 2. idenso::tensor::tests::parsing::infinite_execution
  231. 16.76 s gammaloop-nextest-spenso> failure: test failure with exit code 101
  232. 16.76 s gammaloop-nextest-spenso> thread 'tensor::tests::parsing::infinite_execution' (832) panicked at /nix/store/9a12dww58xis3an3kmn597llpijv83b1-vendor-cargo-deps/c19b7c6f923b580ac259164a89f2577984ad5ab09ee9d583b888f934adbbe8d0/insta-1.47.2/src/runtime.rs:719:13:
  233. 16.76 s gammaloop-nextest-spenso> snapshot assertion for 'infinite_execution' failed in line 910
  234. 16.76 s gammaloop-nextest-spenso> stack backtrace:
  235. 16.76 s gammaloop-nextest-spenso> 0: __rustc::rust_begin_unwind
  236. 16.76 s gammaloop-nextest-spenso> 1: core::panicking::panic_fmt
  237. 16.76 s gammaloop-nextest-spenso> 2: insta::runtime::assert_snapshot
  238. 16.76 s gammaloop-nextest-spenso> 3: idenso::tensor::tests::parsing::infinite_execution
  239. 16.76 s gammaloop-nextest-spenso> 4: <idenso::tensor::tests::parsing::infinite_execution::{closure#0} as core::ops::function::FnOnce<()>>::call_once
  240. 16.76 s gammaloop-nextest-spenso> note: Some details are omitted, run with `RUST_BACKTRACE=full` for a verbose backtrace.
  241. 16.76 s gammaloop-nextest-spenso> system-out
  242. 16.76 s gammaloop-nextest-spenso> running 1 test
  243. 16.76 s gammaloop-nextest-spenso> ━━━━━━━━━━━━━━━━━━━━━━━━━━━━━━━ Snapshot Summary ━━━━━━━━━━━━━━━━━━━━━━━━━━━━━━━
  244. 16.76 s gammaloop-nextest-spenso> Snapshot: infinite_execution
  245. 16.76 s gammaloop-nextest-spenso> Source: crates/idenso/src/tensor/tests/parsing.rs:910
  246. 16.76 s gammaloop-nextest-spenso> ────────────────────────────────────────────────────────────────────────────────
  247. 16.76 s gammaloop-nextest-spenso> Expression: net_iter.snapshot_dot()
  248. 16.76 s gammaloop-nextest-spenso> ────────────────────────────────────────────────────────────────────────────────
  249. 16.76 s gammaloop-nextest-spenso> -old snapshot
  250. 16.76 s gammaloop-nextest-spenso> +new results
  251. 16.76 s gammaloop-nextest-spenso> ────────────┬───────────────────────────────────────────────────────────────────
  252. 16.76 s gammaloop-nextest-spenso> 8 8 │ 0:0:s-> ext0 [id=0 color="red"];
  253. 16.76 s gammaloop-nextest-spenso> 9 9 │ ext1 [style=invis];
  254. 16.76 s gammaloop-nextest-spenso> 10 10 │ 0:5:s-> ext1 [id=1 dir=none color="red" label="mink4|l_0"];
  255. 16.76 s gammaloop-nextest-spenso> 11 11 │ ext2 [style=invis];
  256. 16.76 s gammaloop-nextest-spenso> 12 │- 0:4:s-> ext2 [id=2 dir=none color="red" label="bis4|l_2"];
  257. 16.76 s gammaloop-nextest-spenso> 12 │+ 0:3:s-> ext2 [id=2 dir=none color="red" label="mink4|l_1"];
  258. 16.76 s gammaloop-nextest-spenso> 13 13 │ ext3 [style=invis];
  259. 16.76 s gammaloop-nextest-spenso> 14 │- 0:3:s-> ext3 [id=3 dir=none color="red" label="bis4|l_3"];
  260. 16.76 s gammaloop-nextest-spenso> 14 │+ 0:1:s-> ext3 [id=3 dir=none color="red" label="bis4|l_2"];
  261. 16.76 s gammaloop-nextest-spenso> 15 15 │ ext4 [style=invis];
  262. 16.76 s gammaloop-nextest-spenso> 16 │- 0:1:s-> ext4 [id=4 dir=none color="red" label="mink4|l_1"];
  263. 16.76 s gammaloop-nextest-spenso> 16 │+ 0:2:s-> ext4 [id=4 dir=none color="red" label="mink4|l_4"];
  264. 16.76 s gammaloop-nextest-spenso> 17 17 │ ext5 [style=invis];
  265. 16.76 s gammaloop-nextest-spenso> 18 │- 0:2:s-> ext5 [id=5 dir=none color="red" label="mink4|l_4"];
  266. 16.76 s gammaloop-nextest-spenso> 18 │+ 0:4:s-> ext5 [id=5 dir=none color="red" label="bis4|l_3"];
  267. 16.76 s gammaloop-nextest-spenso> 19 19 │ }
  268. 16.76 s gammaloop-nextest-spenso> ────────────┴───────────────────────────────────────────────────────────────────
  269. 16.76 s gammaloop-nextest-spenso> To update snapshots run `cargo insta review`
  270. 16.76 s gammaloop-nextest-spenso> Stopped on the first failure. Run `cargo insta test` to run all snapshots.
  271. 16.76 s gammaloop-nextest-spenso> test tensor::tests::parsing::infinite_execution ... FAILED
  272. 16.76 s gammaloop-nextest-spenso>
  273. 16.76 s gammaloop-nextest-spenso> failures:
  274. 16.76 s gammaloop-nextest-spenso>
  275. 16.76 s gammaloop-nextest-spenso> failures:
  276. 16.76 s gammaloop-nextest-spenso> tensor::tests::parsing::infinite_execution
  277. 16.76 s gammaloop-nextest-spenso>
  278. 16.76 s gammaloop-nextest-spenso> test result: FAILED. 0 passed; 1 failed; 0 ignored; 0 measured; 240 filtered out; finished in 0.09s
  279. 16.76 s gammaloop-nextest-spenso> system-err
  280. 16.76 s gammaloop-nextest-spenso> thread 'tensor::tests::parsing::infinite_execution' (832) panicked at /nix/store/9a12dww58xis3an3kmn597llpijv83b1-vendor-cargo-deps/c19b7c6f923b580ac259164a89f2577984ad5ab09ee9d583b888f934adbbe8d0/insta-1.47.2/src/runtime.rs:719:13:
  281. 16.76 s gammaloop-nextest-spenso> snapshot assertion for 'infinite_execution' failed in line 910
  282. 16.76 s gammaloop-nextest-spenso> stack backtrace:
  283. 16.76 s gammaloop-nextest-spenso> 0: __rustc::rust_begin_unwind
  284. 16.76 s gammaloop-nextest-spenso> 1: core::panicking::panic_fmt
  285. 16.76 s gammaloop-nextest-spenso> 2: insta::runtime::assert_snapshot
  286. 16.76 s gammaloop-nextest-spenso> 3: idenso::tensor::tests::parsing::infinite_execution
  287. 16.76 s gammaloop-nextest-spenso> 4: <idenso::tensor::tests::parsing::infinite_execution::{closure#0} as core::ops::function::FnOnce<()>>::call_once
  288. 16.76 s gammaloop-nextest-spenso> note: Some details are omitted, run with `RUST_BACKTRACE=full` for a verbose backtrace.
  289. 16.76 s gammaloop-nextest-spenso> =========================================
  290. 16.77 s gammaloop-nextest-spenso> Extracting 2 binaries and 1 linked path to /build/nextest-archive-woDeo9
  291. 16.84 s gammaloop-nextest-spenso> Extracted 8 files to /build/nextest-archive-woDeo9 in 0.07s
  292. 16.85 s gammaloop-nextest-spenso> ------------
  293. 16.85 s gammaloop-nextest-spenso> Nextest run ID 446f6923-8525-4d9c-8d3f-2c3bd6b53db4 with nextest profile: ci_gammaloop
  294. 16.85 s gammaloop-nextest-spenso> Starting 135 tests across 2 binaries
  295. 16.92 s gammaloop-nextest-spenso> ------------
  296. 16.92 s gammaloop-nextest-spenso> Summary [ 0.076s] 135 tests run: 135 passed, 0 skipped
  297. 16.96 s gammaloop-nextest-spenso>
  298. 16.96 s gammaloop-nextest-spenso> ========== nextest test summary ==========
  299. 16.96 s gammaloop-nextest-spenso> report: target/nextest/ci_gammaloop/junit.xml
  300. 16.96 s gammaloop-nextest-spenso> tests: 135, failures: 0, errors: 0
  301. 16.96 s gammaloop-nextest-spenso> No failing testcases found.
  302. 16.96 s gammaloop-nextest-spenso> =========================================
  303. 16.97 s gammaloop-nextest-spenso> Extracting 5 binaries and 2 linked paths to /build/nextest-archive-at32Dg
  304. 17.15 s gammaloop-nextest-spenso> Extracted 19 files to /build/nextest-archive-at32Dg in 0.18s
  305. 17.16 s gammaloop-nextest-spenso> ------------
  306. 17.16 s gammaloop-nextest-spenso> Nextest run ID ad705c1d-ba1d-4a0f-9919-0e371a00d279 with nextest profile: ci_gammaloop
  307. 17.16 s gammaloop-nextest-spenso> Starting 25 tests across 5 binaries (1 test skipped via profile.ci_gammaloop.default-filter)
  308. 17.36 s gammaloop-nextest-spenso> ------------
  309. 17.36 s gammaloop-nextest-spenso> Summary [ 0.192s] 25 tests run: 25 passed, 1 skipped
  310. 17.40 s gammaloop-nextest-spenso>
  311. 17.40 s gammaloop-nextest-spenso> ========== nextest test summary ==========
  312. 17.40 s gammaloop-nextest-spenso> report: target/nextest/ci_gammaloop/junit.xml
  313. 17.40 s gammaloop-nextest-spenso> tests: 25, failures: 0, errors: 0
  314. 17.40 s gammaloop-nextest-spenso> No failing testcases found.
  315. 17.40 s gammaloop-nextest-spenso> =========================================
  316. 17.42 s gammaloop-nextest-spenso> Extracting 2 binaries and 1 linked path to /build/nextest-archive-fvBYNj
  317. 17.47 s gammaloop-nextest-spenso> Extracted 8 files to /build/nextest-archive-fvBYNj in 0.05s
  318. 17.48 s gammaloop-nextest-spenso> ------------
  319. 17.48 s gammaloop-nextest-spenso> Nextest run ID 102f7e86-d717-497e-8c1c-3624f566c200 with nextest profile: ci_gammaloop
  320. 17.48 s gammaloop-nextest-spenso> Starting 1 test across 2 binaries
  321. 17.48 s gammaloop-nextest-spenso> ------------
  322. 17.48 s gammaloop-nextest-spenso> Summary [ 0.005s] 1 test run: 1 passed, 0 skipped
  323. 17.52 s gammaloop-nextest-spenso>
  324. 17.52 s gammaloop-nextest-spenso> ========== nextest test summary ==========
  325. 17.52 s gammaloop-nextest-spenso> report: target/nextest/ci_gammaloop/junit.xml
  326. 17.52 s gammaloop-nextest-spenso> tests: 1, failures: 0, errors: 0
  327. 17.52 s gammaloop-nextest-spenso> No failing testcases found.
  328. 17.52 s gammaloop-nextest-spenso> =========================================
  329. 17.53 s gammaloop-nextest-spenso> Extracting 1 binary and 1 linked path to /build/nextest-archive-S293jH
  330. 17.58 s gammaloop-nextest-spenso> Extracted 7 files to /build/nextest-archive-S293jH in 0.05s
  331. 17.59 s gammaloop-nextest-spenso> ------------
  332. 17.59 s gammaloop-nextest-spenso> Nextest run ID 6ef61c1c-f830-4d98-ae9f-b591046b74dd with nextest profile: ci_gammaloop
  333. 17.59 s gammaloop-nextest-spenso> Starting 0 tests across 1 binary
  334. 17.59 s gammaloop-nextest-spenso> ------------
  335. 17.59 s gammaloop-nextest-spenso> Summary [ 0.000s] 0 tests run: 0 passed, 0 skipped
  336. 17.62 s gammaloop-nextest-spenso>
  337. 17.62 s gammaloop-nextest-spenso> ========== nextest test summary ==========
  338. 17.62 s gammaloop-nextest-spenso> report: target/nextest/ci_gammaloop/junit.xml
  339. 17.62 s gammaloop-nextest-spenso> tests: 0, failures: 0, errors: 0
  340. 17.62 s gammaloop-nextest-spenso> No failing testcases found.
  341. 17.62 s gammaloop-nextest-spenso> =========================================
  342. 17.64 s error: Cannot build '/nix/store/pn60vy13s1ckr0c5f24izs97bwnqwxqx-gammaloop-nextest-spenso.drv'.
  343. 17.64 s Reason: builder failed with exit code 100.
  344. 17.64 s Output paths:
  345. 17.64 s /nix/store/17qw6dx3kfigd59dmxis8z590cgcrsjb-gammaloop-nextest-spenso
  346. 17.64 s Last 325 log lines:
  347. 17.64 s > Extracting 5 binaries and 2 linked paths to /build/nextest-archive-ZdbtV2
  348. 17.64 s > Extracted 19 files to /build/nextest-archive-ZdbtV2 in 0.17s
  349. 17.64 s > ------------
  350. 17.64 s > Nextest run ID 89778efb-206a-44eb-b0e7-e9c61040686e with nextest profile: ci_gammaloop
  351. 17.64 s > Starting 224 tests across 5 binaries (26 tests skipped, including 2 tests via profile.ci_gammaloop.default-filter)
  352. 17.64 s > FAIL [ 0.011s] ( 45/224) idenso color::test::form_reference::metric_contraction_respects_antisymmetric_normalization
  353. 17.64 s > stdout ---
  354. 17.64 s >
  355. 17.64 s > running 1 test
  356. 17.64 s > test color::test::form_reference::metric_contraction_respects_antisymmetric_normalization ... FAILED
  357. 17.64 s >
  358. 17.64 s > failures:
  359. 17.64 s >
  360. 17.64 s > failures:
  361. 17.64 s > color::test::form_reference::metric_contraction_respects_antisymmetric_normalization
  362. 17.64 s >
  363. 17.64 s > test result: FAILED. 0 passed; 1 failed; 0 ignored; 0 measured; 240 filtered out; finished in 0.00s
  364. 17.64 s >
  365. 17.64 s > stderr ---
  366. 17.64 s >
  367. 17.64 s > thread 'color::test::form_reference::metric_contraction_respects_antisymmetric_normalization' (333) panicked at crates/idenso/src/color/test/form_reference.rs:171:5:
  368. 17.64 s > assertion `left == right` failed
  369. 17.64 s > left: "-1*f(coad(8,standalone_metric_j),coad(8,standalone_metric_s),coad(8,standalone_metric_u))"
  370. 17.64 s > right: "f(coad(8,standalone_metric_j),coad(8,standalone_metric_s),coad(8,standalone_metric_u))"
  371. 17.64 s > stack backtrace:
  372. 17.64 s > 0: __rustc::rust_begin_unwind
  373. 17.64 s > 1: core::panicking::panic_fmt
  374. 17.64 s > 2: core::panicking::assert_failed_inner
  375. 17.64 s > 3: core::panicking::assert_failed::<alloc::string::String, alloc::string::String>
  376. 17.64 s > 4: idenso::color::test::form_reference::metric_contraction_respects_antisymmetric_normalization
  377. 17.64 s > 5: <idenso::color::test::form_reference::metric_contraction_respects_antisymmetric_normalization::{closure#0} as core::ops::function::FnOnce<()>>::call_once
  378. 17.64 s > note: Some details are omitted, run with `RUST_BACKTRACE=full` for a verbose backtrace.
  379. 17.64 s >
  380. 17.64 s > FAIL [ 0.091s] (221/224) idenso tensor::tests::parsing::infinite_execution
  381. 17.64 s > stdout ---
  382. 17.64 s >
  383. 17.64 s > running 1 test
  384. 17.64 s > ━━━━━━━━━━━━━━━━━━━━━━━━━━━━━━━ Snapshot Summary ━━━━━━━━━━━━━━━━━━━━━━━━━━━━━━━
  385. 17.64 s > Snapshot: infinite_execution
  386. 17.64 s > Source: crates/idenso/src/tensor/tests/parsing.rs:910
  387. 17.64 s > ────────────────────────────────────────────────────────────────────────────────
  388. 17.64 s > Expression: net_iter.snapshot_dot()
  389. 17.64 s > ────────────────────────────────────────────────────────────────────────────────
  390. 17.64 s > -old snapshot
  391. 17.64 s > +new results
  392. 17.64 s > ────────────┬───────────────────────────────────────────────────────────────────
  393. 17.64 s > 8 8 │ 0:0:s -> ext0 [id=0 color="red"];
  394. 17.64 s > 9 9 │ ext1 [style=invis];
  395. 17.64 s > 10 10 │ 0:5:s -> ext1 [id=1 dir=none color="red" label="mink4|l_0"];
  396. 17.64 s > 11 11 │ ext2 [style=invis];
  397. 17.64 s > 12 │- 0:4:s -> ext2 [id=2 dir=none color="red" label="bis4|l_2"];
  398. 17.64 s > 12 │+ 0:3:s -> ext2 [id=2 dir=none color="red" label="mink4|l_1"];
  399. 17.64 s > 13 13 │ ext3 [style=invis];
  400. 17.64 s > 14 │- 0:3:s -> ext3 [id=3 dir=none color="red" label="bis4|l_3"];
  401. 17.64 s > 14 │+ 0:1:s -> ext3 [id=3 dir=none color="red" label="bis4|l_2"];
  402. 17.64 s > 15 15 │ ext4 [style=invis];
  403. 17.64 s > 16 │- 0:1:s -> ext4 [id=4 dir=none color="red" label="mink4|l_1"];
  404. 17.64 s > 16 │+ 0:2:s -> ext4 [id=4 dir=none color="red" label="mink4|l_4"];
  405. 17.64 s > 17 17 │ ext5 [style=invis];
  406. 17.64 s > 18 │- 0:2:s -> ext5 [id=5 dir=none color="red" label="mink4|l_4"];
  407. 17.64 s > 18 │+ 0:4:s -> ext5 [id=5 dir=none color="red" label="bis4|l_3"];
  408. 17.64 s > 19 19 │ }
  409. 17.64 s > ────────────┴───────────────────────────────────────────────────────────────────
  410. 17.64 s > To update snapshots run `cargo insta review`
  411. 17.64 s > Stopped on the first failure. Run `cargo insta test` to run all snapshots.
  412. 17.64 s > test tensor::tests::parsing::infinite_execution ... FAILED
  413. 17.64 s >
  414. 17.64 s > failures:
  415. 17.64 s >
  416. 17.64 s > failures:
  417. 17.64 s > tensor::tests::parsing::infinite_execution
  418. 17.64 s >
  419. 17.64 s > test result: FAILED. 0 passed; 1 failed; 0 ignored; 0 measured; 240 filtered out; finished in 0.09s
  420. 17.64 s >
  421. 17.64 s > stderr ---
  422. 17.64 s >
  423. 17.64 s > thread 'tensor::tests::parsing::infinite_execution' (832) panicked at /nix/store/9a12dww58xis3an3kmn597llpijv83b1-vendor-cargo-deps/c19b7c6f923b580ac259164a89f2577984ad5ab09ee9d583b888f934adbbe8d0/insta-1.47.2/src/runtime.rs:719:13:
  424. 17.64 s > snapshot assertion for 'infinite_execution' failed in line 910
  425. 17.64 s > stack backtrace:
  426. 17.64 s > 0: __rustc::rust_begin_unwind
  427. 17.64 s > 1: core::panicking::panic_fmt
  428. 17.64 s > 2: insta::runtime::assert_snapshot
  429. 17.64 s > 3: idenso::tensor::tests::parsing::infinite_execution
  430. 17.64 s > 4: <idenso::tensor::tests::parsing::infinite_execution::{closure#0} as core::ops::function::FnOnce<()>>::call_once
  431. 17.64 s > note: Some details are omitted, run with `RUST_BACKTRACE=full` for a verbose backtrace.
  432. 17.64 s >
  433. 17.64 s > ------------
  434. 17.64 s > Summary [ 1.579s] 224 tests run: 222 passed, 2 failed, 26 skipped
  435. 17.64 s > FAIL [ 0.011s] ( 45/224) idenso color::test::form_reference::metric_contraction_respects_antisymmetric_normalization
  436. 17.64 s > stdout ---
  437. 17.64 s >
  438. 17.64 s > running 1 test
  439. 17.64 s > test color::test::form_reference::metric_contraction_respects_antisymmetric_normalization ... FAILED
  440. 17.64 s >
  441. 17.64 s > failures:
  442. 17.64 s >
  443. 17.64 s > failures:
  444. 17.64 s > color::test::form_reference::metric_contraction_respects_antisymmetric_normalization
  445. 17.64 s >
  446. 17.64 s > test result: FAILED. 0 passed; 1 failed; 0 ignored; 0 measured; 240 filtered out; finished in 0.00s
  447. 17.64 s >
  448. 17.64 s > stderr ---
  449. 17.64 s >
  450. 17.64 s > thread 'color::test::form_reference::metric_contraction_respects_antisymmetric_normalization' (333) panicked at crates/idenso/src/color/test/form_reference.rs:171:5:
  451. 17.64 s > assertion `left == right` failed
  452. 17.64 s > left: "-1*f(coad(8,standalone_metric_j),coad(8,standalone_metric_s),coad(8,standalone_metric_u))"
  453. 17.64 s > right: "f(coad(8,standalone_metric_j),coad(8,standalone_metric_s),coad(8,standalone_metric_u))"
  454. 17.64 s > stack backtrace:
  455. 17.64 s > 0: __rustc::rust_begin_unwind
  456. 17.64 s > 1: core::panicking::panic_fmt
  457. 17.64 s > 2: core::panicking::assert_failed_inner
  458. 17.64 s > 3: core::panicking::assert_failed::<alloc::string::String, alloc::string::String>
  459. 17.64 s > 4: idenso::color::test::form_reference::metric_contraction_respects_antisymmetric_normalization
  460. 17.64 s > 5: <idenso::color::test::form_reference::metric_contraction_respects_antisymmetric_normalization::{closure#0} as core::ops::function::FnOnce<()>>::call_once
  461. 17.64 s > note: Some details are omitted, run with `RUST_BACKTRACE=full` for a verbose backtrace.
  462. 17.64 s >
  463. 17.64 s > FAIL [ 0.091s] (221/224) idenso tensor::tests::parsing::infinite_execution
  464. 17.64 s > stdout ---
  465. 17.64 s >
  466. 17.64 s > running 1 test
  467. 17.64 s > ━━━━━━━━━━━━━━━━━━━━━━━━━━━━━━━ Snapshot Summary ━━━━━━━━━━━━━━━━━━━━━━━━━━━━━━━
  468. 17.64 s > Snapshot: infinite_execution
  469. 17.64 s > Source: crates/idenso/src/tensor/tests/parsing.rs:910
  470. 17.64 s > ────────────────────────────────────────────────────────────────────────────────
  471. 17.64 s > Expression: net_iter.snapshot_dot()
  472. 17.64 s > ────────────────────────────────────────────────────────────────────────────────
  473. 17.64 s > -old snapshot
  474. 17.64 s > +new results
  475. 17.64 s > ────────────┬───────────────────────────────────────────────────────────────────
  476. 17.64 s > 8 8 │ 0:0:s -> ext0 [id=0 color="red"];
  477. 17.64 s > 9 9 │ ext1 [style=invis];
  478. 17.64 s > 10 10 │ 0:5:s -> ext1 [id=1 dir=none color="red" label="mink4|l_0"];
  479. 17.64 s > 11 11 │ ext2 [style=invis];
  480. 17.64 s > 12 │- 0:4:s -> ext2 [id=2 dir=none color="red" label="bis4|l_2"];
  481. 17.64 s > 12 │+ 0:3:s -> ext2 [id=2 dir=none color="red" label="mink4|l_1"];
  482. 17.64 s > 13 13 │ ext3 [style=invis];
  483. 17.64 s > 14 │- 0:3:s -> ext3 [id=3 dir=none color="red" label="bis4|l_3"];
  484. 17.64 s > 14 │+ 0:1:s -> ext3 [id=3 dir=none color="red" label="bis4|l_2"];
  485. 17.64 s > 15 15 │ ext4 [style=invis];
  486. 17.64 s > 16 │- 0:1:s -> ext4 [id=4 dir=none color="red" label="mink4|l_1"];
  487. 17.64 s > 16 │+ 0:2:s -> ext4 [id=4 dir=none color="red" label="mink4|l_4"];
  488. 17.64 s > 17 17 │ ext5 [style=invis];
  489. 17.64 s > 18 │- 0:2:s -> ext5 [id=5 dir=none color="red" label="mink4|l_4"];
  490. 17.64 s > 18 │+ 0:4:s -> ext5 [id=5 dir=none color="red" label="bis4|l_3"];
  491. 17.64 s > 19 19 │ }
  492. 17.64 s > ────────────┴───────────────────────────────────────────────────────────────────
  493. 17.64 s > To update snapshots run `cargo insta review`
  494. 17.64 s > Stopped on the first failure. Run `cargo insta test` to run all snapshots.
  495. 17.64 s > test tensor::tests::parsing::infinite_execution ... FAILED
  496. 17.64 s >
  497. 17.64 s > failures:
  498. 17.64 s >
  499. 17.64 s > failures:
  500. 17.64 s > tensor::tests::parsing::infinite_execution
  501. 17.64 s >
  502. 17.64 s > test result: FAILED. 0 passed; 1 failed; 0 ignored; 0 measured; 240 filtered out; finished in 0.09s
  503. 17.64 s >
  504. 17.64 s > stderr ---
  505. 17.64 s >
  506. 17.64 s > thread 'tensor::tests::parsing::infinite_execution' (832) panicked at /nix/store/9a12dww58xis3an3kmn597llpijv83b1-vendor-cargo-deps/c19b7c6f923b580ac259164a89f2577984ad5ab09ee9d583b888f934adbbe8d0/insta-1.47.2/src/runtime.rs:719:13:
  507. 17.64 s > snapshot assertion for 'infinite_execution' failed in line 910
  508. 17.64 s > stack backtrace:
  509. 17.64 s > 0: __rustc::rust_begin_unwind
  510. 17.64 s > 1: core::panicking::panic_fmt
  511. 17.64 s > 2: insta::runtime::assert_snapshot
  512. 17.64 s > 3: idenso::tensor::tests::parsing::infinite_execution
  513. 17.64 s > 4: <idenso::tensor::tests::parsing::infinite_execution::{closure#0} as core::ops::function::FnOnce<()>>::call_once
  514. 17.64 s > note: Some details are omitted, run with `RUST_BACKTRACE=full` for a verbose backtrace.
  515. 17.64 s >
  516. 17.64 s > error: test run failed
  517. 17.64 s >
  518. 17.64 s > ========== nextest test summary ==========
  519. 17.64 s > report: target/nextest/ci_gammaloop/junit.xml
  520. 17.64 s > tests: 224, failures: 2, errors: 0
  521. 17.64 s >
  522. 17.64 s > 1. idenso::color::test::form_reference::metric_contraction_respects_antisymmetric_normalization
  523. 17.64 s > failure: test failure with exit code 101
  524. 17.64 s > thread 'color::test::form_reference::metric_contraction_respects_antisymmetric_normalization' (333) panicked at crates/idenso/src/color/test/form_reference.rs:171:5:
  525. 17.64 s > assertion `left == right` failed
  526. 17.64 s > left: "-1*f(coad(8,standalone_metric_j),coad(8,standalone_metric_s),coad(8,standalone_metric_u))"
  527. 17.64 s > right: "f(coad(8,standalone_metric_j),coad(8,standalone_metric_s),coad(8,standalone_metric_u))"
  528. 17.64 s > stack backtrace:
  529. 17.64 s > 0: __rustc::rust_begin_unwind
  530. 17.64 s > 1: core::panicking::panic_fmt
  531. 17.64 s > 2: core::panicking::assert_failed_inner
  532. 17.64 s > 3: core::panicking::assert_failed::<alloc::string::String, alloc::string::String>
  533. 17.64 s > 4: idenso::color::test::form_reference::metric_contraction_respects_antisymmetric_normalization
  534. 17.64 s > 5: <idenso::color::test::form_reference::metric_contraction_respects_antisymmetric_normalization::{closure#0} as core::ops::function::FnOnce<()>>::call_once
  535. 17.64 s > note: Some details are omitted, run with `RUST_BACKTRACE=full` for a verbose backtrace.
  536. 17.64 s > system-out
  537. 17.64 s > running 1 test
  538. 17.64 s > test color::test::form_reference::metric_contraction_respects_antisymmetric_normalization ... FAILED
  539. 17.64 s >
  540. 17.64 s > failures:
  541. 17.64 s >
  542. 17.64 s > failures:
  543. 17.64 s > color::test::form_reference::metric_contraction_respects_antisymmetric_normalization
  544. 17.64 s >
  545. 17.64 s > test result: FAILED. 0 passed; 1 failed; 0 ignored; 0 measured; 240 filtered out; finished in 0.00s
  546. 17.64 s > system-err
  547. 17.64 s > thread 'color::test::form_reference::metric_contraction_respects_antisymmetric_normalization' (333) panicked at crates/idenso/src/color/test/form_reference.rs:171:5:
  548. 17.64 s > assertion `left == right` failed
  549. 17.64 s > left: "-1*f(coad(8,standalone_metric_j),coad(8,standalone_metric_s),coad(8,standalone_metric_u))"
  550. 17.64 s > right: "f(coad(8,standalone_metric_j),coad(8,standalone_metric_s),coad(8,standalone_metric_u))"
  551. 17.64 s > stack backtrace:
  552. 17.64 s > 0: __rustc::rust_begin_unwind
  553. 17.64 s > 1: core::panicking::panic_fmt
  554. 17.64 s > 2: core::panicking::assert_failed_inner
  555. 17.64 s > 3: core::panicking::assert_failed::<alloc::string::String, alloc::string::String>
  556. 17.64 s > 4: idenso::color::test::form_reference::metric_contraction_respects_antisymmetric_normalization
  557. 17.64 s > 5: <idenso::color::test::form_reference::metric_contraction_respects_antisymmetric_normalization::{closure#0} as core::ops::function::FnOnce<()>>::call_once
  558. 17.64 s > note: Some details are omitted, run with `RUST_BACKTRACE=full` for a verbose backtrace.
  559. 17.64 s >
  560. 17.64 s > 2. idenso::tensor::tests::parsing::infinite_execution
  561. 17.64 s > failure: test failure with exit code 101
  562. 17.64 s > thread 'tensor::tests::parsing::infinite_execution' (832) panicked at /nix/store/9a12dww58xis3an3kmn597llpijv83b1-vendor-cargo-deps/c19b7c6f923b580ac259164a89f2577984ad5ab09ee9d583b888f934adbbe8d0/insta-1.47.2/src/runtime.rs:719:13:
  563. 17.64 s > snapshot assertion for 'infinite_execution' failed in line 910
  564. 17.64 s > stack backtrace:
  565. 17.64 s > 0: __rustc::rust_begin_unwind
  566. 17.64 s > 1: core::panicking::panic_fmt
  567. 17.64 s > 2: insta::runtime::assert_snapshot
  568. 17.64 s > 3: idenso::tensor::tests::parsing::infinite_execution
  569. 17.64 s > 4: <idenso::tensor::tests::parsing::infinite_execution::{closure#0} as core::ops::function::FnOnce<()>>::call_once
  570. 17.64 s > note: Some details are omitted, run with `RUST_BACKTRACE=full` for a verbose backtrace.
  571. 17.64 s > system-out
  572. 17.64 s > running 1 test
  573. 17.64 s > ━━━━━━━━━━━━━━━━━━━━━━━━━━━━━━━ Snapshot Summary ━━━━━━━━━━━━━━━━━━━━━━━━━━━━━━━
  574. 17.64 s > Snapshot: infinite_execution
  575. 17.64 s > Source: crates/idenso/src/tensor/tests/parsing.rs:910
  576. 17.64 s > ────────────────────────────────────────────────────────────────────────────────
  577. 17.64 s > Expression: net_iter.snapshot_dot()
  578. 17.64 s > ────────────────────────────────────────────────────────────────────────────────
  579. 17.64 s > -old snapshot
  580. 17.64 s > +new results
  581. 17.64 s > ────────────┬───────────────────────────────────────────────────────────────────
  582. 17.64 s > 8 8 │ 0:0:s-> ext0 [id=0 color="red"];
  583. 17.64 s > 9 9 │ ext1 [style=invis];
  584. 17.64 s > 10 10 │ 0:5:s-> ext1 [id=1 dir=none color="red" label="mink4|l_0"];
  585. 17.64 s > 11 11 │ ext2 [style=invis];
  586. 17.64 s > 12 │- 0:4:s-> ext2 [id=2 dir=none color="red" label="bis4|l_2"];
  587. 17.64 s > 12 │+ 0:3:s-> ext2 [id=2 dir=none color="red" label="mink4|l_1"];
  588. 17.64 s > 13 13 │ ext3 [style=invis];
  589. 17.64 s > 14 │- 0:3:s-> ext3 [id=3 dir=none color="red" label="bis4|l_3"];
  590. 17.64 s > 14 │+ 0:1:s-> ext3 [id=3 dir=none color="red" label="bis4|l_2"];
  591. 17.64 s > 15 15 │ ext4 [style=invis];
  592. 17.64 s > 16 │- 0:1:s-> ext4 [id=4 dir=none color="red" label="mink4|l_1"];
  593. 17.64 s > 16 │+ 0:2:s-> ext4 [id=4 dir=none color="red" label="mink4|l_4"];
  594. 17.64 s > 17 17 │ ext5 [style=invis];
  595. 17.64 s > 18 │- 0:2:s-> ext5 [id=5 dir=none color="red" label="mink4|l_4"];
  596. 17.64 s > 18 │+ 0:4:s-> ext5 [id=5 dir=none color="red" label="bis4|l_3"];
  597. 17.64 s > 19 19 │ }
  598. 17.64 s > ────────────┴───────────────────────────────────────────────────────────────────
  599. 17.64 s > To update snapshots run `cargo insta review`
  600. 17.64 s > Stopped on the first failure. Run `cargo insta test` to run all snapshots.
  601. 17.64 s > test tensor::tests::parsing::infinite_execution ... FAILED
  602. 17.64 s >
  603. 17.64 s > failures:
  604. 17.64 s >
  605. 17.64 s > failures:
  606. 17.64 s > tensor::tests::parsing::infinite_execution
  607. 17.64 s >
  608. 17.64 s > test result: FAILED. 0 passed; 1 failed; 0 ignored; 0 measured; 240 filtered out; finished in 0.09s
  609. 17.64 s > system-err
  610. 17.64 s > thread 'tensor::tests::parsing::infinite_execution' (832) panicked at /nix/store/9a12dww58xis3an3kmn597llpijv83b1-vendor-cargo-deps/c19b7c6f923b580ac259164a89f2577984ad5ab09ee9d583b888f934adbbe8d0/insta-1.47.2/src/runtime.rs:719:13:
  611. 17.64 s > snapshot assertion for 'infinite_execution' failed in line 910
  612. 17.64 s > stack backtrace:
  613. 17.64 s > 0: __rustc::rust_begin_unwind
  614. 17.64 s > 1: core::panicking::panic_fmt
  615. 17.64 s > 2: insta::runtime::assert_snapshot
  616. 17.64 s > 3: idenso::tensor::tests::parsing::infinite_execution
  617. 17.64 s > 4: <idenso::tensor::tests::parsing::infinite_execution::{closure#0} as core::ops::function::FnOnce<()>>::call_once
  618. 17.64 s > note: Some details are omitted, run with `RUST_BACKTRACE=full` for a verbose backtrace.
  619. 17.64 s > =========================================
  620. 17.64 s > Extracting 2 binaries and 1 linked path to /build/nextest-archive-woDeo9
  621. 17.64 s > Extracted 8 files to /build/nextest-archive-woDeo9 in 0.07s
  622. 17.64 s > ------------
  623. 17.64 s > Nextest run ID 446f6923-8525-4d9c-8d3f-2c3bd6b53db4 with nextest profile: ci_gammaloop
  624. 17.64 s > Starting 135 tests across 2 binaries
  625. 17.64 s > ------------
  626. 17.64 s > Summary [ 0.076s] 135 tests run: 135 passed, 0 skipped
  627. 17.64 s >
  628. 17.64 s > ========== nextest test summary ==========
  629. 17.64 s > report: target/nextest/ci_gammaloop/junit.xml
  630. 17.64 s > tests: 135, failures: 0, errors: 0
  631. 17.64 s > No failing testcases found.
  632. 17.64 s > =========================================
  633. 17.64 s > Extracting 5 binaries and 2 linked paths to /build/nextest-archive-at32Dg
  634. 17.64 s > Extracted 19 files to /build/nextest-archive-at32Dg in 0.18s
  635. 17.64 s > ------------
  636. 17.64 s > Nextest run ID ad705c1d-ba1d-4a0f-9919-0e371a00d279 with nextest profile: ci_gammaloop
  637. 17.64 s > Starting 25 tests across 5 binaries (1 test skipped via profile.ci_gammaloop.default-filter)
  638. 17.64 s > ------------
  639. 17.64 s > Summary [ 0.192s] 25 tests run: 25 passed, 1 skipped
  640. 17.64 s >
  641. 17.64 s > ========== nextest test summary ==========
  642. 17.64 s > report: target/nextest/ci_gammaloop/junit.xml
  643. 17.64 s > tests: 25, failures: 0, errors: 0
  644. 17.64 s > No failing testcases found.
  645. 17.64 s > =========================================
  646. 17.64 s > Extracting 2 binaries and 1 linked path to /build/nextest-archive-fvBYNj
  647. 17.64 s > Extracted 8 files to /build/nextest-archive-fvBYNj in 0.05s
  648. 17.64 s > ------------
  649. 17.64 s > Nextest run ID 102f7e86-d717-497e-8c1c-3624f566c200 with nextest profile: ci_gammaloop
  650. 17.64 s > Starting 1 test across 2 binaries
  651. 17.64 s > ------------
  652. 17.64 s > Summary [ 0.005s] 1 test run: 1 passed, 0 skipped
  653. 17.64 s >
  654. 17.64 s > ========== nextest test summary ==========
  655. 17.64 s > report: target/nextest/ci_gammaloop/junit.xml
  656. 17.64 s > tests: 1, failures: 0, errors: 0
  657. 17.64 s > No failing testcases found.
  658. 17.64 s > =========================================
  659. 17.64 s > Extracting 1 binary and 1 linked path to /build/nextest-archive-S293jH
  660. 17.64 s > Extracted 7 files to /build/nextest-archive-S293jH in 0.05s
  661. 17.64 s > ------------
  662. 17.64 s > Nextest run ID 6ef61c1c-f830-4d98-ae9f-b591046b74dd with nextest profile: ci_gammaloop
  663. 17.64 s > Starting 0 tests across 1 binary
  664. 17.64 s > ------------
  665. 17.64 s > Summary [ 0.000s] 0 tests run: 0 passed, 0 skipped
  666. 17.64 s >
  667. 17.64 s > ========== nextest test summary ==========
  668. 17.64 s > report: target/nextest/ci_gammaloop/junit.xml
  669. 17.64 s > tests: 0, failures: 0, errors: 0
  670. 17.64 s > No failing testcases found.
  671. 17.64 s > =========================================
  672. 17.64 s For full logs, run:
  673. 17.64 s nix log /nix/store/pn60vy13s1ckr0c5f24izs97bwnqwxqx-gammaloop-nextest-spenso.drv
  674. 17.73 s [0 built (1 failed), 0.0Run failed.