test packages.x86_64-linux.nix-ci-check-gammaloop-nextest-spenso
0.08 s
$ /nix/store/9ypz3flqsrl5xl495mm8h645gadjsxi1-coreutils-9.11/bin/timeout --kill-after=15s 7200s /nix/store/23zk8sgzamrbmj1fday15szf7f2279s8-nix-2.34.7/bin/nix --extra-experimental-features nix-command --extra-experimental-features flakes flake clone git+https://github.com/alphal00p/gammaloop --dest /tmp/nix-ci-worker/stable-pwd/repo/
0.09 s
Cloning into '/tmp/nix-ci-worker/stable-pwd/repo'...
1.02 s
remote: Enumerating objects: 65018, done.
1.12 s
remote: Counting objects: 0% (1/7669)
remote: Counting objects: 1% (77/7669)
remote: Counting objects: 2% (154/7669)
remote: Counting objects: 3% (231/7669)
remote: Counting objects: 4% (307/7669)
remote: Counting objects: 5% (384/7669)
remote: Counting objects: 6% (461/7669)
remote: Counting objects: 7% (537/7669)
remote: Counting objects: 8% (614/7669)
remote: Counting objects: 9% (691/7669)
remote: Counting objects: 10% (767/7669)
remote: Counting objects: 11% (844/7669)
remote: Counting objects: 12% (921/7669)
remote: Counting objects: 13% (997/7669)
remote: Counting objects: 14% (1074/7669)
remote: Counting objects: 15% (1151/7669)
remote: Counting objects: 16% (1228/7669)
remote: Counting objects: 17% (1304/7669)
remote: Counting objects: 18% (1381/7669)
remote: Counting objects: 19% (1458/7669)
remote: Counting objects: 20% (1534/7669)
remote: Counting objects: 21% (1611/7669)
remote: Counting objects: 22% (1688/7669)
remote: Counting objects: 23% (1764/7669)
remote: Counting objects: 24% (1841/7669)
remote: Counting objects: 25% (1918/7669)
remote: Counting objects: 26% (1994/7669)
remote: Counting objects: 27% (2071/7669)
remote: Counting objects: 28% (2148/7669)
remote: Counting objects: 29% (2225/7669)
remote: Counting objects: 30% (2301/7669)
remote: Counting objects: 31% (2378/7669)
remote: Counting objects: 32% (2455/7669)
remote: Counting objects: 33% (2531/7669)
remote: Counting objects: 34% (2608/7669)
remote: Counting objects: 35% (2685/7669)
remote: Counting objects: 36% (2761/7669)
remote: Counting objects: 37% (2838/7669)
remote: Counting objects: 38% (2915/7669)
remote: Counting objects: 39% (2991/7669)
remote: Counting objects: 40% (3068/7669)
remote: Counting objects: 41% (3145/7669)
remote: Counting objects: 42% (3221/7669)
remote: Counting objects: 43% (3298/7669)
remote: Counting objects: 44% (3375/7669)
remote: Counting objects: 45% (3452/7669)
remote: Counting objects: 46% (3528/7669)
remote: Counting objects: 47% (3605/7669)
remote: Counting objects: 48% (3682/7669)
remote: Counting objects: 49% (3758/7669)
remote: Counting objects: 50% (3835/7669)
remote: Counting objects: 51% (3912/7669)
remote: Counting objects: 52% (3988/7669)
remote: Counting objects: 53% (4065/7669)
remote: Counting objects: 54% (4142/7669)
remote: Counting objects: 55% (4218/7669)
remote: Counting objects: 56% (4295/7669)
remote: Counting objects: 57% (4372/7669)
remote: Counting objects: 58% (4449/7669)
remote: Counting objects: 59% (4525/7669)
remote: Counting objects: 60% (4602/7669)
remote: Counting objects: 61% (4679/7669)
remote: Counting objects: 62% (4755/7669)
remote: Counting objects: 63% (4832/7669)
remote: Counting objects: 64% (4909/7669)
remote: Counting objects: 65% (4985/7669)
remote: Counting objects: 66% (5062/7669)
remote: Counting objects: 67% (5139/7669)
remote: Counting objects: 68% (5215/7669)
remote: Counting objects: 69% (5292/7669)
remote: Counting objects: 70% (5369/7669)
remote: Counting objects: 71% (5445/7669)
remote: Counting objects: 72% (5522/7669)
remote: Counting objects: 73% (5599/7669)
remote: Counting objects: 74% (5676/7669)
remote: Counting objects: 75% (5752/7669)
remote: Counting objects: 76% (5829/7669)
remote: Counting objects: 77% (5906/7669)
remote: Counting objects: 78% (5982/7669)
remote: Counting objects: 79% (6059/7669)
remote: Counting objects: 80% (6136/7669)
remote: Counting objects: 81% (6212/7669)
remote: Counting objects: 82% (6289/7669)
remote: Counting objects: 83% (6366/7669)
remote: Counting objects: 84% (6442/7669)
remote: Counting objects: 85% (6519/7669)
remote: Counting objects: 86% (6596/7669)
remote: Counting objects: 87% (6673/7669)
remote: Counting objects: 88% (6749/7669)
remote: Counting objects: 89% (6826/7669)
remote: Counting objects: 90% (6903/7669)
remote: Counting objects: 91% (6979/7669)
remote: Counting objects: 92% (7056/7669)
remote: Counting objects: 93% (7133/7669)
remote: Counting objects: 94% (7209/7669)
remote: Counting objects: 95% (7286/7669)
remote: Counting objects: 96% (7363/7669)
remote: Counting objects: 97% (7439/7669)
remote: Counting objects: 98% (7516/7669)
remote: Counting objects: 99% (7593/7669)
remote: Counting objects: 100% (7669/7669)
remote: Counting objects: 100% (7669/7669), done.
2.54 s
remote: Compressing objects: 0% (1/1403)
remote: Compressing objects: 1% (15/1403)
remote: Compressing objects: 2% (29/1403)
remote: Compressing objects: 3% (43/1403)
remote: Compressing objects: 4% (57/1403)
remote: Compressing objects: 5% (71/1403)
remote: Compressing objects: 6% (85/1403)
remote: Compressing objects: 7% (99/1403)
remote: Compressing objects: 8% (113/1403)
remote: Compressing objects: 9% (127/1403)
remote: Compressing objects: 10% (141/1403)
remote: Compressing objects: 11% (155/1403)
remote: Compressing objects: 12% (169/1403)
remote: Compressing objects: 12% (180/1403)
remote: Compressing objects: 13% (183/1403)
remote: Compressing objects: 14% (197/1403)
remote: Compressing objects: 15% (211/1403)
remote: Compressing objects: 16% (225/1403)
remote: Compressing objects: 17% (239/1403)
remote: Compressing objects: 18% (253/1403)
remote: Compressing objects: 19% (267/1403)
remote: Compressing objects: 20% (281/1403)
remote: Compressing objects: 21% (295/1403)
remote: Compressing objects: 22% (309/1403)
remote: Compressing objects: 23% (323/1403)
remote: Compressing objects: 24% (337/1403)
remote: Compressing objects: 25% (351/1403)
remote: Compressing objects: 26% (365/1403)
remote: Compressing objects: 27% (379/1403)
remote: Compressing objects: 28% (393/1403)
remote: Compressing objects: 29% (407/1403)
remote: Compressing objects: 30% (421/1403)
remote: Compressing objects: 31% (435/1403)
remote: Compressing objects: 32% (449/1403)
remote: Compressing objects: 33% (463/1403)
remote: Compressing objects: 34% (478/1403)
remote: Compressing objects: 35% (492/1403)
remote: Compressing objects: 36% (506/1403)
remote: Compressing objects: 37% (520/1403)
remote: Compressing objects: 38% (534/1403)
remote: Compressing objects: 39% (548/1403)
remote: Compressing objects: 40% (562/1403)
remote: Compressing objects: 41% (576/1403)
remote: Compressing objects: 42% (590/1403)
remote: Compressing objects: 43% (604/1403)
remote: Compressing objects: 44% (618/1403)
remote: Compressing objects: 45% (632/1403)
remote: Compressing objects: 46% (646/1403)
remote: Compressing objects: 47% (660/1403)
remote: Compressing objects: 48% (674/1403)
remote: Compressing objects: 49% (688/1403)
remote: Compressing objects: 50% (702/1403)
remote: Compressing objects: 51% (716/1403)
remote: Compressing objects: 52% (730/1403)
remote: Compressing objects: 53% (744/1403)
remote: Compressing objects: 54% (758/1403)
remote: Compressing objects: 55% (772/1403)
remote: Compressing objects: 56% (786/1403)
remote: Compressing objects: 57% (800/1403)
remote: Compressing objects: 58% (814/1403)
remote: Compressing objects: 59% (828/1403)
remote: Compressing objects: 60% (842/1403)
remote: Compressing objects: 61% (856/1403)
remote: Compressing objects: 62% (870/1403)
remote: Compressing objects: 63% (884/1403)
remote: Compressing objects: 64% (898/1403)
remote: Compressing objects: 65% (912/1403)
remote: Compressing objects: 66% (926/1403)
remote: Compressing objects: 67% (941/1403)
remote: Compressing objects: 68% (955/1403)
remote: Compressing objects: 69% (969/1403)
remote: Compressing objects: 70% (983/1403)
remote: Compressing objects: 71% (997/1403)
remote: Compressing objects: 72% (1011/1403)
remote: Compressing objects: 73% (1025/1403)
remote: Compressing objects: 74% (1039/1403)
remote: Compressing objects: 75% (1053/1403)
remote: Compressing objects: 76% (1067/1403)
remote: Compressing objects: 77% (1081/1403)
remote: Compressing objects: 78% (1095/1403)
remote: Compressing objects: 79% (1109/1403)
remote: Compressing objects: 80% (1123/1403)
remote: Compressing objects: 81% (1137/1403)
remote: Compressing objects: 82% (1151/1403)
remote: Compressing objects: 83% (1165/1403)
remote: Compressing objects: 84% (1179/1403)
remote: Compressing objects: 85% (1193/1403)
remote: Compressing objects: 86% (1207/1403)
remote: Compressing objects: 87% (1221/1403)
remote: Compressing objects: 88% (1235/1403)
remote: Compressing objects: 89% (1249/1403)
remote: Compressing objects: 90% (1263/1403)
remote: Compressing objects: 91% (1277/1403)
remote: Compressing objects: 92% (1291/1403)
remote: Compressing objects: 93% (1305/1403)
remote: Compressing objects: 94% (1319/1403)
remote: Compressing objects: 95% (1333/1403)
remote: Compressing objects: 96% (1347/1403)
remote: Compressing objects: 97% (1361/1403)
remote: Compressing objects: 98% (1375/1403)
remote: Compressing objects: 99% (1389/1403)
remote: Compressing objects: 100% (1403/1403)
remote: Compressing objects: 100% (1403/1403), done.
5.39 s
Receiving objects: 0% (1/65018)
Receiving objects: 1% (651/65018)
Receiving objects: 2% (1301/65018)
Receiving objects: 3% (1951/65018)
Receiving objects: 4% (2601/65018)
Receiving objects: 5% (3251/65018)
Receiving objects: 6% (3902/65018)
Receiving objects: 7% (4552/65018)
Receiving objects: 8% (5202/65018)
Receiving objects: 9% (5852/65018)
Receiving objects: 10% (6502/65018)
Receiving objects: 11% (7152/65018)
Receiving objects: 12% (7803/65018), 14.53 MiB | 29.05 MiB/s
Receiving objects: 13% (8453/65018), 14.53 MiB | 29.05 MiB/s
Receiving objects: 14% (9103/65018), 14.53 MiB | 29.05 MiB/s
Receiving objects: 15% (9753/65018), 14.53 MiB | 29.05 MiB/s
Receiving objects: 16% (10403/65018), 14.53 MiB | 29.05 MiB/s
Receiving objects: 17% (11054/65018), 14.53 MiB | 29.05 MiB/s
Receiving objects: 18% (11704/65018), 14.53 MiB | 29.05 MiB/s
Receiving objects: 19% (12354/65018), 14.53 MiB | 29.05 MiB/s
Receiving objects: 20% (13004/65018), 14.53 MiB | 29.05 MiB/s
Receiving objects: 21% (13654/65018), 14.53 MiB | 29.05 MiB/s
Receiving objects: 22% (14304/65018), 14.53 MiB | 29.05 MiB/s
Receiving objects: 23% (14955/65018), 14.53 MiB | 29.05 MiB/s
Receiving objects: 24% (15605/65018), 14.53 MiB | 29.05 MiB/s
Receiving objects: 25% (16255/65018), 14.53 MiB | 29.05 MiB/s
Receiving objects: 26% (16905/65018), 14.53 MiB | 29.05 MiB/s
Receiving objects: 27% (17555/65018), 14.53 MiB | 29.05 MiB/s
Receiving objects: 28% (18206/65018), 14.53 MiB | 29.05 MiB/s
Receiving objects: 29% (18856/65018), 14.53 MiB | 29.05 MiB/s
Receiving objects: 30% (19506/65018), 14.53 MiB | 29.05 MiB/s
Receiving objects: 31% (20156/65018), 14.53 MiB | 29.05 MiB/s
Receiving objects: 32% (20806/65018), 14.53 MiB | 29.05 MiB/s
Receiving objects: 33% (21456/65018), 14.53 MiB | 29.05 MiB/s
Receiving objects: 34% (22107/65018), 14.53 MiB | 29.05 MiB/s
Receiving objects: 35% (22757/65018), 14.53 MiB | 29.05 MiB/s
Receiving objects: 36% (23407/65018), 14.53 MiB | 29.05 MiB/s
Receiving objects: 37% (24057/65018), 14.53 MiB | 29.05 MiB/s
Receiving objects: 38% (24707/65018), 14.53 MiB | 29.05 MiB/s
Receiving objects: 39% (25358/65018), 14.53 MiB | 29.05 MiB/s
Receiving objects: 40% (26008/65018), 14.53 MiB | 29.05 MiB/s
Receiving objects: 41% (26658/65018), 14.53 MiB | 29.05 MiB/s
Receiving objects: 42% (27308/65018), 14.53 MiB | 29.05 MiB/s
Receiving objects: 43% (27958/65018), 14.53 MiB | 29.05 MiB/s
Receiving objects: 44% (28608/65018), 14.53 MiB | 29.05 MiB/s
Receiving objects: 45% (29259/65018), 14.53 MiB | 29.05 MiB/s
Receiving objects: 46% (29909/65018), 14.53 MiB | 29.05 MiB/s
Receiving objects: 47% (30559/65018), 14.53 MiB | 29.05 MiB/s
Receiving objects: 48% (31209/65018), 14.53 MiB | 29.05 MiB/s
Receiving objects: 49% (31859/65018), 14.53 MiB | 29.05 MiB/s
Receiving objects: 50% (32509/65018), 14.53 MiB | 29.05 MiB/s
Receiving objects: 50% (32753/65018), 30.22 MiB | 30.21 MiB/s
Receiving objects: 51% (33160/65018), 30.22 MiB | 30.21 MiB/s
Receiving objects: 52% (33810/65018), 30.22 MiB | 30.21 MiB/s
Receiving objects: 53% (34460/65018), 30.22 MiB | 30.21 MiB/s
Receiving objects: 54% (35110/65018), 30.22 MiB | 30.21 MiB/s
Receiving objects: 55% (35760/65018), 30.22 MiB | 30.21 MiB/s
Receiving objects: 56% (36411/65018), 30.22 MiB | 30.21 MiB/s
Receiving objects: 57% (37061/65018), 30.22 MiB | 30.21 MiB/s
Receiving objects: 58% (37711/65018), 30.22 MiB | 30.21 MiB/s
Receiving objects: 59% (38361/65018), 30.22 MiB | 30.21 MiB/s
Receiving objects: 60% (39011/65018), 30.22 MiB | 30.21 MiB/s
Receiving objects: 61% (39661/65018), 30.22 MiB | 30.21 MiB/s
Receiving objects: 62% (40312/65018), 46.39 MiB | 29.61 MiB/s
Receiving objects: 63% (40962/65018), 46.39 MiB | 29.61 MiB/s
Receiving objects: 64% (41612/65018), 46.39 MiB | 29.61 MiB/s
Receiving objects: 65% (42262/65018), 46.39 MiB | 29.61 MiB/s
Receiving objects: 66% (42912/65018), 46.39 MiB | 29.61 MiB/s
Receiving objects: 67% (43563/65018), 46.39 MiB | 29.61 MiB/s
Receiving objects: 68% (44213/65018), 46.39 MiB | 29.61 MiB/s
Receiving objects: 69% (44863/65018), 46.39 MiB | 29.61 MiB/s
Receiving objects: 70% (45513/65018), 46.39 MiB | 29.61 MiB/s
Receiving objects: 71% (46163/65018), 46.39 MiB | 29.61 MiB/s
Receiving objects: 72% (46813/65018), 46.39 MiB | 29.61 MiB/s
Receiving objects: 73% (47464/65018), 46.39 MiB | 29.61 MiB/s
Receiving objects: 73% (48050/65018), 46.39 MiB | 29.61 MiB/s
Receiving objects: 74% (48114/65018), 46.39 MiB | 29.61 MiB/s
Receiving objects: 75% (48764/65018), 46.39 MiB | 29.61 MiB/s
Receiving objects: 76% (49414/65018), 61.84 MiB | 29.92 MiB/s
Receiving objects: 77% (50064/65018), 61.84 MiB | 29.92 MiB/s
Receiving objects: 78% (50715/65018), 61.84 MiB | 29.92 MiB/s
Receiving objects: 79% (51365/65018), 61.84 MiB | 29.92 MiB/s
Receiving objects: 80% (52015/65018), 61.84 MiB | 29.92 MiB/s
Receiving objects: 81% (52665/65018), 61.84 MiB | 29.92 MiB/s
Receiving objects: 82% (53315/65018), 61.84 MiB | 29.92 MiB/s
Receiving objects: 83% (53965/65018), 61.84 MiB | 29.92 MiB/s
Receiving objects: 84% (54616/65018), 78.66 MiB | 30.65 MiB/s
Receiving objects: 85% (55266/65018), 78.66 MiB | 30.65 MiB/s
Receiving objects: 86% (55916/65018), 78.66 MiB | 30.65 MiB/s
Receiving objects: 87% (56566/65018), 78.66 MiB | 30.65 MiB/s
Receiving objects: 88% (57216/65018), 78.66 MiB | 30.65 MiB/s
Receiving objects: 89% (57867/65018), 78.66 MiB | 30.65 MiB/s
Receiving objects: 90% (58517/65018), 78.66 MiB | 30.65 MiB/s
Receiving objects: 91% (59167/65018), 78.66 MiB | 30.65 MiB/s
Receiving objects: 92% (59817/65018), 78.66 MiB | 30.65 MiB/s
Receiving objects: 93% (60467/65018), 78.66 MiB | 30.65 MiB/s
Receiving objects: 94% (61117/65018), 78.66 MiB | 30.65 MiB/s
Receiving objects: 95% (61768/65018), 78.66 MiB | 30.65 MiB/s
Receiving objects: 96% (62418/65018), 78.66 MiB | 30.65 MiB/s
Receiving objects: 97% (63068/65018), 78.66 MiB | 30.65 MiB/s
Receiving objects: 98% (63718/65018), 78.66 MiB | 30.65 MiB/s
Receiving objects: 99% (64368/65018), 78.66 MiB | 30.65 MiB/s
remote: Total 65018 (delta 6782), reused 6267 (delta 6266), pack-reused 57349 (from 1)
5.40 s
Receiving objects: 100% (65018/65018), 78.66 MiB | 30.65 MiB/s
Receiving objects: 100% (65018/65018), 86.93 MiB | 30.61 MiB/s, done.
6.04 s
Resolving deltas: 0% (0/45900)
Resolving deltas: 1% (459/45900)
Resolving deltas: 2% (918/45900)
Resolving deltas: 3% (1377/45900)
Resolving deltas: 4% (1836/45900)
Resolving deltas: 5% (2295/45900)
Resolving deltas: 6% (2756/45900)
Resolving deltas: 7% (3213/45900)
Resolving deltas: 8% (3673/45900)
Resolving deltas: 9% (4131/45900)
Resolving deltas: 10% (4590/45900)
Resolving deltas: 11% (5049/45900)
Resolving deltas: 12% (5508/45900)
Resolving deltas: 13% (5967/45900)
Resolving deltas: 14% (6426/45900)
Resolving deltas: 15% (6885/45900)
Resolving deltas: 16% (7344/45900)
Resolving deltas: 17% (7803/45900)
Resolving deltas: 18% (8262/45900)
Resolving deltas: 19% (8721/45900)
Resolving deltas: 20% (9180/45900)
Resolving deltas: 21% (9639/45900)
Resolving deltas: 22% (10100/45900)
Resolving deltas: 23% (10557/45900)
Resolving deltas: 24% (11017/45900)
Resolving deltas: 25% (11475/45900)
Resolving deltas: 26% (11934/45900)
Resolving deltas: 27% (12394/45900)
Resolving deltas: 28% (12852/45900)
Resolving deltas: 29% (13311/45900)
Resolving deltas: 30% (13770/45900)
Resolving deltas: 31% (14229/45900)
Resolving deltas: 32% (14688/45900)
Resolving deltas: 33% (15147/45900)
Resolving deltas: 34% (15606/45900)
Resolving deltas: 35% (16065/45900)
Resolving deltas: 36% (16525/45900)
Resolving deltas: 37% (16983/45900)
Resolving deltas: 38% (17442/45900)
Resolving deltas: 39% (17901/45900)
Resolving deltas: 40% (18360/45900)
Resolving deltas: 41% (18819/45900)
Resolving deltas: 42% (19278/45900)
Resolving deltas: 43% (19737/45900)
Resolving deltas: 44% (20196/45900)
Resolving deltas: 45% (20655/45900)
Resolving deltas: 46% (21114/45900)
Resolving deltas: 47% (21574/45900)
Resolving deltas: 48% (22035/45900)
Resolving deltas: 49% (22494/45900)
Resolving deltas: 50% (22951/45900)
Resolving deltas: 51% (23409/45900)
Resolving deltas: 52% (23868/45900)
Resolving deltas: 53% (24327/45900)
Resolving deltas: 54% (24786/45900)
Resolving deltas: 55% (25245/45900)
Resolving deltas: 56% (25704/45900)
Resolving deltas: 57% (26163/45900)
Resolving deltas: 58% (26622/45900)
Resolving deltas: 59% (27081/45900)
Resolving deltas: 60% (27540/45900)
Resolving deltas: 61% (27999/45900)
Resolving deltas: 62% (28458/45900)
Resolving deltas: 63% (28917/45900)
Resolving deltas: 64% (29376/45900)
Resolving deltas: 65% (29835/45900)
Resolving deltas: 66% (30294/45900)
Resolving deltas: 67% (30753/45900)
Resolving deltas: 68% (31212/45900)
Resolving deltas: 69% (31671/45900)
Resolving deltas: 70% (32130/45900)
Resolving deltas: 71% (32589/45900)
Resolving deltas: 72% (33048/45900)
Resolving deltas: 73% (33507/45900)
Resolving deltas: 74% (33966/45900)
Resolving deltas: 75% (34425/45900)
Resolving deltas: 76% (34884/45900)
Resolving deltas: 77% (35343/45900)
Resolving deltas: 78% (35802/45900)
Resolving deltas: 79% (36261/45900)
Resolving deltas: 80% (36724/45900)
Resolving deltas: 81% (37179/45900)
Resolving deltas: 82% (37638/45900)
Resolving deltas: 83% (38097/45900)
Resolving deltas: 84% (38556/45900)
Resolving deltas: 85% (39015/45900)
Resolving deltas: 86% (39474/45900)
Resolving deltas: 87% (39934/45900)
Resolving deltas: 88% (40393/45900)
Resolving deltas: 89% (40851/45900)
Resolving deltas: 90% (41310/45900)
Resolving deltas: 91% (41769/45900)
Resolving deltas: 92% (42228/45900)
Resolving deltas: 93% (42687/45900)
Resolving deltas: 94% (43146/45900)
Resolving deltas: 95% (43605/45900)
Resolving deltas: 96% (44064/45900)
Resolving deltas: 97% (44523/45900)
Resolving deltas: 98% (44982/45900)
Resolving deltas: 99% (45441/45900)
Resolving deltas: 100% (45900/45900)
Resolving deltas: 100% (45900/45900), done.
6.34 s
Fetching commit 5c37e36355998a98df0d7791c7daeeae576fd7ee for vakint_rustred ...
6.34 s
$ /nix/store/bcnisk3ydfgv26v2gw3zlky24g00yww2-git-2.54.0/bin/git fetch origin 5c37e36355998a98df0d7791c7daeeae576fd7ee
6.75 s
From https://github.com/alphal00p/gammaloop
6.75 s
* branch 5c37e36355998a98df0d7791c7daeeae576fd7ee -> FETCH_HEAD
6.76 s
$ /nix/store/9ypz3flqsrl5xl495mm8h645gadjsxi1-coreutils-9.11/bin/timeout --kill-after=15s 7200s /nix/store/bcnisk3ydfgv26v2gw3zlky24g00yww2-git-2.54.0/bin/git -c advice.detachedHead=false checkout 5c37e36355998a98df0d7791c7daeeae576fd7ee
6.92 s
HEAD is now at 5c37e363 Advance RustRed dependency to refactored core
6.93 s
$ /nix/store/9ypz3flqsrl5xl495mm8h645gadjsxi1-coreutils-9.11/bin/timeout --kill-after=15s 7200s /nix/store/23zk8sgzamrbmj1fday15szf7f2279s8-nix-2.34.7/bin/nix --extra-experimental-features nix-command --extra-experimental-features flakes --log-format internal-json run .#packages.x86_64-linux.nix-ci-check-gammaloop-nextest-spenso --print-build-logs
10.90 s
11.10 s
Downloading cached gammaloop-nextest-binaries-spenso-idenso from https://cache.nix-ci.com
11.12 s
Downloading cached gammaloop-nextest-binaries-spenso-spenso-hep-lib from https://cache.nix-ci.com
11.12 s
Downloading cached gammaloop-nextest-binaries-spenso-spenso from https://cache.nix-ci.com
11.12 s
Downloading cached gammaloop-nextest-binaries-spenso-spenso-macros from https://cache.nix-ci.com
11.12 s
Downloading cached gammaloop-nextest-binaries-spenso-symbolica-utils from https://cache.nix-ci.com
11.27 s
Downloaded cached gammaloop-nextest-binaries-spenso-spenso-macros (6.5 MiB) in 156ms
11.27 s
Progress: 0 of 7 built, 1 of 5 downloaded from cache (4 downloading)
11.28 s
Downloaded cached gammaloop-nextest-binaries-spenso-symbolica-utils (6.3 MiB) in 160ms
11.28 s
Progress: 0 of 6 built, 2 of 5 downloaded from cache (3 downloading)
11.34 s
Downloaded cached gammaloop-nextest-binaries-spenso-spenso (10.2 MiB) in 222ms
11.34 s
Progress: 0 of 5 built, 3 of 5 downloaded from cache (2 downloading)
11.54 s
Downloaded cached gammaloop-nextest-binaries-spenso-idenso (29.3 MiB) in 442ms
11.54 s
Progress: 0 of 4 built, 4 of 5 downloaded from cache (1 downloading)
11.57 s
Downloaded cached gammaloop-nextest-binaries-spenso-spenso-hep-lib (34 MiB) in 447ms
11.57 s
Progress: 0 of 3 built, 5 of 5 downloaded from cache
11.59 s
Building /nix/store/fnx9dk8497x2w5xm8x5ahprvnzrkc513-gammaloop-nextest-binaries-spenso.drv
11.65 s
[gammaloop-nextest-binaries-spenso:post-build] Uploading to the NixCI cache: /nix/store/llq6sj8f8x6mr10n0r66gby5rpr6rs76-gammaloop-nextest-binaries-spenso
11.68 s
[gammaloop-nextest-binaries-spenso:post-build] warning: 'warn-short-path-literals' is deprecated, use 'lint-short-path-literals = ignore' instead
11.69 s
[gammaloop-nextest-binaries-spenso:post-build] copying 1 paths...
11.69 s
[gammaloop-nextest-binaries-spenso:post-build] copying path '/nix/store/llq6sj8f8x6mr10n0r66gby5rpr6rs76-gammaloop-nextest-binaries-spenso' to 'https://cache.nix-ci.com'...
11.75 s
[gammaloop-nextest-binaries-spenso:post-build] warning: 'warn-short-path-literals' is deprecated, use 'lint-short-path-literals = ignore' instead
11.87 s
[gammaloop-nextest-binaries-spenso:post-build] copying 0 paths...
11.88 s
Uploaded gammaloop-nextest-binaries-spenso in 243ms
11.88 s
Progress: 1 of 3 built, 5 of 5 downloaded from cache
11.88 s
Built gammaloop-nextest-binaries-spenso in 293ms
11.95 s
Building /nix/store/a6x4vlgg7r3hxrd4mwklf3c16b7fh2x6-nix-ci-check-gammaloop-nextest-spenso.drv
12.01 s
[nix-ci-check-gammaloop-nextest-spenso:post-build] Uploading to the NixCI cache: /nix/store/zyf6m4hrpyr4hi0ywh5myf92hs7sjj9w-nix-ci-check-gammaloop-nextest-spenso
12.05 s
[nix-ci-check-gammaloop-nextest-spenso:post-build] warning: 'warn-short-path-literals' is deprecated, use 'lint-short-path-literals = ignore' instead
12.06 s
[nix-ci-check-gammaloop-nextest-spenso:post-build] copying 1 paths...
12.06 s
[nix-ci-check-gammaloop-nextest-spenso:post-build] copying path '/nix/store/zyf6m4hrpyr4hi0ywh5myf92hs7sjj9w-nix-ci-check-gammaloop-nextest-spenso' to 'https://cache.nix-ci.com'...
12.13 s
[nix-ci-check-gammaloop-nextest-spenso:post-build] warning: 'warn-short-path-literals' is deprecated, use 'lint-short-path-literals = ignore' instead
12.29 s
[nix-ci-check-gammaloop-nextest-spenso:post-build] copying 0 paths...
12.31 s
Uploaded nix-ci-check-gammaloop-nextest-spenso in 309ms
12.31 s
Progress: 2 of 3 built, 5 of 5 downloaded from cache
12.31 s
Built nix-ci-check-gammaloop-nextest-spenso in 360ms
12.31 s
Progress: 3 of 3 built, 5 of 5 downloaded from cache
16.97 s
evaluating derivation 'g
copying '/nix/store/p93a
evaluating derivation 'g
copying '/nix/store/p93a
evaluating derivation 'g
copying '/nix/store/p93a
evaluating derivation 'g
querying gammaloop-nexte
querying info about miss
querying gammaloop-nexte
[0 /1 built, 0.0 KiB DL]
[1 /0 /1 built, 0.0 KiB DLgammaloop-nextest-spenso> Extracting 5 binaries and 2 linked paths to /build/nextest-archive-q6nNCI
17.13 s
gammaloop-nextest-spenso> Extracted 19 files to /build/nextest-archive-q6nNCI in 0.16s
17.14 s
gammaloop-nextest-spenso> ------------
17.14 s
gammaloop-nextest-spenso> Nextest run ID cbe297e1-6d1f-4cae-a878-387b4ec18753 with nextest profile: ci_gammaloop
17.14 s
gammaloop-nextest-spenso> Starting 224 tests across 5 binaries (26 tests skipped , including 2 tests via profile.ci_gammaloop.default-filter )
17.21 s
gammaloop-nextest-spenso> FAIL [ 0.010s] ( 46/224) idenso color::test::form_reference :: metric_contraction_respects_antisymmetric_normalization
17.21 s
gammaloop-nextest-spenso> stdout ---
17.21 s
gammaloop-nextest-spenso>
17.21 s
gammaloop-nextest-spenso> running 1 test
17.21 s
gammaloop-nextest-spenso> test color::test::form_reference::metric_contraction_respects_antisymmetric_normalization ... FAILED
17.21 s
gammaloop-nextest-spenso>
17.21 s
gammaloop-nextest-spenso> failures:
17.21 s
gammaloop-nextest-spenso>
17.21 s
gammaloop-nextest-spenso> failures:
17.21 s
gammaloop-nextest-spenso> color::test::form_reference::metric_contraction_respects_antisymmetric_normalization
17.21 s
gammaloop-nextest-spenso>
17.21 s
gammaloop-nextest-spenso> test result: FAILED. 0 passed; 1 failed; 0 ignored; 0 measured; 240 filtered out; finished in 0.00s
17.21 s
gammaloop-nextest-spenso>
17.21 s
gammaloop-nextest-spenso> stderr ---
17.21 s
gammaloop-nextest-spenso>
17.21 s
gammaloop-nextest-spenso> thread 'color::test::form_reference::metric_contraction_respects_antisymmetric_normalization' (332) panicked at crates/idenso/src/color/test/form_reference.rs:171:5:
17.21 s
gammaloop-nextest-spenso> assertion `left == right` failed
17.21 s
gammaloop-nextest-spenso> left: "-1*f(coad(8,standalone_metric_j),coad(8,standalone_metric_s),coad(8,standalone_metric_u))"
17.21 s
gammaloop-nextest-spenso> right: "f(coad(8,standalone_metric_j),coad(8,standalone_metric_s),coad(8,standalone_metric_u))"
17.21 s
gammaloop-nextest-spenso> stack backtrace:
17.21 s
gammaloop-nextest-spenso> 0: __rustc::rust_begin_unwind
17.21 s
gammaloop-nextest-spenso> 1: core::panicking::panic_fmt
17.21 s
gammaloop-nextest-spenso> 2: core::panicking::assert_failed_inner
17.21 s
gammaloop-nextest-spenso> 3: core::panicking::assert_failed::<alloc::string::String, alloc::string::String>
17.21 s
gammaloop-nextest-spenso> 4: idenso::color::test::form_reference::metric_contraction_respects_antisymmetric_normalization
17.21 s
gammaloop-nextest-spenso> 5: <idenso::color::test::form_reference::metric_contraction_respects_antisymmetric_normalization::{closure#0} as core::ops::function::FnOnce<()>>::call_once
17.21 s
gammaloop-nextest-spenso> note: Some details are omitted, run with `RUST_BACKTRACE=full` for a verbose backtrace.
17.21 s
gammaloop-nextest-spenso>
17.41 s
gammaloop-nextest-spenso> FAIL [ 0.040s] (220/224) idenso tensor::tests::parsing :: infinite_execution
17.41 s
gammaloop-nextest-spenso> stdout ---
17.41 s
gammaloop-nextest-spenso>
17.41 s
gammaloop-nextest-spenso> running 1 test
17.41 s
gammaloop-nextest-spenso> ━━━━━━━━━━━━━━━━━━━━━━━━━━━━━━━ Snapshot Summary ━━━━━━━━━━━━━━━━━━━━━━━━━━━━━━━
17.41 s
gammaloop-nextest-spenso> Snapshot: infinite_execution
17.41 s
gammaloop-nextest-spenso> Source: crates/idenso/src/tensor/tests/parsing.rs:910
17.41 s
gammaloop-nextest-spenso> ────────────────────────────────────────────────────────────────────────────────
17.41 s
gammaloop-nextest-spenso> Expression: net_iter.snapshot_dot()
17.41 s
gammaloop-nextest-spenso> ────────────────────────────────────────────────────────────────────────────────
17.41 s
gammaloop-nextest-spenso> -old snapshot
17.41 s
gammaloop-nextest-spenso> +new results
17.41 s
gammaloop-nextest-spenso> ────────────┬───────────────────────────────────────────────────────────────────
17.41 s
gammaloop-nextest-spenso> 8 8 │ 0:0:s -> ext0 [id=0 color="red"];
17.41 s
gammaloop-nextest-spenso> 9 9 │ ext1 [style=invis];
17.41 s
gammaloop-nextest-spenso> 10 10 │ 0:5:s -> ext1 [id=1 dir=none color="red" label="mink4|l_0"];
17.41 s
gammaloop-nextest-spenso> 11 11 │ ext2 [style=invis];
17.41 s
gammaloop-nextest-spenso> 12 │- 0:4:s -> ext2 [id=2 dir=none color="red" label="bis4|l_2"];
17.41 s
gammaloop-nextest-spenso> 12 │+ 0:3:s -> ext2 [id=2 dir=none color="red" label="mink4|l_1"];
17.41 s
gammaloop-nextest-spenso> 13 13 │ ext3 [style=invis];
17.41 s
gammaloop-nextest-spenso> 14 │- 0:3:s -> ext3 [id=3 dir=none color="red" label="bis4|l_3"];
17.41 s
gammaloop-nextest-spenso> 14 │+ 0:1:s -> ext3 [id=3 dir=none color="red" label="bis4|l_2"];
17.41 s
gammaloop-nextest-spenso> 15 15 │ ext4 [style=invis];
17.41 s
gammaloop-nextest-spenso> 16 │- 0:1:s -> ext4 [id=4 dir=none color="red" label="mink4|l_1"];
17.41 s
gammaloop-nextest-spenso> 16 │+ 0:2:s -> ext4 [id=4 dir=none color="red" label="mink4|l_4"];
17.41 s
gammaloop-nextest-spenso> 17 17 │ ext5 [style=invis];
17.41 s
gammaloop-nextest-spenso> 18 │- 0:2:s -> ext5 [id=5 dir=none color="red" label="mink4|l_4"];
17.41 s
gammaloop-nextest-spenso> 18 │+ 0:4:s -> ext5 [id=5 dir=none color="red" label="bis4|l_3"];
17.41 s
gammaloop-nextest-spenso> 19 19 │ }
17.41 s
gammaloop-nextest-spenso> ────────────┴───────────────────────────────────────────────────────────────────
17.41 s
gammaloop-nextest-spenso> To update snapshots run `cargo insta review`
17.41 s
gammaloop-nextest-spenso> Stopped on the first failure. Run `cargo insta test` to run all snapshots.
17.41 s
gammaloop-nextest-spenso> test tensor::tests::parsing::infinite_execution ... FAILED
17.41 s
gammaloop-nextest-spenso>
17.41 s
gammaloop-nextest-spenso> failures:
17.41 s
gammaloop-nextest-spenso>
17.41 s
gammaloop-nextest-spenso> failures:
17.41 s
gammaloop-nextest-spenso> tensor::tests::parsing::infinite_execution
17.41 s
gammaloop-nextest-spenso>
17.41 s
gammaloop-nextest-spenso> test result: FAILED. 0 passed; 1 failed; 0 ignored; 0 measured; 240 filtered out; finished in 0.03s
17.41 s
gammaloop-nextest-spenso>
17.41 s
gammaloop-nextest-spenso> stderr ---
17.41 s
gammaloop-nextest-spenso>
17.41 s
gammaloop-nextest-spenso> thread 'tensor::tests::parsing::infinite_execution' (840) panicked at /nix/store/9a12dww58xis3an3kmn597llpijv83b1-vendor-cargo-deps/c19b7c6f923b580ac259164a89f2577984ad5ab09ee9d583b888f934adbbe8d0/insta-1.47.2/src/runtime.rs:719:13:
17.41 s
gammaloop-nextest-spenso> snapshot assertion for 'infinite_execution' failed in line 910
17.41 s
gammaloop-nextest-spenso> stack backtrace:
17.41 s
gammaloop-nextest-spenso> 0: __rustc::rust_begin_unwind
17.41 s
gammaloop-nextest-spenso> 1: core::panicking::panic_fmt
17.41 s
gammaloop-nextest-spenso> 2: insta::runtime::assert_snapshot
17.41 s
gammaloop-nextest-spenso> 3: idenso::tensor::tests::parsing::infinite_execution
17.41 s
gammaloop-nextest-spenso> 4: <idenso::tensor::tests::parsing::infinite_execution::{closure#0} as core::ops::function::FnOnce<()>>::call_once
17.41 s
gammaloop-nextest-spenso> note: Some details are omitted, run with `RUST_BACKTRACE=full` for a verbose backtrace.
17.41 s
gammaloop-nextest-spenso>
18.69 s
gammaloop-nextest-spenso> ------------
18.69 s
gammaloop-nextest-spenso> Summary [ 1.541s] 224 tests run: 222 passed , 2 failed , 26 skipped
18.69 s
gammaloop-nextest-spenso> FAIL [ 0.010s] ( 46/224) idenso color::test::form_reference :: metric_contraction_respects_antisymmetric_normalization
18.69 s
gammaloop-nextest-spenso> stdout ---
18.69 s
gammaloop-nextest-spenso>
18.69 s
gammaloop-nextest-spenso> running 1 test
18.69 s
gammaloop-nextest-spenso> test color::test::form_reference::metric_contraction_respects_antisymmetric_normalization ... FAILED
18.69 s
gammaloop-nextest-spenso>
18.69 s
gammaloop-nextest-spenso> failures:
18.69 s
gammaloop-nextest-spenso>
18.69 s
gammaloop-nextest-spenso> failures:
18.69 s
gammaloop-nextest-spenso> color::test::form_reference::metric_contraction_respects_antisymmetric_normalization
18.69 s
gammaloop-nextest-spenso>
18.69 s
gammaloop-nextest-spenso> test result: FAILED. 0 passed; 1 failed; 0 ignored; 0 measured; 240 filtered out; finished in 0.00s
18.69 s
gammaloop-nextest-spenso>
18.69 s
gammaloop-nextest-spenso> stderr ---
18.69 s
gammaloop-nextest-spenso>
18.69 s
gammaloop-nextest-spenso> thread 'color::test::form_reference::metric_contraction_respects_antisymmetric_normalization' (332) panicked at crates/idenso/src/color/test/form_reference.rs:171:5:
18.69 s
gammaloop-nextest-spenso> assertion `left == right` failed
18.69 s
gammaloop-nextest-spenso> left: "-1*f(coad(8,standalone_metric_j),coad(8,standalone_metric_s),coad(8,standalone_metric_u))"
18.69 s
gammaloop-nextest-spenso> right: "f(coad(8,standalone_metric_j),coad(8,standalone_metric_s),coad(8,standalone_metric_u))"
18.69 s
gammaloop-nextest-spenso> stack backtrace:
18.69 s
gammaloop-nextest-spenso> 0: __rustc::rust_begin_unwind
18.69 s
gammaloop-nextest-spenso> 1: core::panicking::panic_fmt
18.69 s
gammaloop-nextest-spenso> 2: core::panicking::assert_failed_inner
18.69 s
gammaloop-nextest-spenso> 3: core::panicking::assert_failed::<alloc::string::String, alloc::string::String>
18.69 s
gammaloop-nextest-spenso> 4: idenso::color::test::form_reference::metric_contraction_respects_antisymmetric_normalization
18.69 s
gammaloop-nextest-spenso> 5: <idenso::color::test::form_reference::metric_contraction_respects_antisymmetric_normalization::{closure#0} as core::ops::function::FnOnce<()>>::call_once
18.69 s
gammaloop-nextest-spenso> note: Some details are omitted, run with `RUST_BACKTRACE=full` for a verbose backtrace.
18.69 s
gammaloop-nextest-spenso>
18.69 s
gammaloop-nextest-spenso> FAIL [ 0.040s] (220/224) idenso tensor::tests::parsing :: infinite_execution
18.69 s
gammaloop-nextest-spenso> stdout ---
18.69 s
gammaloop-nextest-spenso>
18.69 s
gammaloop-nextest-spenso> running 1 test
18.69 s
gammaloop-nextest-spenso> ━━━━━━━━━━━━━━━━━━━━━━━━━━━━━━━ Snapshot Summary ━━━━━━━━━━━━━━━━━━━━━━━━━━━━━━━
18.69 s
gammaloop-nextest-spenso> Snapshot: infinite_execution
18.69 s
gammaloop-nextest-spenso> Source: crates/idenso/src/tensor/tests/parsing.rs:910
18.69 s
gammaloop-nextest-spenso> ────────────────────────────────────────────────────────────────────────────────
18.69 s
gammaloop-nextest-spenso> Expression: net_iter.snapshot_dot()
18.69 s
gammaloop-nextest-spenso> ────────────────────────────────────────────────────────────────────────────────
18.69 s
gammaloop-nextest-spenso> -old snapshot
18.69 s
gammaloop-nextest-spenso> +new results
18.69 s
gammaloop-nextest-spenso> ────────────┬───────────────────────────────────────────────────────────────────
18.69 s
gammaloop-nextest-spenso> 8 8 │ 0:0:s -> ext0 [id=0 color="red"];
18.69 s
gammaloop-nextest-spenso> 9 9 │ ext1 [style=invis];
18.69 s
gammaloop-nextest-spenso> 10 10 │ 0:5:s -> ext1 [id=1 dir=none color="red" label="mink4|l_0"];
18.69 s
gammaloop-nextest-spenso> 11 11 │ ext2 [style=invis];
18.69 s
gammaloop-nextest-spenso> 12 │- 0:4:s -> ext2 [id=2 dir=none color="red" label="bis4|l_2"];
18.69 s
gammaloop-nextest-spenso> 12 │+ 0:3:s -> ext2 [id=2 dir=none color="red" label="mink4|l_1"];
18.69 s
gammaloop-nextest-spenso> 13 13 │ ext3 [style=invis];
18.69 s
gammaloop-nextest-spenso> 14 │- 0:3:s -> ext3 [id=3 dir=none color="red" label="bis4|l_3"];
18.69 s
gammaloop-nextest-spenso> 14 │+ 0:1:s -> ext3 [id=3 dir=none color="red" label="bis4|l_2"];
18.69 s
gammaloop-nextest-spenso> 15 15 │ ext4 [style=invis];
18.69 s
gammaloop-nextest-spenso> 16 │- 0:1:s -> ext4 [id=4 dir=none color="red" label="mink4|l_1"];
18.69 s
gammaloop-nextest-spenso> 16 │+ 0:2:s -> ext4 [id=4 dir=none color="red" label="mink4|l_4"];
18.69 s
gammaloop-nextest-spenso> 17 17 │ ext5 [style=invis];
18.69 s
gammaloop-nextest-spenso> 18 │- 0:2:s -> ext5 [id=5 dir=none color="red" label="mink4|l_4"];
18.69 s
gammaloop-nextest-spenso> 18 │+ 0:4:s -> ext5 [id=5 dir=none color="red" label="bis4|l_3"];
18.69 s
gammaloop-nextest-spenso> 19 19 │ }
18.69 s
gammaloop-nextest-spenso> ────────────┴───────────────────────────────────────────────────────────────────
18.69 s
gammaloop-nextest-spenso> To update snapshots run `cargo insta review`
18.69 s
gammaloop-nextest-spenso> Stopped on the first failure. Run `cargo insta test` to run all snapshots.
18.69 s
gammaloop-nextest-spenso> test tensor::tests::parsing::infinite_execution ... FAILED
18.69 s
gammaloop-nextest-spenso>
18.69 s
gammaloop-nextest-spenso> failures:
18.69 s
gammaloop-nextest-spenso>
18.69 s
gammaloop-nextest-spenso> failures:
18.69 s
gammaloop-nextest-spenso> tensor::tests::parsing::infinite_execution
18.69 s
gammaloop-nextest-spenso>
18.69 s
gammaloop-nextest-spenso> test result: FAILED. 0 passed; 1 failed; 0 ignored; 0 measured; 240 filtered out; finished in 0.03s
18.69 s
gammaloop-nextest-spenso>
18.69 s
gammaloop-nextest-spenso> stderr ---
18.69 s
gammaloop-nextest-spenso>
18.69 s
gammaloop-nextest-spenso> thread 'tensor::tests::parsing::infinite_execution' (840) panicked at /nix/store/9a12dww58xis3an3kmn597llpijv83b1-vendor-cargo-deps/c19b7c6f923b580ac259164a89f2577984ad5ab09ee9d583b888f934adbbe8d0/insta-1.47.2/src/runtime.rs:719:13:
18.69 s
gammaloop-nextest-spenso> snapshot assertion for 'infinite_execution' failed in line 910
18.69 s
gammaloop-nextest-spenso> stack backtrace:
18.69 s
gammaloop-nextest-spenso> 0: __rustc::rust_begin_unwind
18.69 s
gammaloop-nextest-spenso> 1: core::panicking::panic_fmt
18.69 s
gammaloop-nextest-spenso> 2: insta::runtime::assert_snapshot
18.69 s
gammaloop-nextest-spenso> 3: idenso::tensor::tests::parsing::infinite_execution
18.69 s
gammaloop-nextest-spenso> 4: <idenso::tensor::tests::parsing::infinite_execution::{closure#0} as core::ops::function::FnOnce<()>>::call_once
18.69 s
gammaloop-nextest-spenso> note: Some details are omitted, run with `RUST_BACKTRACE=full` for a verbose backtrace.
18.69 s
gammaloop-nextest-spenso>
18.71 s
gammaloop-nextest-spenso> error : test run failed
18.74 s
gammaloop-nextest-spenso>
18.74 s
gammaloop-nextest-spenso> ========== nextest test summary ==========
18.74 s
gammaloop-nextest-spenso> report: target/nextest/ci_gammaloop/junit.xml
18.74 s
gammaloop-nextest-spenso> tests: 224, failures: 2, errors: 0
18.74 s
gammaloop-nextest-spenso>
18.74 s
gammaloop-nextest-spenso> 1. idenso::color::test::form_reference::metric_contraction_respects_antisymmetric_normalization
18.74 s
gammaloop-nextest-spenso> failure: test failure with exit code 101
18.74 s
gammaloop-nextest-spenso> thread 'color::test::form_reference::metric_contraction_respects_antisymmetric_normalization' (332) panicked at crates/idenso/src/color/test/form_reference.rs:171:5:
18.74 s
gammaloop-nextest-spenso> assertion `left == right` failed
18.74 s
gammaloop-nextest-spenso> left: "-1*f(coad(8,standalone_metric_j),coad(8,standalone_metric_s),coad(8,standalone_metric_u))"
18.74 s
gammaloop-nextest-spenso> right: "f(coad(8,standalone_metric_j),coad(8,standalone_metric_s),coad(8,standalone_metric_u))"
18.74 s
gammaloop-nextest-spenso> stack backtrace:
18.74 s
gammaloop-nextest-spenso> 0: __rustc::rust_begin_unwind
18.74 s
gammaloop-nextest-spenso> 1: core::panicking::panic_fmt
18.74 s
gammaloop-nextest-spenso> 2: core::panicking::assert_failed_inner
18.74 s
gammaloop-nextest-spenso> 3: core::panicking::assert_failed::<alloc::string::String, alloc::string::String>
18.74 s
gammaloop-nextest-spenso> 4: idenso::color::test::form_reference::metric_contraction_respects_antisymmetric_normalization
18.74 s
gammaloop-nextest-spenso> 5: <idenso::color::test::form_reference::metric_contraction_respects_antisymmetric_normalization::{closure#0} as core::ops::function::FnOnce<()>>::call_once
18.74 s
gammaloop-nextest-spenso> note: Some details are omitted, run with `RUST_BACKTRACE=full` for a verbose backtrace.
18.74 s
gammaloop-nextest-spenso> system-out
18.74 s
gammaloop-nextest-spenso> running 1 test
18.74 s
gammaloop-nextest-spenso> test color::test::form_reference::metric_contraction_respects_antisymmetric_normalization ... FAILED
18.74 s
gammaloop-nextest-spenso>
18.74 s
gammaloop-nextest-spenso> failures:
18.74 s
gammaloop-nextest-spenso>
18.74 s
gammaloop-nextest-spenso> failures:
18.74 s
gammaloop-nextest-spenso> color::test::form_reference::metric_contraction_respects_antisymmetric_normalization
18.74 s
gammaloop-nextest-spenso>
18.74 s
gammaloop-nextest-spenso> test result: FAILED. 0 passed; 1 failed; 0 ignored; 0 measured; 240 filtered out; finished in 0.00s
18.74 s
gammaloop-nextest-spenso> system-err
18.74 s
gammaloop-nextest-spenso> thread 'color::test::form_reference::metric_contraction_respects_antisymmetric_normalization' (332) panicked at crates/idenso/src/color/test/form_reference.rs:171:5:
18.74 s
gammaloop-nextest-spenso> assertion `left == right` failed
18.74 s
gammaloop-nextest-spenso> left: "-1*f(coad(8,standalone_metric_j),coad(8,standalone_metric_s),coad(8,standalone_metric_u))"
18.74 s
gammaloop-nextest-spenso> right: "f(coad(8,standalone_metric_j),coad(8,standalone_metric_s),coad(8,standalone_metric_u))"
18.74 s
gammaloop-nextest-spenso> stack backtrace:
18.74 s
gammaloop-nextest-spenso> 0: __rustc::rust_begin_unwind
18.74 s
gammaloop-nextest-spenso> 1: core::panicking::panic_fmt
18.74 s
gammaloop-nextest-spenso> 2: core::panicking::assert_failed_inner
18.74 s
gammaloop-nextest-spenso> 3: core::panicking::assert_failed::<alloc::string::String, alloc::string::String>
18.74 s
gammaloop-nextest-spenso> 4: idenso::color::test::form_reference::metric_contraction_respects_antisymmetric_normalization
18.74 s
gammaloop-nextest-spenso> 5: <idenso::color::test::form_reference::metric_contraction_respects_antisymmetric_normalization::{closure#0} as core::ops::function::FnOnce<()>>::call_once
18.74 s
gammaloop-nextest-spenso> note: Some details are omitted, run with `RUST_BACKTRACE=full` for a verbose backtrace.
18.74 s
gammaloop-nextest-spenso>
18.74 s
gammaloop-nextest-spenso> 2. idenso::tensor::tests::parsing::infinite_execution
18.74 s
gammaloop-nextest-spenso> failure: test failure with exit code 101
18.74 s
gammaloop-nextest-spenso> thread 'tensor::tests::parsing::infinite_execution' (840) panicked at /nix/store/9a12dww58xis3an3kmn597llpijv83b1-vendor-cargo-deps/c19b7c6f923b580ac259164a89f2577984ad5ab09ee9d583b888f934adbbe8d0/insta-1.47.2/src/runtime.rs:719:13:
18.74 s
gammaloop-nextest-spenso> snapshot assertion for 'infinite_execution' failed in line 910
18.74 s
gammaloop-nextest-spenso> stack backtrace:
18.74 s
gammaloop-nextest-spenso> 0: __rustc::rust_begin_unwind
18.74 s
gammaloop-nextest-spenso> 1: core::panicking::panic_fmt
18.74 s
gammaloop-nextest-spenso> 2: insta::runtime::assert_snapshot
18.74 s
gammaloop-nextest-spenso> 3: idenso::tensor::tests::parsing::infinite_execution
18.74 s
gammaloop-nextest-spenso> 4: <idenso::tensor::tests::parsing::infinite_execution::{closure#0} as core::ops::function::FnOnce<()>>::call_once
18.74 s
gammaloop-nextest-spenso> note: Some details are omitted, run with `RUST_BACKTRACE=full` for a verbose backtrace.
18.74 s
gammaloop-nextest-spenso> system-out
18.74 s
gammaloop-nextest-spenso> running 1 test
18.74 s
gammaloop-nextest-spenso> ━━━━━━━━━━━━━━━━━━━━━━━━━━━━━━━ Snapshot Summary ━━━━━━━━━━━━━━━━━━━━━━━━━━━━━━━
18.74 s
gammaloop-nextest-spenso> Snapshot: infinite_execution
18.74 s
gammaloop-nextest-spenso> Source: crates/idenso/src/tensor/tests/parsing.rs:910
18.74 s
gammaloop-nextest-spenso> ────────────────────────────────────────────────────────────────────────────────
18.74 s
gammaloop-nextest-spenso> Expression: net_iter.snapshot_dot()
18.74 s
gammaloop-nextest-spenso> ────────────────────────────────────────────────────────────────────────────────
18.74 s
gammaloop-nextest-spenso> -old snapshot
18.74 s
gammaloop-nextest-spenso> +new results
18.74 s
gammaloop-nextest-spenso> ────────────┬───────────────────────────────────────────────────────────────────
18.74 s
gammaloop-nextest-spenso> 8 8 │ 0:0:s-> ext0 [id=0 color="red"];
18.74 s
gammaloop-nextest-spenso> 9 9 │ ext1 [style=invis];
18.74 s
gammaloop-nextest-spenso> 10 10 │ 0:5:s-> ext1 [id=1 dir=none color="red" label="mink4|l_0"];
18.74 s
gammaloop-nextest-spenso> 11 11 │ ext2 [style=invis];
18.74 s
gammaloop-nextest-spenso> 12 │- 0:4:s-> ext2 [id=2 dir=none color="red" label="bis4|l_2"];
18.74 s
gammaloop-nextest-spenso> 12 │+ 0:3:s-> ext2 [id=2 dir=none color="red" label="mink4|l_1"];
18.74 s
gammaloop-nextest-spenso> 13 13 │ ext3 [style=invis];
18.74 s
gammaloop-nextest-spenso> 14 │- 0:3:s-> ext3 [id=3 dir=none color="red" label="bis4|l_3"];
18.74 s
gammaloop-nextest-spenso> 14 │+ 0:1:s-> ext3 [id=3 dir=none color="red" label="bis4|l_2"];
18.74 s
gammaloop-nextest-spenso> 15 15 │ ext4 [style=invis];
18.74 s
gammaloop-nextest-spenso> 16 │- 0:1:s-> ext4 [id=4 dir=none color="red" label="mink4|l_1"];
18.74 s
gammaloop-nextest-spenso> 16 │+ 0:2:s-> ext4 [id=4 dir=none color="red" label="mink4|l_4"];
18.74 s
gammaloop-nextest-spenso> 17 17 │ ext5 [style=invis];
18.74 s
gammaloop-nextest-spenso> 18 │- 0:2:s-> ext5 [id=5 dir=none color="red" label="mink4|l_4"];
18.74 s
gammaloop-nextest-spenso> 18 │+ 0:4:s-> ext5 [id=5 dir=none color="red" label="bis4|l_3"];
18.74 s
gammaloop-nextest-spenso> 19 19 │ }
18.74 s
gammaloop-nextest-spenso> ────────────┴───────────────────────────────────────────────────────────────────
18.74 s
gammaloop-nextest-spenso> To update snapshots run `cargo insta review`
18.74 s
gammaloop-nextest-spenso> Stopped on the first failure. Run `cargo insta test` to run all snapshots.
18.74 s
gammaloop-nextest-spenso> test tensor::tests::parsing::infinite_execution ... FAILED
18.74 s
gammaloop-nextest-spenso>
18.74 s
gammaloop-nextest-spenso> failures:
18.74 s
gammaloop-nextest-spenso>
18.74 s
gammaloop-nextest-spenso> failures:
18.74 s
gammaloop-nextest-spenso> tensor::tests::parsing::infinite_execution
18.74 s
gammaloop-nextest-spenso>
18.74 s
gammaloop-nextest-spenso> test result: FAILED. 0 passed; 1 failed; 0 ignored; 0 measured; 240 filtered out; finished in 0.03s
18.74 s
gammaloop-nextest-spenso> system-err
18.74 s
gammaloop-nextest-spenso> thread 'tensor::tests::parsing::infinite_execution' (840) panicked at /nix/store/9a12dww58xis3an3kmn597llpijv83b1-vendor-cargo-deps/c19b7c6f923b580ac259164a89f2577984ad5ab09ee9d583b888f934adbbe8d0/insta-1.47.2/src/runtime.rs:719:13:
18.74 s
gammaloop-nextest-spenso> snapshot assertion for 'infinite_execution' failed in line 910
18.74 s
gammaloop-nextest-spenso> stack backtrace:
18.74 s
gammaloop-nextest-spenso> 0: __rustc::rust_begin_unwind
18.74 s
gammaloop-nextest-spenso> 1: core::panicking::panic_fmt
18.74 s
gammaloop-nextest-spenso> 2: insta::runtime::assert_snapshot
18.74 s
gammaloop-nextest-spenso> 3: idenso::tensor::tests::parsing::infinite_execution
18.74 s
gammaloop-nextest-spenso> 4: <idenso::tensor::tests::parsing::infinite_execution::{closure#0} as core::ops::function::FnOnce<()>>::call_once
18.74 s
gammaloop-nextest-spenso> note: Some details are omitted, run with `RUST_BACKTRACE=full` for a verbose backtrace.
18.74 s
gammaloop-nextest-spenso> =========================================
18.75 s
gammaloop-nextest-spenso> Extracting 2 binaries and 1 linked path to /build/nextest-archive-fVYoA0
18.82 s
gammaloop-nextest-spenso> Extracted 8 files to /build/nextest-archive-fVYoA0 in 0.07s
18.83 s
gammaloop-nextest-spenso> ------------
18.83 s
gammaloop-nextest-spenso> Nextest run ID 0b7fa40b-0624-42e0-ad19-b005a25eb7fb with nextest profile: ci_gammaloop
18.83 s
gammaloop-nextest-spenso> Starting 135 tests across 2 binaries
18.90 s
gammaloop-nextest-spenso> ------------
18.90 s
gammaloop-nextest-spenso> Summary [ 0.075s] 135 tests run: 135 passed , 0 skipped
18.94 s
gammaloop-nextest-spenso>
18.94 s
gammaloop-nextest-spenso> ========== nextest test summary ==========
18.94 s
gammaloop-nextest-spenso> report: target/nextest/ci_gammaloop/junit.xml
18.94 s
gammaloop-nextest-spenso> tests: 135, failures: 0, errors: 0
18.94 s
gammaloop-nextest-spenso> No failing testcases found.
18.94 s
gammaloop-nextest-spenso> =========================================
18.95 s
gammaloop-nextest-spenso> Extracting 5 binaries and 2 linked paths to /build/nextest-archive-Z1LVlT
19.13 s
gammaloop-nextest-spenso> Extracted 19 files to /build/nextest-archive-Z1LVlT in 0.18s
19.14 s
gammaloop-nextest-spenso> ------------
19.14 s
gammaloop-nextest-spenso> Nextest run ID 8f5cce55-79e6-4d09-8143-51c8372fcb77 with nextest profile: ci_gammaloop
19.14 s
gammaloop-nextest-spenso> Starting 25 tests across 5 binaries (1 test skipped via profile.ci_gammaloop.default-filter )
19.33 s
gammaloop-nextest-spenso> ------------
19.33 s
gammaloop-nextest-spenso> Summary [ 0.184s] 25 tests run: 25 passed , 1 skipped
19.38 s
gammaloop-nextest-spenso>
19.38 s
gammaloop-nextest-spenso> ========== nextest test summary ==========
19.38 s
gammaloop-nextest-spenso> report: target/nextest/ci_gammaloop/junit.xml
19.38 s
gammaloop-nextest-spenso> tests: 25, failures: 0, errors: 0
19.38 s
gammaloop-nextest-spenso> No failing testcases found.
19.38 s
gammaloop-nextest-spenso> =========================================
19.39 s
gammaloop-nextest-spenso> Extracting 2 binaries and 1 linked path to /build/nextest-archive-fDgQvf
19.44 s
gammaloop-nextest-spenso> Extracted 8 files to /build/nextest-archive-fDgQvf in 0.05s
19.45 s
gammaloop-nextest-spenso> ------------
19.45 s
gammaloop-nextest-spenso> Nextest run ID adb4d8cb-d2df-4b76-8ff6-878521950302 with nextest profile: ci_gammaloop
19.45 s
gammaloop-nextest-spenso> Starting 1 test across 2 binaries
19.45 s
gammaloop-nextest-spenso> ------------
19.45 s
gammaloop-nextest-spenso> Summary [ 0.005s] 1 test run: 1 passed , 0 skipped
19.48 s
gammaloop-nextest-spenso>
19.48 s
gammaloop-nextest-spenso> ========== nextest test summary ==========
19.48 s
gammaloop-nextest-spenso> report: target/nextest/ci_gammaloop/junit.xml
19.48 s
gammaloop-nextest-spenso> tests: 1, failures: 0, errors: 0
19.48 s
gammaloop-nextest-spenso> No failing testcases found.
19.48 s
gammaloop-nextest-spenso> =========================================
19.50 s
gammaloop-nextest-spenso> Extracting 1 binary and 1 linked path to /build/nextest-archive-eAk938
19.55 s
gammaloop-nextest-spenso> Extracted 7 files to /build/nextest-archive-eAk938 in 0.05s
19.55 s
gammaloop-nextest-spenso> ------------
19.55 s
gammaloop-nextest-spenso> Nextest run ID 54e42e70-dbf3-48c1-a170-78c11581e170 with nextest profile: ci_gammaloop
19.55 s
gammaloop-nextest-spenso> Starting 0 tests across 1 binary
19.55 s
gammaloop-nextest-spenso> ------------
19.55 s
gammaloop-nextest-spenso> Summary [ 0.000s] 0 tests run: 0 passed , 0 skipped
19.59 s
gammaloop-nextest-spenso>
19.59 s
gammaloop-nextest-spenso> ========== nextest test summary ==========
19.59 s
gammaloop-nextest-spenso> report: target/nextest/ci_gammaloop/junit.xml
19.59 s
gammaloop-nextest-spenso> tests: 0, failures: 0, errors: 0
19.59 s
gammaloop-nextest-spenso> No failing testcases found.
19.59 s
gammaloop-nextest-spenso> =========================================
19.61 s
[0 built (1 failed ), 0.0 error: Cannot build '/nix/store/pn60vy13s1ckr0c5f24izs97bwnqwxqx-gammaloop-nextest-spenso.drv '.
19.61 s
Reason: builder failed with exit code 100 .
19.61 s
Output paths:
19.61 s
/nix/store/17qw6dx3kfigd59dmxis8z590cgcrsjb-gammaloop-nextest-spenso
19.61 s
Last 325 log lines:
19.61 s
> Extracting 5 binaries and 2 linked paths to /build/nextest-archive-q6nNCI
19.61 s
> Extracted 19 files to /build/nextest-archive-q6nNCI in 0.16s
19.61 s
> ------------
19.61 s
> Nextest run ID cbe297e1-6d1f-4cae-a878-387b4ec18753 with nextest profile: ci_gammaloop
19.61 s
> Starting 224 tests across 5 binaries (26 tests skipped , including 2 tests via profile.ci_gammaloop.default-filter )
19.61 s
> FAIL [ 0.010s] ( 46/224) idenso color::test::form_reference :: metric_contraction_respects_antisymmetric_normalization
19.61 s
> stdout ---
19.61 s
>
19.61 s
> running 1 test
19.61 s
> test color::test::form_reference::metric_contraction_respects_antisymmetric_normalization ... FAILED
19.61 s
>
19.61 s
> failures:
19.61 s
>
19.61 s
> failures:
19.61 s
> color::test::form_reference::metric_contraction_respects_antisymmetric_normalization
19.61 s
>
19.61 s
> test result: FAILED. 0 passed; 1 failed; 0 ignored; 0 measured; 240 filtered out; finished in 0.00s
19.61 s
>
19.61 s
> stderr ---
19.61 s
>
19.61 s
> thread 'color::test::form_reference::metric_contraction_respects_antisymmetric_normalization' (332) panicked at crates/idenso/src/color/test/form_reference.rs:171:5:
19.61 s
> assertion `left == right` failed
19.61 s
> left: "-1*f(coad(8,standalone_metric_j),coad(8,standalone_metric_s),coad(8,standalone_metric_u))"
19.61 s
> right: "f(coad(8,standalone_metric_j),coad(8,standalone_metric_s),coad(8,standalone_metric_u))"
19.61 s
> stack backtrace:
19.61 s
> 0: __rustc::rust_begin_unwind
19.61 s
> 1: core::panicking::panic_fmt
19.61 s
> 2: core::panicking::assert_failed_inner
19.61 s
> 3: core::panicking::assert_failed::<alloc::string::String, alloc::string::String>
19.61 s
> 4: idenso::color::test::form_reference::metric_contraction_respects_antisymmetric_normalization
19.61 s
> 5: <idenso::color::test::form_reference::metric_contraction_respects_antisymmetric_normalization::{closure#0} as core::ops::function::FnOnce<()>>::call_once
19.61 s
> note: Some details are omitted, run with `RUST_BACKTRACE=full` for a verbose backtrace.
19.61 s
>
19.61 s
> FAIL [ 0.040s] (220/224) idenso tensor::tests::parsing :: infinite_execution
19.61 s
> stdout ---
19.61 s
>
19.61 s
> running 1 test
19.61 s
> ━━━━━━━━━━━━━━━━━━━━━━━━━━━━━━━ Snapshot Summary ━━━━━━━━━━━━━━━━━━━━━━━━━━━━━━━
19.61 s
> Snapshot: infinite_execution
19.61 s
> Source: crates/idenso/src/tensor/tests/parsing.rs:910
19.61 s
> ────────────────────────────────────────────────────────────────────────────────
19.61 s
> Expression: net_iter.snapshot_dot()
19.61 s
> ────────────────────────────────────────────────────────────────────────────────
19.61 s
> -old snapshot
19.61 s
> +new results
19.61 s
> ────────────┬───────────────────────────────────────────────────────────────────
19.61 s
> 8 8 │ 0:0:s -> ext0 [id=0 color="red"];
19.61 s
> 9 9 │ ext1 [style=invis];
19.61 s
> 10 10 │ 0:5:s -> ext1 [id=1 dir=none color="red" label="mink4|l_0"];
19.61 s
> 11 11 │ ext2 [style=invis];
19.61 s
> 12 │- 0:4:s -> ext2 [id=2 dir=none color="red" label="bis4|l_2"];
19.61 s
> 12 │+ 0:3:s -> ext2 [id=2 dir=none color="red" label="mink4|l_1"];
19.61 s
> 13 13 │ ext3 [style=invis];
19.61 s
> 14 │- 0:3:s -> ext3 [id=3 dir=none color="red" label="bis4|l_3"];
19.61 s
> 14 │+ 0:1:s -> ext3 [id=3 dir=none color="red" label="bis4|l_2"];
19.61 s
> 15 15 │ ext4 [style=invis];
19.61 s
> 16 │- 0:1:s -> ext4 [id=4 dir=none color="red" label="mink4|l_1"];
19.61 s
> 16 │+ 0:2:s -> ext4 [id=4 dir=none color="red" label="mink4|l_4"];
19.61 s
> 17 17 │ ext5 [style=invis];
19.61 s
> 18 │- 0:2:s -> ext5 [id=5 dir=none color="red" label="mink4|l_4"];
19.61 s
> 18 │+ 0:4:s -> ext5 [id=5 dir=none color="red" label="bis4|l_3"];
19.61 s
> 19 19 │ }
19.61 s
> ────────────┴───────────────────────────────────────────────────────────────────
19.61 s
> To update snapshots run `cargo insta review`
19.61 s
> Stopped on the first failure. Run `cargo insta test` to run all snapshots.
19.61 s
> test tensor::tests::parsing::infinite_execution ... FAILED
19.61 s
>
19.61 s
> failures:
19.61 s
>
19.61 s
> failures:
19.61 s
> tensor::tests::parsing::infinite_execution
19.61 s
>
19.61 s
> test result: FAILED. 0 passed; 1 failed; 0 ignored; 0 measured; 240 filtered out; finished in 0.03s
19.61 s
>
19.61 s
> stderr ---
19.61 s
>
19.61 s
> thread 'tensor::tests::parsing::infinite_execution' (840) panicked at /nix/store/9a12dww58xis3an3kmn597llpijv83b1-vendor-cargo-deps/c19b7c6f923b580ac259164a89f2577984ad5ab09ee9d583b888f934adbbe8d0/insta-1.47.2/src/runtime.rs:719:13:
19.61 s
> snapshot assertion for 'infinite_execution' failed in line 910
19.61 s
> stack backtrace:
19.61 s
> 0: __rustc::rust_begin_unwind
19.61 s
> 1: core::panicking::panic_fmt
19.61 s
> 2: insta::runtime::assert_snapshot
19.61 s
> 3: idenso::tensor::tests::parsing::infinite_execution
19.61 s
> 4: <idenso::tensor::tests::parsing::infinite_execution::{closure#0} as core::ops::function::FnOnce<()>>::call_once
19.61 s
> note: Some details are omitted, run with `RUST_BACKTRACE=full` for a verbose backtrace.
19.61 s
>
19.61 s
> ------------
19.61 s
> Summary [ 1.541s] 224 tests run: 222 passed , 2 failed , 26 skipped
19.61 s
> FAIL [ 0.010s] ( 46/224) idenso color::test::form_reference :: metric_contraction_respects_antisymmetric_normalization
19.61 s
> stdout ---
19.61 s
>
19.61 s
> running 1 test
19.61 s
> test color::test::form_reference::metric_contraction_respects_antisymmetric_normalization ... FAILED
19.61 s
>
19.61 s
> failures:
19.61 s
>
19.61 s
> failures:
19.61 s
> color::test::form_reference::metric_contraction_respects_antisymmetric_normalization
19.61 s
>
19.61 s
> test result: FAILED. 0 passed; 1 failed; 0 ignored; 0 measured; 240 filtered out; finished in 0.00s
19.61 s
>
19.61 s
> stderr ---
19.61 s
>
19.61 s
> thread 'color::test::form_reference::metric_contraction_respects_antisymmetric_normalization' (332) panicked at crates/idenso/src/color/test/form_reference.rs:171:5:
19.61 s
> assertion `left == right` failed
19.61 s
> left: "-1*f(coad(8,standalone_metric_j),coad(8,standalone_metric_s),coad(8,standalone_metric_u))"
19.61 s
> right: "f(coad(8,standalone_metric_j),coad(8,standalone_metric_s),coad(8,standalone_metric_u))"
19.61 s
> stack backtrace:
19.61 s
> 0: __rustc::rust_begin_unwind
19.61 s
> 1: core::panicking::panic_fmt
19.61 s
> 2: core::panicking::assert_failed_inner
19.61 s
> 3: core::panicking::assert_failed::<alloc::string::String, alloc::string::String>
19.61 s
> 4: idenso::color::test::form_reference::metric_contraction_respects_antisymmetric_normalization
19.61 s
> 5: <idenso::color::test::form_reference::metric_contraction_respects_antisymmetric_normalization::{closure#0} as core::ops::function::FnOnce<()>>::call_once
19.61 s
> note: Some details are omitted, run with `RUST_BACKTRACE=full` for a verbose backtrace.
19.61 s
>
19.61 s
> FAIL [ 0.040s] (220/224) idenso tensor::tests::parsing :: infinite_execution
19.61 s
> stdout ---
19.61 s
>
19.61 s
> running 1 test
19.61 s
> ━━━━━━━━━━━━━━━━━━━━━━━━━━━━━━━ Snapshot Summary ━━━━━━━━━━━━━━━━━━━━━━━━━━━━━━━
19.61 s
> Snapshot: infinite_execution
19.61 s
> Source: crates/idenso/src/tensor/tests/parsing.rs:910
19.61 s
> ────────────────────────────────────────────────────────────────────────────────
19.61 s
> Expression: net_iter.snapshot_dot()
19.61 s
> ────────────────────────────────────────────────────────────────────────────────
19.61 s
> -old snapshot
19.61 s
> +new results
19.61 s
> ────────────┬───────────────────────────────────────────────────────────────────
19.61 s
> 8 8 │ 0:0:s -> ext0 [id=0 color="red"];
19.61 s
> 9 9 │ ext1 [style=invis];
19.61 s
> 10 10 │ 0:5:s -> ext1 [id=1 dir=none color="red" label="mink4|l_0"];
19.61 s
> 11 11 │ ext2 [style=invis];
19.61 s
> 12 │- 0:4:s -> ext2 [id=2 dir=none color="red" label="bis4|l_2"];
19.61 s
> 12 │+ 0:3:s -> ext2 [id=2 dir=none color="red" label="mink4|l_1"];
19.61 s
> 13 13 │ ext3 [style=invis];
19.61 s
> 14 │- 0:3:s -> ext3 [id=3 dir=none color="red" label="bis4|l_3"];
19.61 s
> 14 │+ 0:1:s -> ext3 [id=3 dir=none color="red" label="bis4|l_2"];
19.61 s
> 15 15 │ ext4 [style=invis];
19.61 s
> 16 │- 0:1:s -> ext4 [id=4 dir=none color="red" label="mink4|l_1"];
19.61 s
> 16 │+ 0:2:s -> ext4 [id=4 dir=none color="red" label="mink4|l_4"];
19.61 s
> 17 17 │ ext5 [style=invis];
19.61 s
> 18 │- 0:2:s -> ext5 [id=5 dir=none color="red" label="mink4|l_4"];
19.61 s
> 18 │+ 0:4:s -> ext5 [id=5 dir=none color="red" label="bis4|l_3"];
19.61 s
> 19 19 │ }
19.61 s
> ────────────┴───────────────────────────────────────────────────────────────────
19.61 s
> To update snapshots run `cargo insta review`
19.61 s
> Stopped on the first failure. Run `cargo insta test` to run all snapshots.
19.61 s
> test tensor::tests::parsing::infinite_execution ... FAILED
19.61 s
>
19.61 s
> failures:
19.61 s
>
19.61 s
> failures:
19.61 s
> tensor::tests::parsing::infinite_execution
19.61 s
>
19.61 s
> test result: FAILED. 0 passed; 1 failed; 0 ignored; 0 measured; 240 filtered out; finished in 0.03s
19.61 s
>
19.61 s
> stderr ---
19.61 s
>
19.61 s
> thread 'tensor::tests::parsing::infinite_execution' (840) panicked at /nix/store/9a12dww58xis3an3kmn597llpijv83b1-vendor-cargo-deps/c19b7c6f923b580ac259164a89f2577984ad5ab09ee9d583b888f934adbbe8d0/insta-1.47.2/src/runtime.rs:719:13:
19.61 s
> snapshot assertion for 'infinite_execution' failed in line 910
19.61 s
> stack backtrace:
19.61 s
> 0: __rustc::rust_begin_unwind
19.61 s
> 1: core::panicking::panic_fmt
19.61 s
> 2: insta::runtime::assert_snapshot
19.61 s
> 3: idenso::tensor::tests::parsing::infinite_execution
19.61 s
> 4: <idenso::tensor::tests::parsing::infinite_execution::{closure#0} as core::ops::function::FnOnce<()>>::call_once
19.61 s
> note: Some details are omitted, run with `RUST_BACKTRACE=full` for a verbose backtrace.
19.61 s
>
19.61 s
> error : test run failed
19.61 s
>
19.61 s
> ========== nextest test summary ==========
19.61 s
> report: target/nextest/ci_gammaloop/junit.xml
19.61 s
> tests: 224, failures: 2, errors: 0
19.61 s
>
19.61 s
> 1. idenso::color::test::form_reference::metric_contraction_respects_antisymmetric_normalization
19.61 s
> failure: test failure with exit code 101
19.61 s
> thread 'color::test::form_reference::metric_contraction_respects_antisymmetric_normalization' (332) panicked at crates/idenso/src/color/test/form_reference.rs:171:5:
19.61 s
> assertion `left == right` failed
19.61 s
> left: "-1*f(coad(8,standalone_metric_j),coad(8,standalone_metric_s),coad(8,standalone_metric_u))"
19.61 s
> right: "f(coad(8,standalone_metric_j),coad(8,standalone_metric_s),coad(8,standalone_metric_u))"
19.61 s
> stack backtrace:
19.61 s
> 0: __rustc::rust_begin_unwind
19.61 s
> 1: core::panicking::panic_fmt
19.61 s
> 2: core::panicking::assert_failed_inner
19.61 s
> 3: core::panicking::assert_failed::<alloc::string::String, alloc::string::String>
19.61 s
> 4: idenso::color::test::form_reference::metric_contraction_respects_antisymmetric_normalization
19.61 s
> 5: <idenso::color::test::form_reference::metric_contraction_respects_antisymmetric_normalization::{closure#0} as core::ops::function::FnOnce<()>>::call_once
19.61 s
> note: Some details are omitted, run with `RUST_BACKTRACE=full` for a verbose backtrace.
19.61 s
> system-out
19.61 s
> running 1 test
19.61 s
> test color::test::form_reference::metric_contraction_respects_antisymmetric_normalization ... FAILED
19.61 s
>
19.61 s
> failures:
19.61 s
>
19.61 s
> failures:
19.61 s
> color::test::form_reference::metric_contraction_respects_antisymmetric_normalization
19.61 s
>
19.61 s
> test result: FAILED. 0 passed; 1 failed; 0 ignored; 0 measured; 240 filtered out; finished in 0.00s
19.61 s
> system-err
19.61 s
> thread 'color::test::form_reference::metric_contraction_respects_antisymmetric_normalization' (332) panicked at crates/idenso/src/color/test/form_reference.rs:171:5:
19.61 s
> assertion `left == right` failed
19.61 s
> left: "-1*f(coad(8,standalone_metric_j),coad(8,standalone_metric_s),coad(8,standalone_metric_u))"
19.61 s
> right: "f(coad(8,standalone_metric_j),coad(8,standalone_metric_s),coad(8,standalone_metric_u))"
19.61 s
> stack backtrace:
19.61 s
> 0: __rustc::rust_begin_unwind
19.61 s
> 1: core::panicking::panic_fmt
19.61 s
> 2: core::panicking::assert_failed_inner
19.61 s
> 3: core::panicking::assert_failed::<alloc::string::String, alloc::string::String>
19.61 s
> 4: idenso::color::test::form_reference::metric_contraction_respects_antisymmetric_normalization
19.61 s
> 5: <idenso::color::test::form_reference::metric_contraction_respects_antisymmetric_normalization::{closure#0} as core::ops::function::FnOnce<()>>::call_once
19.61 s
> note: Some details are omitted, run with `RUST_BACKTRACE=full` for a verbose backtrace.
19.61 s
>
19.61 s
> 2. idenso::tensor::tests::parsing::infinite_execution
19.61 s
> failure: test failure with exit code 101
19.61 s
> thread 'tensor::tests::parsing::infinite_execution' (840) panicked at /nix/store/9a12dww58xis3an3kmn597llpijv83b1-vendor-cargo-deps/c19b7c6f923b580ac259164a89f2577984ad5ab09ee9d583b888f934adbbe8d0/insta-1.47.2/src/runtime.rs:719:13:
19.61 s
> snapshot assertion for 'infinite_execution' failed in line 910
19.61 s
> stack backtrace:
19.61 s
> 0: __rustc::rust_begin_unwind
19.61 s
> 1: core::panicking::panic_fmt
19.61 s
> 2: insta::runtime::assert_snapshot
19.61 s
> 3: idenso::tensor::tests::parsing::infinite_execution
19.61 s
> 4: <idenso::tensor::tests::parsing::infinite_execution::{closure#0} as core::ops::function::FnOnce<()>>::call_once
19.61 s
> note: Some details are omitted, run with `RUST_BACKTRACE=full` for a verbose backtrace.
19.61 s
> system-out
19.61 s
> running 1 test
19.61 s
> ━━━━━━━━━━━━━━━━━━━━━━━━━━━━━━━ Snapshot Summary ━━━━━━━━━━━━━━━━━━━━━━━━━━━━━━━
19.61 s
> Snapshot: infinite_execution
19.61 s
> Source: crates/idenso/src/tensor/tests/parsing.rs:910
19.61 s
> ────────────────────────────────────────────────────────────────────────────────
19.61 s
> Expression: net_iter.snapshot_dot()
19.61 s
> ────────────────────────────────────────────────────────────────────────────────
19.61 s
> -old snapshot
19.61 s
> +new results
19.61 s
> ────────────┬───────────────────────────────────────────────────────────────────
19.61 s
> 8 8 │ 0:0:s-> ext0 [id=0 color="red"];
19.61 s
> 9 9 │ ext1 [style=invis];
19.61 s
> 10 10 │ 0:5:s-> ext1 [id=1 dir=none color="red" label="mink4|l_0"];
19.61 s
> 11 11 │ ext2 [style=invis];
19.61 s
> 12 │- 0:4:s-> ext2 [id=2 dir=none color="red" label="bis4|l_2"];
19.61 s
> 12 │+ 0:3:s-> ext2 [id=2 dir=none color="red" label="mink4|l_1"];
19.61 s
> 13 13 │ ext3 [style=invis];
19.61 s
> 14 │- 0:3:s-> ext3 [id=3 dir=none color="red" label="bis4|l_3"];
19.61 s
> 14 │+ 0:1:s-> ext3 [id=3 dir=none color="red" label="bis4|l_2"];
19.61 s
> 15 15 │ ext4 [style=invis];
19.61 s
> 16 │- 0:1:s-> ext4 [id=4 dir=none color="red" label="mink4|l_1"];
19.61 s
> 16 │+ 0:2:s-> ext4 [id=4 dir=none color="red" label="mink4|l_4"];
19.61 s
> 17 17 │ ext5 [style=invis];
19.61 s
> 18 │- 0:2:s-> ext5 [id=5 dir=none color="red" label="mink4|l_4"];
19.61 s
> 18 │+ 0:4:s-> ext5 [id=5 dir=none color="red" label="bis4|l_3"];
19.61 s
> 19 19 │ }
19.61 s
> ────────────┴───────────────────────────────────────────────────────────────────
19.61 s
> To update snapshots run `cargo insta review`
19.61 s
> Stopped on the first failure. Run `cargo insta test` to run all snapshots.
19.61 s
> test tensor::tests::parsing::infinite_execution ... FAILED
19.61 s
>
19.61 s
> failures:
19.61 s
>
19.61 s
> failures:
19.61 s
> tensor::tests::parsing::infinite_execution
19.61 s
>
19.61 s
> test result: FAILED. 0 passed; 1 failed; 0 ignored; 0 measured; 240 filtered out; finished in 0.03s
19.61 s
> system-err
19.61 s
> thread 'tensor::tests::parsing::infinite_execution' (840) panicked at /nix/store/9a12dww58xis3an3kmn597llpijv83b1-vendor-cargo-deps/c19b7c6f923b580ac259164a89f2577984ad5ab09ee9d583b888f934adbbe8d0/insta-1.47.2/src/runtime.rs:719:13:
19.61 s
> snapshot assertion for 'infinite_execution' failed in line 910
19.61 s
> stack backtrace:
19.61 s
> 0: __rustc::rust_begin_unwind
19.61 s
> 1: core::panicking::panic_fmt
19.61 s
> 2: insta::runtime::assert_snapshot
19.61 s
> 3: idenso::tensor::tests::parsing::infinite_execution
19.61 s
> 4: <idenso::tensor::tests::parsing::infinite_execution::{closure#0} as core::ops::function::FnOnce<()>>::call_once
19.61 s
> note: Some details are omitted, run with `RUST_BACKTRACE=full` for a verbose backtrace.
19.61 s
> =========================================
19.61 s
> Extracting 2 binaries and 1 linked path to /build/nextest-archive-fVYoA0
19.61 s
> Extracted 8 files to /build/nextest-archive-fVYoA0 in 0.07s
19.61 s
> ------------
19.61 s
> Nextest run ID 0b7fa40b-0624-42e0-ad19-b005a25eb7fb with nextest profile: ci_gammaloop
19.61 s
> Starting 135 tests across 2 binaries
19.61 s
> ------------
19.61 s
> Summary [ 0.075s] 135 tests run: 135 passed , 0 skipped
19.61 s
>
19.61 s
> ========== nextest test summary ==========
19.61 s
> report: target/nextest/ci_gammaloop/junit.xml
19.61 s
> tests: 135, failures: 0, errors: 0
19.61 s
> No failing testcases found.
19.61 s
> =========================================
19.61 s
> Extracting 5 binaries and 2 linked paths to /build/nextest-archive-Z1LVlT
19.61 s
> Extracted 19 files to /build/nextest-archive-Z1LVlT in 0.18s
19.61 s
> ------------
19.61 s
> Nextest run ID 8f5cce55-79e6-4d09-8143-51c8372fcb77 with nextest profile: ci_gammaloop
19.61 s
> Starting 25 tests across 5 binaries (1 test skipped via profile.ci_gammaloop.default-filter )
19.61 s
> ------------
19.61 s
> Summary [ 0.184s] 25 tests run: 25 passed , 1 skipped
19.61 s
>
19.61 s
> ========== nextest test summary ==========
19.61 s
> report: target/nextest/ci_gammaloop/junit.xml
19.61 s
> tests: 25, failures: 0, errors: 0
19.61 s
> No failing testcases found.
19.61 s
> =========================================
19.61 s
> Extracting 2 binaries and 1 linked path to /build/nextest-archive-fDgQvf
19.61 s
> Extracted 8 files to /build/nextest-archive-fDgQvf in 0.05s
19.61 s
> ------------
19.61 s
> Nextest run ID adb4d8cb-d2df-4b76-8ff6-878521950302 with nextest profile: ci_gammaloop
19.61 s
> Starting 1 test across 2 binaries
19.61 s
> ------------
19.61 s
> Summary [ 0.005s] 1 test run: 1 passed , 0 skipped
19.61 s
>
19.61 s
> ========== nextest test summary ==========
19.61 s
> report: target/nextest/ci_gammaloop/junit.xml
19.61 s
> tests: 1, failures: 0, errors: 0
19.61 s
> No failing testcases found.
19.61 s
> =========================================
19.61 s
> Extracting 1 binary and 1 linked path to /build/nextest-archive-eAk938
19.61 s
> Extracted 7 files to /build/nextest-archive-eAk938 in 0.05s
19.61 s
> ------------
19.61 s
> Nextest run ID 54e42e70-dbf3-48c1-a170-78c11581e170 with nextest profile: ci_gammaloop
19.61 s
> Starting 0 tests across 1 binary
19.61 s
> ------------
19.61 s
> Summary [ 0.000s] 0 tests run: 0 passed , 0 skipped
19.61 s
>
19.61 s
> ========== nextest test summary ==========
19.61 s
> report: target/nextest/ci_gammaloop/junit.xml
19.61 s
> tests: 0, failures: 0, errors: 0
19.61 s
> No failing testcases found.
19.61 s
> =========================================
19.61 s
For full logs, run:
19.61 s
nix log /nix/store/pn60vy13s1ckr0c5f24izs97bwnqwxqx-gammaloop-nextest-spenso.drv
19.70 s
Run failed.