1. 0.08 s $ /nix/store/9ypz3flqsrl5xl495mm8h645gadjsxi1-coreutils-9.11/bin/timeout --kill-after=15s 7200s /nix/store/23zk8sgzamrbmj1fday15szf7f2279s8-nix-2.34.7/bin/nix --extra-experimental-features nix-command --extra-experimental-features flakes flake clone git+https://github.com/alphal00p/gammaloop --dest /tmp/nix-ci-worker/stable-pwd/repo/
  2. 0.09 s Cloning into '/tmp/nix-ci-worker/stable-pwd/repo'...
  3. 1.02 s remote: Enumerating objects: 65018, done.
  4. 1.12 s remote: Counting objects: 0% (1/7669) remote: Counting objects: 1% (77/7669) remote: Counting objects: 2% (154/7669) remote: Counting objects: 3% (231/7669) remote: Counting objects: 4% (307/7669) remote: Counting objects: 5% (384/7669) remote: Counting objects: 6% (461/7669) remote: Counting objects: 7% (537/7669) remote: Counting objects: 8% (614/7669) remote: Counting objects: 9% (691/7669) remote: Counting objects: 10% (767/7669) remote: Counting objects: 11% (844/7669) remote: Counting objects: 12% (921/7669) remote: Counting objects: 13% (997/7669) remote: Counting objects: 14% (1074/7669) remote: Counting objects: 15% (1151/7669) remote: Counting objects: 16% (1228/7669) remote: Counting objects: 17% (1304/7669) remote: Counting objects: 18% (1381/7669) remote: Counting objects: 19% (1458/7669) remote: Counting objects: 20% (1534/7669) remote: Counting objects: 21% (1611/7669) remote: Counting objects: 22% (1688/7669) remote: Counting objects: 23% (1764/7669) remote: Counting objects: 24% (1841/7669) remote: Counting objects: 25% (1918/7669) remote: Counting objects: 26% (1994/7669) remote: Counting objects: 27% (2071/7669) remote: Counting objects: 28% (2148/7669) remote: Counting objects: 29% (2225/7669) remote: Counting objects: 30% (2301/7669) remote: Counting objects: 31% (2378/7669) remote: Counting objects: 32% (2455/7669) remote: Counting objects: 33% (2531/7669) remote: Counting objects: 34% (2608/7669) remote: Counting objects: 35% (2685/7669) remote: Counting objects: 36% (2761/7669) remote: Counting objects: 37% (2838/7669) remote: Counting objects: 38% (2915/7669) remote: Counting objects: 39% (2991/7669) remote: Counting objects: 40% (3068/7669) remote: Counting objects: 41% (3145/7669) remote: Counting objects: 42% (3221/7669) remote: Counting objects: 43% (3298/7669) remote: Counting objects: 44% (3375/7669) remote: Counting objects: 45% (3452/7669) remote: Counting objects: 46% (3528/7669) remote: Counting objects: 47% (3605/7669) remote: Counting objects: 48% (3682/7669) remote: Counting objects: 49% (3758/7669) remote: Counting objects: 50% (3835/7669) remote: Counting objects: 51% (3912/7669) remote: Counting objects: 52% (3988/7669) remote: Counting objects: 53% (4065/7669) remote: Counting objects: 54% (4142/7669) remote: Counting objects: 55% (4218/7669) remote: Counting objects: 56% (4295/7669) remote: Counting objects: 57% (4372/7669) remote: Counting objects: 58% (4449/7669) remote: Counting objects: 59% (4525/7669) remote: Counting objects: 60% (4602/7669) remote: Counting objects: 61% (4679/7669) remote: Counting objects: 62% (4755/7669) remote: Counting objects: 63% (4832/7669) remote: Counting objects: 64% (4909/7669) remote: Counting objects: 65% (4985/7669) remote: Counting objects: 66% (5062/7669) remote: Counting objects: 67% (5139/7669) remote: Counting objects: 68% (5215/7669) remote: Counting objects: 69% (5292/7669) remote: Counting objects: 70% (5369/7669) remote: Counting objects: 71% (5445/7669) remote: Counting objects: 72% (5522/7669) remote: Counting objects: 73% (5599/7669) remote: Counting objects: 74% (5676/7669) remote: Counting objects: 75% (5752/7669) remote: Counting objects: 76% (5829/7669) remote: Counting objects: 77% (5906/7669) remote: Counting objects: 78% (5982/7669) remote: Counting objects: 79% (6059/7669) remote: Counting objects: 80% (6136/7669) remote: Counting objects: 81% (6212/7669) remote: Counting objects: 82% (6289/7669) remote: Counting objects: 83% (6366/7669) remote: Counting objects: 84% (6442/7669) remote: Counting objects: 85% (6519/7669) remote: Counting objects: 86% (6596/7669) remote: Counting objects: 87% (6673/7669) remote: Counting objects: 88% (6749/7669) remote: Counting objects: 89% (6826/7669) remote: Counting objects: 90% (6903/7669) remote: Counting objects: 91% (6979/7669) remote: Counting objects: 92% (7056/7669) remote: Counting objects: 93% (7133/7669) remote: Counting objects: 94% (7209/7669) remote: Counting objects: 95% (7286/7669) remote: Counting objects: 96% (7363/7669) remote: Counting objects: 97% (7439/7669) remote: Counting objects: 98% (7516/7669) remote: Counting objects: 99% (7593/7669) remote: Counting objects: 100% (7669/7669) remote: Counting objects: 100% (7669/7669), done.
  5. 2.54 s remote: Compressing objects: 0% (1/1403) remote: Compressing objects: 1% (15/1403) remote: Compressing objects: 2% (29/1403) remote: Compressing objects: 3% (43/1403) remote: Compressing objects: 4% (57/1403) remote: Compressing objects: 5% (71/1403) remote: Compressing objects: 6% (85/1403) remote: Compressing objects: 7% (99/1403) remote: Compressing objects: 8% (113/1403) remote: Compressing objects: 9% (127/1403) remote: Compressing objects: 10% (141/1403) remote: Compressing objects: 11% (155/1403) remote: Compressing objects: 12% (169/1403) remote: Compressing objects: 12% (180/1403) remote: Compressing objects: 13% (183/1403) remote: Compressing objects: 14% (197/1403) remote: Compressing objects: 15% (211/1403) remote: Compressing objects: 16% (225/1403) remote: Compressing objects: 17% (239/1403) remote: Compressing objects: 18% (253/1403) remote: Compressing objects: 19% (267/1403) remote: Compressing objects: 20% (281/1403) remote: Compressing objects: 21% (295/1403) remote: Compressing objects: 22% (309/1403) remote: Compressing objects: 23% (323/1403) remote: Compressing objects: 24% (337/1403) remote: Compressing objects: 25% (351/1403) remote: Compressing objects: 26% (365/1403) remote: Compressing objects: 27% (379/1403) remote: Compressing objects: 28% (393/1403) remote: Compressing objects: 29% (407/1403) remote: Compressing objects: 30% (421/1403) remote: Compressing objects: 31% (435/1403) remote: Compressing objects: 32% (449/1403) remote: Compressing objects: 33% (463/1403) remote: Compressing objects: 34% (478/1403) remote: Compressing objects: 35% (492/1403) remote: Compressing objects: 36% (506/1403) remote: Compressing objects: 37% (520/1403) remote: Compressing objects: 38% (534/1403) remote: Compressing objects: 39% (548/1403) remote: Compressing objects: 40% (562/1403) remote: Compressing objects: 41% (576/1403) remote: Compressing objects: 42% (590/1403) remote: Compressing objects: 43% (604/1403) remote: Compressing objects: 44% (618/1403) remote: Compressing objects: 45% (632/1403) remote: Compressing objects: 46% (646/1403) remote: Compressing objects: 47% (660/1403) remote: Compressing objects: 48% (674/1403) remote: Compressing objects: 49% (688/1403) remote: Compressing objects: 50% (702/1403) remote: Compressing objects: 51% (716/1403) remote: Compressing objects: 52% (730/1403) remote: Compressing objects: 53% (744/1403) remote: Compressing objects: 54% (758/1403) remote: Compressing objects: 55% (772/1403) remote: Compressing objects: 56% (786/1403) remote: Compressing objects: 57% (800/1403) remote: Compressing objects: 58% (814/1403) remote: Compressing objects: 59% (828/1403) remote: Compressing objects: 60% (842/1403) remote: Compressing objects: 61% (856/1403) remote: Compressing objects: 62% (870/1403) remote: Compressing objects: 63% (884/1403) remote: Compressing objects: 64% (898/1403) remote: Compressing objects: 65% (912/1403) remote: Compressing objects: 66% (926/1403) remote: Compressing objects: 67% (941/1403) remote: Compressing objects: 68% (955/1403) remote: Compressing objects: 69% (969/1403) remote: Compressing objects: 70% (983/1403) remote: Compressing objects: 71% (997/1403) remote: Compressing objects: 72% (1011/1403) remote: Compressing objects: 73% (1025/1403) remote: Compressing objects: 74% (1039/1403) remote: Compressing objects: 75% (1053/1403) remote: Compressing objects: 76% (1067/1403) remote: Compressing objects: 77% (1081/1403) remote: Compressing objects: 78% (1095/1403) remote: Compressing objects: 79% (1109/1403) remote: Compressing objects: 80% (1123/1403) remote: Compressing objects: 81% (1137/1403) remote: Compressing objects: 82% (1151/1403) remote: Compressing objects: 83% (1165/1403) remote: Compressing objects: 84% (1179/1403) remote: Compressing objects: 85% (1193/1403) remote: Compressing objects: 86% (1207/1403) remote: Compressing objects: 87% (1221/1403) remote: Compressing objects: 88% (1235/1403) remote: Compressing objects: 89% (1249/1403) remote: Compressing objects: 90% (1263/1403) remote: Compressing objects: 91% (1277/1403) remote: Compressing objects: 92% (1291/1403) remote: Compressing objects: 93% (1305/1403) remote: Compressing objects: 94% (1319/1403) remote: Compressing objects: 95% (1333/1403) remote: Compressing objects: 96% (1347/1403) remote: Compressing objects: 97% (1361/1403) remote: Compressing objects: 98% (1375/1403) remote: Compressing objects: 99% (1389/1403) remote: Compressing objects: 100% (1403/1403) remote: Compressing objects: 100% (1403/1403), done.
  6. 5.39 s Receiving objects: 0% (1/65018) Receiving objects: 1% (651/65018) Receiving objects: 2% (1301/65018) Receiving objects: 3% (1951/65018) Receiving objects: 4% (2601/65018) Receiving objects: 5% (3251/65018) Receiving objects: 6% (3902/65018) Receiving objects: 7% (4552/65018) Receiving objects: 8% (5202/65018) Receiving objects: 9% (5852/65018) Receiving objects: 10% (6502/65018) Receiving objects: 11% (7152/65018) Receiving objects: 12% (7803/65018), 14.53 MiB | 29.05 MiB/s Receiving objects: 13% (8453/65018), 14.53 MiB | 29.05 MiB/s Receiving objects: 14% (9103/65018), 14.53 MiB | 29.05 MiB/s Receiving objects: 15% (9753/65018), 14.53 MiB | 29.05 MiB/s Receiving objects: 16% (10403/65018), 14.53 MiB | 29.05 MiB/s Receiving objects: 17% (11054/65018), 14.53 MiB | 29.05 MiB/s Receiving objects: 18% (11704/65018), 14.53 MiB | 29.05 MiB/s Receiving objects: 19% (12354/65018), 14.53 MiB | 29.05 MiB/s Receiving objects: 20% (13004/65018), 14.53 MiB | 29.05 MiB/s Receiving objects: 21% (13654/65018), 14.53 MiB | 29.05 MiB/s Receiving objects: 22% (14304/65018), 14.53 MiB | 29.05 MiB/s Receiving objects: 23% (14955/65018), 14.53 MiB | 29.05 MiB/s Receiving objects: 24% (15605/65018), 14.53 MiB | 29.05 MiB/s Receiving objects: 25% (16255/65018), 14.53 MiB | 29.05 MiB/s Receiving objects: 26% (16905/65018), 14.53 MiB | 29.05 MiB/s Receiving objects: 27% (17555/65018), 14.53 MiB | 29.05 MiB/s Receiving objects: 28% (18206/65018), 14.53 MiB | 29.05 MiB/s Receiving objects: 29% (18856/65018), 14.53 MiB | 29.05 MiB/s Receiving objects: 30% (19506/65018), 14.53 MiB | 29.05 MiB/s Receiving objects: 31% (20156/65018), 14.53 MiB | 29.05 MiB/s Receiving objects: 32% (20806/65018), 14.53 MiB | 29.05 MiB/s Receiving objects: 33% (21456/65018), 14.53 MiB | 29.05 MiB/s Receiving objects: 34% (22107/65018), 14.53 MiB | 29.05 MiB/s Receiving objects: 35% (22757/65018), 14.53 MiB | 29.05 MiB/s Receiving objects: 36% (23407/65018), 14.53 MiB | 29.05 MiB/s Receiving objects: 37% (24057/65018), 14.53 MiB | 29.05 MiB/s Receiving objects: 38% (24707/65018), 14.53 MiB | 29.05 MiB/s Receiving objects: 39% (25358/65018), 14.53 MiB | 29.05 MiB/s Receiving objects: 40% (26008/65018), 14.53 MiB | 29.05 MiB/s Receiving objects: 41% (26658/65018), 14.53 MiB | 29.05 MiB/s Receiving objects: 42% (27308/65018), 14.53 MiB | 29.05 MiB/s Receiving objects: 43% (27958/65018), 14.53 MiB | 29.05 MiB/s Receiving objects: 44% (28608/65018), 14.53 MiB | 29.05 MiB/s Receiving objects: 45% (29259/65018), 14.53 MiB | 29.05 MiB/s Receiving objects: 46% (29909/65018), 14.53 MiB | 29.05 MiB/s Receiving objects: 47% (30559/65018), 14.53 MiB | 29.05 MiB/s Receiving objects: 48% (31209/65018), 14.53 MiB | 29.05 MiB/s Receiving objects: 49% (31859/65018), 14.53 MiB | 29.05 MiB/s Receiving objects: 50% (32509/65018), 14.53 MiB | 29.05 MiB/s Receiving objects: 50% (32753/65018), 30.22 MiB | 30.21 MiB/s Receiving objects: 51% (33160/65018), 30.22 MiB | 30.21 MiB/s Receiving objects: 52% (33810/65018), 30.22 MiB | 30.21 MiB/s Receiving objects: 53% (34460/65018), 30.22 MiB | 30.21 MiB/s Receiving objects: 54% (35110/65018), 30.22 MiB | 30.21 MiB/s Receiving objects: 55% (35760/65018), 30.22 MiB | 30.21 MiB/s Receiving objects: 56% (36411/65018), 30.22 MiB | 30.21 MiB/s Receiving objects: 57% (37061/65018), 30.22 MiB | 30.21 MiB/s Receiving objects: 58% (37711/65018), 30.22 MiB | 30.21 MiB/s Receiving objects: 59% (38361/65018), 30.22 MiB | 30.21 MiB/s Receiving objects: 60% (39011/65018), 30.22 MiB | 30.21 MiB/s Receiving objects: 61% (39661/65018), 30.22 MiB | 30.21 MiB/s Receiving objects: 62% (40312/65018), 46.39 MiB | 29.61 MiB/s Receiving objects: 63% (40962/65018), 46.39 MiB | 29.61 MiB/s Receiving objects: 64% (41612/65018), 46.39 MiB | 29.61 MiB/s Receiving objects: 65% (42262/65018), 46.39 MiB | 29.61 MiB/s Receiving objects: 66% (42912/65018), 46.39 MiB | 29.61 MiB/s Receiving objects: 67% (43563/65018), 46.39 MiB | 29.61 MiB/s Receiving objects: 68% (44213/65018), 46.39 MiB | 29.61 MiB/s Receiving objects: 69% (44863/65018), 46.39 MiB | 29.61 MiB/s Receiving objects: 70% (45513/65018), 46.39 MiB | 29.61 MiB/s Receiving objects: 71% (46163/65018), 46.39 MiB | 29.61 MiB/s Receiving objects: 72% (46813/65018), 46.39 MiB | 29.61 MiB/s Receiving objects: 73% (47464/65018), 46.39 MiB | 29.61 MiB/s Receiving objects: 73% (48050/65018), 46.39 MiB | 29.61 MiB/s Receiving objects: 74% (48114/65018), 46.39 MiB | 29.61 MiB/s Receiving objects: 75% (48764/65018), 46.39 MiB | 29.61 MiB/s Receiving objects: 76% (49414/65018), 61.84 MiB | 29.92 MiB/s Receiving objects: 77% (50064/65018), 61.84 MiB | 29.92 MiB/s Receiving objects: 78% (50715/65018), 61.84 MiB | 29.92 MiB/s Receiving objects: 79% (51365/65018), 61.84 MiB | 29.92 MiB/s Receiving objects: 80% (52015/65018), 61.84 MiB | 29.92 MiB/s Receiving objects: 81% (52665/65018), 61.84 MiB | 29.92 MiB/s Receiving objects: 82% (53315/65018), 61.84 MiB | 29.92 MiB/s Receiving objects: 83% (53965/65018), 61.84 MiB | 29.92 MiB/s Receiving objects: 84% (54616/65018), 78.66 MiB | 30.65 MiB/s Receiving objects: 85% (55266/65018), 78.66 MiB | 30.65 MiB/s Receiving objects: 86% (55916/65018), 78.66 MiB | 30.65 MiB/s Receiving objects: 87% (56566/65018), 78.66 MiB | 30.65 MiB/s Receiving objects: 88% (57216/65018), 78.66 MiB | 30.65 MiB/s Receiving objects: 89% (57867/65018), 78.66 MiB | 30.65 MiB/s Receiving objects: 90% (58517/65018), 78.66 MiB | 30.65 MiB/s Receiving objects: 91% (59167/65018), 78.66 MiB | 30.65 MiB/s Receiving objects: 92% (59817/65018), 78.66 MiB | 30.65 MiB/s Receiving objects: 93% (60467/65018), 78.66 MiB | 30.65 MiB/s Receiving objects: 94% (61117/65018), 78.66 MiB | 30.65 MiB/s Receiving objects: 95% (61768/65018), 78.66 MiB | 30.65 MiB/s Receiving objects: 96% (62418/65018), 78.66 MiB | 30.65 MiB/s Receiving objects: 97% (63068/65018), 78.66 MiB | 30.65 MiB/s Receiving objects: 98% (63718/65018), 78.66 MiB | 30.65 MiB/s Receiving objects: 99% (64368/65018), 78.66 MiB | 30.65 MiB/s remote: Total 65018 (delta 6782), reused 6267 (delta 6266), pack-reused 57349 (from 1)
  7. 5.40 s Receiving objects: 100% (65018/65018), 78.66 MiB | 30.65 MiB/s Receiving objects: 100% (65018/65018), 86.93 MiB | 30.61 MiB/s, done.
  8. 6.04 s Resolving deltas: 0% (0/45900) Resolving deltas: 1% (459/45900) Resolving deltas: 2% (918/45900) Resolving deltas: 3% (1377/45900) Resolving deltas: 4% (1836/45900) Resolving deltas: 5% (2295/45900) Resolving deltas: 6% (2756/45900) Resolving deltas: 7% (3213/45900) Resolving deltas: 8% (3673/45900) Resolving deltas: 9% (4131/45900) Resolving deltas: 10% (4590/45900) Resolving deltas: 11% (5049/45900) Resolving deltas: 12% (5508/45900) Resolving deltas: 13% (5967/45900) Resolving deltas: 14% (6426/45900) Resolving deltas: 15% (6885/45900) Resolving deltas: 16% (7344/45900) Resolving deltas: 17% (7803/45900) Resolving deltas: 18% (8262/45900) Resolving deltas: 19% (8721/45900) Resolving deltas: 20% (9180/45900) Resolving deltas: 21% (9639/45900) Resolving deltas: 22% (10100/45900) Resolving deltas: 23% (10557/45900) Resolving deltas: 24% (11017/45900) Resolving deltas: 25% (11475/45900) Resolving deltas: 26% (11934/45900) Resolving deltas: 27% (12394/45900) Resolving deltas: 28% (12852/45900) Resolving deltas: 29% (13311/45900) Resolving deltas: 30% (13770/45900) Resolving deltas: 31% (14229/45900) Resolving deltas: 32% (14688/45900) Resolving deltas: 33% (15147/45900) Resolving deltas: 34% (15606/45900) Resolving deltas: 35% (16065/45900) Resolving deltas: 36% (16525/45900) Resolving deltas: 37% (16983/45900) Resolving deltas: 38% (17442/45900) Resolving deltas: 39% (17901/45900) Resolving deltas: 40% (18360/45900) Resolving deltas: 41% (18819/45900) Resolving deltas: 42% (19278/45900) Resolving deltas: 43% (19737/45900) Resolving deltas: 44% (20196/45900) Resolving deltas: 45% (20655/45900) Resolving deltas: 46% (21114/45900) Resolving deltas: 47% (21574/45900) Resolving deltas: 48% (22035/45900) Resolving deltas: 49% (22494/45900) Resolving deltas: 50% (22951/45900) Resolving deltas: 51% (23409/45900) Resolving deltas: 52% (23868/45900) Resolving deltas: 53% (24327/45900) Resolving deltas: 54% (24786/45900) Resolving deltas: 55% (25245/45900) Resolving deltas: 56% (25704/45900) Resolving deltas: 57% (26163/45900) Resolving deltas: 58% (26622/45900) Resolving deltas: 59% (27081/45900) Resolving deltas: 60% (27540/45900) Resolving deltas: 61% (27999/45900) Resolving deltas: 62% (28458/45900) Resolving deltas: 63% (28917/45900) Resolving deltas: 64% (29376/45900) Resolving deltas: 65% (29835/45900) Resolving deltas: 66% (30294/45900) Resolving deltas: 67% (30753/45900) Resolving deltas: 68% (31212/45900) Resolving deltas: 69% (31671/45900) Resolving deltas: 70% (32130/45900) Resolving deltas: 71% (32589/45900) Resolving deltas: 72% (33048/45900) Resolving deltas: 73% (33507/45900) Resolving deltas: 74% (33966/45900) Resolving deltas: 75% (34425/45900) Resolving deltas: 76% (34884/45900) Resolving deltas: 77% (35343/45900) Resolving deltas: 78% (35802/45900) Resolving deltas: 79% (36261/45900) Resolving deltas: 80% (36724/45900) Resolving deltas: 81% (37179/45900) Resolving deltas: 82% (37638/45900) Resolving deltas: 83% (38097/45900) Resolving deltas: 84% (38556/45900) Resolving deltas: 85% (39015/45900) Resolving deltas: 86% (39474/45900) Resolving deltas: 87% (39934/45900) Resolving deltas: 88% (40393/45900) Resolving deltas: 89% (40851/45900) Resolving deltas: 90% (41310/45900) Resolving deltas: 91% (41769/45900) Resolving deltas: 92% (42228/45900) Resolving deltas: 93% (42687/45900) Resolving deltas: 94% (43146/45900) Resolving deltas: 95% (43605/45900) Resolving deltas: 96% (44064/45900) Resolving deltas: 97% (44523/45900) Resolving deltas: 98% (44982/45900) Resolving deltas: 99% (45441/45900) Resolving deltas: 100% (45900/45900) Resolving deltas: 100% (45900/45900), done.
  9. 6.34 s Fetching commit 5c37e36355998a98df0d7791c7daeeae576fd7ee for vakint_rustred ...
  10. 6.34 s $ /nix/store/bcnisk3ydfgv26v2gw3zlky24g00yww2-git-2.54.0/bin/git fetch origin 5c37e36355998a98df0d7791c7daeeae576fd7ee
  11. 6.75 s From https://github.com/alphal00p/gammaloop
  12. 6.75 s * branch 5c37e36355998a98df0d7791c7daeeae576fd7ee -> FETCH_HEAD
  13. 6.76 s $ /nix/store/9ypz3flqsrl5xl495mm8h645gadjsxi1-coreutils-9.11/bin/timeout --kill-after=15s 7200s /nix/store/bcnisk3ydfgv26v2gw3zlky24g00yww2-git-2.54.0/bin/git -c advice.detachedHead=false checkout 5c37e36355998a98df0d7791c7daeeae576fd7ee
  14. 6.92 s HEAD is now at 5c37e363 Advance RustRed dependency to refactored core
  15. 6.93 s $ /nix/store/9ypz3flqsrl5xl495mm8h645gadjsxi1-coreutils-9.11/bin/timeout --kill-after=15s 7200s /nix/store/23zk8sgzamrbmj1fday15szf7f2279s8-nix-2.34.7/bin/nix --extra-experimental-features nix-command --extra-experimental-features flakes --log-format internal-json run .#packages.x86_64-linux.nix-ci-check-gammaloop-nextest-spenso --print-build-logs
  16. 10.90 s
  17. 11.10 s Downloading cached gammaloop-nextest-binaries-spenso-idenso from https://cache.nix-ci.com
  18. 11.12 s Downloading cached gammaloop-nextest-binaries-spenso-spenso-hep-lib from https://cache.nix-ci.com
  19. 11.12 s Downloading cached gammaloop-nextest-binaries-spenso-spenso from https://cache.nix-ci.com
  20. 11.12 s Downloading cached gammaloop-nextest-binaries-spenso-spenso-macros from https://cache.nix-ci.com
  21. 11.12 s Downloading cached gammaloop-nextest-binaries-spenso-symbolica-utils from https://cache.nix-ci.com
  22. 11.27 s Downloaded cached gammaloop-nextest-binaries-spenso-spenso-macros (6.5 MiB) in 156ms
  23. 11.27 s Progress: 0 of 7 built, 1 of 5 downloaded from cache (4 downloading)
  24. 11.28 s Downloaded cached gammaloop-nextest-binaries-spenso-symbolica-utils (6.3 MiB) in 160ms
  25. 11.28 s Progress: 0 of 6 built, 2 of 5 downloaded from cache (3 downloading)
  26. 11.34 s Downloaded cached gammaloop-nextest-binaries-spenso-spenso (10.2 MiB) in 222ms
  27. 11.34 s Progress: 0 of 5 built, 3 of 5 downloaded from cache (2 downloading)
  28. 11.54 s Downloaded cached gammaloop-nextest-binaries-spenso-idenso (29.3 MiB) in 442ms
  29. 11.54 s Progress: 0 of 4 built, 4 of 5 downloaded from cache (1 downloading)
  30. 11.57 s Downloaded cached gammaloop-nextest-binaries-spenso-spenso-hep-lib (34 MiB) in 447ms
  31. 11.57 s Progress: 0 of 3 built, 5 of 5 downloaded from cache
  32. 11.59 s Building /nix/store/fnx9dk8497x2w5xm8x5ahprvnzrkc513-gammaloop-nextest-binaries-spenso.drv
  33. 11.65 s [gammaloop-nextest-binaries-spenso:post-build] Uploading to the NixCI cache: /nix/store/llq6sj8f8x6mr10n0r66gby5rpr6rs76-gammaloop-nextest-binaries-spenso
  34. 11.68 s [gammaloop-nextest-binaries-spenso:post-build] warning: 'warn-short-path-literals' is deprecated, use 'lint-short-path-literals = ignore' instead
  35. 11.69 s [gammaloop-nextest-binaries-spenso:post-build] copying 1 paths...
  36. 11.69 s [gammaloop-nextest-binaries-spenso:post-build] copying path '/nix/store/llq6sj8f8x6mr10n0r66gby5rpr6rs76-gammaloop-nextest-binaries-spenso' to 'https://cache.nix-ci.com'...
  37. 11.75 s [gammaloop-nextest-binaries-spenso:post-build] warning: 'warn-short-path-literals' is deprecated, use 'lint-short-path-literals = ignore' instead
  38. 11.87 s [gammaloop-nextest-binaries-spenso:post-build] copying 0 paths...
  39. 11.88 s Uploaded gammaloop-nextest-binaries-spenso in 243ms
  40. 11.88 s Progress: 1 of 3 built, 5 of 5 downloaded from cache
  41. 11.88 s Built gammaloop-nextest-binaries-spenso in 293ms
  42. 11.95 s Building /nix/store/a6x4vlgg7r3hxrd4mwklf3c16b7fh2x6-nix-ci-check-gammaloop-nextest-spenso.drv
  43. 12.01 s [nix-ci-check-gammaloop-nextest-spenso:post-build] Uploading to the NixCI cache: /nix/store/zyf6m4hrpyr4hi0ywh5myf92hs7sjj9w-nix-ci-check-gammaloop-nextest-spenso
  44. 12.05 s [nix-ci-check-gammaloop-nextest-spenso:post-build] warning: 'warn-short-path-literals' is deprecated, use 'lint-short-path-literals = ignore' instead
  45. 12.06 s [nix-ci-check-gammaloop-nextest-spenso:post-build] copying 1 paths...
  46. 12.06 s [nix-ci-check-gammaloop-nextest-spenso:post-build] copying path '/nix/store/zyf6m4hrpyr4hi0ywh5myf92hs7sjj9w-nix-ci-check-gammaloop-nextest-spenso' to 'https://cache.nix-ci.com'...
  47. 12.13 s [nix-ci-check-gammaloop-nextest-spenso:post-build] warning: 'warn-short-path-literals' is deprecated, use 'lint-short-path-literals = ignore' instead
  48. 12.29 s [nix-ci-check-gammaloop-nextest-spenso:post-build] copying 0 paths...
  49. 12.31 s Uploaded nix-ci-check-gammaloop-nextest-spenso in 309ms
  50. 12.31 s Progress: 2 of 3 built, 5 of 5 downloaded from cache
  51. 12.31 s Built nix-ci-check-gammaloop-nextest-spenso in 360ms
  52. 12.31 s Progress: 3 of 3 built, 5 of 5 downloaded from cache
  53. 16.97 s evaluating derivation 'g copying '/nix/store/p93a evaluating derivation 'g copying '/nix/store/p93a evaluating derivation 'g copying '/nix/store/p93a evaluating derivation 'g querying gammaloop-nexte querying info about miss querying gammaloop-nexte [0/1 built, 0.0 KiB DL] [1/0/1 built, 0.0 KiB DLgammaloop-nextest-spenso> Extracting 5 binaries and 2 linked paths to /build/nextest-archive-q6nNCI
  54. 17.13 s gammaloop-nextest-spenso> Extracted 19 files to /build/nextest-archive-q6nNCI in 0.16s
  55. 17.14 s gammaloop-nextest-spenso> ------------
  56. 17.14 s gammaloop-nextest-spenso> Nextest run ID cbe297e1-6d1f-4cae-a878-387b4ec18753 with nextest profile: ci_gammaloop
  57. 17.14 s gammaloop-nextest-spenso> Starting 224 tests across 5 binaries (26 tests skipped, including 2 tests via profile.ci_gammaloop.default-filter)
  58. 17.21 s gammaloop-nextest-spenso> FAIL [ 0.010s] ( 46/224) idenso color::test::form_reference::metric_contraction_respects_antisymmetric_normalization
  59. 17.21 s gammaloop-nextest-spenso> stdout ---
  60. 17.21 s gammaloop-nextest-spenso>
  61. 17.21 s gammaloop-nextest-spenso> running 1 test
  62. 17.21 s gammaloop-nextest-spenso> test color::test::form_reference::metric_contraction_respects_antisymmetric_normalization ... FAILED
  63. 17.21 s gammaloop-nextest-spenso>
  64. 17.21 s gammaloop-nextest-spenso> failures:
  65. 17.21 s gammaloop-nextest-spenso>
  66. 17.21 s gammaloop-nextest-spenso> failures:
  67. 17.21 s gammaloop-nextest-spenso> color::test::form_reference::metric_contraction_respects_antisymmetric_normalization
  68. 17.21 s gammaloop-nextest-spenso>
  69. 17.21 s gammaloop-nextest-spenso> test result: FAILED. 0 passed; 1 failed; 0 ignored; 0 measured; 240 filtered out; finished in 0.00s
  70. 17.21 s gammaloop-nextest-spenso>
  71. 17.21 s gammaloop-nextest-spenso> stderr ---
  72. 17.21 s gammaloop-nextest-spenso>
  73. 17.21 s gammaloop-nextest-spenso> thread 'color::test::form_reference::metric_contraction_respects_antisymmetric_normalization' (332) panicked at crates/idenso/src/color/test/form_reference.rs:171:5:
  74. 17.21 s gammaloop-nextest-spenso> assertion `left == right` failed
  75. 17.21 s gammaloop-nextest-spenso> left: "-1*f(coad(8,standalone_metric_j),coad(8,standalone_metric_s),coad(8,standalone_metric_u))"
  76. 17.21 s gammaloop-nextest-spenso> right: "f(coad(8,standalone_metric_j),coad(8,standalone_metric_s),coad(8,standalone_metric_u))"
  77. 17.21 s gammaloop-nextest-spenso> stack backtrace:
  78. 17.21 s gammaloop-nextest-spenso> 0: __rustc::rust_begin_unwind
  79. 17.21 s gammaloop-nextest-spenso> 1: core::panicking::panic_fmt
  80. 17.21 s gammaloop-nextest-spenso> 2: core::panicking::assert_failed_inner
  81. 17.21 s gammaloop-nextest-spenso> 3: core::panicking::assert_failed::<alloc::string::String, alloc::string::String>
  82. 17.21 s gammaloop-nextest-spenso> 4: idenso::color::test::form_reference::metric_contraction_respects_antisymmetric_normalization
  83. 17.21 s gammaloop-nextest-spenso> 5: <idenso::color::test::form_reference::metric_contraction_respects_antisymmetric_normalization::{closure#0} as core::ops::function::FnOnce<()>>::call_once
  84. 17.21 s gammaloop-nextest-spenso> note: Some details are omitted, run with `RUST_BACKTRACE=full` for a verbose backtrace.
  85. 17.21 s gammaloop-nextest-spenso>
  86. 17.41 s gammaloop-nextest-spenso> FAIL [ 0.040s] (220/224) idenso tensor::tests::parsing::infinite_execution
  87. 17.41 s gammaloop-nextest-spenso> stdout ---
  88. 17.41 s gammaloop-nextest-spenso>
  89. 17.41 s gammaloop-nextest-spenso> running 1 test
  90. 17.41 s gammaloop-nextest-spenso> ━━━━━━━━━━━━━━━━━━━━━━━━━━━━━━━ Snapshot Summary ━━━━━━━━━━━━━━━━━━━━━━━━━━━━━━━
  91. 17.41 s gammaloop-nextest-spenso> Snapshot: infinite_execution
  92. 17.41 s gammaloop-nextest-spenso> Source: crates/idenso/src/tensor/tests/parsing.rs:910
  93. 17.41 s gammaloop-nextest-spenso> ────────────────────────────────────────────────────────────────────────────────
  94. 17.41 s gammaloop-nextest-spenso> Expression: net_iter.snapshot_dot()
  95. 17.41 s gammaloop-nextest-spenso> ────────────────────────────────────────────────────────────────────────────────
  96. 17.41 s gammaloop-nextest-spenso> -old snapshot
  97. 17.41 s gammaloop-nextest-spenso> +new results
  98. 17.41 s gammaloop-nextest-spenso> ────────────┬───────────────────────────────────────────────────────────────────
  99. 17.41 s gammaloop-nextest-spenso> 8 8 │ 0:0:s -> ext0 [id=0 color="red"];
  100. 17.41 s gammaloop-nextest-spenso> 9 9 │ ext1 [style=invis];
  101. 17.41 s gammaloop-nextest-spenso> 10 10 │ 0:5:s -> ext1 [id=1 dir=none color="red" label="mink4|l_0"];
  102. 17.41 s gammaloop-nextest-spenso> 11 11 │ ext2 [style=invis];
  103. 17.41 s gammaloop-nextest-spenso> 12 │- 0:4:s -> ext2 [id=2 dir=none color="red" label="bis4|l_2"];
  104. 17.41 s gammaloop-nextest-spenso> 12 │+ 0:3:s -> ext2 [id=2 dir=none color="red" label="mink4|l_1"];
  105. 17.41 s gammaloop-nextest-spenso> 13 13 │ ext3 [style=invis];
  106. 17.41 s gammaloop-nextest-spenso> 14 │- 0:3:s -> ext3 [id=3 dir=none color="red" label="bis4|l_3"];
  107. 17.41 s gammaloop-nextest-spenso> 14 │+ 0:1:s -> ext3 [id=3 dir=none color="red" label="bis4|l_2"];
  108. 17.41 s gammaloop-nextest-spenso> 15 15 │ ext4 [style=invis];
  109. 17.41 s gammaloop-nextest-spenso> 16 │- 0:1:s -> ext4 [id=4 dir=none color="red" label="mink4|l_1"];
  110. 17.41 s gammaloop-nextest-spenso> 16 │+ 0:2:s -> ext4 [id=4 dir=none color="red" label="mink4|l_4"];
  111. 17.41 s gammaloop-nextest-spenso> 17 17 │ ext5 [style=invis];
  112. 17.41 s gammaloop-nextest-spenso> 18 │- 0:2:s -> ext5 [id=5 dir=none color="red" label="mink4|l_4"];
  113. 17.41 s gammaloop-nextest-spenso> 18 │+ 0:4:s -> ext5 [id=5 dir=none color="red" label="bis4|l_3"];
  114. 17.41 s gammaloop-nextest-spenso> 19 19 │ }
  115. 17.41 s gammaloop-nextest-spenso> ────────────┴───────────────────────────────────────────────────────────────────
  116. 17.41 s gammaloop-nextest-spenso> To update snapshots run `cargo insta review`
  117. 17.41 s gammaloop-nextest-spenso> Stopped on the first failure. Run `cargo insta test` to run all snapshots.
  118. 17.41 s gammaloop-nextest-spenso> test tensor::tests::parsing::infinite_execution ... FAILED
  119. 17.41 s gammaloop-nextest-spenso>
  120. 17.41 s gammaloop-nextest-spenso> failures:
  121. 17.41 s gammaloop-nextest-spenso>
  122. 17.41 s gammaloop-nextest-spenso> failures:
  123. 17.41 s gammaloop-nextest-spenso> tensor::tests::parsing::infinite_execution
  124. 17.41 s gammaloop-nextest-spenso>
  125. 17.41 s gammaloop-nextest-spenso> test result: FAILED. 0 passed; 1 failed; 0 ignored; 0 measured; 240 filtered out; finished in 0.03s
  126. 17.41 s gammaloop-nextest-spenso>
  127. 17.41 s gammaloop-nextest-spenso> stderr ---
  128. 17.41 s gammaloop-nextest-spenso>
  129. 17.41 s gammaloop-nextest-spenso> thread 'tensor::tests::parsing::infinite_execution' (840) panicked at /nix/store/9a12dww58xis3an3kmn597llpijv83b1-vendor-cargo-deps/c19b7c6f923b580ac259164a89f2577984ad5ab09ee9d583b888f934adbbe8d0/insta-1.47.2/src/runtime.rs:719:13:
  130. 17.41 s gammaloop-nextest-spenso> snapshot assertion for 'infinite_execution' failed in line 910
  131. 17.41 s gammaloop-nextest-spenso> stack backtrace:
  132. 17.41 s gammaloop-nextest-spenso> 0: __rustc::rust_begin_unwind
  133. 17.41 s gammaloop-nextest-spenso> 1: core::panicking::panic_fmt
  134. 17.41 s gammaloop-nextest-spenso> 2: insta::runtime::assert_snapshot
  135. 17.41 s gammaloop-nextest-spenso> 3: idenso::tensor::tests::parsing::infinite_execution
  136. 17.41 s gammaloop-nextest-spenso> 4: <idenso::tensor::tests::parsing::infinite_execution::{closure#0} as core::ops::function::FnOnce<()>>::call_once
  137. 17.41 s gammaloop-nextest-spenso> note: Some details are omitted, run with `RUST_BACKTRACE=full` for a verbose backtrace.
  138. 17.41 s gammaloop-nextest-spenso>
  139. 18.69 s gammaloop-nextest-spenso> ------------
  140. 18.69 s gammaloop-nextest-spenso> Summary [ 1.541s] 224 tests run: 222 passed, 2 failed, 26 skipped
  141. 18.69 s gammaloop-nextest-spenso> FAIL [ 0.010s] ( 46/224) idenso color::test::form_reference::metric_contraction_respects_antisymmetric_normalization
  142. 18.69 s gammaloop-nextest-spenso> stdout ---
  143. 18.69 s gammaloop-nextest-spenso>
  144. 18.69 s gammaloop-nextest-spenso> running 1 test
  145. 18.69 s gammaloop-nextest-spenso> test color::test::form_reference::metric_contraction_respects_antisymmetric_normalization ... FAILED
  146. 18.69 s gammaloop-nextest-spenso>
  147. 18.69 s gammaloop-nextest-spenso> failures:
  148. 18.69 s gammaloop-nextest-spenso>
  149. 18.69 s gammaloop-nextest-spenso> failures:
  150. 18.69 s gammaloop-nextest-spenso> color::test::form_reference::metric_contraction_respects_antisymmetric_normalization
  151. 18.69 s gammaloop-nextest-spenso>
  152. 18.69 s gammaloop-nextest-spenso> test result: FAILED. 0 passed; 1 failed; 0 ignored; 0 measured; 240 filtered out; finished in 0.00s
  153. 18.69 s gammaloop-nextest-spenso>
  154. 18.69 s gammaloop-nextest-spenso> stderr ---
  155. 18.69 s gammaloop-nextest-spenso>
  156. 18.69 s gammaloop-nextest-spenso> thread 'color::test::form_reference::metric_contraction_respects_antisymmetric_normalization' (332) panicked at crates/idenso/src/color/test/form_reference.rs:171:5:
  157. 18.69 s gammaloop-nextest-spenso> assertion `left == right` failed
  158. 18.69 s gammaloop-nextest-spenso> left: "-1*f(coad(8,standalone_metric_j),coad(8,standalone_metric_s),coad(8,standalone_metric_u))"
  159. 18.69 s gammaloop-nextest-spenso> right: "f(coad(8,standalone_metric_j),coad(8,standalone_metric_s),coad(8,standalone_metric_u))"
  160. 18.69 s gammaloop-nextest-spenso> stack backtrace:
  161. 18.69 s gammaloop-nextest-spenso> 0: __rustc::rust_begin_unwind
  162. 18.69 s gammaloop-nextest-spenso> 1: core::panicking::panic_fmt
  163. 18.69 s gammaloop-nextest-spenso> 2: core::panicking::assert_failed_inner
  164. 18.69 s gammaloop-nextest-spenso> 3: core::panicking::assert_failed::<alloc::string::String, alloc::string::String>
  165. 18.69 s gammaloop-nextest-spenso> 4: idenso::color::test::form_reference::metric_contraction_respects_antisymmetric_normalization
  166. 18.69 s gammaloop-nextest-spenso> 5: <idenso::color::test::form_reference::metric_contraction_respects_antisymmetric_normalization::{closure#0} as core::ops::function::FnOnce<()>>::call_once
  167. 18.69 s gammaloop-nextest-spenso> note: Some details are omitted, run with `RUST_BACKTRACE=full` for a verbose backtrace.
  168. 18.69 s gammaloop-nextest-spenso>
  169. 18.69 s gammaloop-nextest-spenso> FAIL [ 0.040s] (220/224) idenso tensor::tests::parsing::infinite_execution
  170. 18.69 s gammaloop-nextest-spenso> stdout ---
  171. 18.69 s gammaloop-nextest-spenso>
  172. 18.69 s gammaloop-nextest-spenso> running 1 test
  173. 18.69 s gammaloop-nextest-spenso> ━━━━━━━━━━━━━━━━━━━━━━━━━━━━━━━ Snapshot Summary ━━━━━━━━━━━━━━━━━━━━━━━━━━━━━━━
  174. 18.69 s gammaloop-nextest-spenso> Snapshot: infinite_execution
  175. 18.69 s gammaloop-nextest-spenso> Source: crates/idenso/src/tensor/tests/parsing.rs:910
  176. 18.69 s gammaloop-nextest-spenso> ────────────────────────────────────────────────────────────────────────────────
  177. 18.69 s gammaloop-nextest-spenso> Expression: net_iter.snapshot_dot()
  178. 18.69 s gammaloop-nextest-spenso> ────────────────────────────────────────────────────────────────────────────────
  179. 18.69 s gammaloop-nextest-spenso> -old snapshot
  180. 18.69 s gammaloop-nextest-spenso> +new results
  181. 18.69 s gammaloop-nextest-spenso> ────────────┬───────────────────────────────────────────────────────────────────
  182. 18.69 s gammaloop-nextest-spenso> 8 8 │ 0:0:s -> ext0 [id=0 color="red"];
  183. 18.69 s gammaloop-nextest-spenso> 9 9 │ ext1 [style=invis];
  184. 18.69 s gammaloop-nextest-spenso> 10 10 │ 0:5:s -> ext1 [id=1 dir=none color="red" label="mink4|l_0"];
  185. 18.69 s gammaloop-nextest-spenso> 11 11 │ ext2 [style=invis];
  186. 18.69 s gammaloop-nextest-spenso> 12 │- 0:4:s -> ext2 [id=2 dir=none color="red" label="bis4|l_2"];
  187. 18.69 s gammaloop-nextest-spenso> 12 │+ 0:3:s -> ext2 [id=2 dir=none color="red" label="mink4|l_1"];
  188. 18.69 s gammaloop-nextest-spenso> 13 13 │ ext3 [style=invis];
  189. 18.69 s gammaloop-nextest-spenso> 14 │- 0:3:s -> ext3 [id=3 dir=none color="red" label="bis4|l_3"];
  190. 18.69 s gammaloop-nextest-spenso> 14 │+ 0:1:s -> ext3 [id=3 dir=none color="red" label="bis4|l_2"];
  191. 18.69 s gammaloop-nextest-spenso> 15 15 │ ext4 [style=invis];
  192. 18.69 s gammaloop-nextest-spenso> 16 │- 0:1:s -> ext4 [id=4 dir=none color="red" label="mink4|l_1"];
  193. 18.69 s gammaloop-nextest-spenso> 16 │+ 0:2:s -> ext4 [id=4 dir=none color="red" label="mink4|l_4"];
  194. 18.69 s gammaloop-nextest-spenso> 17 17 │ ext5 [style=invis];
  195. 18.69 s gammaloop-nextest-spenso> 18 │- 0:2:s -> ext5 [id=5 dir=none color="red" label="mink4|l_4"];
  196. 18.69 s gammaloop-nextest-spenso> 18 │+ 0:4:s -> ext5 [id=5 dir=none color="red" label="bis4|l_3"];
  197. 18.69 s gammaloop-nextest-spenso> 19 19 │ }
  198. 18.69 s gammaloop-nextest-spenso> ────────────┴───────────────────────────────────────────────────────────────────
  199. 18.69 s gammaloop-nextest-spenso> To update snapshots run `cargo insta review`
  200. 18.69 s gammaloop-nextest-spenso> Stopped on the first failure. Run `cargo insta test` to run all snapshots.
  201. 18.69 s gammaloop-nextest-spenso> test tensor::tests::parsing::infinite_execution ... FAILED
  202. 18.69 s gammaloop-nextest-spenso>
  203. 18.69 s gammaloop-nextest-spenso> failures:
  204. 18.69 s gammaloop-nextest-spenso>
  205. 18.69 s gammaloop-nextest-spenso> failures:
  206. 18.69 s gammaloop-nextest-spenso> tensor::tests::parsing::infinite_execution
  207. 18.69 s gammaloop-nextest-spenso>
  208. 18.69 s gammaloop-nextest-spenso> test result: FAILED. 0 passed; 1 failed; 0 ignored; 0 measured; 240 filtered out; finished in 0.03s
  209. 18.69 s gammaloop-nextest-spenso>
  210. 18.69 s gammaloop-nextest-spenso> stderr ---
  211. 18.69 s gammaloop-nextest-spenso>
  212. 18.69 s gammaloop-nextest-spenso> thread 'tensor::tests::parsing::infinite_execution' (840) panicked at /nix/store/9a12dww58xis3an3kmn597llpijv83b1-vendor-cargo-deps/c19b7c6f923b580ac259164a89f2577984ad5ab09ee9d583b888f934adbbe8d0/insta-1.47.2/src/runtime.rs:719:13:
  213. 18.69 s gammaloop-nextest-spenso> snapshot assertion for 'infinite_execution' failed in line 910
  214. 18.69 s gammaloop-nextest-spenso> stack backtrace:
  215. 18.69 s gammaloop-nextest-spenso> 0: __rustc::rust_begin_unwind
  216. 18.69 s gammaloop-nextest-spenso> 1: core::panicking::panic_fmt
  217. 18.69 s gammaloop-nextest-spenso> 2: insta::runtime::assert_snapshot
  218. 18.69 s gammaloop-nextest-spenso> 3: idenso::tensor::tests::parsing::infinite_execution
  219. 18.69 s gammaloop-nextest-spenso> 4: <idenso::tensor::tests::parsing::infinite_execution::{closure#0} as core::ops::function::FnOnce<()>>::call_once
  220. 18.69 s gammaloop-nextest-spenso> note: Some details are omitted, run with `RUST_BACKTRACE=full` for a verbose backtrace.
  221. 18.69 s gammaloop-nextest-spenso>
  222. 18.71 s gammaloop-nextest-spenso> error: test run failed
  223. 18.74 s gammaloop-nextest-spenso>
  224. 18.74 s gammaloop-nextest-spenso> ========== nextest test summary ==========
  225. 18.74 s gammaloop-nextest-spenso> report: target/nextest/ci_gammaloop/junit.xml
  226. 18.74 s gammaloop-nextest-spenso> tests: 224, failures: 2, errors: 0
  227. 18.74 s gammaloop-nextest-spenso>
  228. 18.74 s gammaloop-nextest-spenso> 1. idenso::color::test::form_reference::metric_contraction_respects_antisymmetric_normalization
  229. 18.74 s gammaloop-nextest-spenso> failure: test failure with exit code 101
  230. 18.74 s gammaloop-nextest-spenso> thread 'color::test::form_reference::metric_contraction_respects_antisymmetric_normalization' (332) panicked at crates/idenso/src/color/test/form_reference.rs:171:5:
  231. 18.74 s gammaloop-nextest-spenso> assertion `left == right` failed
  232. 18.74 s gammaloop-nextest-spenso> left: "-1*f(coad(8,standalone_metric_j),coad(8,standalone_metric_s),coad(8,standalone_metric_u))"
  233. 18.74 s gammaloop-nextest-spenso> right: "f(coad(8,standalone_metric_j),coad(8,standalone_metric_s),coad(8,standalone_metric_u))"
  234. 18.74 s gammaloop-nextest-spenso> stack backtrace:
  235. 18.74 s gammaloop-nextest-spenso> 0: __rustc::rust_begin_unwind
  236. 18.74 s gammaloop-nextest-spenso> 1: core::panicking::panic_fmt
  237. 18.74 s gammaloop-nextest-spenso> 2: core::panicking::assert_failed_inner
  238. 18.74 s gammaloop-nextest-spenso> 3: core::panicking::assert_failed::<alloc::string::String, alloc::string::String>
  239. 18.74 s gammaloop-nextest-spenso> 4: idenso::color::test::form_reference::metric_contraction_respects_antisymmetric_normalization
  240. 18.74 s gammaloop-nextest-spenso> 5: <idenso::color::test::form_reference::metric_contraction_respects_antisymmetric_normalization::{closure#0} as core::ops::function::FnOnce<()>>::call_once
  241. 18.74 s gammaloop-nextest-spenso> note: Some details are omitted, run with `RUST_BACKTRACE=full` for a verbose backtrace.
  242. 18.74 s gammaloop-nextest-spenso> system-out
  243. 18.74 s gammaloop-nextest-spenso> running 1 test
  244. 18.74 s gammaloop-nextest-spenso> test color::test::form_reference::metric_contraction_respects_antisymmetric_normalization ... FAILED
  245. 18.74 s gammaloop-nextest-spenso>
  246. 18.74 s gammaloop-nextest-spenso> failures:
  247. 18.74 s gammaloop-nextest-spenso>
  248. 18.74 s gammaloop-nextest-spenso> failures:
  249. 18.74 s gammaloop-nextest-spenso> color::test::form_reference::metric_contraction_respects_antisymmetric_normalization
  250. 18.74 s gammaloop-nextest-spenso>
  251. 18.74 s gammaloop-nextest-spenso> test result: FAILED. 0 passed; 1 failed; 0 ignored; 0 measured; 240 filtered out; finished in 0.00s
  252. 18.74 s gammaloop-nextest-spenso> system-err
  253. 18.74 s gammaloop-nextest-spenso> thread 'color::test::form_reference::metric_contraction_respects_antisymmetric_normalization' (332) panicked at crates/idenso/src/color/test/form_reference.rs:171:5:
  254. 18.74 s gammaloop-nextest-spenso> assertion `left == right` failed
  255. 18.74 s gammaloop-nextest-spenso> left: "-1*f(coad(8,standalone_metric_j),coad(8,standalone_metric_s),coad(8,standalone_metric_u))"
  256. 18.74 s gammaloop-nextest-spenso> right: "f(coad(8,standalone_metric_j),coad(8,standalone_metric_s),coad(8,standalone_metric_u))"
  257. 18.74 s gammaloop-nextest-spenso> stack backtrace:
  258. 18.74 s gammaloop-nextest-spenso> 0: __rustc::rust_begin_unwind
  259. 18.74 s gammaloop-nextest-spenso> 1: core::panicking::panic_fmt
  260. 18.74 s gammaloop-nextest-spenso> 2: core::panicking::assert_failed_inner
  261. 18.74 s gammaloop-nextest-spenso> 3: core::panicking::assert_failed::<alloc::string::String, alloc::string::String>
  262. 18.74 s gammaloop-nextest-spenso> 4: idenso::color::test::form_reference::metric_contraction_respects_antisymmetric_normalization
  263. 18.74 s gammaloop-nextest-spenso> 5: <idenso::color::test::form_reference::metric_contraction_respects_antisymmetric_normalization::{closure#0} as core::ops::function::FnOnce<()>>::call_once
  264. 18.74 s gammaloop-nextest-spenso> note: Some details are omitted, run with `RUST_BACKTRACE=full` for a verbose backtrace.
  265. 18.74 s gammaloop-nextest-spenso>
  266. 18.74 s gammaloop-nextest-spenso> 2. idenso::tensor::tests::parsing::infinite_execution
  267. 18.74 s gammaloop-nextest-spenso> failure: test failure with exit code 101
  268. 18.74 s gammaloop-nextest-spenso> thread 'tensor::tests::parsing::infinite_execution' (840) panicked at /nix/store/9a12dww58xis3an3kmn597llpijv83b1-vendor-cargo-deps/c19b7c6f923b580ac259164a89f2577984ad5ab09ee9d583b888f934adbbe8d0/insta-1.47.2/src/runtime.rs:719:13:
  269. 18.74 s gammaloop-nextest-spenso> snapshot assertion for 'infinite_execution' failed in line 910
  270. 18.74 s gammaloop-nextest-spenso> stack backtrace:
  271. 18.74 s gammaloop-nextest-spenso> 0: __rustc::rust_begin_unwind
  272. 18.74 s gammaloop-nextest-spenso> 1: core::panicking::panic_fmt
  273. 18.74 s gammaloop-nextest-spenso> 2: insta::runtime::assert_snapshot
  274. 18.74 s gammaloop-nextest-spenso> 3: idenso::tensor::tests::parsing::infinite_execution
  275. 18.74 s gammaloop-nextest-spenso> 4: <idenso::tensor::tests::parsing::infinite_execution::{closure#0} as core::ops::function::FnOnce<()>>::call_once
  276. 18.74 s gammaloop-nextest-spenso> note: Some details are omitted, run with `RUST_BACKTRACE=full` for a verbose backtrace.
  277. 18.74 s gammaloop-nextest-spenso> system-out
  278. 18.74 s gammaloop-nextest-spenso> running 1 test
  279. 18.74 s gammaloop-nextest-spenso> ━━━━━━━━━━━━━━━━━━━━━━━━━━━━━━━ Snapshot Summary ━━━━━━━━━━━━━━━━━━━━━━━━━━━━━━━
  280. 18.74 s gammaloop-nextest-spenso> Snapshot: infinite_execution
  281. 18.74 s gammaloop-nextest-spenso> Source: crates/idenso/src/tensor/tests/parsing.rs:910
  282. 18.74 s gammaloop-nextest-spenso> ────────────────────────────────────────────────────────────────────────────────
  283. 18.74 s gammaloop-nextest-spenso> Expression: net_iter.snapshot_dot()
  284. 18.74 s gammaloop-nextest-spenso> ────────────────────────────────────────────────────────────────────────────────
  285. 18.74 s gammaloop-nextest-spenso> -old snapshot
  286. 18.74 s gammaloop-nextest-spenso> +new results
  287. 18.74 s gammaloop-nextest-spenso> ────────────┬───────────────────────────────────────────────────────────────────
  288. 18.74 s gammaloop-nextest-spenso> 8 8 │ 0:0:s-> ext0 [id=0 color="red"];
  289. 18.74 s gammaloop-nextest-spenso> 9 9 │ ext1 [style=invis];
  290. 18.74 s gammaloop-nextest-spenso> 10 10 │ 0:5:s-> ext1 [id=1 dir=none color="red" label="mink4|l_0"];
  291. 18.74 s gammaloop-nextest-spenso> 11 11 │ ext2 [style=invis];
  292. 18.74 s gammaloop-nextest-spenso> 12 │- 0:4:s-> ext2 [id=2 dir=none color="red" label="bis4|l_2"];
  293. 18.74 s gammaloop-nextest-spenso> 12 │+ 0:3:s-> ext2 [id=2 dir=none color="red" label="mink4|l_1"];
  294. 18.74 s gammaloop-nextest-spenso> 13 13 │ ext3 [style=invis];
  295. 18.74 s gammaloop-nextest-spenso> 14 │- 0:3:s-> ext3 [id=3 dir=none color="red" label="bis4|l_3"];
  296. 18.74 s gammaloop-nextest-spenso> 14 │+ 0:1:s-> ext3 [id=3 dir=none color="red" label="bis4|l_2"];
  297. 18.74 s gammaloop-nextest-spenso> 15 15 │ ext4 [style=invis];
  298. 18.74 s gammaloop-nextest-spenso> 16 │- 0:1:s-> ext4 [id=4 dir=none color="red" label="mink4|l_1"];
  299. 18.74 s gammaloop-nextest-spenso> 16 │+ 0:2:s-> ext4 [id=4 dir=none color="red" label="mink4|l_4"];
  300. 18.74 s gammaloop-nextest-spenso> 17 17 │ ext5 [style=invis];
  301. 18.74 s gammaloop-nextest-spenso> 18 │- 0:2:s-> ext5 [id=5 dir=none color="red" label="mink4|l_4"];
  302. 18.74 s gammaloop-nextest-spenso> 18 │+ 0:4:s-> ext5 [id=5 dir=none color="red" label="bis4|l_3"];
  303. 18.74 s gammaloop-nextest-spenso> 19 19 │ }
  304. 18.74 s gammaloop-nextest-spenso> ────────────┴───────────────────────────────────────────────────────────────────
  305. 18.74 s gammaloop-nextest-spenso> To update snapshots run `cargo insta review`
  306. 18.74 s gammaloop-nextest-spenso> Stopped on the first failure. Run `cargo insta test` to run all snapshots.
  307. 18.74 s gammaloop-nextest-spenso> test tensor::tests::parsing::infinite_execution ... FAILED
  308. 18.74 s gammaloop-nextest-spenso>
  309. 18.74 s gammaloop-nextest-spenso> failures:
  310. 18.74 s gammaloop-nextest-spenso>
  311. 18.74 s gammaloop-nextest-spenso> failures:
  312. 18.74 s gammaloop-nextest-spenso> tensor::tests::parsing::infinite_execution
  313. 18.74 s gammaloop-nextest-spenso>
  314. 18.74 s gammaloop-nextest-spenso> test result: FAILED. 0 passed; 1 failed; 0 ignored; 0 measured; 240 filtered out; finished in 0.03s
  315. 18.74 s gammaloop-nextest-spenso> system-err
  316. 18.74 s gammaloop-nextest-spenso> thread 'tensor::tests::parsing::infinite_execution' (840) panicked at /nix/store/9a12dww58xis3an3kmn597llpijv83b1-vendor-cargo-deps/c19b7c6f923b580ac259164a89f2577984ad5ab09ee9d583b888f934adbbe8d0/insta-1.47.2/src/runtime.rs:719:13:
  317. 18.74 s gammaloop-nextest-spenso> snapshot assertion for 'infinite_execution' failed in line 910
  318. 18.74 s gammaloop-nextest-spenso> stack backtrace:
  319. 18.74 s gammaloop-nextest-spenso> 0: __rustc::rust_begin_unwind
  320. 18.74 s gammaloop-nextest-spenso> 1: core::panicking::panic_fmt
  321. 18.74 s gammaloop-nextest-spenso> 2: insta::runtime::assert_snapshot
  322. 18.74 s gammaloop-nextest-spenso> 3: idenso::tensor::tests::parsing::infinite_execution
  323. 18.74 s gammaloop-nextest-spenso> 4: <idenso::tensor::tests::parsing::infinite_execution::{closure#0} as core::ops::function::FnOnce<()>>::call_once
  324. 18.74 s gammaloop-nextest-spenso> note: Some details are omitted, run with `RUST_BACKTRACE=full` for a verbose backtrace.
  325. 18.74 s gammaloop-nextest-spenso> =========================================
  326. 18.75 s gammaloop-nextest-spenso> Extracting 2 binaries and 1 linked path to /build/nextest-archive-fVYoA0
  327. 18.82 s gammaloop-nextest-spenso> Extracted 8 files to /build/nextest-archive-fVYoA0 in 0.07s
  328. 18.83 s gammaloop-nextest-spenso> ------------
  329. 18.83 s gammaloop-nextest-spenso> Nextest run ID 0b7fa40b-0624-42e0-ad19-b005a25eb7fb with nextest profile: ci_gammaloop
  330. 18.83 s gammaloop-nextest-spenso> Starting 135 tests across 2 binaries
  331. 18.90 s gammaloop-nextest-spenso> ------------
  332. 18.90 s gammaloop-nextest-spenso> Summary [ 0.075s] 135 tests run: 135 passed, 0 skipped
  333. 18.94 s gammaloop-nextest-spenso>
  334. 18.94 s gammaloop-nextest-spenso> ========== nextest test summary ==========
  335. 18.94 s gammaloop-nextest-spenso> report: target/nextest/ci_gammaloop/junit.xml
  336. 18.94 s gammaloop-nextest-spenso> tests: 135, failures: 0, errors: 0
  337. 18.94 s gammaloop-nextest-spenso> No failing testcases found.
  338. 18.94 s gammaloop-nextest-spenso> =========================================
  339. 18.95 s gammaloop-nextest-spenso> Extracting 5 binaries and 2 linked paths to /build/nextest-archive-Z1LVlT
  340. 19.13 s gammaloop-nextest-spenso> Extracted 19 files to /build/nextest-archive-Z1LVlT in 0.18s
  341. 19.14 s gammaloop-nextest-spenso> ------------
  342. 19.14 s gammaloop-nextest-spenso> Nextest run ID 8f5cce55-79e6-4d09-8143-51c8372fcb77 with nextest profile: ci_gammaloop
  343. 19.14 s gammaloop-nextest-spenso> Starting 25 tests across 5 binaries (1 test skipped via profile.ci_gammaloop.default-filter)
  344. 19.33 s gammaloop-nextest-spenso> ------------
  345. 19.33 s gammaloop-nextest-spenso> Summary [ 0.184s] 25 tests run: 25 passed, 1 skipped
  346. 19.38 s gammaloop-nextest-spenso>
  347. 19.38 s gammaloop-nextest-spenso> ========== nextest test summary ==========
  348. 19.38 s gammaloop-nextest-spenso> report: target/nextest/ci_gammaloop/junit.xml
  349. 19.38 s gammaloop-nextest-spenso> tests: 25, failures: 0, errors: 0
  350. 19.38 s gammaloop-nextest-spenso> No failing testcases found.
  351. 19.38 s gammaloop-nextest-spenso> =========================================
  352. 19.39 s gammaloop-nextest-spenso> Extracting 2 binaries and 1 linked path to /build/nextest-archive-fDgQvf
  353. 19.44 s gammaloop-nextest-spenso> Extracted 8 files to /build/nextest-archive-fDgQvf in 0.05s
  354. 19.45 s gammaloop-nextest-spenso> ------------
  355. 19.45 s gammaloop-nextest-spenso> Nextest run ID adb4d8cb-d2df-4b76-8ff6-878521950302 with nextest profile: ci_gammaloop
  356. 19.45 s gammaloop-nextest-spenso> Starting 1 test across 2 binaries
  357. 19.45 s gammaloop-nextest-spenso> ------------
  358. 19.45 s gammaloop-nextest-spenso> Summary [ 0.005s] 1 test run: 1 passed, 0 skipped
  359. 19.48 s gammaloop-nextest-spenso>
  360. 19.48 s gammaloop-nextest-spenso> ========== nextest test summary ==========
  361. 19.48 s gammaloop-nextest-spenso> report: target/nextest/ci_gammaloop/junit.xml
  362. 19.48 s gammaloop-nextest-spenso> tests: 1, failures: 0, errors: 0
  363. 19.48 s gammaloop-nextest-spenso> No failing testcases found.
  364. 19.48 s gammaloop-nextest-spenso> =========================================
  365. 19.50 s gammaloop-nextest-spenso> Extracting 1 binary and 1 linked path to /build/nextest-archive-eAk938
  366. 19.55 s gammaloop-nextest-spenso> Extracted 7 files to /build/nextest-archive-eAk938 in 0.05s
  367. 19.55 s gammaloop-nextest-spenso> ------------
  368. 19.55 s gammaloop-nextest-spenso> Nextest run ID 54e42e70-dbf3-48c1-a170-78c11581e170 with nextest profile: ci_gammaloop
  369. 19.55 s gammaloop-nextest-spenso> Starting 0 tests across 1 binary
  370. 19.55 s gammaloop-nextest-spenso> ------------
  371. 19.55 s gammaloop-nextest-spenso> Summary [ 0.000s] 0 tests run: 0 passed, 0 skipped
  372. 19.59 s gammaloop-nextest-spenso>
  373. 19.59 s gammaloop-nextest-spenso> ========== nextest test summary ==========
  374. 19.59 s gammaloop-nextest-spenso> report: target/nextest/ci_gammaloop/junit.xml
  375. 19.59 s gammaloop-nextest-spenso> tests: 0, failures: 0, errors: 0
  376. 19.59 s gammaloop-nextest-spenso> No failing testcases found.
  377. 19.59 s gammaloop-nextest-spenso> =========================================
  378. 19.61 s [0 built (1 failed), 0.0error: Cannot build '/nix/store/pn60vy13s1ckr0c5f24izs97bwnqwxqx-gammaloop-nextest-spenso.drv'.
  379. 19.61 s Reason: builder failed with exit code 100.
  380. 19.61 s Output paths:
  381. 19.61 s /nix/store/17qw6dx3kfigd59dmxis8z590cgcrsjb-gammaloop-nextest-spenso
  382. 19.61 s Last 325 log lines:
  383. 19.61 s > Extracting 5 binaries and 2 linked paths to /build/nextest-archive-q6nNCI
  384. 19.61 s > Extracted 19 files to /build/nextest-archive-q6nNCI in 0.16s
  385. 19.61 s > ------------
  386. 19.61 s > Nextest run ID cbe297e1-6d1f-4cae-a878-387b4ec18753 with nextest profile: ci_gammaloop
  387. 19.61 s > Starting 224 tests across 5 binaries (26 tests skipped, including 2 tests via profile.ci_gammaloop.default-filter)
  388. 19.61 s > FAIL [ 0.010s] ( 46/224) idenso color::test::form_reference::metric_contraction_respects_antisymmetric_normalization
  389. 19.61 s > stdout ---
  390. 19.61 s >
  391. 19.61 s > running 1 test
  392. 19.61 s > test color::test::form_reference::metric_contraction_respects_antisymmetric_normalization ... FAILED
  393. 19.61 s >
  394. 19.61 s > failures:
  395. 19.61 s >
  396. 19.61 s > failures:
  397. 19.61 s > color::test::form_reference::metric_contraction_respects_antisymmetric_normalization
  398. 19.61 s >
  399. 19.61 s > test result: FAILED. 0 passed; 1 failed; 0 ignored; 0 measured; 240 filtered out; finished in 0.00s
  400. 19.61 s >
  401. 19.61 s > stderr ---
  402. 19.61 s >
  403. 19.61 s > thread 'color::test::form_reference::metric_contraction_respects_antisymmetric_normalization' (332) panicked at crates/idenso/src/color/test/form_reference.rs:171:5:
  404. 19.61 s > assertion `left == right` failed
  405. 19.61 s > left: "-1*f(coad(8,standalone_metric_j),coad(8,standalone_metric_s),coad(8,standalone_metric_u))"
  406. 19.61 s > right: "f(coad(8,standalone_metric_j),coad(8,standalone_metric_s),coad(8,standalone_metric_u))"
  407. 19.61 s > stack backtrace:
  408. 19.61 s > 0: __rustc::rust_begin_unwind
  409. 19.61 s > 1: core::panicking::panic_fmt
  410. 19.61 s > 2: core::panicking::assert_failed_inner
  411. 19.61 s > 3: core::panicking::assert_failed::<alloc::string::String, alloc::string::String>
  412. 19.61 s > 4: idenso::color::test::form_reference::metric_contraction_respects_antisymmetric_normalization
  413. 19.61 s > 5: <idenso::color::test::form_reference::metric_contraction_respects_antisymmetric_normalization::{closure#0} as core::ops::function::FnOnce<()>>::call_once
  414. 19.61 s > note: Some details are omitted, run with `RUST_BACKTRACE=full` for a verbose backtrace.
  415. 19.61 s >
  416. 19.61 s > FAIL [ 0.040s] (220/224) idenso tensor::tests::parsing::infinite_execution
  417. 19.61 s > stdout ---
  418. 19.61 s >
  419. 19.61 s > running 1 test
  420. 19.61 s > ━━━━━━━━━━━━━━━━━━━━━━━━━━━━━━━ Snapshot Summary ━━━━━━━━━━━━━━━━━━━━━━━━━━━━━━━
  421. 19.61 s > Snapshot: infinite_execution
  422. 19.61 s > Source: crates/idenso/src/tensor/tests/parsing.rs:910
  423. 19.61 s > ────────────────────────────────────────────────────────────────────────────────
  424. 19.61 s > Expression: net_iter.snapshot_dot()
  425. 19.61 s > ────────────────────────────────────────────────────────────────────────────────
  426. 19.61 s > -old snapshot
  427. 19.61 s > +new results
  428. 19.61 s > ────────────┬───────────────────────────────────────────────────────────────────
  429. 19.61 s > 8 8 │ 0:0:s -> ext0 [id=0 color="red"];
  430. 19.61 s > 9 9 │ ext1 [style=invis];
  431. 19.61 s > 10 10 │ 0:5:s -> ext1 [id=1 dir=none color="red" label="mink4|l_0"];
  432. 19.61 s > 11 11 │ ext2 [style=invis];
  433. 19.61 s > 12 │- 0:4:s -> ext2 [id=2 dir=none color="red" label="bis4|l_2"];
  434. 19.61 s > 12 │+ 0:3:s -> ext2 [id=2 dir=none color="red" label="mink4|l_1"];
  435. 19.61 s > 13 13 │ ext3 [style=invis];
  436. 19.61 s > 14 │- 0:3:s -> ext3 [id=3 dir=none color="red" label="bis4|l_3"];
  437. 19.61 s > 14 │+ 0:1:s -> ext3 [id=3 dir=none color="red" label="bis4|l_2"];
  438. 19.61 s > 15 15 │ ext4 [style=invis];
  439. 19.61 s > 16 │- 0:1:s -> ext4 [id=4 dir=none color="red" label="mink4|l_1"];
  440. 19.61 s > 16 │+ 0:2:s -> ext4 [id=4 dir=none color="red" label="mink4|l_4"];
  441. 19.61 s > 17 17 │ ext5 [style=invis];
  442. 19.61 s > 18 │- 0:2:s -> ext5 [id=5 dir=none color="red" label="mink4|l_4"];
  443. 19.61 s > 18 │+ 0:4:s -> ext5 [id=5 dir=none color="red" label="bis4|l_3"];
  444. 19.61 s > 19 19 │ }
  445. 19.61 s > ────────────┴───────────────────────────────────────────────────────────────────
  446. 19.61 s > To update snapshots run `cargo insta review`
  447. 19.61 s > Stopped on the first failure. Run `cargo insta test` to run all snapshots.
  448. 19.61 s > test tensor::tests::parsing::infinite_execution ... FAILED
  449. 19.61 s >
  450. 19.61 s > failures:
  451. 19.61 s >
  452. 19.61 s > failures:
  453. 19.61 s > tensor::tests::parsing::infinite_execution
  454. 19.61 s >
  455. 19.61 s > test result: FAILED. 0 passed; 1 failed; 0 ignored; 0 measured; 240 filtered out; finished in 0.03s
  456. 19.61 s >
  457. 19.61 s > stderr ---
  458. 19.61 s >
  459. 19.61 s > thread 'tensor::tests::parsing::infinite_execution' (840) panicked at /nix/store/9a12dww58xis3an3kmn597llpijv83b1-vendor-cargo-deps/c19b7c6f923b580ac259164a89f2577984ad5ab09ee9d583b888f934adbbe8d0/insta-1.47.2/src/runtime.rs:719:13:
  460. 19.61 s > snapshot assertion for 'infinite_execution' failed in line 910
  461. 19.61 s > stack backtrace:
  462. 19.61 s > 0: __rustc::rust_begin_unwind
  463. 19.61 s > 1: core::panicking::panic_fmt
  464. 19.61 s > 2: insta::runtime::assert_snapshot
  465. 19.61 s > 3: idenso::tensor::tests::parsing::infinite_execution
  466. 19.61 s > 4: <idenso::tensor::tests::parsing::infinite_execution::{closure#0} as core::ops::function::FnOnce<()>>::call_once
  467. 19.61 s > note: Some details are omitted, run with `RUST_BACKTRACE=full` for a verbose backtrace.
  468. 19.61 s >
  469. 19.61 s > ------------
  470. 19.61 s > Summary [ 1.541s] 224 tests run: 222 passed, 2 failed, 26 skipped
  471. 19.61 s > FAIL [ 0.010s] ( 46/224) idenso color::test::form_reference::metric_contraction_respects_antisymmetric_normalization
  472. 19.61 s > stdout ---
  473. 19.61 s >
  474. 19.61 s > running 1 test
  475. 19.61 s > test color::test::form_reference::metric_contraction_respects_antisymmetric_normalization ... FAILED
  476. 19.61 s >
  477. 19.61 s > failures:
  478. 19.61 s >
  479. 19.61 s > failures:
  480. 19.61 s > color::test::form_reference::metric_contraction_respects_antisymmetric_normalization
  481. 19.61 s >
  482. 19.61 s > test result: FAILED. 0 passed; 1 failed; 0 ignored; 0 measured; 240 filtered out; finished in 0.00s
  483. 19.61 s >
  484. 19.61 s > stderr ---
  485. 19.61 s >
  486. 19.61 s > thread 'color::test::form_reference::metric_contraction_respects_antisymmetric_normalization' (332) panicked at crates/idenso/src/color/test/form_reference.rs:171:5:
  487. 19.61 s > assertion `left == right` failed
  488. 19.61 s > left: "-1*f(coad(8,standalone_metric_j),coad(8,standalone_metric_s),coad(8,standalone_metric_u))"
  489. 19.61 s > right: "f(coad(8,standalone_metric_j),coad(8,standalone_metric_s),coad(8,standalone_metric_u))"
  490. 19.61 s > stack backtrace:
  491. 19.61 s > 0: __rustc::rust_begin_unwind
  492. 19.61 s > 1: core::panicking::panic_fmt
  493. 19.61 s > 2: core::panicking::assert_failed_inner
  494. 19.61 s > 3: core::panicking::assert_failed::<alloc::string::String, alloc::string::String>
  495. 19.61 s > 4: idenso::color::test::form_reference::metric_contraction_respects_antisymmetric_normalization
  496. 19.61 s > 5: <idenso::color::test::form_reference::metric_contraction_respects_antisymmetric_normalization::{closure#0} as core::ops::function::FnOnce<()>>::call_once
  497. 19.61 s > note: Some details are omitted, run with `RUST_BACKTRACE=full` for a verbose backtrace.
  498. 19.61 s >
  499. 19.61 s > FAIL [ 0.040s] (220/224) idenso tensor::tests::parsing::infinite_execution
  500. 19.61 s > stdout ---
  501. 19.61 s >
  502. 19.61 s > running 1 test
  503. 19.61 s > ━━━━━━━━━━━━━━━━━━━━━━━━━━━━━━━ Snapshot Summary ━━━━━━━━━━━━━━━━━━━━━━━━━━━━━━━
  504. 19.61 s > Snapshot: infinite_execution
  505. 19.61 s > Source: crates/idenso/src/tensor/tests/parsing.rs:910
  506. 19.61 s > ────────────────────────────────────────────────────────────────────────────────
  507. 19.61 s > Expression: net_iter.snapshot_dot()
  508. 19.61 s > ────────────────────────────────────────────────────────────────────────────────
  509. 19.61 s > -old snapshot
  510. 19.61 s > +new results
  511. 19.61 s > ────────────┬───────────────────────────────────────────────────────────────────
  512. 19.61 s > 8 8 │ 0:0:s -> ext0 [id=0 color="red"];
  513. 19.61 s > 9 9 │ ext1 [style=invis];
  514. 19.61 s > 10 10 │ 0:5:s -> ext1 [id=1 dir=none color="red" label="mink4|l_0"];
  515. 19.61 s > 11 11 │ ext2 [style=invis];
  516. 19.61 s > 12 │- 0:4:s -> ext2 [id=2 dir=none color="red" label="bis4|l_2"];
  517. 19.61 s > 12 │+ 0:3:s -> ext2 [id=2 dir=none color="red" label="mink4|l_1"];
  518. 19.61 s > 13 13 │ ext3 [style=invis];
  519. 19.61 s > 14 │- 0:3:s -> ext3 [id=3 dir=none color="red" label="bis4|l_3"];
  520. 19.61 s > 14 │+ 0:1:s -> ext3 [id=3 dir=none color="red" label="bis4|l_2"];
  521. 19.61 s > 15 15 │ ext4 [style=invis];
  522. 19.61 s > 16 │- 0:1:s -> ext4 [id=4 dir=none color="red" label="mink4|l_1"];
  523. 19.61 s > 16 │+ 0:2:s -> ext4 [id=4 dir=none color="red" label="mink4|l_4"];
  524. 19.61 s > 17 17 │ ext5 [style=invis];
  525. 19.61 s > 18 │- 0:2:s -> ext5 [id=5 dir=none color="red" label="mink4|l_4"];
  526. 19.61 s > 18 │+ 0:4:s -> ext5 [id=5 dir=none color="red" label="bis4|l_3"];
  527. 19.61 s > 19 19 │ }
  528. 19.61 s > ────────────┴───────────────────────────────────────────────────────────────────
  529. 19.61 s > To update snapshots run `cargo insta review`
  530. 19.61 s > Stopped on the first failure. Run `cargo insta test` to run all snapshots.
  531. 19.61 s > test tensor::tests::parsing::infinite_execution ... FAILED
  532. 19.61 s >
  533. 19.61 s > failures:
  534. 19.61 s >
  535. 19.61 s > failures:
  536. 19.61 s > tensor::tests::parsing::infinite_execution
  537. 19.61 s >
  538. 19.61 s > test result: FAILED. 0 passed; 1 failed; 0 ignored; 0 measured; 240 filtered out; finished in 0.03s
  539. 19.61 s >
  540. 19.61 s > stderr ---
  541. 19.61 s >
  542. 19.61 s > thread 'tensor::tests::parsing::infinite_execution' (840) panicked at /nix/store/9a12dww58xis3an3kmn597llpijv83b1-vendor-cargo-deps/c19b7c6f923b580ac259164a89f2577984ad5ab09ee9d583b888f934adbbe8d0/insta-1.47.2/src/runtime.rs:719:13:
  543. 19.61 s > snapshot assertion for 'infinite_execution' failed in line 910
  544. 19.61 s > stack backtrace:
  545. 19.61 s > 0: __rustc::rust_begin_unwind
  546. 19.61 s > 1: core::panicking::panic_fmt
  547. 19.61 s > 2: insta::runtime::assert_snapshot
  548. 19.61 s > 3: idenso::tensor::tests::parsing::infinite_execution
  549. 19.61 s > 4: <idenso::tensor::tests::parsing::infinite_execution::{closure#0} as core::ops::function::FnOnce<()>>::call_once
  550. 19.61 s > note: Some details are omitted, run with `RUST_BACKTRACE=full` for a verbose backtrace.
  551. 19.61 s >
  552. 19.61 s > error: test run failed
  553. 19.61 s >
  554. 19.61 s > ========== nextest test summary ==========
  555. 19.61 s > report: target/nextest/ci_gammaloop/junit.xml
  556. 19.61 s > tests: 224, failures: 2, errors: 0
  557. 19.61 s >
  558. 19.61 s > 1. idenso::color::test::form_reference::metric_contraction_respects_antisymmetric_normalization
  559. 19.61 s > failure: test failure with exit code 101
  560. 19.61 s > thread 'color::test::form_reference::metric_contraction_respects_antisymmetric_normalization' (332) panicked at crates/idenso/src/color/test/form_reference.rs:171:5:
  561. 19.61 s > assertion `left == right` failed
  562. 19.61 s > left: "-1*f(coad(8,standalone_metric_j),coad(8,standalone_metric_s),coad(8,standalone_metric_u))"
  563. 19.61 s > right: "f(coad(8,standalone_metric_j),coad(8,standalone_metric_s),coad(8,standalone_metric_u))"
  564. 19.61 s > stack backtrace:
  565. 19.61 s > 0: __rustc::rust_begin_unwind
  566. 19.61 s > 1: core::panicking::panic_fmt
  567. 19.61 s > 2: core::panicking::assert_failed_inner
  568. 19.61 s > 3: core::panicking::assert_failed::<alloc::string::String, alloc::string::String>
  569. 19.61 s > 4: idenso::color::test::form_reference::metric_contraction_respects_antisymmetric_normalization
  570. 19.61 s > 5: <idenso::color::test::form_reference::metric_contraction_respects_antisymmetric_normalization::{closure#0} as core::ops::function::FnOnce<()>>::call_once
  571. 19.61 s > note: Some details are omitted, run with `RUST_BACKTRACE=full` for a verbose backtrace.
  572. 19.61 s > system-out
  573. 19.61 s > running 1 test
  574. 19.61 s > test color::test::form_reference::metric_contraction_respects_antisymmetric_normalization ... FAILED
  575. 19.61 s >
  576. 19.61 s > failures:
  577. 19.61 s >
  578. 19.61 s > failures:
  579. 19.61 s > color::test::form_reference::metric_contraction_respects_antisymmetric_normalization
  580. 19.61 s >
  581. 19.61 s > test result: FAILED. 0 passed; 1 failed; 0 ignored; 0 measured; 240 filtered out; finished in 0.00s
  582. 19.61 s > system-err
  583. 19.61 s > thread 'color::test::form_reference::metric_contraction_respects_antisymmetric_normalization' (332) panicked at crates/idenso/src/color/test/form_reference.rs:171:5:
  584. 19.61 s > assertion `left == right` failed
  585. 19.61 s > left: "-1*f(coad(8,standalone_metric_j),coad(8,standalone_metric_s),coad(8,standalone_metric_u))"
  586. 19.61 s > right: "f(coad(8,standalone_metric_j),coad(8,standalone_metric_s),coad(8,standalone_metric_u))"
  587. 19.61 s > stack backtrace:
  588. 19.61 s > 0: __rustc::rust_begin_unwind
  589. 19.61 s > 1: core::panicking::panic_fmt
  590. 19.61 s > 2: core::panicking::assert_failed_inner
  591. 19.61 s > 3: core::panicking::assert_failed::<alloc::string::String, alloc::string::String>
  592. 19.61 s > 4: idenso::color::test::form_reference::metric_contraction_respects_antisymmetric_normalization
  593. 19.61 s > 5: <idenso::color::test::form_reference::metric_contraction_respects_antisymmetric_normalization::{closure#0} as core::ops::function::FnOnce<()>>::call_once
  594. 19.61 s > note: Some details are omitted, run with `RUST_BACKTRACE=full` for a verbose backtrace.
  595. 19.61 s >
  596. 19.61 s > 2. idenso::tensor::tests::parsing::infinite_execution
  597. 19.61 s > failure: test failure with exit code 101
  598. 19.61 s > thread 'tensor::tests::parsing::infinite_execution' (840) panicked at /nix/store/9a12dww58xis3an3kmn597llpijv83b1-vendor-cargo-deps/c19b7c6f923b580ac259164a89f2577984ad5ab09ee9d583b888f934adbbe8d0/insta-1.47.2/src/runtime.rs:719:13:
  599. 19.61 s > snapshot assertion for 'infinite_execution' failed in line 910
  600. 19.61 s > stack backtrace:
  601. 19.61 s > 0: __rustc::rust_begin_unwind
  602. 19.61 s > 1: core::panicking::panic_fmt
  603. 19.61 s > 2: insta::runtime::assert_snapshot
  604. 19.61 s > 3: idenso::tensor::tests::parsing::infinite_execution
  605. 19.61 s > 4: <idenso::tensor::tests::parsing::infinite_execution::{closure#0} as core::ops::function::FnOnce<()>>::call_once
  606. 19.61 s > note: Some details are omitted, run with `RUST_BACKTRACE=full` for a verbose backtrace.
  607. 19.61 s > system-out
  608. 19.61 s > running 1 test
  609. 19.61 s > ━━━━━━━━━━━━━━━━━━━━━━━━━━━━━━━ Snapshot Summary ━━━━━━━━━━━━━━━━━━━━━━━━━━━━━━━
  610. 19.61 s > Snapshot: infinite_execution
  611. 19.61 s > Source: crates/idenso/src/tensor/tests/parsing.rs:910
  612. 19.61 s > ────────────────────────────────────────────────────────────────────────────────
  613. 19.61 s > Expression: net_iter.snapshot_dot()
  614. 19.61 s > ────────────────────────────────────────────────────────────────────────────────
  615. 19.61 s > -old snapshot
  616. 19.61 s > +new results
  617. 19.61 s > ────────────┬───────────────────────────────────────────────────────────────────
  618. 19.61 s > 8 8 │ 0:0:s-> ext0 [id=0 color="red"];
  619. 19.61 s > 9 9 │ ext1 [style=invis];
  620. 19.61 s > 10 10 │ 0:5:s-> ext1 [id=1 dir=none color="red" label="mink4|l_0"];
  621. 19.61 s > 11 11 │ ext2 [style=invis];
  622. 19.61 s > 12 │- 0:4:s-> ext2 [id=2 dir=none color="red" label="bis4|l_2"];
  623. 19.61 s > 12 │+ 0:3:s-> ext2 [id=2 dir=none color="red" label="mink4|l_1"];
  624. 19.61 s > 13 13 │ ext3 [style=invis];
  625. 19.61 s > 14 │- 0:3:s-> ext3 [id=3 dir=none color="red" label="bis4|l_3"];
  626. 19.61 s > 14 │+ 0:1:s-> ext3 [id=3 dir=none color="red" label="bis4|l_2"];
  627. 19.61 s > 15 15 │ ext4 [style=invis];
  628. 19.61 s > 16 │- 0:1:s-> ext4 [id=4 dir=none color="red" label="mink4|l_1"];
  629. 19.61 s > 16 │+ 0:2:s-> ext4 [id=4 dir=none color="red" label="mink4|l_4"];
  630. 19.61 s > 17 17 │ ext5 [style=invis];
  631. 19.61 s > 18 │- 0:2:s-> ext5 [id=5 dir=none color="red" label="mink4|l_4"];
  632. 19.61 s > 18 │+ 0:4:s-> ext5 [id=5 dir=none color="red" label="bis4|l_3"];
  633. 19.61 s > 19 19 │ }
  634. 19.61 s > ────────────┴───────────────────────────────────────────────────────────────────
  635. 19.61 s > To update snapshots run `cargo insta review`
  636. 19.61 s > Stopped on the first failure. Run `cargo insta test` to run all snapshots.
  637. 19.61 s > test tensor::tests::parsing::infinite_execution ... FAILED
  638. 19.61 s >
  639. 19.61 s > failures:
  640. 19.61 s >
  641. 19.61 s > failures:
  642. 19.61 s > tensor::tests::parsing::infinite_execution
  643. 19.61 s >
  644. 19.61 s > test result: FAILED. 0 passed; 1 failed; 0 ignored; 0 measured; 240 filtered out; finished in 0.03s
  645. 19.61 s > system-err
  646. 19.61 s > thread 'tensor::tests::parsing::infinite_execution' (840) panicked at /nix/store/9a12dww58xis3an3kmn597llpijv83b1-vendor-cargo-deps/c19b7c6f923b580ac259164a89f2577984ad5ab09ee9d583b888f934adbbe8d0/insta-1.47.2/src/runtime.rs:719:13:
  647. 19.61 s > snapshot assertion for 'infinite_execution' failed in line 910
  648. 19.61 s > stack backtrace:
  649. 19.61 s > 0: __rustc::rust_begin_unwind
  650. 19.61 s > 1: core::panicking::panic_fmt
  651. 19.61 s > 2: insta::runtime::assert_snapshot
  652. 19.61 s > 3: idenso::tensor::tests::parsing::infinite_execution
  653. 19.61 s > 4: <idenso::tensor::tests::parsing::infinite_execution::{closure#0} as core::ops::function::FnOnce<()>>::call_once
  654. 19.61 s > note: Some details are omitted, run with `RUST_BACKTRACE=full` for a verbose backtrace.
  655. 19.61 s > =========================================
  656. 19.61 s > Extracting 2 binaries and 1 linked path to /build/nextest-archive-fVYoA0
  657. 19.61 s > Extracted 8 files to /build/nextest-archive-fVYoA0 in 0.07s
  658. 19.61 s > ------------
  659. 19.61 s > Nextest run ID 0b7fa40b-0624-42e0-ad19-b005a25eb7fb with nextest profile: ci_gammaloop
  660. 19.61 s > Starting 135 tests across 2 binaries
  661. 19.61 s > ------------
  662. 19.61 s > Summary [ 0.075s] 135 tests run: 135 passed, 0 skipped
  663. 19.61 s >
  664. 19.61 s > ========== nextest test summary ==========
  665. 19.61 s > report: target/nextest/ci_gammaloop/junit.xml
  666. 19.61 s > tests: 135, failures: 0, errors: 0
  667. 19.61 s > No failing testcases found.
  668. 19.61 s > =========================================
  669. 19.61 s > Extracting 5 binaries and 2 linked paths to /build/nextest-archive-Z1LVlT
  670. 19.61 s > Extracted 19 files to /build/nextest-archive-Z1LVlT in 0.18s
  671. 19.61 s > ------------
  672. 19.61 s > Nextest run ID 8f5cce55-79e6-4d09-8143-51c8372fcb77 with nextest profile: ci_gammaloop
  673. 19.61 s > Starting 25 tests across 5 binaries (1 test skipped via profile.ci_gammaloop.default-filter)
  674. 19.61 s > ------------
  675. 19.61 s > Summary [ 0.184s] 25 tests run: 25 passed, 1 skipped
  676. 19.61 s >
  677. 19.61 s > ========== nextest test summary ==========
  678. 19.61 s > report: target/nextest/ci_gammaloop/junit.xml
  679. 19.61 s > tests: 25, failures: 0, errors: 0
  680. 19.61 s > No failing testcases found.
  681. 19.61 s > =========================================
  682. 19.61 s > Extracting 2 binaries and 1 linked path to /build/nextest-archive-fDgQvf
  683. 19.61 s > Extracted 8 files to /build/nextest-archive-fDgQvf in 0.05s
  684. 19.61 s > ------------
  685. 19.61 s > Nextest run ID adb4d8cb-d2df-4b76-8ff6-878521950302 with nextest profile: ci_gammaloop
  686. 19.61 s > Starting 1 test across 2 binaries
  687. 19.61 s > ------------
  688. 19.61 s > Summary [ 0.005s] 1 test run: 1 passed, 0 skipped
  689. 19.61 s >
  690. 19.61 s > ========== nextest test summary ==========
  691. 19.61 s > report: target/nextest/ci_gammaloop/junit.xml
  692. 19.61 s > tests: 1, failures: 0, errors: 0
  693. 19.61 s > No failing testcases found.
  694. 19.61 s > =========================================
  695. 19.61 s > Extracting 1 binary and 1 linked path to /build/nextest-archive-eAk938
  696. 19.61 s > Extracted 7 files to /build/nextest-archive-eAk938 in 0.05s
  697. 19.61 s > ------------
  698. 19.61 s > Nextest run ID 54e42e70-dbf3-48c1-a170-78c11581e170 with nextest profile: ci_gammaloop
  699. 19.61 s > Starting 0 tests across 1 binary
  700. 19.61 s > ------------
  701. 19.61 s > Summary [ 0.000s] 0 tests run: 0 passed, 0 skipped
  702. 19.61 s >
  703. 19.61 s > ========== nextest test summary ==========
  704. 19.61 s > report: target/nextest/ci_gammaloop/junit.xml
  705. 19.61 s > tests: 0, failures: 0, errors: 0
  706. 19.61 s > No failing testcases found.
  707. 19.61 s > =========================================
  708. 19.61 s For full logs, run:
  709. 19.61 s nix log /nix/store/pn60vy13s1ckr0c5f24izs97bwnqwxqx-gammaloop-nextest-spenso.drv
  710. 19.70 s Run failed.