test packages.x86_64-linux.nix-ci-check-gammaloop-nextest-core

Reproduce this run
Original Run
  1. 0.98 s $ /nix/store/9ypz3flqsrl5xl495mm8h645gadjsxi1-coreutils-9.11/bin/timeout --kill-after=15s 7200s /nix/store/23zk8sgzamrbmj1fday15szf7f2279s8-nix-2.34.7/bin/nix --extra-experimental-features nix-command --extra-experimental-features flakes flake clone git+https://github.com/alphal00p/gammaloop --dest /tmp/nix-ci-worker/stable-pwd/repo/
  2. 1.46 s Cloning into '/tmp/nix-ci-worker/stable-pwd/repo'...
  3. 1.46 s remote: Enumerating objects: 65018, done.
  4. 1.46 s remote: Counting objects: 0% (1/7690) remote: Counting objects: 1% (77/7690) remote: Counting objects: 2% (154/7690) remote: Counting objects: 3% (231/7690) remote: Counting objects: 4% (308/7690) remote: Counting objects: 5% (385/7690) remote: Counting objects: 6% (462/7690) remote: Counting objects: 7% (539/7690) remote: Counting objects: 8% (616/7690) remote: Counting objects: 9% (693/7690) remote: Counting objects: 10% (769/7690) remote: Counting objects: 11% (846/7690) remote: Counting objects: 12% (923/7690) remote: Counting objects: 13% (1000/7690) remote: Counting objects: 14% (1077/7690) remote: Counting objects: 15% (1154/7690) remote: Counting objects: 16% (1231/7690) remote: Counting objects: 17% (1308/7690) remote: Counting objects: 18% (1385/7690) remote: Counting objects: 19% (1462/7690) remote: Counting objects: 20% (1538/7690) remote: Counting objects: 21% (1615/7690) remote: Counting objects: 22% (1692/7690) remote: Counting objects: 23% (1769/7690) remote: Counting objects: 24% (1846/7690) remote: Counting objects: 25% (1923/7690) remote: Counting objects: 26% (2000/7690) remote: Counting objects: 27% (2077/7690) remote: Counting objects: 28% (2154/7690) remote: Counting objects: 29% (2231/7690) remote: Counting objects: 30% (2307/7690) remote: Counting objects: 31% (2384/7690) remote: Counting objects: 32% (2461/7690) remote: Counting objects: 33% (2538/7690) remote: Counting objects: 34% (2615/7690) remote: Counting objects: 35% (2692/7690) remote: Counting objects: 36% (2769/7690) remote: Counting objects: 37% (2846/7690) remote: Counting objects: 38% (2923/7690) remote: Counting objects: 39% (3000/7690) remote: Counting objects: 40% (3076/7690) remote: Counting objects: 41% (3153/7690) remote: Counting objects: 42% (3230/7690) remote: Counting objects: 43% (3307/7690) remote: Counting objects: 44% (3384/7690) remote: Counting objects: 45% (3461/7690) remote: Counting objects: 46% (3538/7690) remote: Counting objects: 47% (3615/7690) remote: Counting objects: 48% (3692/7690) remote: Counting objects: 49% (3769/7690) remote: Counting objects: 50% (3845/7690) remote: Counting objects: 51% (3922/7690) remote: Counting objects: 52% (3999/7690) remote: Counting objects: 53% (4076/7690) remote: Counting objects: 54% (4153/7690) remote: Counting objects: 55% (4230/7690) remote: Counting objects: 56% (4307/7690) remote: Counting objects: 57% (4384/7690) remote: Counting objects: 58% (4461/7690) remote: Counting objects: 59% (4538/7690) remote: Counting objects: 60% (4614/7690) remote: Counting objects: 61% (4691/7690) remote: Counting objects: 62% (4768/7690) remote: Counting objects: 63% (4845/7690) remote: Counting objects: 64% (4922/7690) remote: Counting objects: 65% (4999/7690) remote: Counting objects: 66% (5076/7690) remote: Counting objects: 67% (5153/7690) remote: Counting objects: 68% (5230/7690) remote: Counting objects: 69% (5307/7690) remote: Counting objects: 70% (5383/7690) remote: Counting objects: 71% (5460/7690) remote: Counting objects: 72% (5537/7690) remote: Counting objects: 73% (5614/7690) remote: Counting objects: 74% (5691/7690) remote: Counting objects: 75% (5768/7690) remote: Counting objects: 76% (5845/7690) remote: Counting objects: 77% (5922/7690) remote: Counting objects: 78% (5999/7690) remote: Counting objects: 79% (6076/7690) remote: Counting objects: 80% (6152/7690) remote: Counting objects: 81% (6229/7690) remote: Counting objects: 82% (6306/7690) remote: Counting objects: 83% (6383/7690) remote: Counting objects: 84% (6460/7690) remote: Counting objects: 85% (6537/7690) remote: Counting objects: 86% (6614/7690) remote: Counting objects: 87% (6691/7690) remote: Counting objects: 88% (6768/7690) remote: Counting objects: 89% (6845/7690) remote: Counting objects: 90% (6921/7690) remote: Counting objects: 91% (6998/7690) remote: Counting objects: 92% (7075/7690) remote: Counting objects: 93% (7152/7690) remote: Counting objects: 94% (7229/7690) remote: Counting objects: 95% (7306/7690) remote: Counting objects: 96% (7383/7690) remote: Counting objects: 97% (7460/7690) remote: Counting objects: 98% (7537/7690) remote: Counting objects: 99% (7614/7690) remote: Counting objects: 100% (7690/7690) remote: Counting objects: 100% (7690/7690), done.
  5. 2.26 s remote: Compressing objects: 0% (1/1405) remote: Compressing objects: 1% (15/1405) remote: Compressing objects: 2% (29/1405) remote: Compressing objects: 3% (43/1405) remote: Compressing objects: 4% (57/1405) remote: Compressing objects: 5% (71/1405) remote: Compressing objects: 6% (85/1405) remote: Compressing objects: 7% (99/1405) remote: Compressing objects: 8% (113/1405) remote: Compressing objects: 9% (127/1405) remote: Compressing objects: 10% (141/1405) remote: Compressing objects: 11% (155/1405) remote: Compressing objects: 12% (169/1405) remote: Compressing objects: 12% (178/1405) remote: Compressing objects: 13% (183/1405) remote: Compressing objects: 14% (197/1405) remote: Compressing objects: 15% (211/1405) remote: Compressing objects: 16% (225/1405) remote: Compressing objects: 17% (239/1405) remote: Compressing objects: 18% (253/1405) remote: Compressing objects: 19% (267/1405) remote: Compressing objects: 20% (281/1405) remote: Compressing objects: 21% (296/1405) remote: Compressing objects: 22% (310/1405) remote: Compressing objects: 23% (324/1405) remote: Compressing objects: 24% (338/1405) remote: Compressing objects: 25% (352/1405) remote: Compressing objects: 26% (366/1405) remote: Compressing objects: 27% (380/1405) remote: Compressing objects: 28% (394/1405) remote: Compressing objects: 29% (408/1405) remote: Compressing objects: 30% (422/1405) remote: Compressing objects: 31% (436/1405) remote: Compressing objects: 32% (450/1405) remote: Compressing objects: 33% (464/1405) remote: Compressing objects: 34% (478/1405) remote: Compressing objects: 35% (492/1405) remote: Compressing objects: 36% (506/1405) remote: Compressing objects: 37% (520/1405) remote: Compressing objects: 38% (534/1405) remote: Compressing objects: 39% (548/1405) remote: Compressing objects: 40% (562/1405) remote: Compressing objects: 41% (577/1405) remote: Compressing objects: 42% (591/1405) remote: Compressing objects: 43% (605/1405) remote: Compressing objects: 44% (619/1405) remote: Compressing objects: 45% (633/1405) remote: Compressing objects: 46% (647/1405) remote: Compressing objects: 47% (661/1405) remote: Compressing objects: 48% (675/1405) remote: Compressing objects: 49% (689/1405) remote: Compressing objects: 50% (703/1405) remote: Compressing objects: 51% (717/1405) remote: Compressing objects: 52% (731/1405) remote: Compressing objects: 53% (745/1405) remote: Compressing objects: 54% (759/1405) remote: Compressing objects: 55% (773/1405) remote: Compressing objects: 56% (787/1405) remote: Compressing objects: 57% (801/1405) remote: Compressing objects: 58% (815/1405) remote: Compressing objects: 59% (829/1405) remote: Compressing objects: 60% (843/1405) remote: Compressing objects: 61% (858/1405) remote: Compressing objects: 62% (872/1405) remote: Compressing objects: 63% (886/1405) remote: Compressing objects: 64% (900/1405) remote: Compressing objects: 65% (914/1405) remote: Compressing objects: 66% (928/1405) remote: Compressing objects: 67% (942/1405) remote: Compressing objects: 68% (956/1405) remote: Compressing objects: 69% (970/1405) remote: Compressing objects: 70% (984/1405) remote: Compressing objects: 71% (998/1405) remote: Compressing objects: 72% (1012/1405) remote: Compressing objects: 73% (1026/1405) remote: Compressing objects: 74% (1040/1405) remote: Compressing objects: 75% (1054/1405) remote: Compressing objects: 76% (1068/1405) remote: Compressing objects: 77% (1082/1405) remote: Compressing objects: 78% (1096/1405) remote: Compressing objects: 79% (1110/1405) remote: Compressing objects: 80% (1124/1405) remote: Compressing objects: 81% (1139/1405) remote: Compressing objects: 82% (1153/1405) remote: Compressing objects: 83% (1167/1405) remote: Compressing objects: 84% (1181/1405) remote: Compressing objects: 85% (1195/1405) remote: Compressing objects: 86% (1209/1405) remote: Compressing objects: 87% (1223/1405) remote: Compressing objects: 88% (1237/1405) remote: Compressing objects: 89% (1251/1405) remote: Compressing objects: 90% (1265/1405) remote: Compressing objects: 91% (1279/1405) remote: Compressing objects: 92% (1293/1405) remote: Compressing objects: 93% (1307/1405) remote: Compressing objects: 94% (1321/1405) remote: Compressing objects: 95% (1335/1405) remote: Compressing objects: 96% (1349/1405) remote: Compressing objects: 97% (1363/1405) remote: Compressing objects: 98% (1377/1405) remote: Compressing objects: 99% (1391/1405) remote: Compressing objects: 100% (1405/1405) remote: Compressing objects: 100% (1405/1405), done.
  6. 4.92 s Receiving objects: 0% (1/65018) Receiving objects: 1% (651/65018) Receiving objects: 2% (1301/65018) Receiving objects: 3% (1951/65018) Receiving objects: 4% (2601/65018) Receiving objects: 5% (3251/65018) Receiving objects: 6% (3902/65018) Receiving objects: 7% (4552/65018) Receiving objects: 8% (5202/65018), 9.41 MiB | 18.80 MiB/s Receiving objects: 9% (5852/65018), 9.41 MiB | 18.80 MiB/s Receiving objects: 10% (6502/65018), 9.41 MiB | 18.80 MiB/s Receiving objects: 11% (7152/65018), 9.41 MiB | 18.80 MiB/s Receiving objects: 12% (7803/65018), 9.41 MiB | 18.80 MiB/s Receiving objects: 13% (8453/65018), 9.41 MiB | 18.80 MiB/s Receiving objects: 14% (9103/65018), 9.41 MiB | 18.80 MiB/s Receiving objects: 15% (9753/65018), 9.41 MiB | 18.80 MiB/s Receiving objects: 16% (10403/65018), 9.41 MiB | 18.80 MiB/s Receiving objects: 17% (11054/65018), 9.41 MiB | 18.80 MiB/s Receiving objects: 18% (11704/65018), 9.41 MiB | 18.80 MiB/s Receiving objects: 19% (12354/65018), 9.41 MiB | 18.80 MiB/s Receiving objects: 20% (13004/65018), 9.41 MiB | 18.80 MiB/s Receiving objects: 21% (13654/65018), 9.41 MiB | 18.80 MiB/s Receiving objects: 22% (14304/65018), 9.41 MiB | 18.80 MiB/s Receiving objects: 23% (14955/65018), 9.41 MiB | 18.80 MiB/s Receiving objects: 24% (15605/65018), 9.41 MiB | 18.80 MiB/s Receiving objects: 25% (16255/65018), 9.41 MiB | 18.80 MiB/s Receiving objects: 26% (16905/65018), 9.41 MiB | 18.80 MiB/s Receiving objects: 27% (17555/65018), 9.41 MiB | 18.80 MiB/s Receiving objects: 28% (18206/65018), 9.41 MiB | 18.80 MiB/s Receiving objects: 29% (18856/65018), 9.41 MiB | 18.80 MiB/s Receiving objects: 30% (19506/65018), 9.41 MiB | 18.80 MiB/s Receiving objects: 31% (20156/65018), 9.41 MiB | 18.80 MiB/s Receiving objects: 32% (20806/65018), 9.41 MiB | 18.80 MiB/s Receiving objects: 33% (21456/65018), 9.41 MiB | 18.80 MiB/s Receiving objects: 34% (22107/65018), 9.41 MiB | 18.80 MiB/s Receiving objects: 35% (22757/65018), 9.41 MiB | 18.80 MiB/s Receiving objects: 36% (23407/65018), 9.41 MiB | 18.80 MiB/s Receiving objects: 37% (24057/65018), 9.41 MiB | 18.80 MiB/s Receiving objects: 38% (24707/65018), 9.41 MiB | 18.80 MiB/s Receiving objects: 39% (25358/65018), 9.41 MiB | 18.80 MiB/s Receiving objects: 39% (25632/65018), 26.40 MiB | 26.39 MiB/s Receiving objects: 40% (26008/65018), 26.40 MiB | 26.39 MiB/s Receiving objects: 41% (26658/65018), 26.40 MiB | 26.39 MiB/s Receiving objects: 42% (27308/65018), 26.40 MiB | 26.39 MiB/s Receiving objects: 43% (27958/65018), 26.40 MiB | 26.39 MiB/s Receiving objects: 44% (28608/65018), 26.40 MiB | 26.39 MiB/s Receiving objects: 45% (29259/65018), 26.40 MiB | 26.39 MiB/s Receiving objects: 46% (29909/65018), 26.40 MiB | 26.39 MiB/s Receiving objects: 47% (30559/65018), 26.40 MiB | 26.39 MiB/s Receiving objects: 48% (31209/65018), 26.40 MiB | 26.39 MiB/s Receiving objects: 49% (31859/65018), 26.40 MiB | 26.39 MiB/s Receiving objects: 50% (32509/65018), 26.40 MiB | 26.39 MiB/s Receiving objects: 51% (33160/65018), 26.40 MiB | 26.39 MiB/s Receiving objects: 52% (33810/65018), 26.40 MiB | 26.39 MiB/s Receiving objects: 53% (34460/65018), 26.40 MiB | 26.39 MiB/s Receiving objects: 54% (35110/65018), 26.40 MiB | 26.39 MiB/s Receiving objects: 55% (35760/65018), 26.40 MiB | 26.39 MiB/s Receiving objects: 56% (36411/65018), 26.40 MiB | 26.39 MiB/s Receiving objects: 57% (37061/65018), 26.40 MiB | 26.39 MiB/s Receiving objects: 58% (37711/65018), 26.40 MiB | 26.39 MiB/s Receiving objects: 59% (38361/65018), 26.40 MiB | 26.39 MiB/s Receiving objects: 60% (39011/65018), 26.40 MiB | 26.39 MiB/s Receiving objects: 61% (39661/65018), 26.40 MiB | 26.39 MiB/s Receiving objects: 62% (40312/65018), 26.40 MiB | 26.39 MiB/s Receiving objects: 63% (40962/65018), 48.58 MiB | 32.24 MiB/s Receiving objects: 64% (41612/65018), 48.58 MiB | 32.24 MiB/s Receiving objects: 65% (42262/65018), 48.58 MiB | 32.24 MiB/s Receiving objects: 66% (42912/65018), 48.58 MiB | 32.24 MiB/s Receiving objects: 67% (43563/65018), 48.58 MiB | 32.24 MiB/s Receiving objects: 68% (44213/65018), 48.58 MiB | 32.24 MiB/s Receiving objects: 69% (44863/65018), 48.58 MiB | 32.24 MiB/s Receiving objects: 70% (45513/65018), 48.58 MiB | 32.24 MiB/s Receiving objects: 71% (46163/65018), 48.58 MiB | 32.24 MiB/s Receiving objects: 72% (46813/65018), 48.58 MiB | 32.24 MiB/s Receiving objects: 73% (47464/65018), 48.58 MiB | 32.24 MiB/s Receiving objects: 74% (48114/65018), 48.58 MiB | 32.24 MiB/s Receiving objects: 75% (48764/65018), 48.58 MiB | 32.24 MiB/s Receiving objects: 75% (48902/65018), 65.46 MiB | 32.61 MiB/s Receiving objects: 76% (49414/65018), 65.46 MiB | 32.61 MiB/s Receiving objects: 77% (50064/65018), 65.46 MiB | 32.61 MiB/s Receiving objects: 78% (50715/65018), 65.46 MiB | 32.61 MiB/s Receiving objects: 79% (51365/65018), 65.46 MiB | 32.61 MiB/s Receiving objects: 80% (52015/65018), 65.46 MiB | 32.61 MiB/s Receiving objects: 81% (52665/65018), 65.46 MiB | 32.61 MiB/s Receiving objects: 82% (53315/65018), 65.46 MiB | 32.61 MiB/s Receiving objects: 83% (53965/65018), 65.46 MiB | 32.61 MiB/s Receiving objects: 84% (54616/65018), 65.46 MiB | 32.61 MiB/s Receiving objects: 85% (55266/65018), 65.46 MiB | 32.61 MiB/s Receiving objects: 86% (55916/65018), 65.46 MiB | 32.61 MiB/s Receiving objects: 87% (56566/65018), 65.46 MiB | 32.61 MiB/s Receiving objects: 88% (57216/65018), 65.46 MiB | 32.61 MiB/s Receiving objects: 89% (57867/65018), 65.46 MiB | 32.61 MiB/s Receiving objects: 90% (58517/65018), 65.46 MiB | 32.61 MiB/s Receiving objects: 91% (59167/65018), 65.46 MiB | 32.61 MiB/s Receiving objects: 92% (59817/65018), 65.46 MiB | 32.61 MiB/s Receiving objects: 93% (60467/65018), 65.46 MiB | 32.61 MiB/s Receiving objects: 94% (61117/65018), 82.97 MiB | 32.84 MiB/s Receiving objects: 95% (61768/65018), 82.97 MiB | 32.84 MiB/s Receiving objects: 96% (62418/65018), 82.97 MiB | 32.84 MiB/s Receiving objects: 97% (63068/65018), 82.97 MiB | 32.84 MiB/s Receiving objects: 98% (63718/65018), 82.97 MiB | 32.84 MiB/s Receiving objects: 99% (64368/65018), 82.97 MiB | 32.84 MiB/s remote: Total 65018 (delta 6803), reused 6286 (delta 6285), pack-reused 57328 (from 1)
  7. 4.92 s Receiving objects: 100% (65018/65018), 82.97 MiB | 32.84 MiB/s Receiving objects: 100% (65018/65018), 86.93 MiB | 32.69 MiB/s, done.
  8. 6.07 s Resolving deltas: 0% (0/45900) Resolving deltas: 1% (459/45900) Resolving deltas: 2% (918/45900) Resolving deltas: 3% (1377/45900) Resolving deltas: 4% (1836/45900) Resolving deltas: 5% (2298/45900) Resolving deltas: 6% (2754/45900) Resolving deltas: 7% (3213/45900) Resolving deltas: 8% (3672/45900) Resolving deltas: 9% (4131/45900) Resolving deltas: 10% (4590/45900) Resolving deltas: 11% (5049/45900) Resolving deltas: 12% (5508/45900) Resolving deltas: 13% (5967/45900) Resolving deltas: 14% (6426/45900) Resolving deltas: 15% (6885/45900) Resolving deltas: 16% (7344/45900) Resolving deltas: 17% (7803/45900) Resolving deltas: 18% (8262/45900) Resolving deltas: 19% (8721/45900) Resolving deltas: 20% (9180/45900) Resolving deltas: 21% (9641/45900) Resolving deltas: 22% (10098/45900) Resolving deltas: 23% (10557/45900) Resolving deltas: 24% (11018/45900) Resolving deltas: 25% (11476/45900) Resolving deltas: 26% (11934/45900) Resolving deltas: 27% (12393/45900) Resolving deltas: 28% (12852/45900) Resolving deltas: 29% (13311/45900) Resolving deltas: 30% (13771/45900) Resolving deltas: 31% (14229/45900) Resolving deltas: 32% (14688/45900) Resolving deltas: 33% (15147/45900) Resolving deltas: 34% (15606/45900) Resolving deltas: 35% (16065/45900) Resolving deltas: 36% (16524/45900) Resolving deltas: 37% (16983/45900) Resolving deltas: 38% (17442/45900) Resolving deltas: 39% (17901/45900) Resolving deltas: 40% (18361/45900) Resolving deltas: 41% (18819/45900) Resolving deltas: 42% (19278/45900) Resolving deltas: 43% (19738/45900) Resolving deltas: 44% (20196/45900) Resolving deltas: 45% (20655/45900) Resolving deltas: 46% (21114/45900) Resolving deltas: 47% (21573/45900) Resolving deltas: 48% (22032/45900) Resolving deltas: 49% (22491/45900) Resolving deltas: 50% (22950/45900) Resolving deltas: 51% (23409/45900) Resolving deltas: 52% (23868/45900) Resolving deltas: 53% (24327/45900) Resolving deltas: 54% (24787/45900) Resolving deltas: 55% (25245/45900) Resolving deltas: 56% (25704/45900) Resolving deltas: 57% (26163/45900) Resolving deltas: 58% (26625/45900) Resolving deltas: 59% (27081/45900) Resolving deltas: 60% (27540/45900) Resolving deltas: 61% (28000/45900) Resolving deltas: 62% (28458/45900) Resolving deltas: 63% (28917/45900) Resolving deltas: 64% (29376/45900) Resolving deltas: 65% (29835/45900) Resolving deltas: 66% (30294/45900) Resolving deltas: 67% (30753/45900) Resolving deltas: 68% (31212/45900) Resolving deltas: 69% (31671/45900) Resolving deltas: 70% (32130/45900) Resolving deltas: 71% (32589/45900) Resolving deltas: 72% (33048/45900) Resolving deltas: 73% (33507/45900) Resolving deltas: 74% (33966/45900) Resolving deltas: 75% (34426/45900) Resolving deltas: 76% (34884/45900) Resolving deltas: 77% (35343/45900) Resolving deltas: 78% (35802/45900) Resolving deltas: 79% (36261/45900) Resolving deltas: 80% (36720/45900) Resolving deltas: 81% (37179/45900) Resolving deltas: 82% (37638/45900) Resolving deltas: 83% (38097/45900) Resolving deltas: 84% (38556/45900) Resolving deltas: 85% (39015/45900) Resolving deltas: 86% (39474/45900) Resolving deltas: 87% (39933/45900) Resolving deltas: 87% (40257/45900) Resolving deltas: 88% (40392/45900) Resolving deltas: 89% (40851/45900) Resolving deltas: 90% (41311/45900) Resolving deltas: 91% (41769/45900) Resolving deltas: 92% (42228/45900) Resolving deltas: 93% (42687/45900) Resolving deltas: 94% (43146/45900) Resolving deltas: 95% (43605/45900) Resolving deltas: 96% (44064/45900) Resolving deltas: 97% (44523/45900) Resolving deltas: 98% (44982/45900) Resolving deltas: 99% (45441/45900) Resolving deltas: 100% (45900/45900) Resolving deltas: 100% (45900/45900), done.
  9. 6.67 s Fetching commit 5c37e36355998a98df0d7791c7daeeae576fd7ee for vakint_rustred ...
  10. 6.67 s $ /nix/store/bcnisk3ydfgv26v2gw3zlky24g00yww2-git-2.54.0/bin/git fetch origin 5c37e36355998a98df0d7791c7daeeae576fd7ee
  11. 7.38 s From https://github.com/alphal00p/gammaloop
  12. 7.38 s * branch 5c37e36355998a98df0d7791c7daeeae576fd7ee -> FETCH_HEAD
  13. 7.39 s $ /nix/store/9ypz3flqsrl5xl495mm8h645gadjsxi1-coreutils-9.11/bin/timeout --kill-after=15s 7200s /nix/store/bcnisk3ydfgv26v2gw3zlky24g00yww2-git-2.54.0/bin/git -c advice.detachedHead=false checkout 5c37e36355998a98df0d7791c7daeeae576fd7ee
  14. 7.66 s HEAD is now at 5c37e363 Advance RustRed dependency to refactored core
  15. 7.67 s $ /nix/store/9ypz3flqsrl5xl495mm8h645gadjsxi1-coreutils-9.11/bin/timeout --kill-after=15s 7200s /nix/store/23zk8sgzamrbmj1fday15szf7f2279s8-nix-2.34.7/bin/nix --extra-experimental-features nix-command --extra-experimental-features flakes --log-format internal-json run .#packages.x86_64-linux.nix-ci-check-gammaloop-nextest-core --print-build-logs
  16. 7.88 s
  17. 16.24 s evaluating derivation 'g copying '/nix/store/p93a evaluating derivation 'g copying '/nix/store/p93a evaluating derivation 'g copying '/nix/store/p93a evaluating derivation 'g copying '/nix/store/p93a evaluating derivation 'g copying '/nix/store/p93a evaluating derivation 'g copying '/nix/store/p93a evaluating derivation 'g copying '/nix/store/p93a evaluating derivation 'g copying '/nix/store/p93a evaluating derivation 'g copying '/nix/store/p93a evaluating derivation 'g copying '/nix/store/p93a evaluating derivation 'g [0/1 built] [1/0/1 built] building ggammaloop-nextest-core> Extracting 3 binaries (including 1 non-test binary), 1 build script output directory, and 2 linked paths to /build/nextest-archive-Vyv5oz
  18. 16.88 s gammaloop-nextest-core> Extracted 18 files to /build/nextest-archive-Vyv5oz in 0.64s
  19. 16.89 s gammaloop-nextest-core> ------------
  20. 16.89 s gammaloop-nextest-core> Nextest run ID 64073d4b-b8ed-48a8-a880-566b1a0fd496 with nextest profile: ci_gammaloop
  21. 16.89 s gammaloop-nextest-core> Starting 339 tests across 2 binaries
  22. 17.43 s gammaloop-nextest-core> ------------
  23. 17.43 s gammaloop-nextest-core> Summary [ 0.540s] 339 tests run: 339 passed, 0 skipped
  24. 17.56 s gammaloop-nextest-core>
  25. 17.56 s gammaloop-nextest-core> ========== nextest test summary ==========
  26. 17.56 s gammaloop-nextest-core> report: target/nextest/ci_gammaloop/junit.xml
  27. 17.56 s gammaloop-nextest-core> tests: 339, failures: 0, errors: 0
  28. 17.56 s gammaloop-nextest-core> No failing testcases found.
  29. 17.56 s gammaloop-nextest-core> =========================================
  30. 17.58 s gammaloop-nextest-core> Extracting 1 binary and 1 linked path to /build/nextest-archive-QBREyI
  31. 17.68 s gammaloop-nextest-core> Extracted 7 files to /build/nextest-archive-QBREyI in 0.09s
  32. 17.69 s gammaloop-nextest-core> ------------
  33. 17.69 s gammaloop-nextest-core> Nextest run ID 8aa78090-abcf-4d2f-aba0-55acb733908f with nextest profile: ci_gammaloop
  34. 17.69 s gammaloop-nextest-core> Starting 19 tests across 1 binary
  35. 17.70 s gammaloop-nextest-core> ------------
  36. 17.70 s gammaloop-nextest-core> Summary [ 0.015s] 19 tests run: 19 passed, 0 skipped
  37. 17.76 s gammaloop-nextest-core>
  38. 17.76 s gammaloop-nextest-core> ========== nextest test summary ==========
  39. 17.76 s gammaloop-nextest-core> report: target/nextest/ci_gammaloop/junit.xml
  40. 17.76 s gammaloop-nextest-core> tests: 19, failures: 0, errors: 0
  41. 17.76 s gammaloop-nextest-core> No failing testcases found.
  42. 17.76 s gammaloop-nextest-core> =========================================
  43. 17.78 s gammaloop-nextest-core> Extracting 1 binary to /build/nextest-archive-6NmnfY
  44. 17.83 s gammaloop-nextest-core> Extracted 4 files to /build/nextest-archive-6NmnfY in 0.05s
  45. 17.85 s gammaloop-nextest-core> ------------
  46. 17.85 s gammaloop-nextest-core> Nextest run ID 82c62d24-8f4c-4ceb-9d9d-f7cbdcec6a23 with nextest profile: ci_gammaloop
  47. 17.85 s gammaloop-nextest-core> Starting 0 tests across 1 binary
  48. 17.85 s gammaloop-nextest-core> ------------
  49. 17.85 s gammaloop-nextest-core> Summary [ 0.000s] 0 tests run: 0 passed, 0 skipped
  50. 17.90 s gammaloop-nextest-core>
  51. 17.90 s gammaloop-nextest-core> ========== nextest test summary ==========
  52. 17.90 s gammaloop-nextest-core> report: target/nextest/ci_gammaloop/junit.xml
  53. 17.90 s gammaloop-nextest-core> tests: 0, failures: 0, errors: 0
  54. 17.90 s gammaloop-nextest-core> No failing testcases found.
  55. 17.90 s gammaloop-nextest-core> =========================================
  56. 17.92 s gammaloop-nextest-core> Extracting 4 binaries, 1 build script output directory, and 2 linked paths to /build/nextest-archive-OOuIsk
  57. 18.61 s gammaloop-nextest-core> Extracted 18 files to /build/nextest-archive-OOuIsk in 0.69s
  58. 18.63 s gammaloop-nextest-core> ------------
  59. 18.63 s gammaloop-nextest-core> Nextest run ID 8e6a1213-5e34-45f5-917c-d388ed68ccb1 with nextest profile: ci_gammaloop
  60. 18.63 s gammaloop-nextest-core> Starting 456 tests across 4 binaries (61 tests skipped, including 60 tests via profile.ci_gammaloop.default-filter)
  61. 20.27 s gammaloop-nextest-core> FAIL [ 0.447s] (445/456) gammalooprs::test_renormalization finit_part_ghlo
  62. 20.27 s gammaloop-nextest-core> stdout ---
  63. 20.27 s gammaloop-nextest-core>
  64. 20.27 s gammaloop-nextest-core> running 1 test
  65. 20.27 s gammaloop-nextest-core> ren part: 1/2*GC_10^2*dot(P(0,mink(dim)),P(0,mink(dim)))*cas(2,coad(8))/ε
  66. 20.27 s gammaloop-nextest-core> ━━━━━━━━━━━━━━━━━━━━━━━━━━━━━━━ Snapshot Summary ━━━━━━━━━━━━━━━━━━━━━━━━━━━━━━━
  67. 20.27 s gammaloop-nextest-core> Snapshot: finit_part_ghlo
  68. 20.27 s gammaloop-nextest-core> Source: crates/gammalooprs/tests/test_renormalization.rs:557
  69. 20.27 s gammaloop-nextest-core> ────────────────────────────────────────────────────────────────────────────────
  70. 20.27 s gammaloop-nextest-core> Expression: align_to_rqft(&a, &model).to_bare_ordered_string()
  71. 20.27 s gammaloop-nextest-core> ────────────────────────────────────────────────────────────────────────────────
  72. 20.27 s gammaloop-nextest-core> -old snapshot
  73. 20.27 s gammaloop-nextest-core> +new results
  74. 20.27 s gammaloop-nextest-core> ────────────┬───────────────────────────────────────────────────────────────────
  75. 20.27 s gammaloop-nextest-core> 1 │--1/2*cas(2,coad(8))*dot(P(0,mink(4)),P(0,mink(4)))*gs^2*ε^(-1)
  76. 20.27 s gammaloop-nextest-core> 1 │+1/2*cas(2,coad(8))*dot(P(0,mink(4)),P(0,mink(4)))*gs^2*ε^(-1)
  77. 20.27 s gammaloop-nextest-core> ────────────┴───────────────────────────────────────────────────────────────────
  78. 20.27 s gammaloop-nextest-core> To update snapshots run `cargo insta review`
  79. 20.27 s gammaloop-nextest-core> Stopped on the first failure. Run `cargo insta test` to run all snapshots.
  80. 20.27 s gammaloop-nextest-core> test finit_part_ghlo ... FAILED
  81. 20.27 s gammaloop-nextest-core>
  82. 20.27 s gammaloop-nextest-core> failures:
  83. 20.27 s gammaloop-nextest-core>
  84. 20.27 s gammaloop-nextest-core> failures:
  85. 20.27 s gammaloop-nextest-core> finit_part_ghlo
  86. 20.27 s gammaloop-nextest-core>
  87. 20.27 s gammaloop-nextest-core> test result: FAILED. 0 passed; 1 failed; 0 ignored; 0 measured; 5 filtered out; finished in 0.43s
  88. 20.27 s gammaloop-nextest-core>
  89. 20.27 s gammaloop-nextest-core> stderr ---
  90. 20.27 s gammaloop-nextest-core> The application panicked (crashed).
  91. 20.27 s gammaloop-nextest-core> Message: snapshot assertion for 'finit_part_ghlo' failed in line 557
  92. 20.27 s gammaloop-nextest-core> Location: /nix/store/9a12dww58xis3an3kmn597llpijv83b1-vendor-cargo-deps/c19b7c6f923b580ac259164a89f2577984ad5ab09ee9d583b888f934adbbe8d0/insta-1.47.2/src/runtime.rs:719
  93. 20.27 s gammaloop-nextest-core>
  94. 20.27 s gammaloop-nextest-core> ━━━━━━━━━━━━━━━━━━━━━━━━━━━━━━━━━━ BACKTRACE ━━━━━━━━━━━━━━━━━━━━━━━━━━━━━━━━━━━
  95. 20.27 s gammaloop-nextest-core> 1: <color_eyre[51793ea62743adbd]::config::PanicHook>::panic_report<unknown>
  96. 20.27 s gammaloop-nextest-core> at <unknown source file>:<unknown line>
  97. 20.27 s gammaloop-nextest-core> 2: <color_eyre[51793ea62743adbd]::config::PanicHook>::into_panic_hook::{closure#0}<unknown>
  98. 20.27 s gammaloop-nextest-core> at <unknown source file>:<unknown line>
  99. 20.27 s gammaloop-nextest-core> 3: std[bcb96dfbba0ab899]::panicking::panic_with_hook<unknown>
  100. 20.27 s gammaloop-nextest-core> at <unknown source file>:<unknown line>
  101. 20.27 s gammaloop-nextest-core> 4: std[bcb96dfbba0ab899]::panicking::panic_handler::{closure#0}<unknown>
  102. 20.27 s gammaloop-nextest-core> at <unknown source file>:<unknown line>
  103. 20.27 s gammaloop-nextest-core> 5: std[bcb96dfbba0ab899]::sys::backtrace::__rust_end_short_backtrace::<std[bcb96dfbba0ab899]::panicking::panic_handler::{closure#0}, !><unknown>
  104. 20.27 s gammaloop-nextest-core> at <unknown source file>:<unknown line>
  105. 20.27 s gammaloop-nextest-core> 6: __rustc[6c289b9f9c454d21]::rust_begin_unwind<unknown>
  106. 20.27 s gammaloop-nextest-core> at <unknown source file>:<unknown line>
  107. 20.27 s gammaloop-nextest-core> 7: core[940e698046960fd5]::panicking::panic_fmt<unknown>
  108. 20.27 s gammaloop-nextest-core> at <unknown source file>:<unknown line>
  109. 20.27 s gammaloop-nextest-core> 8: insta[307a548ac79ef4d9]::runtime::assert_snapshot<unknown>
  110. 20.27 s gammaloop-nextest-core> at <unknown source file>:<unknown line>
  111. 20.27 s gammaloop-nextest-core> 9: <test_renormalization[e6829672f1ddb150]::finit_part_ghlo::{closure#0} as core[940e698046960fd5]::ops::function::FnOnce<()>>::call_once<unknown>
  112. 20.27 s gammaloop-nextest-core> at <unknown source file>:<unknown line>
  113. 20.27 s gammaloop-nextest-core> 10: test[75d6903177b1d7e9]::__rust_begin_short_backtrace::<core[940e698046960fd5]::result::Result<(), alloc[2ea6bcb46fca0c42]::string::String>, fn() -> core[940e698046960fd5]::result::Result<(), alloc[2ea6bcb46fca0c42]::string::String>><unknown>
  114. 20.27 s gammaloop-nextest-core> at <unknown source file>:<unknown line>
  115. 20.27 s gammaloop-nextest-core> 11: test[75d6903177b1d7e9]::run_test::{closure#0}<unknown>
  116. 20.27 s gammaloop-nextest-core> at <unknown source file>:<unknown line>
  117. 20.27 s gammaloop-nextest-core> 12: std[bcb96dfbba0ab899]::sys::backtrace::__rust_begin_short_backtrace::<test[75d6903177b1d7e9]::run_test::{closure#1}, ()><unknown>
  118. 20.27 s gammaloop-nextest-core> at <unknown source file>:<unknown line>
  119. 20.27 s gammaloop-nextest-core> 13: <std[bcb96dfbba0ab899]::thread::lifecycle::spawn_unchecked<test[75d6903177b1d7e9]::run_test::{closure#1}, ()>::{closure#1} as core[940e698046960fd5]::ops::function::FnOnce<()>>::call_once::{shim:vtable#0}<unknown>
  120. 20.27 s gammaloop-nextest-core> at <unknown source file>:<unknown line>
  121. 20.27 s gammaloop-nextest-core> 14: <std[bcb96dfbba0ab899]::sys::thread::unix::Thread>::new::thread_start<unknown>
  122. 20.27 s gammaloop-nextest-core> at <unknown source file>:<unknown line>
  123. 20.27 s gammaloop-nextest-core> 15: start_thread<unknown>
  124. 20.27 s gammaloop-nextest-core> at <unknown source file>:<unknown line>
  125. 20.27 s gammaloop-nextest-core> 16: __clone3<unknown>
  126. 20.27 s gammaloop-nextest-core> at <unknown source file>:<unknown line>
  127. 20.27 s gammaloop-nextest-core>
  128. 20.27 s gammaloop-nextest-core> Run with COLORBT_SHOW_HIDDEN=1 environment variable to disable frame filtering.
  129. 20.27 s gammaloop-nextest-core> Run with RUST_BACKTRACE=full to include source snippets.
  130. 20.27 s gammaloop-nextest-core>
  131. 23.00 s gammaloop-nextest-core> FAIL [ 3.167s] (451/456) gammalooprs::test_renormalization finite_part_ghost_2loop
  132. 23.03 s gammaloop-nextest-core> stdout ---
  133. 23.03 s gammaloop-nextest-core>
  134. 23.03 s gammaloop-nextest-core> running 1 test
  135. 23.03 s gammaloop-nextest-core> ━━━━━━━━━━━━━━━━━━━━━━━━━━━━━━━ Snapshot Summary ━━━━━━━━━━━━━━━━━━━━━━━━━━━━━━━
  136. 23.03 s gammaloop-nextest-core> Snapshot: finite_part_ghost_2loop-3
  137. 23.03 s gammaloop-nextest-core> Source: crates/gammalooprs/tests/test_renormalization.rs:464
  138. 23.03 s gammaloop-nextest-core> ────────────────────────────────────────────────────────────────────────────────
  139. 23.03 s gammaloop-nextest-core> Expression: align_to_rqft(&a, &model).to_bare_ordered_string()
  140. 23.03 s gammaloop-nextest-core> ────────────────────────────────────────────────────────────────────────────────
  141. 23.03 s gammaloop-nextest-core> -old snapshot
  142. 23.03 s gammaloop-nextest-core> +new results
  143. 23.03 s gammaloop-nextest-core> ────────────┬───────────────────────────────────────────────────────────────────
  144. 23.03 s gammaloop-nextest-core> 1 │-(-1𝑖/32*ε+1𝑖/16)*(cas(2,coad(8)))^2*dot(P(0,mink(4)),P(0,mink(4)))*gs^4*ε^(-2)
  145. 23.03 s gammaloop-nextest-core> 1 │+(-1𝑖/16+1𝑖/32*ε)*(cas(2,coad(8)))^2*dot(P(0,mink(4)),P(0,mink(4)))*gs^4*ε^(-2)
  146. 23.03 s gammaloop-nextest-core> ────────────┴───────────────────────────────────────────────────────────────────
  147. 23.03 s gammaloop-nextest-core> To update snapshots run `cargo insta review`
  148. 23.03 s gammaloop-nextest-core> Stopped on the first failure. Run `cargo insta test` to run all snapshots.
  149. 23.03 s gammaloop-nextest-core> test finite_part_ghost_2loop ... FAILED
  150. 23.03 s gammaloop-nextest-core>
  151. 23.03 s gammaloop-nextest-core> failures:
  152. 23.03 s gammaloop-nextest-core>
  153. 23.03 s gammaloop-nextest-core> failures:
  154. 23.03 s gammaloop-nextest-core> finite_part_ghost_2loop
  155. 23.03 s gammaloop-nextest-core>
  156. 23.03 s gammaloop-nextest-core> test result: FAILED. 0 passed; 1 failed; 0 ignored; 0 measured; 5 filtered out; finished in 3.15s
  157. 23.03 s gammaloop-nextest-core>
  158. 23.03 s gammaloop-nextest-core> stderr ---
  159. 23.03 s gammaloop-nextest-core> The application panicked (crashed).
  160. 23.03 s gammaloop-nextest-core> Message: snapshot assertion for 'finite_part_ghost_2loop-3' failed in line 464
  161. 23.03 s gammaloop-nextest-core> Location: /nix/store/9a12dww58xis3an3kmn597llpijv83b1-vendor-cargo-deps/c19b7c6f923b580ac259164a89f2577984ad5ab09ee9d583b888f934adbbe8d0/insta-1.47.2/src/runtime.rs:719
  162. 23.03 s gammaloop-nextest-core>
  163. 23.03 s gammaloop-nextest-core> ━━━━━━━━━━━━━━━━━━━━━━━━━━━━━━━━━━ BACKTRACE ━━━━━━━━━━━━━━━━━━━━━━━━━━━━━━━━━━━
  164. 23.03 s gammaloop-nextest-core> 1: <color_eyre[51793ea62743adbd]::config::PanicHook>::panic_report<unknown>
  165. 23.03 s gammaloop-nextest-core> at <unknown source file>:<unknown line>
  166. 23.03 s gammaloop-nextest-core> 2: <color_eyre[51793ea62743adbd]::config::PanicHook>::into_panic_hook::{closure#0}<unknown>
  167. 23.03 s gammaloop-nextest-core> at <unknown source file>:<unknown line>
  168. 23.03 s gammaloop-nextest-core> 3: std[bcb96dfbba0ab899]::panicking::panic_with_hook<unknown>
  169. 23.03 s gammaloop-nextest-core> at <unknown source file>:<unknown line>
  170. 23.03 s gammaloop-nextest-core> 4: std[bcb96dfbba0ab899]::panicking::panic_handler::{closure#0}<unknown>
  171. 23.03 s gammaloop-nextest-core> at <unknown source file>:<unknown line>
  172. 23.03 s gammaloop-nextest-core> 5: std[bcb96dfbba0ab899]::sys::backtrace::__rust_end_short_backtrace::<std[bcb96dfbba0ab899]::panicking::panic_handler::{closure#0}, !><unknown>
  173. 23.03 s gammaloop-nextest-core> at <unknown source file>:<unknown line>
  174. 23.03 s gammaloop-nextest-core> 6: __rustc[6c289b9f9c454d21]::rust_begin_unwind<unknown>
  175. 23.03 s gammaloop-nextest-core> at <unknown source file>:<unknown line>
  176. 23.03 s gammaloop-nextest-core> 7: core[940e698046960fd5]::panicking::panic_fmt<unknown>
  177. 23.03 s gammaloop-nextest-core> at <unknown source file>:<unknown line>
  178. 23.03 s gammaloop-nextest-core> 8: insta[307a548ac79ef4d9]::runtime::assert_snapshot<unknown>
  179. 23.03 s gammaloop-nextest-core> at <unknown source file>:<unknown line>
  180. 23.03 s gammaloop-nextest-core> 9: test_renormalization[e6829672f1ddb150]::finite_part_ghost_2loop<unknown>
  181. 23.03 s gammaloop-nextest-core> at <unknown source file>:<unknown line>
  182. 23.03 s gammaloop-nextest-core> 10: <test_renormalization[e6829672f1ddb150]::finite_part_ghost_2loop::{closure#0} as core[940e698046960fd5]::ops::function::FnOnce<()>>::call_once<unknown>
  183. 23.03 s gammaloop-nextest-core> at <unknown source file>:<unknown line>
  184. 23.03 s gammaloop-nextest-core> 11: test[75d6903177b1d7e9]::__rust_begin_short_backtrace::<core[940e698046960fd5]::result::Result<(), alloc[2ea6bcb46fca0c42]::string::String>, fn() -> core[940e698046960fd5]::result::Result<(), alloc[2ea6bcb46fca0c42]::string::String>><unknown>
  185. 23.03 s gammaloop-nextest-core> at <unknown source file>:<unknown line>
  186. 23.03 s gammaloop-nextest-core> 12: test[75d6903177b1d7e9]::run_test::{closure#0}<unknown>
  187. 23.03 s gammaloop-nextest-core> at <unknown source file>:<unknown line>
  188. 23.03 s gammaloop-nextest-core> 13: std[bcb96dfbba0ab899]::sys::backtrace::__rust_begin_short_backtrace::<test[75d6903177b1d7e9]::run_test::{closure#1}, ()><unknown>
  189. 23.03 s gammaloop-nextest-core> at <unknown source file>:<unknown line>
  190. 23.03 s gammaloop-nextest-core> 14: <std[bcb96dfbba0ab899]::thread::lifecycle::spawn_unchecked<test[75d6903177b1d7e9]::run_test::{closure#1}, ()>::{closure#1} as core[940e698046960fd5]::ops::function::FnOnce<()>>::call_once::{shim:vtable#0}<unknown>
  191. 23.03 s gammaloop-nextest-core> at <unknown source file>:<unknown line>
  192. 23.03 s gammaloop-nextest-core> 15: <std[bcb96dfbba0ab899]::sys::thread::unix::Thread>::new::thread_start<unknown>
  193. 23.03 s gammaloop-nextest-core> at <unknown source file>:<unknown line>
  194. 23.03 s gammaloop-nextest-core> 16: start_thread<unknown>
  195. 23.03 s gammaloop-nextest-core> at <unknown source file>:<unknown line>
  196. 23.03 s gammaloop-nextest-core> 17: __clone3<unknown>
  197. 23.03 s gammaloop-nextest-core> at <unknown source file>:<unknown line>
  198. 23.03 s gammaloop-nextest-core>
  199. 23.03 s gammaloop-nextest-core> Run with COLORBT_SHOW_HIDDEN=1 environment variable to disable frame filtering.
  200. 23.03 s gammaloop-nextest-core> Run with RUST_BACKTRACE=full to include source snippets.
  201. 23.03 s gammaloop-nextest-core>
  202. 30.02 s gammaloop-nextest-core> ------------
  203. 30.03 s gammaloop-nextest-core> Summary [ 11.387s] 456 tests run: 454 passed, 2 failed, 61 skipped
  204. 30.03 s gammaloop-nextest-core> FAIL [ 0.447s] (445/456) gammalooprs::test_renormalization finit_part_ghlo
  205. 30.03 s gammaloop-nextest-core> stdout ---
  206. 30.03 s gammaloop-nextest-core>
  207. 30.03 s gammaloop-nextest-core> running 1 test
  208. 30.03 s gammaloop-nextest-core> ren part: 1/2*GC_10^2*dot(P(0,mink(dim)),P(0,mink(dim)))*cas(2,coad(8))/ε
  209. 30.03 s gammaloop-nextest-core> ━━━━━━━━━━━━━━━━━━━━━━━━━━━━━━━ Snapshot Summary ━━━━━━━━━━━━━━━━━━━━━━━━━━━━━━━
  210. 30.03 s gammaloop-nextest-core> Snapshot: finit_part_ghlo
  211. 30.03 s gammaloop-nextest-core> Source: crates/gammalooprs/tests/test_renormalization.rs:557
  212. 30.03 s gammaloop-nextest-core> ────────────────────────────────────────────────────────────────────────────────
  213. 30.03 s gammaloop-nextest-core> Expression: align_to_rqft(&a, &model).to_bare_ordered_string()
  214. 30.03 s gammaloop-nextest-core> ────────────────────────────────────────────────────────────────────────────────
  215. 30.03 s gammaloop-nextest-core> -old snapshot
  216. 30.03 s gammaloop-nextest-core> +new results
  217. 30.03 s gammaloop-nextest-core> ────────────┬───────────────────────────────────────────────────────────────────
  218. 30.03 s gammaloop-nextest-core> 1 │--1/2*cas(2,coad(8))*dot(P(0,mink(4)),P(0,mink(4)))*gs^2*ε^(-1)
  219. 30.03 s gammaloop-nextest-core> 1 │+1/2*cas(2,coad(8))*dot(P(0,mink(4)),P(0,mink(4)))*gs^2*ε^(-1)
  220. 30.03 s gammaloop-nextest-core> ────────────┴───────────────────────────────────────────────────────────────────
  221. 30.03 s gammaloop-nextest-core> To update snapshots run `cargo insta review`
  222. 30.03 s gammaloop-nextest-core> Stopped on the first failure. Run `cargo insta test` to run all snapshots.
  223. 30.03 s gammaloop-nextest-core> test finit_part_ghlo ... FAILED
  224. 30.03 s gammaloop-nextest-core>
  225. 30.03 s gammaloop-nextest-core> failures:
  226. 30.03 s gammaloop-nextest-core>
  227. 30.03 s gammaloop-nextest-core> failures:
  228. 30.03 s gammaloop-nextest-core> finit_part_ghlo
  229. 30.03 s gammaloop-nextest-core>
  230. 30.03 s gammaloop-nextest-core> test result: FAILED. 0 passed; 1 failed; 0 ignored; 0 measured; 5 filtered out; finished in 0.43s
  231. 30.03 s gammaloop-nextest-core>
  232. 30.03 s gammaloop-nextest-core> stderr ---
  233. 30.03 s gammaloop-nextest-core> The application panicked (crashed).
  234. 30.03 s gammaloop-nextest-core> Message: snapshot assertion for 'finit_part_ghlo' failed in line 557
  235. 30.03 s gammaloop-nextest-core> Location: /nix/store/9a12dww58xis3an3kmn597llpijv83b1-vendor-cargo-deps/c19b7c6f923b580ac259164a89f2577984ad5ab09ee9d583b888f934adbbe8d0/insta-1.47.2/src/runtime.rs:719
  236. 30.03 s gammaloop-nextest-core>
  237. 30.03 s gammaloop-nextest-core> ━━━━━━━━━━━━━━━━━━━━━━━━━━━━━━━━━━ BACKTRACE ━━━━━━━━━━━━━━━━━━━━━━━━━━━━━━━━━━━
  238. 30.03 s gammaloop-nextest-core> 1: <color_eyre[51793ea62743adbd]::config::PanicHook>::panic_report<unknown>
  239. 30.03 s gammaloop-nextest-core> at <unknown source file>:<unknown line>
  240. 30.03 s gammaloop-nextest-core> 2: <color_eyre[51793ea62743adbd]::config::PanicHook>::into_panic_hook::{closure#0}<unknown>
  241. 30.03 s gammaloop-nextest-core> at <unknown source file>:<unknown line>
  242. 30.03 s gammaloop-nextest-core> 3: std[bcb96dfbba0ab899]::panicking::panic_with_hook<unknown>
  243. 30.03 s gammaloop-nextest-core> at <unknown source file>:<unknown line>
  244. 30.03 s gammaloop-nextest-core> 4: std[bcb96dfbba0ab899]::panicking::panic_handler::{closure#0}<unknown>
  245. 30.03 s gammaloop-nextest-core> at <unknown source file>:<unknown line>
  246. 30.03 s gammaloop-nextest-core> 5: std[bcb96dfbba0ab899]::sys::backtrace::__rust_end_short_backtrace::<std[bcb96dfbba0ab899]::panicking::panic_handler::{closure#0}, !><unknown>
  247. 30.03 s gammaloop-nextest-core> at <unknown source file>:<unknown line>
  248. 30.03 s gammaloop-nextest-core> 6: __rustc[6c289b9f9c454d21]::rust_begin_unwind<unknown>
  249. 30.03 s gammaloop-nextest-core> at <unknown source file>:<unknown line>
  250. 30.03 s gammaloop-nextest-core> 7: core[940e698046960fd5]::panicking::panic_fmt<unknown>
  251. 30.03 s gammaloop-nextest-core> at <unknown source file>:<unknown line>
  252. 30.03 s gammaloop-nextest-core> 8: insta[307a548ac79ef4d9]::runtime::assert_snapshot<unknown>
  253. 30.03 s gammaloop-nextest-core> at <unknown source file>:<unknown line>
  254. 30.03 s gammaloop-nextest-core> 9: <test_renormalization[e6829672f1ddb150]::finit_part_ghlo::{closure#0} as core[940e698046960fd5]::ops::function::FnOnce<()>>::call_once<unknown>
  255. 30.03 s gammaloop-nextest-core> at <unknown source file>:<unknown line>
  256. 30.03 s gammaloop-nextest-core> 10: test[75d6903177b1d7e9]::__rust_begin_short_backtrace::<core[940e698046960fd5]::result::Result<(), alloc[2ea6bcb46fca0c42]::string::String>, fn() -> core[940e698046960fd5]::result::Result<(), alloc[2ea6bcb46fca0c42]::string::String>><unknown>
  257. 30.03 s gammaloop-nextest-core> at <unknown source file>:<unknown line>
  258. 30.03 s gammaloop-nextest-core> 11: test[75d6903177b1d7e9]::run_test::{closure#0}<unknown>
  259. 30.03 s gammaloop-nextest-core> at <unknown source file>:<unknown line>
  260. 30.03 s gammaloop-nextest-core> 12: std[bcb96dfbba0ab899]::sys::backtrace::__rust_begin_short_backtrace::<test[75d6903177b1d7e9]::run_test::{closure#1}, ()><unknown>
  261. 30.03 s gammaloop-nextest-core> at <unknown source file>:<unknown line>
  262. 30.03 s gammaloop-nextest-core> 13: <std[bcb96dfbba0ab899]::thread::lifecycle::spawn_unchecked<test[75d6903177b1d7e9]::run_test::{closure#1}, ()>::{closure#1} as core[940e698046960fd5]::ops::function::FnOnce<()>>::call_once::{shim:vtable#0}<unknown>
  263. 30.03 s gammaloop-nextest-core> at <unknown source file>:<unknown line>
  264. 30.03 s gammaloop-nextest-core> 14: <std[bcb96dfbba0ab899]::sys::thread::unix::Thread>::new::thread_start<unknown>
  265. 30.03 s gammaloop-nextest-core> at <unknown source file>:<unknown line>
  266. 30.03 s gammaloop-nextest-core> 15: start_thread<unknown>
  267. 30.03 s gammaloop-nextest-core> at <unknown source file>:<unknown line>
  268. 30.03 s gammaloop-nextest-core> 16: __clone3<unknown>
  269. 30.03 s gammaloop-nextest-core> at <unknown source file>:<unknown line>
  270. 30.03 s gammaloop-nextest-core>
  271. 30.03 s gammaloop-nextest-core> Run with COLORBT_SHOW_HIDDEN=1 environment variable to disable frame filtering.
  272. 30.03 s gammaloop-nextest-core> Run with RUST_BACKTRACE=full to include source snippets.
  273. 30.03 s gammaloop-nextest-core>
  274. 30.03 s gammaloop-nextest-core> FAIL [ 3.167s] (451/456) gammalooprs::test_renormalization finite_part_ghost_2loop
  275. 30.03 s gammaloop-nextest-core> stdout ---
  276. 30.03 s gammaloop-nextest-core>
  277. 30.03 s gammaloop-nextest-core> running 1 test
  278. 30.03 s gammaloop-nextest-core> ━━━━━━━━━━━━━━━━━━━━━━━━━━━━━━━ Snapshot Summary ━━━━━━━━━━━━━━━━━━━━━━━━━━━━━━━
  279. 30.03 s gammaloop-nextest-core> Snapshot: finite_part_ghost_2loop-3
  280. 30.03 s gammaloop-nextest-core> Source: crates/gammalooprs/tests/test_renormalization.rs:464
  281. 30.03 s gammaloop-nextest-core> ────────────────────────────────────────────────────────────────────────────────
  282. 30.03 s gammaloop-nextest-core> Expression: align_to_rqft(&a, &model).to_bare_ordered_string()
  283. 30.03 s gammaloop-nextest-core> ────────────────────────────────────────────────────────────────────────────────
  284. 30.03 s gammaloop-nextest-core> -old snapshot
  285. 30.03 s gammaloop-nextest-core> +new results
  286. 30.03 s gammaloop-nextest-core> ────────────┬───────────────────────────────────────────────────────────────────
  287. 30.03 s gammaloop-nextest-core> 1 │-(-1𝑖/32*ε+1𝑖/16)*(cas(2,coad(8)))^2*dot(P(0,mink(4)),P(0,mink(4)))*gs^4*ε^(-2)
  288. 30.03 s gammaloop-nextest-core> 1 │+(-1𝑖/16+1𝑖/32*ε)*(cas(2,coad(8)))^2*dot(P(0,mink(4)),P(0,mink(4)))*gs^4*ε^(-2)
  289. 30.03 s gammaloop-nextest-core> ────────────┴───────────────────────────────────────────────────────────────────
  290. 30.03 s gammaloop-nextest-core> To update snapshots run `cargo insta review`
  291. 30.03 s gammaloop-nextest-core> Stopped on the first failure. Run `cargo insta test` to run all snapshots.
  292. 30.03 s gammaloop-nextest-core> test finite_part_ghost_2loop ... FAILED
  293. 30.03 s gammaloop-nextest-core>
  294. 30.03 s gammaloop-nextest-core> failures:
  295. 30.03 s gammaloop-nextest-core>
  296. 30.03 s gammaloop-nextest-core> failures:
  297. 30.03 s gammaloop-nextest-core> finite_part_ghost_2loop
  298. 30.03 s gammaloop-nextest-core>
  299. 30.03 s gammaloop-nextest-core> test result: FAILED. 0 passed; 1 failed; 0 ignored; 0 measured; 5 filtered out; finished in 3.15s
  300. 30.03 s gammaloop-nextest-core>
  301. 30.03 s gammaloop-nextest-core> stderr ---
  302. 30.03 s gammaloop-nextest-core> The application panicked (crashed).
  303. 30.03 s gammaloop-nextest-core> Message: snapshot assertion for 'finite_part_ghost_2loop-3' failed in line 464
  304. 30.03 s gammaloop-nextest-core> Location: /nix/store/9a12dww58xis3an3kmn597llpijv83b1-vendor-cargo-deps/c19b7c6f923b580ac259164a89f2577984ad5ab09ee9d583b888f934adbbe8d0/insta-1.47.2/src/runtime.rs:719
  305. 30.03 s gammaloop-nextest-core>
  306. 30.03 s gammaloop-nextest-core> ━━━━━━━━━━━━━━━━━━━━━━━━━━━━━━━━━━ BACKTRACE ━━━━━━━━━━━━━━━━━━━━━━━━━━━━━━━━━━━
  307. 30.03 s gammaloop-nextest-core> 1: <color_eyre[51793ea62743adbd]::config::PanicHook>::panic_report<unknown>
  308. 30.03 s gammaloop-nextest-core> at <unknown source file>:<unknown line>
  309. 30.03 s gammaloop-nextest-core> 2: <color_eyre[51793ea62743adbd]::config::PanicHook>::into_panic_hook::{closure#0}<unknown>
  310. 30.03 s gammaloop-nextest-core> at <unknown source file>:<unknown line>
  311. 30.03 s gammaloop-nextest-core> 3: std[bcb96dfbba0ab899]::panicking::panic_with_hook<unknown>
  312. 30.03 s gammaloop-nextest-core> at <unknown source file>:<unknown line>
  313. 30.03 s gammaloop-nextest-core> 4: std[bcb96dfbba0ab899]::panicking::panic_handler::{closure#0}<unknown>
  314. 30.03 s gammaloop-nextest-core> at <unknown source file>:<unknown line>
  315. 30.03 s gammaloop-nextest-core> 5: std[bcb96dfbba0ab899]::sys::backtrace::__rust_end_short_backtrace::<std[bcb96dfbba0ab899]::panicking::panic_handler::{closure#0}, !><unknown>
  316. 30.03 s gammaloop-nextest-core> at <unknown source file>:<unknown line>
  317. 30.03 s gammaloop-nextest-core> 6: __rustc[6c289b9f9c454d21]::rust_begin_unwind<unknown>
  318. 30.03 s gammaloop-nextest-core> at <unknown source file>:<unknown line>
  319. 30.03 s gammaloop-nextest-core> 7: core[940e698046960fd5]::panicking::panic_fmt<unknown>
  320. 30.03 s gammaloop-nextest-core> at <unknown source file>:<unknown line>
  321. 30.03 s gammaloop-nextest-core> 8: insta[307a548ac79ef4d9]::runtime::assert_snapshot<unknown>
  322. 30.03 s gammaloop-nextest-core> at <unknown source file>:<unknown line>
  323. 30.03 s gammaloop-nextest-core> 9: test_renormalization[e6829672f1ddb150]::finite_part_ghost_2loop<unknown>
  324. 30.03 s gammaloop-nextest-core> at <unknown source file>:<unknown line>
  325. 30.03 s gammaloop-nextest-core> 10: <test_renormalization[e6829672f1ddb150]::finite_part_ghost_2loop::{closure#0} as core[940e698046960fd5]::ops::function::FnOnce<()>>::call_once<unknown>
  326. 30.03 s gammaloop-nextest-core> at <unknown source file>:<unknown line>
  327. 30.03 s gammaloop-nextest-core> 11: test[75d6903177b1d7e9]::__rust_begin_short_backtrace::<core[940e698046960fd5]::result::Result<(), alloc[2ea6bcb46fca0c42]::string::String>, fn() -> core[940e698046960fd5]::result::Result<(), alloc[2ea6bcb46fca0c42]::string::String>><unknown>
  328. 30.03 s gammaloop-nextest-core> at <unknown source file>:<unknown line>
  329. 30.03 s gammaloop-nextest-core> 12: test[75d6903177b1d7e9]::run_test::{closure#0}<unknown>
  330. 30.03 s gammaloop-nextest-core> at <unknown source file>:<unknown line>
  331. 30.03 s gammaloop-nextest-core> 13: std[bcb96dfbba0ab899]::sys::backtrace::__rust_begin_short_backtrace::<test[75d6903177b1d7e9]::run_test::{closure#1}, ()><unknown>
  332. 30.03 s gammaloop-nextest-core> at <unknown source file>:<unknown line>
  333. 30.03 s gammaloop-nextest-core> 14: <std[bcb96dfbba0ab899]::thread::lifecycle::spawn_unchecked<test[75d6903177b1d7e9]::run_test::{closure#1}, ()>::{closure#1} as core[940e698046960fd5]::ops::function::FnOnce<()>>::call_once::{shim:vtable#0}<unknown>
  334. 30.03 s gammaloop-nextest-core> at <unknown source file>:<unknown line>
  335. 30.03 s gammaloop-nextest-core> 15: <std[bcb96dfbba0ab899]::sys::thread::unix::Thread>::new::thread_start<unknown>
  336. 30.03 s gammaloop-nextest-core> at <unknown source file>:<unknown line>
  337. 30.03 s gammaloop-nextest-core> 16: start_thread<unknown>
  338. 30.03 s gammaloop-nextest-core> at <unknown source file>:<unknown line>
  339. 30.03 s gammaloop-nextest-core> 17: __clone3<unknown>
  340. 30.03 s gammaloop-nextest-core> at <unknown source file>:<unknown line>
  341. 30.03 s gammaloop-nextest-core>
  342. 30.03 s gammaloop-nextest-core> Run with COLORBT_SHOW_HIDDEN=1 environment variable to disable frame filtering.
  343. 30.03 s gammaloop-nextest-core> Run with RUST_BACKTRACE=full to include source snippets.
  344. 30.03 s gammaloop-nextest-core>
  345. 30.10 s gammaloop-nextest-core> error: test run failed
  346. 30.14 s gammaloop-nextest-core>
  347. 30.14 s gammaloop-nextest-core> ========== nextest test summary ==========
  348. 30.14 s gammaloop-nextest-core> report: target/nextest/ci_gammaloop/junit.xml
  349. 30.14 s gammaloop-nextest-core> tests: 456, failures: 2, errors: 0
  350. 30.14 s gammaloop-nextest-core>
  351. 30.14 s gammaloop-nextest-core> 1. gammalooprs::test_renormalization::finit_part_ghlo
  352. 30.14 s gammaloop-nextest-core> failure: test failure with exit code 101
  353. 30.14 s gammaloop-nextest-core> system-out
  354. 30.14 s gammaloop-nextest-core> running 1 test
  355. 30.14 s gammaloop-nextest-core> ren part: 1/2*GC_10^2*dot(P(0,mink(dim)),P(0,mink(dim)))*cas(2,coad(8))/ε
  356. 30.14 s gammaloop-nextest-core> ━━━━━━━━━━━━━━━━━━━━━━━━━━━━━━━ Snapshot Summary ━━━━━━━━━━━━━━━━━━━━━━━━━━━━━━━
  357. 30.14 s gammaloop-nextest-core> Snapshot: finit_part_ghlo
  358. 30.14 s gammaloop-nextest-core> Source: crates/gammalooprs/tests/test_renormalization.rs:557
  359. 30.14 s gammaloop-nextest-core> ────────────────────────────────────────────────────────────────────────────────
  360. 30.14 s gammaloop-nextest-core> Expression: align_to_rqft(&a, &model).to_bare_ordered_string()
  361. 30.14 s gammaloop-nextest-core> ────────────────────────────────────────────────────────────────────────────────
  362. 30.14 s gammaloop-nextest-core> -old snapshot
  363. 30.14 s gammaloop-nextest-core> +new results
  364. 30.14 s gammaloop-nextest-core> ────────────┬───────────────────────────────────────────────────────────────────
  365. 30.14 s gammaloop-nextest-core> 1 │--1/2*cas(2,coad(8))*dot(P(0,mink(4)),P(0,mink(4)))*gs^2*ε^(-1)
  366. 30.14 s gammaloop-nextest-core> 1 │+1/2*cas(2,coad(8))*dot(P(0,mink(4)),P(0,mink(4)))*gs^2*ε^(-1)
  367. 30.14 s gammaloop-nextest-core> ────────────┴───────────────────────────────────────────────────────────────────
  368. 30.14 s gammaloop-nextest-core> To update snapshots run `cargo insta review`
  369. 30.14 s gammaloop-nextest-core> Stopped on the first failure. Run `cargo insta test` to run all snapshots.
  370. 30.14 s gammaloop-nextest-core> test finit_part_ghlo ... FAILED
  371. 30.14 s gammaloop-nextest-core>
  372. 30.14 s gammaloop-nextest-core> failures:
  373. 30.14 s gammaloop-nextest-core>
  374. 30.14 s gammaloop-nextest-core> failures:
  375. 30.14 s gammaloop-nextest-core> finit_part_ghlo
  376. 30.14 s gammaloop-nextest-core>
  377. 30.14 s gammaloop-nextest-core> test result: FAILED. 0 passed; 1 failed; 0 ignored; 0 measured; 5 filtered out; finished in 0.43s
  378. 30.14 s gammaloop-nextest-core> system-err
  379. 30.14 s gammaloop-nextest-core> The application panicked (crashed).
  380. 30.14 s gammaloop-nextest-core> Message: snapshot assertion for 'finit_part_ghlo' failed in line 557
  381. 30.14 s gammaloop-nextest-core> Location: /nix/store/9a12dww58xis3an3kmn597llpijv83b1-vendor-cargo-deps/c19b7c6f923b580ac259164a89f2577984ad5ab09ee9d583b888f934adbbe8d0/insta-1.47.2/src/runtime.rs:719
  382. 30.14 s gammaloop-nextest-core>
  383. 30.14 s gammaloop-nextest-core> ━━━━━━━━━━━━━━━━━━━━━━━━━━━━━━━━━━ BACKTRACE ━━━━━━━━━━━━━━━━━━━━━━━━━━━━━━━━━━━
  384. 30.14 s gammaloop-nextest-core> 1: <color_eyre[51793ea62743adbd]::config::PanicHook>::panic_report<unknown>
  385. 30.14 s gammaloop-nextest-core> at <unknown source file>:<unknown line>
  386. 30.14 s gammaloop-nextest-core> 2: <color_eyre[51793ea62743adbd]::config::PanicHook>::into_panic_hook::{closure#0}<unknown>
  387. 30.14 s gammaloop-nextest-core> at <unknown source file>:<unknown line>
  388. 30.14 s gammaloop-nextest-core> 3: std[bcb96dfbba0ab899]::panicking::panic_with_hook<unknown>
  389. 30.14 s gammaloop-nextest-core> at <unknown source file>:<unknown line>
  390. 30.14 s gammaloop-nextest-core> 4: std[bcb96dfbba0ab899]::panicking::panic_handler::{closure#0}<unknown>
  391. 30.14 s gammaloop-nextest-core> at <unknown source file>:<unknown line>
  392. 30.14 s gammaloop-nextest-core> 5: std[bcb96dfbba0ab899]::sys::backtrace::__rust_end_short_backtrace::<std[bcb96dfbba0ab899]::panicking::panic_handler::{closure#0}, !><unknown>
  393. 30.14 s gammaloop-nextest-core> at <unknown source file>:<unknown line>
  394. 30.14 s gammaloop-nextest-core> 6: __rustc[6c289b9f9c454d21]::rust_begin_unwind<unknown>
  395. 30.14 s gammaloop-nextest-core> at <unknown source file>:<unknown line>
  396. 30.14 s gammaloop-nextest-core> 7: core[940e698046960fd5]::panicking::panic_fmt<unknown>
  397. 30.14 s gammaloop-nextest-core> at <unknown source file>:<unknown line>
  398. 30.14 s gammaloop-nextest-core> 8: insta[307a548ac79ef4d9]::runtime::assert_snapshot<unknown>
  399. 30.14 s gammaloop-nextest-core> at <unknown source file>:<unknown line>
  400. 30.14 s gammaloop-nextest-core> 9: <test_renormalization[e6829672f1ddb150]::finit_part_ghlo::{closure#0} as core[940e698046960fd5]::ops::function::FnOnce<()>>::call_once<unknown>
  401. 30.14 s gammaloop-nextest-core> at <unknown source file>:<unknown line>
  402. 30.14 s gammaloop-nextest-core> 10: test[75d6903177b1d7e9]::__rust_begin_short_backtrace::<core[940e698046960fd5]::result::Result<(), alloc[2ea6bcb46fca0c42]::string::String>, fn() -> core[940e698046960fd5]::result::Result<(), alloc[2ea6bcb46fca0c42]::string::String>><unknown>
  403. 30.14 s gammaloop-nextest-core> at <unknown source file>:<unknown line>
  404. 30.14 s gammaloop-nextest-core> 11: test[75d6903177b1d7e9]::run_test::{closure#0}<unknown>
  405. 30.14 s gammaloop-nextest-core> at <unknown source file>:<unknown line>
  406. 30.14 s gammaloop-nextest-core> 12: std[bcb96dfbba0ab899]::sys::backtrace::__rust_begin_short_backtrace::<test[75d6903177b1d7e9]::run_test::{closure#1}, ()><unknown>
  407. 30.14 s gammaloop-nextest-core> at <unknown source file>:<unknown line>
  408. 30.14 s gammaloop-nextest-core> 13: <std[bcb96dfbba0ab899]::thread::lifecycle::spawn_unchecked<test[75d6903177b1d7e9]::run_test::{closure#1}, ()>::{closure#1} as core[940e698046960fd5]::ops::function::FnOnce<()>>::call_once::{shim:vtable#0}<unknown>
  409. 30.14 s gammaloop-nextest-core> at <unknown source file>:<unknown line>
  410. 30.14 s gammaloop-nextest-core> 14: <std[bcb96dfbba0ab899]::sys::thread::unix::Thread>::new::thread_start<unknown>
  411. 30.14 s gammaloop-nextest-core> at <unknown source file>:<unknown line>
  412. 30.14 s gammaloop-nextest-core> 15: start_thread<unknown>
  413. 30.14 s gammaloop-nextest-core> at <unknown source file>:<unknown line>
  414. 30.14 s gammaloop-nextest-core> 16: __clone3<unknown>
  415. 30.14 s gammaloop-nextest-core> at <unknown source file>:<unknown line>
  416. 30.14 s gammaloop-nextest-core>
  417. 30.14 s gammaloop-nextest-core> Run with COLORBT_SHOW_HIDDEN=1 environment variable to disable frame filtering.
  418. 30.14 s gammaloop-nextest-core> Run with RUST_BACKTRACE=full to include source snippets.
  419. 30.14 s gammaloop-nextest-core>
  420. 30.14 s gammaloop-nextest-core> 2. gammalooprs::test_renormalization::finite_part_ghost_2loop
  421. 30.14 s gammaloop-nextest-core> failure: test failure with exit code 101
  422. 30.14 s gammaloop-nextest-core> system-out
  423. 30.14 s gammaloop-nextest-core> running 1 test
  424. 30.14 s gammaloop-nextest-core> ━━━━━━━━━━━━━━━━━━━━━━━━━━━━━━━ Snapshot Summary ━━━━━━━━━━━━━━━━━━━━━━━━━━━━━━━
  425. 30.14 s gammaloop-nextest-core> Snapshot: finite_part_ghost_2loop-3
  426. 30.14 s gammaloop-nextest-core> Source: crates/gammalooprs/tests/test_renormalization.rs:464
  427. 30.14 s gammaloop-nextest-core> ────────────────────────────────────────────────────────────────────────────────
  428. 30.14 s gammaloop-nextest-core> Expression: align_to_rqft(&a, &model).to_bare_ordered_string()
  429. 30.14 s gammaloop-nextest-core> ────────────────────────────────────────────────────────────────────────────────
  430. 30.14 s gammaloop-nextest-core> -old snapshot
  431. 30.14 s gammaloop-nextest-core> +new results
  432. 30.14 s gammaloop-nextest-core> ────────────┬───────────────────────────────────────────────────────────────────
  433. 30.14 s gammaloop-nextest-core> 1 │-(-1𝑖/32*ε+1𝑖/16)*(cas(2,coad(8)))^2*dot(P(0,mink(4)),P(0,mink(4)))*gs^4*ε^(-2)
  434. 30.14 s gammaloop-nextest-core> 1 │+(-1𝑖/16+1𝑖/32*ε)*(cas(2,coad(8)))^2*dot(P(0,mink(4)),P(0,mink(4)))*gs^4*ε^(-2)
  435. 30.14 s gammaloop-nextest-core> ────────────┴───────────────────────────────────────────────────────────────────
  436. 30.14 s gammaloop-nextest-core> To update snapshots run `cargo insta review`
  437. 30.14 s gammaloop-nextest-core> Stopped on the first failure. Run `cargo insta test` to run all snapshots.
  438. 30.14 s gammaloop-nextest-core> test finite_part_ghost_2loop ... FAILED
  439. 30.14 s gammaloop-nextest-core>
  440. 30.14 s gammaloop-nextest-core> failures:
  441. 30.14 s gammaloop-nextest-core>
  442. 30.14 s gammaloop-nextest-core> failures:
  443. 30.14 s gammaloop-nextest-core> finite_part_ghost_2loop
  444. 30.14 s gammaloop-nextest-core>
  445. 30.14 s gammaloop-nextest-core> test result: FAILED. 0 passed; 1 failed; 0 ignored; 0 measured; 5 filtered out; finished in 3.15s
  446. 30.14 s gammaloop-nextest-core> system-err
  447. 30.14 s gammaloop-nextest-core> The application panicked (crashed).
  448. 30.14 s gammaloop-nextest-core> Message: snapshot assertion for 'finite_part_ghost_2loop-3' failed in line 464
  449. 30.14 s gammaloop-nextest-core> Location: /nix/store/9a12dww58xis3an3kmn597llpijv83b1-vendor-cargo-deps/c19b7c6f923b580ac259164a89f2577984ad5ab09ee9d583b888f934adbbe8d0/insta-1.47.2/src/runtime.rs:719
  450. 30.14 s gammaloop-nextest-core>
  451. 30.14 s gammaloop-nextest-core> ━━━━━━━━━━━━━━━━━━━━━━━━━━━━━━━━━━ BACKTRACE ━━━━━━━━━━━━━━━━━━━━━━━━━━━━━━━━━━━
  452. 30.14 s gammaloop-nextest-core> 1: <color_eyre[51793ea62743adbd]::config::PanicHook>::panic_report<unknown>
  453. 30.14 s gammaloop-nextest-core> at <unknown source file>:<unknown line>
  454. 30.14 s gammaloop-nextest-core> 2: <color_eyre[51793ea62743adbd]::config::PanicHook>::into_panic_hook::{closure#0}<unknown>
  455. 30.14 s gammaloop-nextest-core> at <unknown source file>:<unknown line>
  456. 30.14 s gammaloop-nextest-core> 3: std[bcb96dfbba0ab899]::panicking::panic_with_hook<unknown>
  457. 30.14 s gammaloop-nextest-core> at <unknown source file>:<unknown line>
  458. 30.14 s gammaloop-nextest-core> 4: std[bcb96dfbba0ab899]::panicking::panic_handler::{closure#0}<unknown>
  459. 30.14 s gammaloop-nextest-core> at <unknown source file>:<unknown line>
  460. 30.14 s gammaloop-nextest-core> 5: std[bcb96dfbba0ab899]::sys::backtrace::__rust_end_short_backtrace::<std[bcb96dfbba0ab899]::panicking::panic_handler::{closure#0}, !><unknown>
  461. 30.14 s gammaloop-nextest-core> at <unknown source file>:<unknown line>
  462. 30.14 s gammaloop-nextest-core> 6: __rustc[6c289b9f9c454d21]::rust_begin_unwind<unknown>
  463. 30.14 s gammaloop-nextest-core> at <unknown source file>:<unknown line>
  464. 30.14 s gammaloop-nextest-core> 7: core[940e698046960fd5]::panicking::panic_fmt<unknown>
  465. 30.14 s gammaloop-nextest-core> at <unknown source file>:<unknown line>
  466. 30.14 s gammaloop-nextest-core> 8: insta[307a548ac79ef4d9]::runtime::assert_snapshot<unknown>
  467. 30.14 s gammaloop-nextest-core> at <unknown source file>:<unknown line>
  468. 30.14 s gammaloop-nextest-core> 9: test_renormalization[e6829672f1ddb150]::finite_part_ghost_2loop<unknown>
  469. 30.14 s gammaloop-nextest-core> at <unknown source file>:<unknown line>
  470. 30.14 s gammaloop-nextest-core> 10: <test_renormalization[e6829672f1ddb150]::finite_part_ghost_2loop::{closure#0} as core[940e698046960fd5]::ops::function::FnOnce<()>>::call_once<unknown>
  471. 30.14 s gammaloop-nextest-core> at <unknown source file>:<unknown line>
  472. 30.14 s gammaloop-nextest-core> 11: test[75d6903177b1d7e9]::__rust_begin_short_backtrace::<core[940e698046960fd5]::result::Result<(), alloc[2ea6bcb46fca0c42]::string::String>, fn() -> core[940e698046960fd5]::result::Result<(), alloc[2ea6bcb46fca0c42]::string::String>><unknown>
  473. 30.14 s gammaloop-nextest-core> at <unknown source file>:<unknown line>
  474. 30.14 s gammaloop-nextest-core> 12: test[75d6903177b1d7e9]::run_test::{closure#0}<unknown>
  475. 30.14 s gammaloop-nextest-core> at <unknown source file>:<unknown line>
  476. 30.14 s gammaloop-nextest-core> 13: std[bcb96dfbba0ab899]::sys::backtrace::__rust_begin_short_backtrace::<test[75d6903177b1d7e9]::run_test::{closure#1}, ()><unknown>
  477. 30.14 s gammaloop-nextest-core> at <unknown source file>:<unknown line>
  478. 30.14 s gammaloop-nextest-core> 14: <std[bcb96dfbba0ab899]::thread::lifecycle::spawn_unchecked<test[75d6903177b1d7e9]::run_test::{closure#1}, ()>::{closure#1} as core[940e698046960fd5]::ops::function::FnOnce<()>>::call_once::{shim:vtable#0}<unknown>
  479. 30.14 s gammaloop-nextest-core> at <unknown source file>:<unknown line>
  480. 30.14 s gammaloop-nextest-core> 15: <std[bcb96dfbba0ab899]::sys::thread::unix::Thread>::new::thread_start<unknown>
  481. 30.14 s gammaloop-nextest-core> at <unknown source file>:<unknown line>
  482. 30.14 s gammaloop-nextest-core> 16: start_thread<unknown>
  483. 30.14 s gammaloop-nextest-core> at <unknown source file>:<unknown line>
  484. 30.14 s gammaloop-nextest-core> 17: __clone3<unknown>
  485. 30.14 s gammaloop-nextest-core> at <unknown source file>:<unknown line>
  486. 30.14 s gammaloop-nextest-core>
  487. 30.14 s gammaloop-nextest-core> Run with COLORBT_SHOW_HIDDEN=1 environment variable to disable frame filtering.
  488. 30.14 s gammaloop-nextest-core> Run with RUST_BACKTRACE=full to include source snippets.
  489. 30.14 s gammaloop-nextest-core> =========================================
  490. 30.20 s error: Cannot build '/nix/store/w43vq41dm53nli0ffchnccbgvz2afac5-gammaloop-nextest-core.drv'.
  491. 30.20 s Reason: builder failed with exit code 100.
  492. 30.20 s Output paths:
  493. 30.20 s /nix/store/x4h8vjy5svl931716ykng98sg4fkfhp2-gammaloop-nextest-core
  494. 30.20 s Last 473 log lines:
  495. 30.20 s > Extracting 3 binaries (including 1 non-test binary), 1 build script output directory, and 2 linked paths to /build/nextest-archive-Vyv5oz
  496. 30.20 s > Extracted 18 files to /build/nextest-archive-Vyv5oz in 0.64s
  497. 30.20 s > ------------
  498. 30.20 s > Nextest run ID 64073d4b-b8ed-48a8-a880-566b1a0fd496 with nextest profile: ci_gammaloop
  499. 30.20 s > Starting 339 tests across 2 binaries
  500. 30.20 s > ------------
  501. 30.20 s > Summary [ 0.540s] 339 tests run: 339 passed, 0 skipped
  502. 30.20 s >
  503. 30.20 s > ========== nextest test summary ==========
  504. 30.20 s > report: target/nextest/ci_gammaloop/junit.xml
  505. 30.20 s > tests: 339, failures: 0, errors: 0
  506. 30.20 s > No failing testcases found.
  507. 30.20 s > =========================================
  508. 30.20 s > Extracting 1 binary and 1 linked path to /build/nextest-archive-QBREyI
  509. 30.20 s > Extracted 7 files to /build/nextest-archive-QBREyI in 0.09s
  510. 30.20 s > ------------
  511. 30.20 s > Nextest run ID 8aa78090-abcf-4d2f-aba0-55acb733908f with nextest profile: ci_gammaloop
  512. 30.20 s > Starting 19 tests across 1 binary
  513. 30.20 s > ------------
  514. 30.20 s > Summary [ 0.015s] 19 tests run: 19 passed, 0 skipped
  515. 30.20 s >
  516. 30.20 s > ========== nextest test summary ==========
  517. 30.20 s > report: target/nextest/ci_gammaloop/junit.xml
  518. 30.20 s > tests: 19, failures: 0, errors: 0
  519. 30.20 s > No failing testcases found.
  520. 30.20 s > =========================================
  521. 30.20 s > Extracting 1 binary to /build/nextest-archive-6NmnfY
  522. 30.20 s > Extracted 4 files to /build/nextest-archive-6NmnfY in 0.05s
  523. 30.20 s > ------------
  524. 30.20 s > Nextest run ID 82c62d24-8f4c-4ceb-9d9d-f7cbdcec6a23 with nextest profile: ci_gammaloop
  525. 30.20 s > Starting 0 tests across 1 binary
  526. 30.20 s > ------------
  527. 30.20 s > Summary [ 0.000s] 0 tests run: 0 passed, 0 skipped
  528. 30.20 s >
  529. 30.20 s > ========== nextest test summary ==========
  530. 30.20 s > report: target/nextest/ci_gammaloop/junit.xml
  531. 30.20 s > tests: 0, failures: 0, errors: 0
  532. 30.20 s > No failing testcases found.
  533. 30.20 s > =========================================
  534. 30.20 s > Extracting 4 binaries, 1 build script output directory, and 2 linked paths to /build/nextest-archive-OOuIsk
  535. 30.20 s > Extracted 18 files to /build/nextest-archive-OOuIsk in 0.69s
  536. 30.20 s > ------------
  537. 30.20 s > Nextest run ID 8e6a1213-5e34-45f5-917c-d388ed68ccb1 with nextest profile: ci_gammaloop
  538. 30.20 s > Starting 456 tests across 4 binaries (61 tests skipped, including 60 tests via profile.ci_gammaloop.default-filter)
  539. 30.20 s > FAIL [ 0.447s] (445/456) gammalooprs::test_renormalization finit_part_ghlo
  540. 30.20 s > stdout ---
  541. 30.20 s >
  542. 30.20 s > running 1 test
  543. 30.20 s > ren part: 1/2*GC_10^2*dot(P(0,mink(dim)),P(0,mink(dim)))*cas(2,coad(8))/ε
  544. 30.20 s > ━━━━━━━━━━━━━━━━━━━━━━━━━━━━━━━ Snapshot Summary ━━━━━━━━━━━━━━━━━━━━━━━━━━━━━━━
  545. 30.20 s > Snapshot: finit_part_ghlo
  546. 30.20 s > Source: crates/gammalooprs/tests/test_renormalization.rs:557
  547. 30.20 s > ────────────────────────────────────────────────────────────────────────────────
  548. 30.20 s > Expression: align_to_rqft(&a, &model).to_bare_ordered_string()
  549. 30.20 s > ────────────────────────────────────────────────────────────────────────────────
  550. 30.20 s > -old snapshot
  551. 30.20 s > +new results
  552. 30.20 s > ────────────┬───────────────────────────────────────────────────────────────────
  553. 30.20 s > 1 │--1/2*cas(2,coad(8))*dot(P(0,mink(4)),P(0,mink(4)))*gs^2*ε^(-1)
  554. 30.20 s > 1 │+1/2*cas(2,coad(8))*dot(P(0,mink(4)),P(0,mink(4)))*gs^2*ε^(-1)
  555. 30.20 s > ────────────┴───────────────────────────────────────────────────────────────────
  556. 30.20 s > To update snapshots run `cargo insta review`
  557. 30.20 s > Stopped on the first failure. Run `cargo insta test` to run all snapshots.
  558. 30.20 s > test finit_part_ghlo ... FAILED
  559. 30.20 s >
  560. 30.20 s > failures:
  561. 30.20 s >
  562. 30.20 s > failures:
  563. 30.20 s > finit_part_ghlo
  564. 30.20 s >
  565. 30.20 s > test result: FAILED. 0 passed; 1 failed; 0 ignored; 0 measured; 5 filtered out; finished in 0.43s
  566. 30.20 s >
  567. 30.20 s > stderr ---
  568. 30.20 s > The application panicked (crashed).
  569. 30.20 s > Message: snapshot assertion for 'finit_part_ghlo' failed in line 557
  570. 30.20 s > Location: /nix/store/9a12dww58xis3an3kmn597llpijv83b1-vendor-cargo-deps/c19b7c6f923b580ac259164a89f2577984ad5ab09ee9d583b888f934adbbe8d0/insta-1.47.2/src/runtime.rs:719
  571. 30.20 s >
  572. 30.20 s > ━━━━━━━━━━━━━━━━━━━━━━━━━━━━━━━━━━ BACKTRACE ━━━━━━━━━━━━━━━━━━━━━━━━━━━━━━━━━━━
  573. 30.20 s > 1: <color_eyre[51793ea62743adbd]::config::PanicHook>::panic_report<unknown>
  574. 30.20 s > at <unknown source file>:<unknown line>
  575. 30.20 s > 2: <color_eyre[51793ea62743adbd]::config::PanicHook>::into_panic_hook::{closure#0}<unknown>
  576. 30.20 s > at <unknown source file>:<unknown line>
  577. 30.20 s > 3: std[bcb96dfbba0ab899]::panicking::panic_with_hook<unknown>
  578. 30.20 s > at <unknown source file>:<unknown line>
  579. 30.20 s > 4: std[bcb96dfbba0ab899]::panicking::panic_handler::{closure#0}<unknown>
  580. 30.20 s > at <unknown source file>:<unknown line>
  581. 30.20 s > 5: std[bcb96dfbba0ab899]::sys::backtrace::__rust_end_short_backtrace::<std[bcb96dfbba0ab899]::panicking::panic_handler::{closure#0}, !><unknown>
  582. 30.20 s > at <unknown source file>:<unknown line>
  583. 30.20 s > 6: __rustc[6c289b9f9c454d21]::rust_begin_unwind<unknown>
  584. 30.20 s > at <unknown source file>:<unknown line>
  585. 30.20 s > 7: core[940e698046960fd5]::panicking::panic_fmt<unknown>
  586. 30.20 s > at <unknown source file>:<unknown line>
  587. 30.20 s > 8: insta[307a548ac79ef4d9]::runtime::assert_snapshot<unknown>
  588. 30.20 s > at <unknown source file>:<unknown line>
  589. 30.20 s > 9: <test_renormalization[e6829672f1ddb150]::finit_part_ghlo::{closure#0} as core[940e698046960fd5]::ops::function::FnOnce<()>>::call_once<unknown>
  590. 30.20 s > at <unknown source file>:<unknown line>
  591. 30.20 s > 10: test[75d6903177b1d7e9]::__rust_begin_short_backtrace::<core[940e698046960fd5]::result::Result<(), alloc[2ea6bcb46fca0c42]::string::String>, fn() -> core[940e698046960fd5]::result::Result<(), alloc[2ea6bcb46fca0c42]::string::String>><unknown>
  592. 30.20 s > at <unknown source file>:<unknown line>
  593. 30.20 s > 11: test[75d6903177b1d7e9]::run_test::{closure#0}<unknown>
  594. 30.20 s > at <unknown source file>:<unknown line>
  595. 30.20 s > 12: std[bcb96dfbba0ab899]::sys::backtrace::__rust_begin_short_backtrace::<test[75d6903177b1d7e9]::run_test::{closure#1}, ()><unknown>
  596. 30.20 s > at <unknown source file>:<unknown line>
  597. 30.20 s > 13: <std[bcb96dfbba0ab899]::thread::lifecycle::spawn_unchecked<test[75d6903177b1d7e9]::run_test::{closure#1}, ()>::{closure#1} as core[940e698046960fd5]::ops::function::FnOnce<()>>::call_once::{shim:vtable#0}<unknown>
  598. 30.20 s > at <unknown source file>:<unknown line>
  599. 30.20 s > 14: <std[bcb96dfbba0ab899]::sys::thread::unix::Thread>::new::thread_start<unknown>
  600. 30.20 s > at <unknown source file>:<unknown line>
  601. 30.20 s > 15: start_thread<unknown>
  602. 30.20 s > at <unknown source file>:<unknown line>
  603. 30.20 s > 16: __clone3<unknown>
  604. 30.20 s > at <unknown source file>:<unknown line>
  605. 30.20 s >
  606. 30.20 s > Run with COLORBT_SHOW_HIDDEN=1 environment variable to disable frame filtering.
  607. 30.20 s > Run with RUST_BACKTRACE=full to include source snippets.
  608. 30.20 s >
  609. 30.20 s > FAIL [ 3.167s] (451/456) gammalooprs::test_renormalization finite_part_ghost_2loop
  610. 30.20 s > stdout ---
  611. 30.20 s >
  612. 30.20 s > running 1 test
  613. 30.20 s > ━━━━━━━━━━━━━━━━━━━━━━━━━━━━━━━ Snapshot Summary ━━━━━━━━━━━━━━━━━━━━━━━━━━━━━━━
  614. 30.20 s > Snapshot: finite_part_ghost_2loop-3
  615. 30.20 s > Source: crates/gammalooprs/tests/test_renormalization.rs:464
  616. 30.20 s > ────────────────────────────────────────────────────────────────────────────────
  617. 30.20 s > Expression: align_to_rqft(&a, &model).to_bare_ordered_string()
  618. 30.20 s > ────────────────────────────────────────────────────────────────────────────────
  619. 30.20 s > -old snapshot
  620. 30.20 s > +new results
  621. 30.20 s > ────────────┬───────────────────────────────────────────────────────────────────
  622. 30.20 s > 1 │-(-1𝑖/32*ε+1𝑖/16)*(cas(2,coad(8)))^2*dot(P(0,mink(4)),P(0,mink(4)))*gs^4*ε^(-2)
  623. 30.20 s > 1 │+(-1𝑖/16+1𝑖/32*ε)*(cas(2,coad(8)))^2*dot(P(0,mink(4)),P(0,mink(4)))*gs^4*ε^(-2)
  624. 30.20 s > ────────────┴───────────────────────────────────────────────────────────────────
  625. 30.20 s > To update snapshots run `cargo insta review`
  626. 30.20 s > Stopped on the first failure. Run `cargo insta test` to run all snapshots.
  627. 30.20 s > test finite_part_ghost_2loop ... FAILED
  628. 30.20 s >
  629. 30.20 s > failures:
  630. 30.20 s >
  631. 30.20 s > failures:
  632. 30.20 s > finite_part_ghost_2loop
  633. 30.20 s >
  634. 30.20 s > test result: FAILED. 0 passed; 1 failed; 0 ignored; 0 measured; 5 filtered out; finished in 3.15s
  635. 30.20 s >
  636. 30.20 s > stderr ---
  637. 30.20 s > The application panicked (crashed).
  638. 30.20 s > Message: snapshot assertion for 'finite_part_ghost_2loop-3' failed in line 464
  639. 30.20 s > Location: /nix/store/9a12dww58xis3an3kmn597llpijv83b1-vendor-cargo-deps/c19b7c6f923b580ac259164a89f2577984ad5ab09ee9d583b888f934adbbe8d0/insta-1.47.2/src/runtime.rs:719
  640. 30.20 s >
  641. 30.20 s > ━━━━━━━━━━━━━━━━━━━━━━━━━━━━━━━━━━ BACKTRACE ━━━━━━━━━━━━━━━━━━━━━━━━━━━━━━━━━━━
  642. 30.20 s > 1: <color_eyre[51793ea62743adbd]::config::PanicHook>::panic_report<unknown>
  643. 30.20 s > at <unknown source file>:<unknown line>
  644. 30.20 s > 2: <color_eyre[51793ea62743adbd]::config::PanicHook>::into_panic_hook::{closure#0}<unknown>
  645. 30.20 s > at <unknown source file>:<unknown line>
  646. 30.20 s > 3: std[bcb96dfbba0ab899]::panicking::panic_with_hook<unknown>
  647. 30.20 s > at <unknown source file>:<unknown line>
  648. 30.20 s > 4: std[bcb96dfbba0ab899]::panicking::panic_handler::{closure#0}<unknown>
  649. 30.20 s > at <unknown source file>:<unknown line>
  650. 30.20 s > 5: std[bcb96dfbba0ab899]::sys::backtrace::__rust_end_short_backtrace::<std[bcb96dfbba0ab899]::panicking::panic_handler::{closure#0}, !><unknown>
  651. 30.20 s > at <unknown source file>:<unknown line>
  652. 30.20 s > 6: __rustc[6c289b9f9c454d21]::rust_begin_unwind<unknown>
  653. 30.20 s > at <unknown source file>:<unknown line>
  654. 30.20 s > 7: core[940e698046960fd5]::panicking::panic_fmt<unknown>
  655. 30.20 s > at <unknown source file>:<unknown line>
  656. 30.20 s > 8: insta[307a548ac79ef4d9]::runtime::assert_snapshot<unknown>
  657. 30.20 s > at <unknown source file>:<unknown line>
  658. 30.20 s > 9: test_renormalization[e6829672f1ddb150]::finite_part_ghost_2loop<unknown>
  659. 30.20 s > at <unknown source file>:<unknown line>
  660. 30.20 s > 10: <test_renormalization[e6829672f1ddb150]::finite_part_ghost_2loop::{closure#0} as core[940e698046960fd5]::ops::function::FnOnce<()>>::call_once<unknown>
  661. 30.20 s > at <unknown source file>:<unknown line>
  662. 30.20 s > 11: test[75d6903177b1d7e9]::__rust_begin_short_backtrace::<core[940e698046960fd5]::result::Result<(), alloc[2ea6bcb46fca0c42]::string::String>, fn() -> core[940e698046960fd5]::result::Result<(), alloc[2ea6bcb46fca0c42]::string::String>><unknown>
  663. 30.20 s > at <unknown source file>:<unknown line>
  664. 30.20 s > 12: test[75d6903177b1d7e9]::run_test::{closure#0}<unknown>
  665. 30.20 s > at <unknown source file>:<unknown line>
  666. 30.20 s > 13: std[bcb96dfbba0ab899]::sys::backtrace::__rust_begin_short_backtrace::<test[75d6903177b1d7e9]::run_test::{closure#1}, ()><unknown>
  667. 30.20 s > at <unknown source file>:<unknown line>
  668. 30.20 s > 14: <std[bcb96dfbba0ab899]::thread::lifecycle::spawn_unchecked<test[75d6903177b1d7e9]::run_test::{closure#1}, ()>::{closure#1} as core[940e698046960fd5]::ops::function::FnOnce<()>>::call_once::{shim:vtable#0}<unknown>
  669. 30.20 s > at <unknown source file>:<unknown line>
  670. 30.20 s > 15: <std[bcb96dfbba0ab899]::sys::thread::unix::Thread>::new::thread_start<unknown>
  671. 30.20 s > at <unknown source file>:<unknown line>
  672. 30.20 s > 16: start_thread<unknown>
  673. 30.20 s > at <unknown source file>:<unknown line>
  674. 30.20 s > 17: __clone3<unknown>
  675. 30.20 s > at <unknown source file>:<unknown line>
  676. 30.20 s >
  677. 30.20 s > Run with COLORBT_SHOW_HIDDEN=1 environment variable to disable frame filtering.
  678. 30.20 s > Run with RUST_BACKTRACE=full to include source snippets.
  679. 30.20 s >
  680. 30.20 s > ------------
  681. 30.20 s > Summary [ 11.387s] 456 tests run: 454 passed, 2 failed, 61 skipped
  682. 30.20 s > FAIL [ 0.447s] (445/456) gammalooprs::test_renormalization finit_part_ghlo
  683. 30.20 s > stdout ---
  684. 30.20 s >
  685. 30.20 s > running 1 test
  686. 30.20 s > ren part: 1/2*GC_10^2*dot(P(0,mink(dim)),P(0,mink(dim)))*cas(2,coad(8))/ε
  687. 30.20 s > ━━━━━━━━━━━━━━━━━━━━━━━━━━━━━━━ Snapshot Summary ━━━━━━━━━━━━━━━━━━━━━━━━━━━━━━━
  688. 30.20 s > Snapshot: finit_part_ghlo
  689. 30.20 s > Source: crates/gammalooprs/tests/test_renormalization.rs:557
  690. 30.20 s > ────────────────────────────────────────────────────────────────────────────────
  691. 30.20 s > Expression: align_to_rqft(&a, &model).to_bare_ordered_string()
  692. 30.20 s > ────────────────────────────────────────────────────────────────────────────────
  693. 30.20 s > -old snapshot
  694. 30.20 s > +new results
  695. 30.20 s > ────────────┬───────────────────────────────────────────────────────────────────
  696. 30.20 s > 1 │--1/2*cas(2,coad(8))*dot(P(0,mink(4)),P(0,mink(4)))*gs^2*ε^(-1)
  697. 30.20 s > 1 │+1/2*cas(2,coad(8))*dot(P(0,mink(4)),P(0,mink(4)))*gs^2*ε^(-1)
  698. 30.20 s > ────────────┴───────────────────────────────────────────────────────────────────
  699. 30.20 s > To update snapshots run `cargo insta review`
  700. 30.20 s > Stopped on the first failure. Run `cargo insta test` to run all snapshots.
  701. 30.20 s > test finit_part_ghlo ... FAILED
  702. 30.20 s >
  703. 30.20 s > failures:
  704. 30.20 s >
  705. 30.20 s > failures:
  706. 30.20 s > finit_part_ghlo
  707. 30.20 s >
  708. 30.20 s > test result: FAILED. 0 passed; 1 failed; 0 ignored; 0 measured; 5 filtered out; finished in 0.43s
  709. 30.20 s >
  710. 30.20 s > stderr ---
  711. 30.20 s > The application panicked (crashed).
  712. 30.20 s > Message: snapshot assertion for 'finit_part_ghlo' failed in line 557
  713. 30.20 s > Location: /nix/store/9a12dww58xis3an3kmn597llpijv83b1-vendor-cargo-deps/c19b7c6f923b580ac259164a89f2577984ad5ab09ee9d583b888f934adbbe8d0/insta-1.47.2/src/runtime.rs:719
  714. 30.20 s >
  715. 30.20 s > ━━━━━━━━━━━━━━━━━━━━━━━━━━━━━━━━━━ BACKTRACE ━━━━━━━━━━━━━━━━━━━━━━━━━━━━━━━━━━━
  716. 30.20 s > 1: <color_eyre[51793ea62743adbd]::config::PanicHook>::panic_report<unknown>
  717. 30.20 s > at <unknown source file>:<unknown line>
  718. 30.20 s > 2: <color_eyre[51793ea62743adbd]::config::PanicHook>::into_panic_hook::{closure#0}<unknown>
  719. 30.20 s > at <unknown source file>:<unknown line>
  720. 30.20 s > 3: std[bcb96dfbba0ab899]::panicking::panic_with_hook<unknown>
  721. 30.20 s > at <unknown source file>:<unknown line>
  722. 30.20 s > 4: std[bcb96dfbba0ab899]::panicking::panic_handler::{closure#0}<unknown>
  723. 30.20 s > at <unknown source file>:<unknown line>
  724. 30.20 s > 5: std[bcb96dfbba0ab899]::sys::backtrace::__rust_end_short_backtrace::<std[bcb96dfbba0ab899]::panicking::panic_handler::{closure#0}, !><unknown>
  725. 30.20 s > at <unknown source file>:<unknown line>
  726. 30.20 s > 6: __rustc[6c289b9f9c454d21]::rust_begin_unwind<unknown>
  727. 30.20 s > at <unknown source file>:<unknown line>
  728. 30.20 s > 7: core[940e698046960fd5]::panicking::panic_fmt<unknown>
  729. 30.20 s > at <unknown source file>:<unknown line>
  730. 30.20 s > 8: insta[307a548ac79ef4d9]::runtime::assert_snapshot<unknown>
  731. 30.20 s > at <unknown source file>:<unknown line>
  732. 30.20 s > 9: <test_renormalization[e6829672f1ddb150]::finit_part_ghlo::{closure#0} as core[940e698046960fd5]::ops::function::FnOnce<()>>::call_once<unknown>
  733. 30.20 s > at <unknown source file>:<unknown line>
  734. 30.20 s > 10: test[75d6903177b1d7e9]::__rust_begin_short_backtrace::<core[940e698046960fd5]::result::Result<(), alloc[2ea6bcb46fca0c42]::string::String>, fn() -> core[940e698046960fd5]::result::Result<(), alloc[2ea6bcb46fca0c42]::string::String>><unknown>
  735. 30.20 s > at <unknown source file>:<unknown line>
  736. 30.20 s > 11: test[75d6903177b1d7e9]::run_test::{closure#0}<unknown>
  737. 30.20 s > at <unknown source file>:<unknown line>
  738. 30.20 s > 12: std[bcb96dfbba0ab899]::sys::backtrace::__rust_begin_short_backtrace::<test[75d6903177b1d7e9]::run_test::{closure#1}, ()><unknown>
  739. 30.20 s > at <unknown source file>:<unknown line>
  740. 30.20 s > 13: <std[bcb96dfbba0ab899]::thread::lifecycle::spawn_unchecked<test[75d6903177b1d7e9]::run_test::{closure#1}, ()>::{closure#1} as core[940e698046960fd5]::ops::function::FnOnce<()>>::call_once::{shim:vtable#0}<unknown>
  741. 30.20 s > at <unknown source file>:<unknown line>
  742. 30.20 s > 14: <std[bcb96dfbba0ab899]::sys::thread::unix::Thread>::new::thread_start<unknown>
  743. 30.20 s > at <unknown source file>:<unknown line>
  744. 30.20 s > 15: start_thread<unknown>
  745. 30.20 s > at <unknown source file>:<unknown line>
  746. 30.20 s > 16: __clone3<unknown>
  747. 30.20 s > at <unknown source file>:<unknown line>
  748. 30.20 s >
  749. 30.20 s > Run with COLORBT_SHOW_HIDDEN=1 environment variable to disable frame filtering.
  750. 30.20 s > Run with RUST_BACKTRACE=full to include source snippets.
  751. 30.20 s >
  752. 30.20 s > FAIL [ 3.167s] (451/456) gammalooprs::test_renormalization finite_part_ghost_2loop
  753. 30.20 s > stdout ---
  754. 30.20 s >
  755. 30.20 s > running 1 test
  756. 30.20 s > ━━━━━━━━━━━━━━━━━━━━━━━━━━━━━━━ Snapshot Summary ━━━━━━━━━━━━━━━━━━━━━━━━━━━━━━━
  757. 30.20 s > Snapshot: finite_part_ghost_2loop-3
  758. 30.20 s > Source: crates/gammalooprs/tests/test_renormalization.rs:464
  759. 30.20 s > ────────────────────────────────────────────────────────────────────────────────
  760. 30.20 s > Expression: align_to_rqft(&a, &model).to_bare_ordered_string()
  761. 30.20 s > ────────────────────────────────────────────────────────────────────────────────
  762. 30.20 s > -old snapshot
  763. 30.20 s > +new results
  764. 30.20 s > ────────────┬───────────────────────────────────────────────────────────────────
  765. 30.20 s > 1 │-(-1𝑖/32*ε+1𝑖/16)*(cas(2,coad(8)))^2*dot(P(0,mink(4)),P(0,mink(4)))*gs^4*ε^(-2)
  766. 30.20 s > 1 │+(-1𝑖/16+1𝑖/32*ε)*(cas(2,coad(8)))^2*dot(P(0,mink(4)),P(0,mink(4)))*gs^4*ε^(-2)
  767. 30.20 s > ────────────┴───────────────────────────────────────────────────────────────────
  768. 30.20 s > To update snapshots run `cargo insta review`
  769. 30.20 s > Stopped on the first failure. Run `cargo insta test` to run all snapshots.
  770. 30.20 s > test finite_part_ghost_2loop ... FAILED
  771. 30.20 s >
  772. 30.20 s > failures:
  773. 30.20 s >
  774. 30.20 s > failures:
  775. 30.20 s > finite_part_ghost_2loop
  776. 30.20 s >
  777. 30.20 s > test result: FAILED. 0 passed; 1 failed; 0 ignored; 0 measured; 5 filtered out; finished in 3.15s
  778. 30.20 s >
  779. 30.20 s > stderr ---
  780. 30.20 s > The application panicked (crashed).
  781. 30.20 s > Message: snapshot assertion for 'finite_part_ghost_2loop-3' failed in line 464
  782. 30.20 s > Location: /nix/store/9a12dww58xis3an3kmn597llpijv83b1-vendor-cargo-deps/c19b7c6f923b580ac259164a89f2577984ad5ab09ee9d583b888f934adbbe8d0/insta-1.47.2/src/runtime.rs:719
  783. 30.20 s >
  784. 30.20 s > ━━━━━━━━━━━━━━━━━━━━━━━━━━━━━━━━━━ BACKTRACE ━━━━━━━━━━━━━━━━━━━━━━━━━━━━━━━━━━━
  785. 30.20 s > 1: <color_eyre[51793ea62743adbd]::config::PanicHook>::panic_report<unknown>
  786. 30.20 s > at <unknown source file>:<unknown line>
  787. 30.20 s > 2: <color_eyre[51793ea62743adbd]::config::PanicHook>::into_panic_hook::{closure#0}<unknown>
  788. 30.20 s > at <unknown source file>:<unknown line>
  789. 30.20 s > 3: std[bcb96dfbba0ab899]::panicking::panic_with_hook<unknown>
  790. 30.20 s > at <unknown source file>:<unknown line>
  791. 30.20 s > 4: std[bcb96dfbba0ab899]::panicking::panic_handler::{closure#0}<unknown>
  792. 30.20 s > at <unknown source file>:<unknown line>
  793. 30.20 s > 5: std[bcb96dfbba0ab899]::sys::backtrace::__rust_end_short_backtrace::<std[bcb96dfbba0ab899]::panicking::panic_handler::{closure#0}, !><unknown>
  794. 30.20 s > at <unknown source file>:<unknown line>
  795. 30.20 s > 6: __rustc[6c289b9f9c454d21]::rust_begin_unwind<unknown>
  796. 30.20 s > at <unknown source file>:<unknown line>
  797. 30.20 s > 7: core[940e698046960fd5]::panicking::panic_fmt<unknown>
  798. 30.20 s > at <unknown source file>:<unknown line>
  799. 30.20 s > 8: insta[307a548ac79ef4d9]::runtime::assert_snapshot<unknown>
  800. 30.20 s > at <unknown source file>:<unknown line>
  801. 30.20 s > 9: test_renormalization[e6829672f1ddb150]::finite_part_ghost_2loop<unknown>
  802. 30.20 s > at <unknown source file>:<unknown line>
  803. 30.20 s > 10: <test_renormalization[e6829672f1ddb150]::finite_part_ghost_2loop::{closure#0} as core[940e698046960fd5]::ops::function::FnOnce<()>>::call_once<unknown>
  804. 30.20 s > at <unknown source file>:<unknown line>
  805. 30.20 s > 11: test[75d6903177b1d7e9]::__rust_begin_short_backtrace::<core[940e698046960fd5]::result::Result<(), alloc[2ea6bcb46fca0c42]::string::String>, fn() -> core[940e698046960fd5]::result::Result<(), alloc[2ea6bcb46fca0c42]::string::String>><unknown>
  806. 30.20 s > at <unknown source file>:<unknown line>
  807. 30.20 s > 12: test[75d6903177b1d7e9]::run_test::{closure#0}<unknown>
  808. 30.20 s > at <unknown source file>:<unknown line>
  809. 30.20 s > 13: std[bcb96dfbba0ab899]::sys::backtrace::__rust_begin_short_backtrace::<test[75d6903177b1d7e9]::run_test::{closure#1}, ()><unknown>
  810. 30.20 s > at <unknown source file>:<unknown line>
  811. 30.20 s > 14: <std[bcb96dfbba0ab899]::thread::lifecycle::spawn_unchecked<test[75d6903177b1d7e9]::run_test::{closure#1}, ()>::{closure#1} as core[940e698046960fd5]::ops::function::FnOnce<()>>::call_once::{shim:vtable#0}<unknown>
  812. 30.20 s > at <unknown source file>:<unknown line>
  813. 30.20 s > 15: <std[bcb96dfbba0ab899]::sys::thread::unix::Thread>::new::thread_start<unknown>
  814. 30.20 s > at <unknown source file>:<unknown line>
  815. 30.20 s > 16: start_thread<unknown>
  816. 30.20 s > at <unknown source file>:<unknown line>
  817. 30.20 s > 17: __clone3<unknown>
  818. 30.20 s > at <unknown source file>:<unknown line>
  819. 30.20 s >
  820. 30.20 s > Run with COLORBT_SHOW_HIDDEN=1 environment variable to disable frame filtering.
  821. 30.20 s > Run with RUST_BACKTRACE=full to include source snippets.
  822. 30.20 s >
  823. 30.20 s > error: test run failed
  824. 30.20 s >
  825. 30.20 s > ========== nextest test summary ==========
  826. 30.20 s > report: target/nextest/ci_gammaloop/junit.xml
  827. 30.20 s > tests: 456, failures: 2, errors: 0
  828. 30.20 s >
  829. 30.20 s > 1. gammalooprs::test_renormalization::finit_part_ghlo
  830. 30.20 s > failure: test failure with exit code 101
  831. 30.20 s > system-out
  832. 30.20 s > running 1 test
  833. 30.20 s > ren part: 1/2*GC_10^2*dot(P(0,mink(dim)),P(0,mink(dim)))*cas(2,coad(8))/ε
  834. 30.20 s > ━━━━━━━━━━━━━━━━━━━━━━━━━━━━━━━ Snapshot Summary ━━━━━━━━━━━━━━━━━━━━━━━━━━━━━━━
  835. 30.20 s > Snapshot: finit_part_ghlo
  836. 30.20 s > Source: crates/gammalooprs/tests/test_renormalization.rs:557
  837. 30.20 s > ────────────────────────────────────────────────────────────────────────────────
  838. 30.20 s > Expression: align_to_rqft(&a, &model).to_bare_ordered_string()
  839. 30.20 s > ────────────────────────────────────────────────────────────────────────────────
  840. 30.20 s > -old snapshot
  841. 30.20 s > +new results
  842. 30.20 s > ────────────┬───────────────────────────────────────────────────────────────────
  843. 30.20 s > 1 │--1/2*cas(2,coad(8))*dot(P(0,mink(4)),P(0,mink(4)))*gs^2*ε^(-1)
  844. 30.20 s > 1 │+1/2*cas(2,coad(8))*dot(P(0,mink(4)),P(0,mink(4)))*gs^2*ε^(-1)
  845. 30.20 s > ────────────┴───────────────────────────────────────────────────────────────────
  846. 30.20 s > To update snapshots run `cargo insta review`
  847. 30.20 s > Stopped on the first failure. Run `cargo insta test` to run all snapshots.
  848. 30.20 s > test finit_part_ghlo ... FAILED
  849. 30.20 s >
  850. 30.20 s > failures:
  851. 30.20 s >
  852. 30.20 s > failures:
  853. 30.20 s > finit_part_ghlo
  854. 30.20 s >
  855. 30.20 s > test result: FAILED. 0 passed; 1 failed; 0 ignored; 0 measured; 5 filtered out; finished in 0.43s
  856. 30.20 s > system-err
  857. 30.20 s > The application panicked (crashed).
  858. 30.20 s > Message: snapshot assertion for 'finit_part_ghlo' failed in line 557
  859. 30.20 s > Location: /nix/store/9a12dww58xis3an3kmn597llpijv83b1-vendor-cargo-deps/c19b7c6f923b580ac259164a89f2577984ad5ab09ee9d583b888f934adbbe8d0/insta-1.47.2/src/runtime.rs:719
  860. 30.20 s >
  861. 30.20 s > ━━━━━━━━━━━━━━━━━━━━━━━━━━━━━━━━━━ BACKTRACE ━━━━━━━━━━━━━━━━━━━━━━━━━━━━━━━━━━━
  862. 30.20 s > 1: <color_eyre[51793ea62743adbd]::config::PanicHook>::panic_report<unknown>
  863. 30.20 s > at <unknown source file>:<unknown line>
  864. 30.20 s > 2: <color_eyre[51793ea62743adbd]::config::PanicHook>::into_panic_hook::{closure#0}<unknown>
  865. 30.20 s > at <unknown source file>:<unknown line>
  866. 30.20 s > 3: std[bcb96dfbba0ab899]::panicking::panic_with_hook<unknown>
  867. 30.20 s > at <unknown source file>:<unknown line>
  868. 30.20 s > 4: std[bcb96dfbba0ab899]::panicking::panic_handler::{closure#0}<unknown>
  869. 30.20 s > at <unknown source file>:<unknown line>
  870. 30.20 s > 5: std[bcb96dfbba0ab899]::sys::backtrace::__rust_end_short_backtrace::<std[bcb96dfbba0ab899]::panicking::panic_handler::{closure#0}, !><unknown>
  871. 30.20 s > at <unknown source file>:<unknown line>
  872. 30.20 s > 6: __rustc[6c289b9f9c454d21]::rust_begin_unwind<unknown>
  873. 30.20 s > at <unknown source file>:<unknown line>
  874. 30.20 s > 7: core[940e698046960fd5]::panicking::panic_fmt<unknown>
  875. 30.20 s > at <unknown source file>:<unknown line>
  876. 30.20 s > 8: insta[307a548ac79ef4d9]::runtime::assert_snapshot<unknown>
  877. 30.20 s > at <unknown source file>:<unknown line>
  878. 30.20 s > 9: <test_renormalization[e6829672f1ddb150]::finit_part_ghlo::{closure#0} as core[940e698046960fd5]::ops::function::FnOnce<()>>::call_once<unknown>
  879. 30.20 s > at <unknown source file>:<unknown line>
  880. 30.20 s > 10: test[75d6903177b1d7e9]::__rust_begin_short_backtrace::<core[940e698046960fd5]::result::Result<(), alloc[2ea6bcb46fca0c42]::string::String>, fn() -> core[940e698046960fd5]::result::Result<(), alloc[2ea6bcb46fca0c42]::string::String>><unknown>
  881. 30.20 s > at <unknown source file>:<unknown line>
  882. 30.20 s > 11: test[75d6903177b1d7e9]::run_test::{closure#0}<unknown>
  883. 30.20 s > at <unknown source file>:<unknown line>
  884. 30.20 s > 12: std[bcb96dfbba0ab899]::sys::backtrace::__rust_begin_short_backtrace::<test[75d6903177b1d7e9]::run_test::{closure#1}, ()><unknown>
  885. 30.20 s > at <unknown source file>:<unknown line>
  886. 30.20 s > 13: <std[bcb96dfbba0ab899]::thread::lifecycle::spawn_unchecked<test[75d6903177b1d7e9]::run_test::{closure#1}, ()>::{closure#1} as core[940e698046960fd5]::ops::function::FnOnce<()>>::call_once::{shim:vtable#0}<unknown>
  887. 30.20 s > at <unknown source file>:<unknown line>
  888. 30.20 s > 14: <std[bcb96dfbba0ab899]::sys::thread::unix::Thread>::new::thread_start<unknown>
  889. 30.20 s > at <unknown source file>:<unknown line>
  890. 30.20 s > 15: start_thread<unknown>
  891. 30.20 s > at <unknown source file>:<unknown line>
  892. 30.20 s > 16: __clone3<unknown>
  893. 30.20 s > at <unknown source file>:<unknown line>
  894. 30.20 s >
  895. 30.20 s > Run with COLORBT_SHOW_HIDDEN=1 environment variable to disable frame filtering.
  896. 30.20 s > Run with RUST_BACKTRACE=full to include source snippets.
  897. 30.20 s >
  898. 30.20 s > 2. gammalooprs::test_renormalization::finite_part_ghost_2loop
  899. 30.20 s > failure: test failure with exit code 101
  900. 30.20 s > system-out
  901. 30.20 s > running 1 test
  902. 30.20 s > ━━━━━━━━━━━━━━━━━━━━━━━━━━━━━━━ Snapshot Summary ━━━━━━━━━━━━━━━━━━━━━━━━━━━━━━━
  903. 30.20 s > Snapshot: finite_part_ghost_2loop-3
  904. 30.20 s > Source: crates/gammalooprs/tests/test_renormalization.rs:464
  905. 30.20 s > ────────────────────────────────────────────────────────────────────────────────
  906. 30.20 s > Expression: align_to_rqft(&a, &model).to_bare_ordered_string()
  907. 30.20 s > ────────────────────────────────────────────────────────────────────────────────
  908. 30.20 s > -old snapshot
  909. 30.20 s > +new results
  910. 30.20 s > ────────────┬───────────────────────────────────────────────────────────────────
  911. 30.20 s > 1 │-(-1𝑖/32*ε+1𝑖/16)*(cas(2,coad(8)))^2*dot(P(0,mink(4)),P(0,mink(4)))*gs^4*ε^(-2)
  912. 30.20 s > 1 │+(-1𝑖/16+1𝑖/32*ε)*(cas(2,coad(8)))^2*dot(P(0,mink(4)),P(0,mink(4)))*gs^4*ε^(-2)
  913. 30.20 s > ────────────┴───────────────────────────────────────────────────────────────────
  914. 30.20 s > To update snapshots run `cargo insta review`
  915. 30.20 s > Stopped on the first failure. Run `cargo insta test` to run all snapshots.
  916. 30.20 s > test finite_part_ghost_2loop ... FAILED
  917. 30.20 s >
  918. 30.20 s > failures:
  919. 30.20 s >
  920. 30.20 s > failures:
  921. 30.20 s > finite_part_ghost_2loop
  922. 30.20 s >
  923. 30.20 s > test result: FAILED. 0 passed; 1 failed; 0 ignored; 0 measured; 5 filtered out; finished in 3.15s
  924. 30.20 s > system-err
  925. 30.20 s > The application panicked (crashed).
  926. 30.20 s > Message: snapshot assertion for 'finite_part_ghost_2loop-3' failed in line 464
  927. 30.20 s > Location: /nix/store/9a12dww58xis3an3kmn597llpijv83b1-vendor-cargo-deps/c19b7c6f923b580ac259164a89f2577984ad5ab09ee9d583b888f934adbbe8d0/insta-1.47.2/src/runtime.rs:719
  928. 30.20 s >
  929. 30.20 s > ━━━━━━━━━━━━━━━━━━━━━━━━━━━━━━━━━━ BACKTRACE ━━━━━━━━━━━━━━━━━━━━━━━━━━━━━━━━━━━
  930. 30.20 s > 1: <color_eyre[51793ea62743adbd]::config::PanicHook>::panic_report<unknown>
  931. 30.20 s > at <unknown source file>:<unknown line>
  932. 30.20 s > 2: <color_eyre[51793ea62743adbd]::config::PanicHook>::into_panic_hook::{closure#0}<unknown>
  933. 30.20 s > at <unknown source file>:<unknown line>
  934. 30.20 s > 3: std[bcb96dfbba0ab899]::panicking::panic_with_hook<unknown>
  935. 30.20 s > at <unknown source file>:<unknown line>
  936. 30.20 s > 4: std[bcb96dfbba0ab899]::panicking::panic_handler::{closure#0}<unknown>
  937. 30.20 s > at <unknown source file>:<unknown line>
  938. 30.20 s > 5: std[bcb96dfbba0ab899]::sys::backtrace::__rust_end_short_backtrace::<std[bcb96dfbba0ab899]::panicking::panic_handler::{closure#0}, !><unknown>
  939. 30.20 s > at <unknown source file>:<unknown line>
  940. 30.20 s > 6: __rustc[6c289b9f9c454d21]::rust_begin_unwind<unknown>
  941. 30.20 s > at <unknown source file>:<unknown line>
  942. 30.20 s > 7: core[940e698046960fd5]::panicking::panic_fmt<unknown>
  943. 30.20 s > at <unknown source file>:<unknown line>
  944. 30.20 s > 8: insta[307a548ac79ef4d9]::runtime::assert_snapshot<unknown>
  945. 30.20 s > at <unknown source file>:<unknown line>
  946. 30.20 s > 9: test_renormalization[e6829672f1ddb150]::finite_part_ghost_2loop<unknown>
  947. 30.20 s > at <unknown source file>:<unknown line>
  948. 30.20 s > 10: <test_renormalization[e6829672f1ddb150]::finite_part_ghost_2loop::{closure#0} as core[940e698046960fd5]::ops::function::FnOnce<()>>::call_once<unknown>
  949. 30.20 s > at <unknown source file>:<unknown line>
  950. 30.20 s > 11: test[75d6903177b1d7e9]::__rust_begin_short_backtrace::<core[940e698046960fd5]::result::Result<(), alloc[2ea6bcb46fca0c42]::string::String>, fn() -> core[940e698046960fd5]::result::Result<(), alloc[2ea6bcb46fca0c42]::string::String>><unknown>
  951. 30.20 s > at <unknown source file>:<unknown line>
  952. 30.20 s > 12: test[75d6903177b1d7e9]::run_test::{closure#0}<unknown>
  953. 30.20 s > at <unknown source file>:<unknown line>
  954. 30.20 s > 13: std[bcb96dfbba0ab899]::sys::backtrace::__rust_begin_short_backtrace::<test[75d6903177b1d7e9]::run_test::{closure#1}, ()><unknown>
  955. 30.20 s > at <unknown source file>:<unknown line>
  956. 30.20 s > 14: <std[bcb96dfbba0ab899]::thread::lifecycle::spawn_unchecked<test[75d6903177b1d7e9]::run_test::{closure#1}, ()>::{closure#1} as core[940e698046960fd5]::ops::function::FnOnce<()>>::call_once::{shim:vtable#0}<unknown>
  957. 30.20 s > at <unknown source file>:<unknown line>
  958. 30.20 s > 15: <std[bcb96dfbba0ab899]::sys::thread::unix::Thread>::new::thread_start<unknown>
  959. 30.20 s > at <unknown source file>:<unknown line>
  960. 30.20 s > 16: start_thread<unknown>
  961. 30.20 s > at <unknown source file>:<unknown line>
  962. 30.20 s > 17: __clone3<unknown>
  963. 30.20 s > at <unknown source file>:<unknown line>
  964. 30.20 s >
  965. 30.20 s > Run with COLORBT_SHOW_HIDDEN=1 environment variable to disable frame filtering.
  966. 30.20 s > Run with RUST_BACKTRACE=full to include source snippets.
  967. 30.20 s > =========================================
  968. 30.20 s For full logs, run:
  969. 30.20 s nix log /nix/store/w43vq41dm53nli0ffchnccbgvz2afac5-gammaloop-nextest-core.drv
  970. 30.32 s [0 built (1 failed)]Run failed.