test packages.x86_64-linux.nix-ci-check-gammaloop-nextest-core

Reproduce this run
Retry Run
  1. 0.70 s $ /nix/store/9ypz3flqsrl5xl495mm8h645gadjsxi1-coreutils-9.11/bin/timeout --kill-after=15s 7200s /nix/store/23zk8sgzamrbmj1fday15szf7f2279s8-nix-2.34.7/bin/nix --extra-experimental-features nix-command --extra-experimental-features flakes flake clone git+https://github.com/alphal00p/gammaloop --dest /tmp/nix-ci-worker/stable-pwd/repo/
  2. 0.92 s Cloning into '/tmp/nix-ci-worker/stable-pwd/repo'...
  3. 1.19 s remote: Enumerating objects: 65018, done.
  4. 1.31 s remote: Counting objects: 0% (1/7690) remote: Counting objects: 1% (77/7690) remote: Counting objects: 2% (154/7690) remote: Counting objects: 3% (231/7690) remote: Counting objects: 4% (308/7690) remote: Counting objects: 5% (385/7690) remote: Counting objects: 6% (462/7690) remote: Counting objects: 7% (539/7690) remote: Counting objects: 8% (616/7690) remote: Counting objects: 9% (693/7690) remote: Counting objects: 10% (769/7690) remote: Counting objects: 11% (846/7690) remote: Counting objects: 12% (923/7690) remote: Counting objects: 13% (1000/7690) remote: Counting objects: 14% (1077/7690) remote: Counting objects: 15% (1154/7690) remote: Counting objects: 16% (1231/7690) remote: Counting objects: 17% (1308/7690) remote: Counting objects: 18% (1385/7690) remote: Counting objects: 19% (1462/7690) remote: Counting objects: 20% (1538/7690) remote: Counting objects: 21% (1615/7690) remote: Counting objects: 22% (1692/7690) remote: Counting objects: 23% (1769/7690) remote: Counting objects: 24% (1846/7690) remote: Counting objects: 25% (1923/7690) remote: Counting objects: 26% (2000/7690) remote: Counting objects: 27% (2077/7690) remote: Counting objects: 28% (2154/7690) remote: Counting objects: 29% (2231/7690) remote: Counting objects: 30% (2307/7690) remote: Counting objects: 31% (2384/7690) remote: Counting objects: 32% (2461/7690) remote: Counting objects: 33% (2538/7690) remote: Counting objects: 34% (2615/7690) remote: Counting objects: 35% (2692/7690) remote: Counting objects: 36% (2769/7690) remote: Counting objects: 37% (2846/7690) remote: Counting objects: 38% (2923/7690) remote: Counting objects: 39% (3000/7690) remote: Counting objects: 40% (3076/7690) remote: Counting objects: 41% (3153/7690) remote: Counting objects: 42% (3230/7690) remote: Counting objects: 43% (3307/7690) remote: Counting objects: 44% (3384/7690) remote: Counting objects: 45% (3461/7690) remote: Counting objects: 46% (3538/7690) remote: Counting objects: 47% (3615/7690) remote: Counting objects: 48% (3692/7690) remote: Counting objects: 49% (3769/7690) remote: Counting objects: 50% (3845/7690) remote: Counting objects: 51% (3922/7690) remote: Counting objects: 52% (3999/7690) remote: Counting objects: 53% (4076/7690) remote: Counting objects: 54% (4153/7690) remote: Counting objects: 55% (4230/7690) remote: Counting objects: 56% (4307/7690) remote: Counting objects: 57% (4384/7690) remote: Counting objects: 58% (4461/7690) remote: Counting objects: 59% (4538/7690) remote: Counting objects: 60% (4614/7690) remote: Counting objects: 61% (4691/7690) remote: Counting objects: 62% (4768/7690) remote: Counting objects: 63% (4845/7690) remote: Counting objects: 64% (4922/7690) remote: Counting objects: 65% (4999/7690) remote: Counting objects: 66% (5076/7690) remote: Counting objects: 67% (5153/7690) remote: Counting objects: 68% (5230/7690) remote: Counting objects: 69% (5307/7690) remote: Counting objects: 70% (5383/7690) remote: Counting objects: 71% (5460/7690) remote: Counting objects: 72% (5537/7690) remote: Counting objects: 73% (5614/7690) remote: Counting objects: 74% (5691/7690) remote: Counting objects: 75% (5768/7690) remote: Counting objects: 76% (5845/7690) remote: Counting objects: 77% (5922/7690) remote: Counting objects: 78% (5999/7690) remote: Counting objects: 79% (6076/7690) remote: Counting objects: 80% (6152/7690) remote: Counting objects: 81% (6229/7690) remote: Counting objects: 82% (6306/7690) remote: Counting objects: 83% (6383/7690) remote: Counting objects: 84% (6460/7690) remote: Counting objects: 85% (6537/7690) remote: Counting objects: 86% (6614/7690) remote: Counting objects: 87% (6691/7690) remote: Counting objects: 88% (6768/7690) remote: Counting objects: 89% (6845/7690) remote: Counting objects: 90% (6921/7690) remote: Counting objects: 91% (6998/7690) remote: Counting objects: 92% (7075/7690) remote: Counting objects: 93% (7152/7690) remote: Counting objects: 94% (7229/7690) remote: Counting objects: 95% (7306/7690) remote: Counting objects: 96% (7383/7690) remote: Counting objects: 97% (7460/7690) remote: Counting objects: 98% (7537/7690) remote: Counting objects: 99% (7614/7690) remote: Counting objects: 100% (7690/7690) remote: Counting objects: 100% (7690/7690), done.
  5. 2.77 s remote: Compressing objects: 0% (1/1405) remote: Compressing objects: 1% (15/1405) remote: Compressing objects: 2% (29/1405) remote: Compressing objects: 3% (43/1405) remote: Compressing objects: 4% (57/1405) remote: Compressing objects: 5% (71/1405) remote: Compressing objects: 6% (85/1405) remote: Compressing objects: 7% (99/1405) remote: Compressing objects: 8% (113/1405) remote: Compressing objects: 9% (127/1405) remote: Compressing objects: 10% (141/1405) remote: Compressing objects: 11% (155/1405) remote: Compressing objects: 11% (163/1405) remote: Compressing objects: 12% (169/1405) remote: Compressing objects: 13% (183/1405) remote: Compressing objects: 14% (197/1405) remote: Compressing objects: 15% (211/1405) remote: Compressing objects: 16% (225/1405) remote: Compressing objects: 17% (239/1405) remote: Compressing objects: 18% (253/1405) remote: Compressing objects: 19% (267/1405) remote: Compressing objects: 20% (281/1405) remote: Compressing objects: 21% (296/1405) remote: Compressing objects: 22% (310/1405) remote: Compressing objects: 23% (324/1405) remote: Compressing objects: 24% (338/1405) remote: Compressing objects: 25% (352/1405) remote: Compressing objects: 26% (366/1405) remote: Compressing objects: 27% (380/1405) remote: Compressing objects: 28% (394/1405) remote: Compressing objects: 29% (408/1405) remote: Compressing objects: 30% (422/1405) remote: Compressing objects: 31% (436/1405) remote: Compressing objects: 32% (450/1405) remote: Compressing objects: 33% (464/1405) remote: Compressing objects: 34% (478/1405) remote: Compressing objects: 35% (492/1405) remote: Compressing objects: 36% (506/1405) remote: Compressing objects: 37% (520/1405) remote: Compressing objects: 38% (534/1405) remote: Compressing objects: 39% (548/1405) remote: Compressing objects: 40% (562/1405) remote: Compressing objects: 41% (577/1405) remote: Compressing objects: 42% (591/1405) remote: Compressing objects: 43% (605/1405) remote: Compressing objects: 44% (619/1405) remote: Compressing objects: 45% (633/1405) remote: Compressing objects: 46% (647/1405) remote: Compressing objects: 47% (661/1405) remote: Compressing objects: 48% (675/1405) remote: Compressing objects: 49% (689/1405) remote: Compressing objects: 50% (703/1405) remote: Compressing objects: 51% (717/1405) remote: Compressing objects: 52% (731/1405) remote: Compressing objects: 53% (745/1405) remote: Compressing objects: 54% (759/1405) remote: Compressing objects: 55% (773/1405) remote: Compressing objects: 56% (787/1405) remote: Compressing objects: 57% (801/1405) remote: Compressing objects: 58% (815/1405) remote: Compressing objects: 59% (829/1405) remote: Compressing objects: 60% (843/1405) remote: Compressing objects: 61% (858/1405) remote: Compressing objects: 62% (872/1405) remote: Compressing objects: 63% (886/1405) remote: Compressing objects: 64% (900/1405) remote: Compressing objects: 65% (914/1405) remote: Compressing objects: 66% (928/1405) remote: Compressing objects: 67% (942/1405) remote: Compressing objects: 68% (956/1405) remote: Compressing objects: 69% (970/1405) remote: Compressing objects: 70% (984/1405) remote: Compressing objects: 71% (998/1405) remote: Compressing objects: 72% (1012/1405) remote: Compressing objects: 73% (1026/1405) remote: Compressing objects: 74% (1040/1405) remote: Compressing objects: 75% (1054/1405) remote: Compressing objects: 76% (1068/1405) remote: Compressing objects: 77% (1082/1405) remote: Compressing objects: 78% (1096/1405) remote: Compressing objects: 79% (1110/1405) remote: Compressing objects: 80% (1124/1405) remote: Compressing objects: 81% (1139/1405) remote: Compressing objects: 82% (1153/1405) remote: Compressing objects: 83% (1167/1405) remote: Compressing objects: 84% (1181/1405) remote: Compressing objects: 85% (1195/1405) remote: Compressing objects: 86% (1209/1405) remote: Compressing objects: 87% (1223/1405) remote: Compressing objects: 88% (1237/1405) remote: Compressing objects: 89% (1251/1405) remote: Compressing objects: 90% (1265/1405) remote: Compressing objects: 91% (1279/1405) remote: Compressing objects: 92% (1293/1405) remote: Compressing objects: 93% (1307/1405) remote: Compressing objects: 94% (1321/1405) remote: Compressing objects: 95% (1335/1405) remote: Compressing objects: 96% (1349/1405) remote: Compressing objects: 97% (1363/1405) remote: Compressing objects: 98% (1377/1405) remote: Compressing objects: 99% (1391/1405) remote: Compressing objects: 100% (1405/1405) remote: Compressing objects: 100% (1405/1405), done.
  6. 5.40 s Receiving objects: 0% (1/65018) Receiving objects: 1% (651/65018) Receiving objects: 2% (1301/65018) Receiving objects: 3% (1951/65018) Receiving objects: 4% (2601/65018) Receiving objects: 5% (3251/65018) Receiving objects: 6% (3902/65018) Receiving objects: 7% (4552/65018) Receiving objects: 8% (5202/65018) Receiving objects: 9% (5852/65018) Receiving objects: 10% (6502/65018) Receiving objects: 11% (7152/65018) Receiving objects: 12% (7803/65018), 16.24 MiB | 32.47 MiB/s Receiving objects: 13% (8453/65018), 16.24 MiB | 32.47 MiB/s Receiving objects: 14% (9103/65018), 16.24 MiB | 32.47 MiB/s Receiving objects: 15% (9753/65018), 16.24 MiB | 32.47 MiB/s Receiving objects: 16% (10403/65018), 16.24 MiB | 32.47 MiB/s Receiving objects: 17% (11054/65018), 16.24 MiB | 32.47 MiB/s Receiving objects: 18% (11704/65018), 16.24 MiB | 32.47 MiB/s Receiving objects: 19% (12354/65018), 16.24 MiB | 32.47 MiB/s Receiving objects: 20% (13004/65018), 16.24 MiB | 32.47 MiB/s Receiving objects: 21% (13654/65018), 16.24 MiB | 32.47 MiB/s Receiving objects: 22% (14304/65018), 16.24 MiB | 32.47 MiB/s Receiving objects: 23% (14955/65018), 16.24 MiB | 32.47 MiB/s Receiving objects: 24% (15605/65018), 16.24 MiB | 32.47 MiB/s Receiving objects: 25% (16255/65018), 16.24 MiB | 32.47 MiB/s Receiving objects: 26% (16905/65018), 16.24 MiB | 32.47 MiB/s Receiving objects: 27% (17555/65018), 16.24 MiB | 32.47 MiB/s Receiving objects: 28% (18206/65018), 16.24 MiB | 32.47 MiB/s Receiving objects: 29% (18856/65018), 16.24 MiB | 32.47 MiB/s Receiving objects: 30% (19506/65018), 16.24 MiB | 32.47 MiB/s Receiving objects: 31% (20156/65018), 16.24 MiB | 32.47 MiB/s Receiving objects: 32% (20806/65018), 16.24 MiB | 32.47 MiB/s Receiving objects: 33% (21456/65018), 16.24 MiB | 32.47 MiB/s Receiving objects: 34% (22107/65018), 16.24 MiB | 32.47 MiB/s Receiving objects: 35% (22757/65018), 16.24 MiB | 32.47 MiB/s Receiving objects: 36% (23407/65018), 16.24 MiB | 32.47 MiB/s Receiving objects: 37% (24057/65018), 16.24 MiB | 32.47 MiB/s Receiving objects: 38% (24707/65018), 16.24 MiB | 32.47 MiB/s Receiving objects: 39% (25358/65018), 16.24 MiB | 32.47 MiB/s Receiving objects: 40% (26008/65018), 16.24 MiB | 32.47 MiB/s Receiving objects: 41% (26658/65018), 16.24 MiB | 32.47 MiB/s Receiving objects: 42% (27308/65018), 16.24 MiB | 32.47 MiB/s Receiving objects: 43% (27958/65018), 16.24 MiB | 32.47 MiB/s Receiving objects: 44% (28608/65018), 16.24 MiB | 32.47 MiB/s Receiving objects: 45% (29259/65018), 16.24 MiB | 32.47 MiB/s Receiving objects: 46% (29909/65018), 16.24 MiB | 32.47 MiB/s Receiving objects: 47% (30559/65018), 16.24 MiB | 32.47 MiB/s Receiving objects: 48% (31209/65018), 16.24 MiB | 32.47 MiB/s Receiving objects: 49% (31859/65018), 16.24 MiB | 32.47 MiB/s Receiving objects: 50% (32509/65018), 16.24 MiB | 32.47 MiB/s Receiving objects: 51% (33160/65018), 16.24 MiB | 32.47 MiB/s Receiving objects: 52% (33810/65018), 16.24 MiB | 32.47 MiB/s Receiving objects: 52% (33908/65018), 16.24 MiB | 32.47 MiB/s Receiving objects: 53% (34460/65018), 32.57 MiB | 32.53 MiB/s Receiving objects: 54% (35110/65018), 32.57 MiB | 32.53 MiB/s Receiving objects: 55% (35760/65018), 32.57 MiB | 32.53 MiB/s Receiving objects: 56% (36411/65018), 32.57 MiB | 32.53 MiB/s Receiving objects: 57% (37061/65018), 32.57 MiB | 32.53 MiB/s Receiving objects: 58% (37711/65018), 32.57 MiB | 32.53 MiB/s Receiving objects: 59% (38361/65018), 32.57 MiB | 32.53 MiB/s Receiving objects: 60% (39011/65018), 32.57 MiB | 32.53 MiB/s Receiving objects: 61% (39661/65018), 32.57 MiB | 32.53 MiB/s Receiving objects: 62% (40312/65018), 32.57 MiB | 32.53 MiB/s Receiving objects: 63% (40962/65018), 32.57 MiB | 32.53 MiB/s Receiving objects: 64% (41612/65018), 49.82 MiB | 33.19 MiB/s Receiving objects: 65% (42262/65018), 49.82 MiB | 33.19 MiB/s Receiving objects: 66% (42912/65018), 49.82 MiB | 33.19 MiB/s Receiving objects: 67% (43563/65018), 49.82 MiB | 33.19 MiB/s Receiving objects: 68% (44213/65018), 49.82 MiB | 33.19 MiB/s Receiving objects: 69% (44863/65018), 49.82 MiB | 33.19 MiB/s Receiving objects: 70% (45513/65018), 49.82 MiB | 33.19 MiB/s Receiving objects: 71% (46163/65018), 49.82 MiB | 33.19 MiB/s Receiving objects: 72% (46813/65018), 49.82 MiB | 33.19 MiB/s Receiving objects: 73% (47464/65018), 49.82 MiB | 33.19 MiB/s Receiving objects: 74% (48114/65018), 49.82 MiB | 33.19 MiB/s Receiving objects: 75% (48764/65018), 49.82 MiB | 33.19 MiB/s Receiving objects: 75% (48902/65018), 66.10 MiB | 32.80 MiB/s Receiving objects: 76% (49414/65018), 66.10 MiB | 32.80 MiB/s Receiving objects: 77% (50064/65018), 66.10 MiB | 32.80 MiB/s Receiving objects: 78% (50715/65018), 66.10 MiB | 32.80 MiB/s Receiving objects: 79% (51365/65018), 66.10 MiB | 32.80 MiB/s Receiving objects: 80% (52015/65018), 66.10 MiB | 32.80 MiB/s Receiving objects: 81% (52665/65018), 66.10 MiB | 32.80 MiB/s Receiving objects: 82% (53315/65018), 66.10 MiB | 32.80 MiB/s Receiving objects: 83% (53965/65018), 66.10 MiB | 32.80 MiB/s Receiving objects: 84% (54616/65018), 66.10 MiB | 32.80 MiB/s Receiving objects: 85% (55266/65018), 66.10 MiB | 32.80 MiB/s Receiving objects: 86% (55916/65018), 66.10 MiB | 32.80 MiB/s Receiving objects: 87% (56566/65018), 66.10 MiB | 32.80 MiB/s Receiving objects: 88% (57216/65018), 66.10 MiB | 32.80 MiB/s Receiving objects: 89% (57867/65018), 66.10 MiB | 32.80 MiB/s Receiving objects: 90% (58517/65018), 66.10 MiB | 32.80 MiB/s Receiving objects: 91% (59167/65018), 66.10 MiB | 32.80 MiB/s Receiving objects: 92% (59817/65018), 66.10 MiB | 32.80 MiB/s Receiving objects: 93% (60467/65018), 66.10 MiB | 32.80 MiB/s Receiving objects: 94% (61117/65018), 83.30 MiB | 33.12 MiB/s Receiving objects: 95% (61768/65018), 83.30 MiB | 33.12 MiB/s Receiving objects: 96% (62418/65018), 83.30 MiB | 33.12 MiB/s Receiving objects: 97% (63068/65018), 83.30 MiB | 33.12 MiB/s Receiving objects: 98% (63718/65018), 83.30 MiB | 33.12 MiB/s Receiving objects: 99% (64368/65018), 83.30 MiB | 33.12 MiB/s remote: Total 65018 (delta 6803), reused 6286 (delta 6285), pack-reused 57328 (from 1)
  7. 5.40 s Receiving objects: 100% (65018/65018), 83.30 MiB | 33.12 MiB/s Receiving objects: 100% (65018/65018), 86.93 MiB | 33.14 MiB/s, done.
  8. 6.12 s Resolving deltas: 0% (0/45900) Resolving deltas: 1% (459/45900) Resolving deltas: 2% (918/45900) Resolving deltas: 3% (1377/45900) Resolving deltas: 4% (1837/45900) Resolving deltas: 5% (2296/45900) Resolving deltas: 6% (2756/45900) Resolving deltas: 7% (3213/45900) Resolving deltas: 8% (3672/45900) Resolving deltas: 9% (4131/45900) Resolving deltas: 10% (4590/45900) Resolving deltas: 11% (5049/45900) Resolving deltas: 12% (5508/45900) Resolving deltas: 13% (5967/45900) Resolving deltas: 14% (6426/45900) Resolving deltas: 15% (6885/45900) Resolving deltas: 16% (7346/45900) Resolving deltas: 17% (7803/45900) Resolving deltas: 18% (8263/45900) Resolving deltas: 19% (8721/45900) Resolving deltas: 20% (9184/45900) Resolving deltas: 21% (9639/45900) Resolving deltas: 22% (10101/45900) Resolving deltas: 23% (10557/45900) Resolving deltas: 24% (11016/45900) Resolving deltas: 25% (11477/45900) Resolving deltas: 26% (11934/45900) Resolving deltas: 27% (12393/45900) Resolving deltas: 28% (12852/45900) Resolving deltas: 29% (13313/45900) Resolving deltas: 30% (13770/45900) Resolving deltas: 31% (14229/45900) Resolving deltas: 32% (14688/45900) Resolving deltas: 33% (15150/45900) Resolving deltas: 34% (15607/45900) Resolving deltas: 35% (16065/45900) Resolving deltas: 36% (16524/45900) Resolving deltas: 37% (16984/45900) Resolving deltas: 38% (17442/45900) Resolving deltas: 39% (17901/45900) Resolving deltas: 40% (18360/45900) Resolving deltas: 41% (18819/45900) Resolving deltas: 42% (19278/45900) Resolving deltas: 43% (19737/45900) Resolving deltas: 44% (20196/45900) Resolving deltas: 45% (20655/45900) Resolving deltas: 46% (21114/45900) Resolving deltas: 47% (21573/45900) Resolving deltas: 48% (22032/45900) Resolving deltas: 49% (22491/45900) Resolving deltas: 50% (22950/45900) Resolving deltas: 51% (23409/45900) Resolving deltas: 52% (23868/45900) Resolving deltas: 53% (24327/45900) Resolving deltas: 54% (24786/45900) Resolving deltas: 55% (25246/45900) Resolving deltas: 56% (25704/45900) Resolving deltas: 57% (26163/45900) Resolving deltas: 58% (26622/45900) Resolving deltas: 59% (27084/45900) Resolving deltas: 60% (27540/45900) Resolving deltas: 61% (27999/45900) Resolving deltas: 62% (28458/45900) Resolving deltas: 63% (28917/45900) Resolving deltas: 64% (29376/45900) Resolving deltas: 65% (29835/45900) Resolving deltas: 66% (30294/45900) Resolving deltas: 67% (30754/45900) Resolving deltas: 68% (31212/45900) Resolving deltas: 69% (31671/45900) Resolving deltas: 70% (32130/45900) Resolving deltas: 71% (32589/45900) Resolving deltas: 72% (33048/45900) Resolving deltas: 73% (33507/45900) Resolving deltas: 74% (33966/45900) Resolving deltas: 75% (34427/45900) Resolving deltas: 76% (34884/45900) Resolving deltas: 77% (35343/45900) Resolving deltas: 78% (35802/45900) Resolving deltas: 79% (36261/45900) Resolving deltas: 80% (36720/45900) Resolving deltas: 81% (37179/45900) Resolving deltas: 82% (37638/45900) Resolving deltas: 83% (38099/45900) Resolving deltas: 84% (38556/45900) Resolving deltas: 85% (39015/45900) Resolving deltas: 86% (39474/45900) Resolving deltas: 87% (39933/45900) Resolving deltas: 88% (40392/45900) Resolving deltas: 89% (40851/45900) Resolving deltas: 90% (41310/45900) Resolving deltas: 91% (41769/45900) Resolving deltas: 92% (42228/45900) Resolving deltas: 93% (42687/45900) Resolving deltas: 94% (43146/45900) Resolving deltas: 95% (43605/45900) Resolving deltas: 96% (44064/45900) Resolving deltas: 97% (44523/45900) Resolving deltas: 98% (44982/45900) Resolving deltas: 99% (45441/45900) Resolving deltas: 100% (45900/45900) Resolving deltas: 100% (45900/45900), done.
  9. 6.47 s Fetching commit 5c37e36355998a98df0d7791c7daeeae576fd7ee for vakint_rustred ...
  10. 6.47 s $ /nix/store/bcnisk3ydfgv26v2gw3zlky24g00yww2-git-2.54.0/bin/git fetch origin 5c37e36355998a98df0d7791c7daeeae576fd7ee
  11. 6.89 s From https://github.com/alphal00p/gammaloop
  12. 6.89 s * branch 5c37e36355998a98df0d7791c7daeeae576fd7ee -> FETCH_HEAD
  13. 6.91 s $ /nix/store/9ypz3flqsrl5xl495mm8h645gadjsxi1-coreutils-9.11/bin/timeout --kill-after=15s 7200s /nix/store/bcnisk3ydfgv26v2gw3zlky24g00yww2-git-2.54.0/bin/git -c advice.detachedHead=false checkout 5c37e36355998a98df0d7791c7daeeae576fd7ee
  14. 7.07 s HEAD is now at 5c37e363 Advance RustRed dependency to refactored core
  15. 7.08 s $ /nix/store/9ypz3flqsrl5xl495mm8h645gadjsxi1-coreutils-9.11/bin/timeout --kill-after=15s 7200s /nix/store/23zk8sgzamrbmj1fday15szf7f2279s8-nix-2.34.7/bin/nix --extra-experimental-features nix-command --extra-experimental-features flakes --log-format internal-json run .#packages.x86_64-linux.nix-ci-check-gammaloop-nextest-core --print-build-logs
  16. 13.20 s
  17. 13.26 s Downloading cached gammaloop-nextest-binaries-core-gammaloop-api from https://cache.nix-ci.com
  18. 13.27 s Downloading cached gammaloop-nextest-binaries-core-gammaloop-tracing-filter-macros from https://cache.nix-ci.com
  19. 13.27 s Downloading cached gammaloop-nextest-binaries-core-gammaloop-tracing-filter from https://cache.nix-ci.com
  20. 13.27 s Downloading cached gammaloop-nextest-binaries-core-gammalooprs from https://cache.nix-ci.com
  21. 13.32 s Downloaded cached gammaloop-nextest-binaries-core-gammaloop-tracing-filter-macros (1.7 MiB) in 54ms
  22. 13.32 s Progress: 0 of 1 built, 1 of 6 downloaded from cache (3 downloading)
  23. 13.45 s Downloaded cached gammaloop-nextest-binaries-core-gammaloop-tracing-filter (6.6 MiB) in 183ms
  24. 13.45 s Progress: 0 of 1 built, 2 of 6 downloaded from cache (2 downloading)
  25. 14.42 s Downloaded cached gammaloop-nextest-binaries-core-gammaloop-api (66.7 MiB) in 1.1s
  26. 14.42 s Progress: 0 of 1 built, 3 of 6 downloaded from cache (1 downloading)
  27. 14.49 s Downloaded cached gammaloop-nextest-binaries-core-gammalooprs (76.7 MiB) in 1.2s
  28. 14.49 s Progress: 0 of 1 built, 4 of 6 downloaded from cache
  29. 14.49 s Downloading cached gammaloop-nextest-binaries-core from https://cache.nix-ci.com
  30. 14.50 s Downloaded cached gammaloop-nextest-binaries-core (1640 B) in 4ms
  31. 14.50 s Progress: 0 of 1 built, 5 of 6 downloaded from cache
  32. 14.50 s Downloading cached nix-ci-check-gammaloop-nextest-core from https://cache.nix-ci.com
  33. 14.50 s Downloaded cached nix-ci-check-gammaloop-nextest-core (1016 B) in 3ms
  34. 14.50 s Progress: 0 of 1 built, 6 of 6 downloaded from cache
  35. 21.79 s evaluating derivation 'g copying '/nix/store/p93a evaluating derivation 'g copying '/nix/store/p93a evaluating derivation 'g copying '/nix/store/p93a evaluating derivation 'g copying '/nix/store/p93a evaluating derivation 'g copying '/nix/store/p93a evaluating derivation 'g copying '/nix/store/p93a evaluating derivation 'g copying '/nix/store/p93a evaluating derivation 'g copying '/nix/store/p93a evaluating derivation 'g copying '/nix/store/p93a evaluating derivation 'g querying gammaloop-nexte [0/14 built, 0.0 KiB DL] [0/1 built, 0.0 KiB DL] [1/0/1 built, 0.0 KiB DLgammaloop-nextest-core> Extracting 3 binaries (including 1 non-test binary), 1 build script output directory, and 2 linked paths to /build/nextest-archive-nyldlM
  36. 22.39 s gammaloop-nextest-core> Extracted 18 files to /build/nextest-archive-nyldlM in 0.60s
  37. 22.40 s gammaloop-nextest-core> ------------
  38. 22.40 s gammaloop-nextest-core> Nextest run ID bfda6f3f-8720-484f-ae35-14479e94918f with nextest profile: ci_gammaloop
  39. 22.40 s gammaloop-nextest-core> Starting 339 tests across 2 binaries
  40. 23.02 s gammaloop-nextest-core> ------------
  41. 23.02 s gammaloop-nextest-core> Summary [ 0.615s] 339 tests run: 339 passed, 0 skipped
  42. 23.13 s gammaloop-nextest-core>
  43. 23.13 s gammaloop-nextest-core> ========== nextest test summary ==========
  44. 23.13 s gammaloop-nextest-core> report: target/nextest/ci_gammaloop/junit.xml
  45. 23.13 s gammaloop-nextest-core> tests: 339, failures: 0, errors: 0
  46. 23.13 s gammaloop-nextest-core> No failing testcases found.
  47. 23.13 s gammaloop-nextest-core> =========================================
  48. 23.15 s gammaloop-nextest-core> Extracting 1 binary and 1 linked path to /build/nextest-archive-2iXYJp
  49. 23.24 s gammaloop-nextest-core> Extracted 7 files to /build/nextest-archive-2iXYJp in 0.09s
  50. 23.26 s gammaloop-nextest-core> ------------
  51. 23.26 s gammaloop-nextest-core> Nextest run ID 20109795-2eec-456a-b7d7-04cf0c5e45db with nextest profile: ci_gammaloop
  52. 23.26 s gammaloop-nextest-core> Starting 19 tests across 1 binary
  53. 23.28 s gammaloop-nextest-core> ------------
  54. 23.28 s gammaloop-nextest-core> Summary [ 0.019s] 19 tests run: 19 passed, 0 skipped
  55. 23.33 s gammaloop-nextest-core>
  56. 23.33 s gammaloop-nextest-core> ========== nextest test summary ==========
  57. 23.33 s gammaloop-nextest-core> report: target/nextest/ci_gammaloop/junit.xml
  58. 23.33 s gammaloop-nextest-core> tests: 19, failures: 0, errors: 0
  59. 23.33 s gammaloop-nextest-core> No failing testcases found.
  60. 23.33 s gammaloop-nextest-core> =========================================
  61. 23.35 s gammaloop-nextest-core> Extracting 1 binary to /build/nextest-archive-k32YYn
  62. 23.39 s gammaloop-nextest-core> Extracted 4 files to /build/nextest-archive-k32YYn in 0.05s
  63. 23.41 s gammaloop-nextest-core> ------------
  64. 23.41 s gammaloop-nextest-core> Nextest run ID a7fca9db-d5af-4947-acd5-82acb4a73716 with nextest profile: ci_gammaloop
  65. 23.41 s gammaloop-nextest-core> Starting 0 tests across 1 binary
  66. 23.41 s gammaloop-nextest-core> ------------
  67. 23.41 s gammaloop-nextest-core> Summary [ 0.000s] 0 tests run: 0 passed, 0 skipped
  68. 23.45 s gammaloop-nextest-core>
  69. 23.45 s gammaloop-nextest-core> ========== nextest test summary ==========
  70. 23.45 s gammaloop-nextest-core> report: target/nextest/ci_gammaloop/junit.xml
  71. 23.45 s gammaloop-nextest-core> tests: 0, failures: 0, errors: 0
  72. 23.45 s gammaloop-nextest-core> No failing testcases found.
  73. 23.45 s gammaloop-nextest-core> =========================================
  74. 23.47 s gammaloop-nextest-core> Extracting 4 binaries, 1 build script output directory, and 2 linked paths to /build/nextest-archive-ucW3zz
  75. 24.14 s gammaloop-nextest-core> Extracted 18 files to /build/nextest-archive-ucW3zz in 0.67s
  76. 24.15 s gammaloop-nextest-core> ------------
  77. 24.15 s gammaloop-nextest-core> Nextest run ID 7fb19012-f195-46d7-86c0-7c6cd448fdac with nextest profile: ci_gammaloop
  78. 24.15 s gammaloop-nextest-core> Starting 456 tests across 4 binaries (61 tests skipped, including 60 tests via profile.ci_gammaloop.default-filter)
  79. 25.72 s gammaloop-nextest-core> FAIL [ 0.419s] (445/456) gammalooprs::test_renormalization finit_part_ghlo
  80. 25.73 s gammaloop-nextest-core> stdout ---
  81. 25.73 s gammaloop-nextest-core>
  82. 25.73 s gammaloop-nextest-core> running 1 test
  83. 25.73 s gammaloop-nextest-core> ren part: 1/2*GC_10^2*dot(P(0,mink(dim)),P(0,mink(dim)))*cas(2,coad(8))/ε
  84. 25.73 s gammaloop-nextest-core> ━━━━━━━━━━━━━━━━━━━━━━━━━━━━━━━ Snapshot Summary ━━━━━━━━━━━━━━━━━━━━━━━━━━━━━━━
  85. 25.73 s gammaloop-nextest-core> Snapshot: finit_part_ghlo
  86. 25.73 s gammaloop-nextest-core> Source: crates/gammalooprs/tests/test_renormalization.rs:557
  87. 25.73 s gammaloop-nextest-core> ────────────────────────────────────────────────────────────────────────────────
  88. 25.73 s gammaloop-nextest-core> Expression: align_to_rqft(&a, &model).to_bare_ordered_string()
  89. 25.73 s gammaloop-nextest-core> ────────────────────────────────────────────────────────────────────────────────
  90. 25.73 s gammaloop-nextest-core> -old snapshot
  91. 25.73 s gammaloop-nextest-core> +new results
  92. 25.73 s gammaloop-nextest-core> ────────────┬───────────────────────────────────────────────────────────────────
  93. 25.73 s gammaloop-nextest-core> 1 │--1/2*cas(2,coad(8))*dot(P(0,mink(4)),P(0,mink(4)))*gs^2*ε^(-1)
  94. 25.73 s gammaloop-nextest-core> 1 │+1/2*cas(2,coad(8))*dot(P(0,mink(4)),P(0,mink(4)))*gs^2*ε^(-1)
  95. 25.73 s gammaloop-nextest-core> ────────────┴───────────────────────────────────────────────────────────────────
  96. 25.73 s gammaloop-nextest-core> To update snapshots run `cargo insta review`
  97. 25.73 s gammaloop-nextest-core> Stopped on the first failure. Run `cargo insta test` to run all snapshots.
  98. 25.73 s gammaloop-nextest-core> test finit_part_ghlo ... FAILED
  99. 25.73 s gammaloop-nextest-core>
  100. 25.73 s gammaloop-nextest-core> failures:
  101. 25.73 s gammaloop-nextest-core>
  102. 25.73 s gammaloop-nextest-core> failures:
  103. 25.73 s gammaloop-nextest-core> finit_part_ghlo
  104. 25.73 s gammaloop-nextest-core>
  105. 25.73 s gammaloop-nextest-core> test result: FAILED. 0 passed; 1 failed; 0 ignored; 0 measured; 5 filtered out; finished in 0.40s
  106. 25.73 s gammaloop-nextest-core>
  107. 25.73 s gammaloop-nextest-core> stderr ---
  108. 25.73 s gammaloop-nextest-core> The application panicked (crashed).
  109. 25.73 s gammaloop-nextest-core> Message: snapshot assertion for 'finit_part_ghlo' failed in line 557
  110. 25.73 s gammaloop-nextest-core> Location: /nix/store/9a12dww58xis3an3kmn597llpijv83b1-vendor-cargo-deps/c19b7c6f923b580ac259164a89f2577984ad5ab09ee9d583b888f934adbbe8d0/insta-1.47.2/src/runtime.rs:719
  111. 25.73 s gammaloop-nextest-core>
  112. 25.73 s gammaloop-nextest-core> ━━━━━━━━━━━━━━━━━━━━━━━━━━━━━━━━━━ BACKTRACE ━━━━━━━━━━━━━━━━━━━━━━━━━━━━━━━━━━━
  113. 25.73 s gammaloop-nextest-core> 1: <color_eyre[51793ea62743adbd]::config::PanicHook>::panic_report<unknown>
  114. 25.73 s gammaloop-nextest-core> at <unknown source file>:<unknown line>
  115. 25.73 s gammaloop-nextest-core> 2: <color_eyre[51793ea62743adbd]::config::PanicHook>::into_panic_hook::{closure#0}<unknown>
  116. 25.73 s gammaloop-nextest-core> at <unknown source file>:<unknown line>
  117. 25.73 s gammaloop-nextest-core> 3: std[bcb96dfbba0ab899]::panicking::panic_with_hook<unknown>
  118. 25.73 s gammaloop-nextest-core> at <unknown source file>:<unknown line>
  119. 25.73 s gammaloop-nextest-core> 4: std[bcb96dfbba0ab899]::panicking::panic_handler::{closure#0}<unknown>
  120. 25.73 s gammaloop-nextest-core> at <unknown source file>:<unknown line>
  121. 25.73 s gammaloop-nextest-core> 5: std[bcb96dfbba0ab899]::sys::backtrace::__rust_end_short_backtrace::<std[bcb96dfbba0ab899]::panicking::panic_handler::{closure#0}, !><unknown>
  122. 25.73 s gammaloop-nextest-core> at <unknown source file>:<unknown line>
  123. 25.73 s gammaloop-nextest-core> 6: __rustc[6c289b9f9c454d21]::rust_begin_unwind<unknown>
  124. 25.73 s gammaloop-nextest-core> at <unknown source file>:<unknown line>
  125. 25.73 s gammaloop-nextest-core> 7: core[940e698046960fd5]::panicking::panic_fmt<unknown>
  126. 25.73 s gammaloop-nextest-core> at <unknown source file>:<unknown line>
  127. 25.73 s gammaloop-nextest-core> 8: insta[307a548ac79ef4d9]::runtime::assert_snapshot<unknown>
  128. 25.73 s gammaloop-nextest-core> at <unknown source file>:<unknown line>
  129. 25.73 s gammaloop-nextest-core> 9: <test_renormalization[e6829672f1ddb150]::finit_part_ghlo::{closure#0} as core[940e698046960fd5]::ops::function::FnOnce<()>>::call_once<unknown>
  130. 25.73 s gammaloop-nextest-core> at <unknown source file>:<unknown line>
  131. 25.73 s gammaloop-nextest-core> 10: test[75d6903177b1d7e9]::__rust_begin_short_backtrace::<core[940e698046960fd5]::result::Result<(), alloc[2ea6bcb46fca0c42]::string::String>, fn() -> core[940e698046960fd5]::result::Result<(), alloc[2ea6bcb46fca0c42]::string::String>><unknown>
  132. 25.73 s gammaloop-nextest-core> at <unknown source file>:<unknown line>
  133. 25.73 s gammaloop-nextest-core> 11: test[75d6903177b1d7e9]::run_test::{closure#0}<unknown>
  134. 25.73 s gammaloop-nextest-core> at <unknown source file>:<unknown line>
  135. 25.73 s gammaloop-nextest-core> 12: std[bcb96dfbba0ab899]::sys::backtrace::__rust_begin_short_backtrace::<test[75d6903177b1d7e9]::run_test::{closure#1}, ()><unknown>
  136. 25.73 s gammaloop-nextest-core> at <unknown source file>:<unknown line>
  137. 25.73 s gammaloop-nextest-core> 13: <std[bcb96dfbba0ab899]::thread::lifecycle::spawn_unchecked<test[75d6903177b1d7e9]::run_test::{closure#1}, ()>::{closure#1} as core[940e698046960fd5]::ops::function::FnOnce<()>>::call_once::{shim:vtable#0}<unknown>
  138. 25.73 s gammaloop-nextest-core> at <unknown source file>:<unknown line>
  139. 25.73 s gammaloop-nextest-core> 14: <std[bcb96dfbba0ab899]::sys::thread::unix::Thread>::new::thread_start<unknown>
  140. 25.73 s gammaloop-nextest-core> at <unknown source file>:<unknown line>
  141. 25.73 s gammaloop-nextest-core> 15: start_thread<unknown>
  142. 25.73 s gammaloop-nextest-core> at <unknown source file>:<unknown line>
  143. 25.73 s gammaloop-nextest-core> 16: __clone3<unknown>
  144. 25.73 s gammaloop-nextest-core> at <unknown source file>:<unknown line>
  145. 25.73 s gammaloop-nextest-core>
  146. 25.73 s gammaloop-nextest-core> Run with COLORBT_SHOW_HIDDEN=1 environment variable to disable frame filtering.
  147. 25.73 s gammaloop-nextest-core> Run with RUST_BACKTRACE=full to include source snippets.
  148. 25.73 s gammaloop-nextest-core>
  149. 28.52 s gammaloop-nextest-core> FAIL [ 3.212s] (452/456) gammalooprs::test_renormalization finite_part_ghost_2loop
  150. 28.55 s gammaloop-nextest-core> stdout ---
  151. 28.55 s gammaloop-nextest-core>
  152. 28.55 s gammaloop-nextest-core> running 1 test
  153. 28.55 s gammaloop-nextest-core> ━━━━━━━━━━━━━━━━━━━━━━━━━━━━━━━ Snapshot Summary ━━━━━━━━━━━━━━━━━━━━━━━━━━━━━━━
  154. 28.55 s gammaloop-nextest-core> Snapshot: finite_part_ghost_2loop-3
  155. 28.55 s gammaloop-nextest-core> Source: crates/gammalooprs/tests/test_renormalization.rs:464
  156. 28.55 s gammaloop-nextest-core> ────────────────────────────────────────────────────────────────────────────────
  157. 28.55 s gammaloop-nextest-core> Expression: align_to_rqft(&a, &model).to_bare_ordered_string()
  158. 28.55 s gammaloop-nextest-core> ────────────────────────────────────────────────────────────────────────────────
  159. 28.55 s gammaloop-nextest-core> -old snapshot
  160. 28.55 s gammaloop-nextest-core> +new results
  161. 28.55 s gammaloop-nextest-core> ────────────┬───────────────────────────────────────────────────────────────────
  162. 28.55 s gammaloop-nextest-core> 1 │-(-1𝑖/32*ε+1𝑖/16)*(cas(2,coad(8)))^2*dot(P(0,mink(4)),P(0,mink(4)))*gs^4*ε^(-2)
  163. 28.55 s gammaloop-nextest-core> 1 │+(-1𝑖/16+1𝑖/32*ε)*(cas(2,coad(8)))^2*dot(P(0,mink(4)),P(0,mink(4)))*gs^4*ε^(-2)
  164. 28.55 s gammaloop-nextest-core> ────────────┴───────────────────────────────────────────────────────────────────
  165. 28.55 s gammaloop-nextest-core> To update snapshots run `cargo insta review`
  166. 28.55 s gammaloop-nextest-core> Stopped on the first failure. Run `cargo insta test` to run all snapshots.
  167. 28.55 s gammaloop-nextest-core> test finite_part_ghost_2loop ... FAILED
  168. 28.55 s gammaloop-nextest-core>
  169. 28.55 s gammaloop-nextest-core> failures:
  170. 28.55 s gammaloop-nextest-core>
  171. 28.55 s gammaloop-nextest-core> failures:
  172. 28.55 s gammaloop-nextest-core> finite_part_ghost_2loop
  173. 28.55 s gammaloop-nextest-core>
  174. 28.55 s gammaloop-nextest-core> test result: FAILED. 0 passed; 1 failed; 0 ignored; 0 measured; 5 filtered out; finished in 3.20s
  175. 28.55 s gammaloop-nextest-core>
  176. 28.55 s gammaloop-nextest-core> stderr ---
  177. 28.55 s gammaloop-nextest-core> The application panicked (crashed).
  178. 28.55 s gammaloop-nextest-core> Message: snapshot assertion for 'finite_part_ghost_2loop-3' failed in line 464
  179. 28.55 s gammaloop-nextest-core> Location: /nix/store/9a12dww58xis3an3kmn597llpijv83b1-vendor-cargo-deps/c19b7c6f923b580ac259164a89f2577984ad5ab09ee9d583b888f934adbbe8d0/insta-1.47.2/src/runtime.rs:719
  180. 28.55 s gammaloop-nextest-core>
  181. 28.55 s gammaloop-nextest-core> ━━━━━━━━━━━━━━━━━━━━━━━━━━━━━━━━━━ BACKTRACE ━━━━━━━━━━━━━━━━━━━━━━━━━━━━━━━━━━━
  182. 28.55 s gammaloop-nextest-core> 1: <color_eyre[51793ea62743adbd]::config::PanicHook>::panic_report<unknown>
  183. 28.55 s gammaloop-nextest-core> at <unknown source file>:<unknown line>
  184. 28.55 s gammaloop-nextest-core> 2: <color_eyre[51793ea62743adbd]::config::PanicHook>::into_panic_hook::{closure#0}<unknown>
  185. 28.55 s gammaloop-nextest-core> at <unknown source file>:<unknown line>
  186. 28.55 s gammaloop-nextest-core> 3: std[bcb96dfbba0ab899]::panicking::panic_with_hook<unknown>
  187. 28.55 s gammaloop-nextest-core> at <unknown source file>:<unknown line>
  188. 28.55 s gammaloop-nextest-core> 4: std[bcb96dfbba0ab899]::panicking::panic_handler::{closure#0}<unknown>
  189. 28.55 s gammaloop-nextest-core> at <unknown source file>:<unknown line>
  190. 28.55 s gammaloop-nextest-core> 5: std[bcb96dfbba0ab899]::sys::backtrace::__rust_end_short_backtrace::<std[bcb96dfbba0ab899]::panicking::panic_handler::{closure#0}, !><unknown>
  191. 28.55 s gammaloop-nextest-core> at <unknown source file>:<unknown line>
  192. 28.55 s gammaloop-nextest-core> 6: __rustc[6c289b9f9c454d21]::rust_begin_unwind<unknown>
  193. 28.55 s gammaloop-nextest-core> at <unknown source file>:<unknown line>
  194. 28.55 s gammaloop-nextest-core> 7: core[940e698046960fd5]::panicking::panic_fmt<unknown>
  195. 28.55 s gammaloop-nextest-core> at <unknown source file>:<unknown line>
  196. 28.55 s gammaloop-nextest-core> 8: insta[307a548ac79ef4d9]::runtime::assert_snapshot<unknown>
  197. 28.55 s gammaloop-nextest-core> at <unknown source file>:<unknown line>
  198. 28.55 s gammaloop-nextest-core> 9: test_renormalization[e6829672f1ddb150]::finite_part_ghost_2loop<unknown>
  199. 28.55 s gammaloop-nextest-core> at <unknown source file>:<unknown line>
  200. 28.55 s gammaloop-nextest-core> 10: <test_renormalization[e6829672f1ddb150]::finite_part_ghost_2loop::{closure#0} as core[940e698046960fd5]::ops::function::FnOnce<()>>::call_once<unknown>
  201. 28.55 s gammaloop-nextest-core> at <unknown source file>:<unknown line>
  202. 28.55 s gammaloop-nextest-core> 11: test[75d6903177b1d7e9]::__rust_begin_short_backtrace::<core[940e698046960fd5]::result::Result<(), alloc[2ea6bcb46fca0c42]::string::String>, fn() -> core[940e698046960fd5]::result::Result<(), alloc[2ea6bcb46fca0c42]::string::String>><unknown>
  203. 28.55 s gammaloop-nextest-core> at <unknown source file>:<unknown line>
  204. 28.55 s gammaloop-nextest-core> 12: test[75d6903177b1d7e9]::run_test::{closure#0}<unknown>
  205. 28.55 s gammaloop-nextest-core> at <unknown source file>:<unknown line>
  206. 28.55 s gammaloop-nextest-core> 13: std[bcb96dfbba0ab899]::sys::backtrace::__rust_begin_short_backtrace::<test[75d6903177b1d7e9]::run_test::{closure#1}, ()><unknown>
  207. 28.55 s gammaloop-nextest-core> at <unknown source file>:<unknown line>
  208. 28.55 s gammaloop-nextest-core> 14: <std[bcb96dfbba0ab899]::thread::lifecycle::spawn_unchecked<test[75d6903177b1d7e9]::run_test::{closure#1}, ()>::{closure#1} as core[940e698046960fd5]::ops::function::FnOnce<()>>::call_once::{shim:vtable#0}<unknown>
  209. 28.55 s gammaloop-nextest-core> at <unknown source file>:<unknown line>
  210. 28.55 s gammaloop-nextest-core> 15: <std[bcb96dfbba0ab899]::sys::thread::unix::Thread>::new::thread_start<unknown>
  211. 28.55 s gammaloop-nextest-core> at <unknown source file>:<unknown line>
  212. 28.55 s gammaloop-nextest-core> 16: start_thread<unknown>
  213. 28.55 s gammaloop-nextest-core> at <unknown source file>:<unknown line>
  214. 28.55 s gammaloop-nextest-core> 17: __clone3<unknown>
  215. 28.55 s gammaloop-nextest-core> at <unknown source file>:<unknown line>
  216. 28.55 s gammaloop-nextest-core>
  217. 28.55 s gammaloop-nextest-core> Run with COLORBT_SHOW_HIDDEN=1 environment variable to disable frame filtering.
  218. 28.55 s gammaloop-nextest-core> Run with RUST_BACKTRACE=full to include source snippets.
  219. 28.55 s gammaloop-nextest-core>
  220. 36.27 s gammaloop-nextest-core> ------------
  221. 36.28 s gammaloop-nextest-core> Summary [ 12.115s] 456 tests run: 454 passed, 2 failed, 61 skipped
  222. 36.28 s gammaloop-nextest-core> FAIL [ 0.419s] (445/456) gammalooprs::test_renormalization finit_part_ghlo
  223. 36.28 s gammaloop-nextest-core> stdout ---
  224. 36.28 s gammaloop-nextest-core>
  225. 36.28 s gammaloop-nextest-core> running 1 test
  226. 36.28 s gammaloop-nextest-core> ren part: 1/2*GC_10^2*dot(P(0,mink(dim)),P(0,mink(dim)))*cas(2,coad(8))/ε
  227. 36.28 s gammaloop-nextest-core> ━━━━━━━━━━━━━━━━━━━━━━━━━━━━━━━ Snapshot Summary ━━━━━━━━━━━━━━━━━━━━━━━━━━━━━━━
  228. 36.28 s gammaloop-nextest-core> Snapshot: finit_part_ghlo
  229. 36.28 s gammaloop-nextest-core> Source: crates/gammalooprs/tests/test_renormalization.rs:557
  230. 36.28 s gammaloop-nextest-core> ────────────────────────────────────────────────────────────────────────────────
  231. 36.28 s gammaloop-nextest-core> Expression: align_to_rqft(&a, &model).to_bare_ordered_string()
  232. 36.28 s gammaloop-nextest-core> ────────────────────────────────────────────────────────────────────────────────
  233. 36.28 s gammaloop-nextest-core> -old snapshot
  234. 36.28 s gammaloop-nextest-core> +new results
  235. 36.28 s gammaloop-nextest-core> ────────────┬───────────────────────────────────────────────────────────────────
  236. 36.28 s gammaloop-nextest-core> 1 │--1/2*cas(2,coad(8))*dot(P(0,mink(4)),P(0,mink(4)))*gs^2*ε^(-1)
  237. 36.28 s gammaloop-nextest-core> 1 │+1/2*cas(2,coad(8))*dot(P(0,mink(4)),P(0,mink(4)))*gs^2*ε^(-1)
  238. 36.28 s gammaloop-nextest-core> ────────────┴───────────────────────────────────────────────────────────────────
  239. 36.28 s gammaloop-nextest-core> To update snapshots run `cargo insta review`
  240. 36.28 s gammaloop-nextest-core> Stopped on the first failure. Run `cargo insta test` to run all snapshots.
  241. 36.28 s gammaloop-nextest-core> test finit_part_ghlo ... FAILED
  242. 36.28 s gammaloop-nextest-core>
  243. 36.28 s gammaloop-nextest-core> failures:
  244. 36.28 s gammaloop-nextest-core>
  245. 36.28 s gammaloop-nextest-core> failures:
  246. 36.28 s gammaloop-nextest-core> finit_part_ghlo
  247. 36.28 s gammaloop-nextest-core>
  248. 36.28 s gammaloop-nextest-core> test result: FAILED. 0 passed; 1 failed; 0 ignored; 0 measured; 5 filtered out; finished in 0.40s
  249. 36.28 s gammaloop-nextest-core>
  250. 36.28 s gammaloop-nextest-core> stderr ---
  251. 36.28 s gammaloop-nextest-core> The application panicked (crashed).
  252. 36.28 s gammaloop-nextest-core> Message: snapshot assertion for 'finit_part_ghlo' failed in line 557
  253. 36.28 s gammaloop-nextest-core> Location: /nix/store/9a12dww58xis3an3kmn597llpijv83b1-vendor-cargo-deps/c19b7c6f923b580ac259164a89f2577984ad5ab09ee9d583b888f934adbbe8d0/insta-1.47.2/src/runtime.rs:719
  254. 36.28 s gammaloop-nextest-core>
  255. 36.28 s gammaloop-nextest-core> ━━━━━━━━━━━━━━━━━━━━━━━━━━━━━━━━━━ BACKTRACE ━━━━━━━━━━━━━━━━━━━━━━━━━━━━━━━━━━━
  256. 36.28 s gammaloop-nextest-core> 1: <color_eyre[51793ea62743adbd]::config::PanicHook>::panic_report<unknown>
  257. 36.28 s gammaloop-nextest-core> at <unknown source file>:<unknown line>
  258. 36.28 s gammaloop-nextest-core> 2: <color_eyre[51793ea62743adbd]::config::PanicHook>::into_panic_hook::{closure#0}<unknown>
  259. 36.28 s gammaloop-nextest-core> at <unknown source file>:<unknown line>
  260. 36.28 s gammaloop-nextest-core> 3: std[bcb96dfbba0ab899]::panicking::panic_with_hook<unknown>
  261. 36.28 s gammaloop-nextest-core> at <unknown source file>:<unknown line>
  262. 36.28 s gammaloop-nextest-core> 4: std[bcb96dfbba0ab899]::panicking::panic_handler::{closure#0}<unknown>
  263. 36.28 s gammaloop-nextest-core> at <unknown source file>:<unknown line>
  264. 36.28 s gammaloop-nextest-core> 5: std[bcb96dfbba0ab899]::sys::backtrace::__rust_end_short_backtrace::<std[bcb96dfbba0ab899]::panicking::panic_handler::{closure#0}, !><unknown>
  265. 36.28 s gammaloop-nextest-core> at <unknown source file>:<unknown line>
  266. 36.28 s gammaloop-nextest-core> 6: __rustc[6c289b9f9c454d21]::rust_begin_unwind<unknown>
  267. 36.28 s gammaloop-nextest-core> at <unknown source file>:<unknown line>
  268. 36.28 s gammaloop-nextest-core> 7: core[940e698046960fd5]::panicking::panic_fmt<unknown>
  269. 36.28 s gammaloop-nextest-core> at <unknown source file>:<unknown line>
  270. 36.28 s gammaloop-nextest-core> 8: insta[307a548ac79ef4d9]::runtime::assert_snapshot<unknown>
  271. 36.28 s gammaloop-nextest-core> at <unknown source file>:<unknown line>
  272. 36.28 s gammaloop-nextest-core> 9: <test_renormalization[e6829672f1ddb150]::finit_part_ghlo::{closure#0} as core[940e698046960fd5]::ops::function::FnOnce<()>>::call_once<unknown>
  273. 36.28 s gammaloop-nextest-core> at <unknown source file>:<unknown line>
  274. 36.28 s gammaloop-nextest-core> 10: test[75d6903177b1d7e9]::__rust_begin_short_backtrace::<core[940e698046960fd5]::result::Result<(), alloc[2ea6bcb46fca0c42]::string::String>, fn() -> core[940e698046960fd5]::result::Result<(), alloc[2ea6bcb46fca0c42]::string::String>><unknown>
  275. 36.28 s gammaloop-nextest-core> at <unknown source file>:<unknown line>
  276. 36.28 s gammaloop-nextest-core> 11: test[75d6903177b1d7e9]::run_test::{closure#0}<unknown>
  277. 36.28 s gammaloop-nextest-core> at <unknown source file>:<unknown line>
  278. 36.28 s gammaloop-nextest-core> 12: std[bcb96dfbba0ab899]::sys::backtrace::__rust_begin_short_backtrace::<test[75d6903177b1d7e9]::run_test::{closure#1}, ()><unknown>
  279. 36.28 s gammaloop-nextest-core> at <unknown source file>:<unknown line>
  280. 36.28 s gammaloop-nextest-core> 13: <std[bcb96dfbba0ab899]::thread::lifecycle::spawn_unchecked<test[75d6903177b1d7e9]::run_test::{closure#1}, ()>::{closure#1} as core[940e698046960fd5]::ops::function::FnOnce<()>>::call_once::{shim:vtable#0}<unknown>
  281. 36.28 s gammaloop-nextest-core> at <unknown source file>:<unknown line>
  282. 36.28 s gammaloop-nextest-core> 14: <std[bcb96dfbba0ab899]::sys::thread::unix::Thread>::new::thread_start<unknown>
  283. 36.28 s gammaloop-nextest-core> at <unknown source file>:<unknown line>
  284. 36.28 s gammaloop-nextest-core> 15: start_thread<unknown>
  285. 36.28 s gammaloop-nextest-core> at <unknown source file>:<unknown line>
  286. 36.28 s gammaloop-nextest-core> 16: __clone3<unknown>
  287. 36.28 s gammaloop-nextest-core> at <unknown source file>:<unknown line>
  288. 36.28 s gammaloop-nextest-core>
  289. 36.28 s gammaloop-nextest-core> Run with COLORBT_SHOW_HIDDEN=1 environment variable to disable frame filtering.
  290. 36.28 s gammaloop-nextest-core> Run with RUST_BACKTRACE=full to include source snippets.
  291. 36.28 s gammaloop-nextest-core>
  292. 36.28 s gammaloop-nextest-core> FAIL [ 3.212s] (452/456) gammalooprs::test_renormalization finite_part_ghost_2loop
  293. 36.28 s gammaloop-nextest-core> stdout ---
  294. 36.28 s gammaloop-nextest-core>
  295. 36.28 s gammaloop-nextest-core> running 1 test
  296. 36.28 s gammaloop-nextest-core> ━━━━━━━━━━━━━━━━━━━━━━━━━━━━━━━ Snapshot Summary ━━━━━━━━━━━━━━━━━━━━━━━━━━━━━━━
  297. 36.28 s gammaloop-nextest-core> Snapshot: finite_part_ghost_2loop-3
  298. 36.28 s gammaloop-nextest-core> Source: crates/gammalooprs/tests/test_renormalization.rs:464
  299. 36.28 s gammaloop-nextest-core> ────────────────────────────────────────────────────────────────────────────────
  300. 36.28 s gammaloop-nextest-core> Expression: align_to_rqft(&a, &model).to_bare_ordered_string()
  301. 36.28 s gammaloop-nextest-core> ────────────────────────────────────────────────────────────────────────────────
  302. 36.28 s gammaloop-nextest-core> -old snapshot
  303. 36.28 s gammaloop-nextest-core> +new results
  304. 36.28 s gammaloop-nextest-core> ────────────┬───────────────────────────────────────────────────────────────────
  305. 36.28 s gammaloop-nextest-core> 1 │-(-1𝑖/32*ε+1𝑖/16)*(cas(2,coad(8)))^2*dot(P(0,mink(4)),P(0,mink(4)))*gs^4*ε^(-2)
  306. 36.28 s gammaloop-nextest-core> 1 │+(-1𝑖/16+1𝑖/32*ε)*(cas(2,coad(8)))^2*dot(P(0,mink(4)),P(0,mink(4)))*gs^4*ε^(-2)
  307. 36.28 s gammaloop-nextest-core> ────────────┴───────────────────────────────────────────────────────────────────
  308. 36.28 s gammaloop-nextest-core> To update snapshots run `cargo insta review`
  309. 36.28 s gammaloop-nextest-core> Stopped on the first failure. Run `cargo insta test` to run all snapshots.
  310. 36.28 s gammaloop-nextest-core> test finite_part_ghost_2loop ... FAILED
  311. 36.28 s gammaloop-nextest-core>
  312. 36.28 s gammaloop-nextest-core> failures:
  313. 36.28 s gammaloop-nextest-core>
  314. 36.28 s gammaloop-nextest-core> failures:
  315. 36.28 s gammaloop-nextest-core> finite_part_ghost_2loop
  316. 36.28 s gammaloop-nextest-core>
  317. 36.28 s gammaloop-nextest-core> test result: FAILED. 0 passed; 1 failed; 0 ignored; 0 measured; 5 filtered out; finished in 3.20s
  318. 36.28 s gammaloop-nextest-core>
  319. 36.28 s gammaloop-nextest-core> stderr ---
  320. 36.28 s gammaloop-nextest-core> The application panicked (crashed).
  321. 36.28 s gammaloop-nextest-core> Message: snapshot assertion for 'finite_part_ghost_2loop-3' failed in line 464
  322. 36.28 s gammaloop-nextest-core> Location: /nix/store/9a12dww58xis3an3kmn597llpijv83b1-vendor-cargo-deps/c19b7c6f923b580ac259164a89f2577984ad5ab09ee9d583b888f934adbbe8d0/insta-1.47.2/src/runtime.rs:719
  323. 36.28 s gammaloop-nextest-core>
  324. 36.28 s gammaloop-nextest-core> ━━━━━━━━━━━━━━━━━━━━━━━━━━━━━━━━━━ BACKTRACE ━━━━━━━━━━━━━━━━━━━━━━━━━━━━━━━━━━━
  325. 36.28 s gammaloop-nextest-core> 1: <color_eyre[51793ea62743adbd]::config::PanicHook>::panic_report<unknown>
  326. 36.28 s gammaloop-nextest-core> at <unknown source file>:<unknown line>
  327. 36.28 s gammaloop-nextest-core> 2: <color_eyre[51793ea62743adbd]::config::PanicHook>::into_panic_hook::{closure#0}<unknown>
  328. 36.28 s gammaloop-nextest-core> at <unknown source file>:<unknown line>
  329. 36.28 s gammaloop-nextest-core> 3: std[bcb96dfbba0ab899]::panicking::panic_with_hook<unknown>
  330. 36.28 s gammaloop-nextest-core> at <unknown source file>:<unknown line>
  331. 36.28 s gammaloop-nextest-core> 4: std[bcb96dfbba0ab899]::panicking::panic_handler::{closure#0}<unknown>
  332. 36.28 s gammaloop-nextest-core> at <unknown source file>:<unknown line>
  333. 36.28 s gammaloop-nextest-core> 5: std[bcb96dfbba0ab899]::sys::backtrace::__rust_end_short_backtrace::<std[bcb96dfbba0ab899]::panicking::panic_handler::{closure#0}, !><unknown>
  334. 36.28 s gammaloop-nextest-core> at <unknown source file>:<unknown line>
  335. 36.28 s gammaloop-nextest-core> 6: __rustc[6c289b9f9c454d21]::rust_begin_unwind<unknown>
  336. 36.28 s gammaloop-nextest-core> at <unknown source file>:<unknown line>
  337. 36.28 s gammaloop-nextest-core> 7: core[940e698046960fd5]::panicking::panic_fmt<unknown>
  338. 36.28 s gammaloop-nextest-core> at <unknown source file>:<unknown line>
  339. 36.28 s gammaloop-nextest-core> 8: insta[307a548ac79ef4d9]::runtime::assert_snapshot<unknown>
  340. 36.28 s gammaloop-nextest-core> at <unknown source file>:<unknown line>
  341. 36.28 s gammaloop-nextest-core> 9: test_renormalization[e6829672f1ddb150]::finite_part_ghost_2loop<unknown>
  342. 36.28 s gammaloop-nextest-core> at <unknown source file>:<unknown line>
  343. 36.28 s gammaloop-nextest-core> 10: <test_renormalization[e6829672f1ddb150]::finite_part_ghost_2loop::{closure#0} as core[940e698046960fd5]::ops::function::FnOnce<()>>::call_once<unknown>
  344. 36.28 s gammaloop-nextest-core> at <unknown source file>:<unknown line>
  345. 36.28 s gammaloop-nextest-core> 11: test[75d6903177b1d7e9]::__rust_begin_short_backtrace::<core[940e698046960fd5]::result::Result<(), alloc[2ea6bcb46fca0c42]::string::String>, fn() -> core[940e698046960fd5]::result::Result<(), alloc[2ea6bcb46fca0c42]::string::String>><unknown>
  346. 36.28 s gammaloop-nextest-core> at <unknown source file>:<unknown line>
  347. 36.28 s gammaloop-nextest-core> 12: test[75d6903177b1d7e9]::run_test::{closure#0}<unknown>
  348. 36.28 s gammaloop-nextest-core> at <unknown source file>:<unknown line>
  349. 36.28 s gammaloop-nextest-core> 13: std[bcb96dfbba0ab899]::sys::backtrace::__rust_begin_short_backtrace::<test[75d6903177b1d7e9]::run_test::{closure#1}, ()><unknown>
  350. 36.28 s gammaloop-nextest-core> at <unknown source file>:<unknown line>
  351. 36.28 s gammaloop-nextest-core> 14: <std[bcb96dfbba0ab899]::thread::lifecycle::spawn_unchecked<test[75d6903177b1d7e9]::run_test::{closure#1}, ()>::{closure#1} as core[940e698046960fd5]::ops::function::FnOnce<()>>::call_once::{shim:vtable#0}<unknown>
  352. 36.28 s gammaloop-nextest-core> at <unknown source file>:<unknown line>
  353. 36.28 s gammaloop-nextest-core> 15: <std[bcb96dfbba0ab899]::sys::thread::unix::Thread>::new::thread_start<unknown>
  354. 36.28 s gammaloop-nextest-core> at <unknown source file>:<unknown line>
  355. 36.28 s gammaloop-nextest-core> 16: start_thread<unknown>
  356. 36.28 s gammaloop-nextest-core> at <unknown source file>:<unknown line>
  357. 36.28 s gammaloop-nextest-core> 17: __clone3<unknown>
  358. 36.28 s gammaloop-nextest-core> at <unknown source file>:<unknown line>
  359. 36.28 s gammaloop-nextest-core>
  360. 36.28 s gammaloop-nextest-core> Run with COLORBT_SHOW_HIDDEN=1 environment variable to disable frame filtering.
  361. 36.28 s gammaloop-nextest-core> Run with RUST_BACKTRACE=full to include source snippets.
  362. 36.28 s gammaloop-nextest-core>
  363. 36.35 s gammaloop-nextest-core> error: test run failed
  364. 36.39 s gammaloop-nextest-core>
  365. 36.39 s gammaloop-nextest-core> ========== nextest test summary ==========
  366. 36.39 s gammaloop-nextest-core> report: target/nextest/ci_gammaloop/junit.xml
  367. 36.39 s gammaloop-nextest-core> tests: 456, failures: 2, errors: 0
  368. 36.39 s gammaloop-nextest-core>
  369. 36.39 s gammaloop-nextest-core> 1. gammalooprs::test_renormalization::finit_part_ghlo
  370. 36.39 s gammaloop-nextest-core> failure: test failure with exit code 101
  371. 36.39 s gammaloop-nextest-core> system-out
  372. 36.39 s gammaloop-nextest-core> running 1 test
  373. 36.39 s gammaloop-nextest-core> ren part: 1/2*GC_10^2*dot(P(0,mink(dim)),P(0,mink(dim)))*cas(2,coad(8))/ε
  374. 36.39 s gammaloop-nextest-core> ━━━━━━━━━━━━━━━━━━━━━━━━━━━━━━━ Snapshot Summary ━━━━━━━━━━━━━━━━━━━━━━━━━━━━━━━
  375. 36.39 s gammaloop-nextest-core> Snapshot: finit_part_ghlo
  376. 36.39 s gammaloop-nextest-core> Source: crates/gammalooprs/tests/test_renormalization.rs:557
  377. 36.39 s gammaloop-nextest-core> ────────────────────────────────────────────────────────────────────────────────
  378. 36.39 s gammaloop-nextest-core> Expression: align_to_rqft(&a, &model).to_bare_ordered_string()
  379. 36.39 s gammaloop-nextest-core> ────────────────────────────────────────────────────────────────────────────────
  380. 36.39 s gammaloop-nextest-core> -old snapshot
  381. 36.39 s gammaloop-nextest-core> +new results
  382. 36.39 s gammaloop-nextest-core> ────────────┬───────────────────────────────────────────────────────────────────
  383. 36.39 s gammaloop-nextest-core> 1 │--1/2*cas(2,coad(8))*dot(P(0,mink(4)),P(0,mink(4)))*gs^2*ε^(-1)
  384. 36.39 s gammaloop-nextest-core> 1 │+1/2*cas(2,coad(8))*dot(P(0,mink(4)),P(0,mink(4)))*gs^2*ε^(-1)
  385. 36.39 s gammaloop-nextest-core> ────────────┴───────────────────────────────────────────────────────────────────
  386. 36.39 s gammaloop-nextest-core> To update snapshots run `cargo insta review`
  387. 36.39 s gammaloop-nextest-core> Stopped on the first failure. Run `cargo insta test` to run all snapshots.
  388. 36.39 s gammaloop-nextest-core> test finit_part_ghlo ... FAILED
  389. 36.39 s gammaloop-nextest-core>
  390. 36.39 s gammaloop-nextest-core> failures:
  391. 36.39 s gammaloop-nextest-core>
  392. 36.39 s gammaloop-nextest-core> failures:
  393. 36.39 s gammaloop-nextest-core> finit_part_ghlo
  394. 36.39 s gammaloop-nextest-core>
  395. 36.39 s gammaloop-nextest-core> test result: FAILED. 0 passed; 1 failed; 0 ignored; 0 measured; 5 filtered out; finished in 0.40s
  396. 36.39 s gammaloop-nextest-core> system-err
  397. 36.39 s gammaloop-nextest-core> The application panicked (crashed).
  398. 36.39 s gammaloop-nextest-core> Message: snapshot assertion for 'finit_part_ghlo' failed in line 557
  399. 36.39 s gammaloop-nextest-core> Location: /nix/store/9a12dww58xis3an3kmn597llpijv83b1-vendor-cargo-deps/c19b7c6f923b580ac259164a89f2577984ad5ab09ee9d583b888f934adbbe8d0/insta-1.47.2/src/runtime.rs:719
  400. 36.39 s gammaloop-nextest-core>
  401. 36.39 s gammaloop-nextest-core> ━━━━━━━━━━━━━━━━━━━━━━━━━━━━━━━━━━ BACKTRACE ━━━━━━━━━━━━━━━━━━━━━━━━━━━━━━━━━━━
  402. 36.39 s gammaloop-nextest-core> 1: <color_eyre[51793ea62743adbd]::config::PanicHook>::panic_report<unknown>
  403. 36.39 s gammaloop-nextest-core> at <unknown source file>:<unknown line>
  404. 36.39 s gammaloop-nextest-core> 2: <color_eyre[51793ea62743adbd]::config::PanicHook>::into_panic_hook::{closure#0}<unknown>
  405. 36.39 s gammaloop-nextest-core> at <unknown source file>:<unknown line>
  406. 36.39 s gammaloop-nextest-core> 3: std[bcb96dfbba0ab899]::panicking::panic_with_hook<unknown>
  407. 36.39 s gammaloop-nextest-core> at <unknown source file>:<unknown line>
  408. 36.39 s gammaloop-nextest-core> 4: std[bcb96dfbba0ab899]::panicking::panic_handler::{closure#0}<unknown>
  409. 36.39 s gammaloop-nextest-core> at <unknown source file>:<unknown line>
  410. 36.39 s gammaloop-nextest-core> 5: std[bcb96dfbba0ab899]::sys::backtrace::__rust_end_short_backtrace::<std[bcb96dfbba0ab899]::panicking::panic_handler::{closure#0}, !><unknown>
  411. 36.39 s gammaloop-nextest-core> at <unknown source file>:<unknown line>
  412. 36.39 s gammaloop-nextest-core> 6: __rustc[6c289b9f9c454d21]::rust_begin_unwind<unknown>
  413. 36.39 s gammaloop-nextest-core> at <unknown source file>:<unknown line>
  414. 36.39 s gammaloop-nextest-core> 7: core[940e698046960fd5]::panicking::panic_fmt<unknown>
  415. 36.39 s gammaloop-nextest-core> at <unknown source file>:<unknown line>
  416. 36.39 s gammaloop-nextest-core> 8: insta[307a548ac79ef4d9]::runtime::assert_snapshot<unknown>
  417. 36.39 s gammaloop-nextest-core> at <unknown source file>:<unknown line>
  418. 36.39 s gammaloop-nextest-core> 9: <test_renormalization[e6829672f1ddb150]::finit_part_ghlo::{closure#0} as core[940e698046960fd5]::ops::function::FnOnce<()>>::call_once<unknown>
  419. 36.39 s gammaloop-nextest-core> at <unknown source file>:<unknown line>
  420. 36.39 s gammaloop-nextest-core> 10: test[75d6903177b1d7e9]::__rust_begin_short_backtrace::<core[940e698046960fd5]::result::Result<(), alloc[2ea6bcb46fca0c42]::string::String>, fn() -> core[940e698046960fd5]::result::Result<(), alloc[2ea6bcb46fca0c42]::string::String>><unknown>
  421. 36.39 s gammaloop-nextest-core> at <unknown source file>:<unknown line>
  422. 36.39 s gammaloop-nextest-core> 11: test[75d6903177b1d7e9]::run_test::{closure#0}<unknown>
  423. 36.39 s gammaloop-nextest-core> at <unknown source file>:<unknown line>
  424. 36.39 s gammaloop-nextest-core> 12: std[bcb96dfbba0ab899]::sys::backtrace::__rust_begin_short_backtrace::<test[75d6903177b1d7e9]::run_test::{closure#1}, ()><unknown>
  425. 36.39 s gammaloop-nextest-core> at <unknown source file>:<unknown line>
  426. 36.39 s gammaloop-nextest-core> 13: <std[bcb96dfbba0ab899]::thread::lifecycle::spawn_unchecked<test[75d6903177b1d7e9]::run_test::{closure#1}, ()>::{closure#1} as core[940e698046960fd5]::ops::function::FnOnce<()>>::call_once::{shim:vtable#0}<unknown>
  427. 36.39 s gammaloop-nextest-core> at <unknown source file>:<unknown line>
  428. 36.39 s gammaloop-nextest-core> 14: <std[bcb96dfbba0ab899]::sys::thread::unix::Thread>::new::thread_start<unknown>
  429. 36.39 s gammaloop-nextest-core> at <unknown source file>:<unknown line>
  430. 36.39 s gammaloop-nextest-core> 15: start_thread<unknown>
  431. 36.39 s gammaloop-nextest-core> at <unknown source file>:<unknown line>
  432. 36.39 s gammaloop-nextest-core> 16: __clone3<unknown>
  433. 36.39 s gammaloop-nextest-core> at <unknown source file>:<unknown line>
  434. 36.39 s gammaloop-nextest-core>
  435. 36.39 s gammaloop-nextest-core> Run with COLORBT_SHOW_HIDDEN=1 environment variable to disable frame filtering.
  436. 36.39 s gammaloop-nextest-core> Run with RUST_BACKTRACE=full to include source snippets.
  437. 36.39 s gammaloop-nextest-core>
  438. 36.39 s gammaloop-nextest-core> 2. gammalooprs::test_renormalization::finite_part_ghost_2loop
  439. 36.39 s gammaloop-nextest-core> failure: test failure with exit code 101
  440. 36.39 s gammaloop-nextest-core> system-out
  441. 36.39 s gammaloop-nextest-core> running 1 test
  442. 36.39 s gammaloop-nextest-core> ━━━━━━━━━━━━━━━━━━━━━━━━━━━━━━━ Snapshot Summary ━━━━━━━━━━━━━━━━━━━━━━━━━━━━━━━
  443. 36.39 s gammaloop-nextest-core> Snapshot: finite_part_ghost_2loop-3
  444. 36.39 s gammaloop-nextest-core> Source: crates/gammalooprs/tests/test_renormalization.rs:464
  445. 36.39 s gammaloop-nextest-core> ────────────────────────────────────────────────────────────────────────────────
  446. 36.39 s gammaloop-nextest-core> Expression: align_to_rqft(&a, &model).to_bare_ordered_string()
  447. 36.39 s gammaloop-nextest-core> ────────────────────────────────────────────────────────────────────────────────
  448. 36.39 s gammaloop-nextest-core> -old snapshot
  449. 36.39 s gammaloop-nextest-core> +new results
  450. 36.39 s gammaloop-nextest-core> ────────────┬───────────────────────────────────────────────────────────────────
  451. 36.39 s gammaloop-nextest-core> 1 │-(-1𝑖/32*ε+1𝑖/16)*(cas(2,coad(8)))^2*dot(P(0,mink(4)),P(0,mink(4)))*gs^4*ε^(-2)
  452. 36.39 s gammaloop-nextest-core> 1 │+(-1𝑖/16+1𝑖/32*ε)*(cas(2,coad(8)))^2*dot(P(0,mink(4)),P(0,mink(4)))*gs^4*ε^(-2)
  453. 36.39 s gammaloop-nextest-core> ────────────┴───────────────────────────────────────────────────────────────────
  454. 36.39 s gammaloop-nextest-core> To update snapshots run `cargo insta review`
  455. 36.39 s gammaloop-nextest-core> Stopped on the first failure. Run `cargo insta test` to run all snapshots.
  456. 36.39 s gammaloop-nextest-core> test finite_part_ghost_2loop ... FAILED
  457. 36.39 s gammaloop-nextest-core>
  458. 36.39 s gammaloop-nextest-core> failures:
  459. 36.39 s gammaloop-nextest-core>
  460. 36.39 s gammaloop-nextest-core> failures:
  461. 36.39 s gammaloop-nextest-core> finite_part_ghost_2loop
  462. 36.39 s gammaloop-nextest-core>
  463. 36.39 s gammaloop-nextest-core> test result: FAILED. 0 passed; 1 failed; 0 ignored; 0 measured; 5 filtered out; finished in 3.20s
  464. 36.39 s gammaloop-nextest-core> system-err
  465. 36.39 s gammaloop-nextest-core> The application panicked (crashed).
  466. 36.39 s gammaloop-nextest-core> Message: snapshot assertion for 'finite_part_ghost_2loop-3' failed in line 464
  467. 36.39 s gammaloop-nextest-core> Location: /nix/store/9a12dww58xis3an3kmn597llpijv83b1-vendor-cargo-deps/c19b7c6f923b580ac259164a89f2577984ad5ab09ee9d583b888f934adbbe8d0/insta-1.47.2/src/runtime.rs:719
  468. 36.39 s gammaloop-nextest-core>
  469. 36.39 s gammaloop-nextest-core> ━━━━━━━━━━━━━━━━━━━━━━━━━━━━━━━━━━ BACKTRACE ━━━━━━━━━━━━━━━━━━━━━━━━━━━━━━━━━━━
  470. 36.39 s gammaloop-nextest-core> 1: <color_eyre[51793ea62743adbd]::config::PanicHook>::panic_report<unknown>
  471. 36.39 s gammaloop-nextest-core> at <unknown source file>:<unknown line>
  472. 36.39 s gammaloop-nextest-core> 2: <color_eyre[51793ea62743adbd]::config::PanicHook>::into_panic_hook::{closure#0}<unknown>
  473. 36.39 s gammaloop-nextest-core> at <unknown source file>:<unknown line>
  474. 36.39 s gammaloop-nextest-core> 3: std[bcb96dfbba0ab899]::panicking::panic_with_hook<unknown>
  475. 36.39 s gammaloop-nextest-core> at <unknown source file>:<unknown line>
  476. 36.39 s gammaloop-nextest-core> 4: std[bcb96dfbba0ab899]::panicking::panic_handler::{closure#0}<unknown>
  477. 36.39 s gammaloop-nextest-core> at <unknown source file>:<unknown line>
  478. 36.39 s gammaloop-nextest-core> 5: std[bcb96dfbba0ab899]::sys::backtrace::__rust_end_short_backtrace::<std[bcb96dfbba0ab899]::panicking::panic_handler::{closure#0}, !><unknown>
  479. 36.39 s gammaloop-nextest-core> at <unknown source file>:<unknown line>
  480. 36.39 s gammaloop-nextest-core> 6: __rustc[6c289b9f9c454d21]::rust_begin_unwind<unknown>
  481. 36.39 s gammaloop-nextest-core> at <unknown source file>:<unknown line>
  482. 36.39 s gammaloop-nextest-core> 7: core[940e698046960fd5]::panicking::panic_fmt<unknown>
  483. 36.39 s gammaloop-nextest-core> at <unknown source file>:<unknown line>
  484. 36.39 s gammaloop-nextest-core> 8: insta[307a548ac79ef4d9]::runtime::assert_snapshot<unknown>
  485. 36.39 s gammaloop-nextest-core> at <unknown source file>:<unknown line>
  486. 36.39 s gammaloop-nextest-core> 9: test_renormalization[e6829672f1ddb150]::finite_part_ghost_2loop<unknown>
  487. 36.39 s gammaloop-nextest-core> at <unknown source file>:<unknown line>
  488. 36.39 s gammaloop-nextest-core> 10: <test_renormalization[e6829672f1ddb150]::finite_part_ghost_2loop::{closure#0} as core[940e698046960fd5]::ops::function::FnOnce<()>>::call_once<unknown>
  489. 36.39 s gammaloop-nextest-core> at <unknown source file>:<unknown line>
  490. 36.39 s gammaloop-nextest-core> 11: test[75d6903177b1d7e9]::__rust_begin_short_backtrace::<core[940e698046960fd5]::result::Result<(), alloc[2ea6bcb46fca0c42]::string::String>, fn() -> core[940e698046960fd5]::result::Result<(), alloc[2ea6bcb46fca0c42]::string::String>><unknown>
  491. 36.39 s gammaloop-nextest-core> at <unknown source file>:<unknown line>
  492. 36.39 s gammaloop-nextest-core> 12: test[75d6903177b1d7e9]::run_test::{closure#0}<unknown>
  493. 36.39 s gammaloop-nextest-core> at <unknown source file>:<unknown line>
  494. 36.39 s gammaloop-nextest-core> 13: std[bcb96dfbba0ab899]::sys::backtrace::__rust_begin_short_backtrace::<test[75d6903177b1d7e9]::run_test::{closure#1}, ()><unknown>
  495. 36.39 s gammaloop-nextest-core> at <unknown source file>:<unknown line>
  496. 36.39 s gammaloop-nextest-core> 14: <std[bcb96dfbba0ab899]::thread::lifecycle::spawn_unchecked<test[75d6903177b1d7e9]::run_test::{closure#1}, ()>::{closure#1} as core[940e698046960fd5]::ops::function::FnOnce<()>>::call_once::{shim:vtable#0}<unknown>
  497. 36.39 s gammaloop-nextest-core> at <unknown source file>:<unknown line>
  498. 36.39 s gammaloop-nextest-core> 15: <std[bcb96dfbba0ab899]::sys::thread::unix::Thread>::new::thread_start<unknown>
  499. 36.39 s gammaloop-nextest-core> at <unknown source file>:<unknown line>
  500. 36.39 s gammaloop-nextest-core> 16: start_thread<unknown>
  501. 36.39 s gammaloop-nextest-core> at <unknown source file>:<unknown line>
  502. 36.39 s gammaloop-nextest-core> 17: __clone3<unknown>
  503. 36.39 s gammaloop-nextest-core> at <unknown source file>:<unknown line>
  504. 36.39 s gammaloop-nextest-core>
  505. 36.39 s gammaloop-nextest-core> Run with COLORBT_SHOW_HIDDEN=1 environment variable to disable frame filtering.
  506. 36.39 s gammaloop-nextest-core> Run with RUST_BACKTRACE=full to include source snippets.
  507. 36.39 s gammaloop-nextest-core> =========================================
  508. 36.44 s [0 built (1 failed), 0.0error: Cannot build '/nix/store/w43vq41dm53nli0ffchnccbgvz2afac5-gammaloop-nextest-core.drv'.
  509. 36.44 s Reason: builder failed with exit code 100.
  510. 36.44 s Output paths:
  511. 36.44 s /nix/store/x4h8vjy5svl931716ykng98sg4fkfhp2-gammaloop-nextest-core
  512. 36.44 s Last 473 log lines:
  513. 36.44 s > Extracting 3 binaries (including 1 non-test binary), 1 build script output directory, and 2 linked paths to /build/nextest-archive-nyldlM
  514. 36.44 s > Extracted 18 files to /build/nextest-archive-nyldlM in 0.60s
  515. 36.44 s > ------------
  516. 36.44 s > Nextest run ID bfda6f3f-8720-484f-ae35-14479e94918f with nextest profile: ci_gammaloop
  517. 36.44 s > Starting 339 tests across 2 binaries
  518. 36.44 s > ------------
  519. 36.44 s > Summary [ 0.615s] 339 tests run: 339 passed, 0 skipped
  520. 36.44 s >
  521. 36.44 s > ========== nextest test summary ==========
  522. 36.44 s > report: target/nextest/ci_gammaloop/junit.xml
  523. 36.44 s > tests: 339, failures: 0, errors: 0
  524. 36.44 s > No failing testcases found.
  525. 36.44 s > =========================================
  526. 36.44 s > Extracting 1 binary and 1 linked path to /build/nextest-archive-2iXYJp
  527. 36.44 s > Extracted 7 files to /build/nextest-archive-2iXYJp in 0.09s
  528. 36.44 s > ------------
  529. 36.44 s > Nextest run ID 20109795-2eec-456a-b7d7-04cf0c5e45db with nextest profile: ci_gammaloop
  530. 36.44 s > Starting 19 tests across 1 binary
  531. 36.44 s > ------------
  532. 36.44 s > Summary [ 0.019s] 19 tests run: 19 passed, 0 skipped
  533. 36.44 s >
  534. 36.44 s > ========== nextest test summary ==========
  535. 36.44 s > report: target/nextest/ci_gammaloop/junit.xml
  536. 36.44 s > tests: 19, failures: 0, errors: 0
  537. 36.44 s > No failing testcases found.
  538. 36.44 s > =========================================
  539. 36.44 s > Extracting 1 binary to /build/nextest-archive-k32YYn
  540. 36.44 s > Extracted 4 files to /build/nextest-archive-k32YYn in 0.05s
  541. 36.44 s > ------------
  542. 36.44 s > Nextest run ID a7fca9db-d5af-4947-acd5-82acb4a73716 with nextest profile: ci_gammaloop
  543. 36.44 s > Starting 0 tests across 1 binary
  544. 36.44 s > ------------
  545. 36.44 s > Summary [ 0.000s] 0 tests run: 0 passed, 0 skipped
  546. 36.44 s >
  547. 36.44 s > ========== nextest test summary ==========
  548. 36.44 s > report: target/nextest/ci_gammaloop/junit.xml
  549. 36.44 s > tests: 0, failures: 0, errors: 0
  550. 36.44 s > No failing testcases found.
  551. 36.44 s > =========================================
  552. 36.44 s > Extracting 4 binaries, 1 build script output directory, and 2 linked paths to /build/nextest-archive-ucW3zz
  553. 36.44 s > Extracted 18 files to /build/nextest-archive-ucW3zz in 0.67s
  554. 36.44 s > ------------
  555. 36.44 s > Nextest run ID 7fb19012-f195-46d7-86c0-7c6cd448fdac with nextest profile: ci_gammaloop
  556. 36.44 s > Starting 456 tests across 4 binaries (61 tests skipped, including 60 tests via profile.ci_gammaloop.default-filter)
  557. 36.44 s > FAIL [ 0.419s] (445/456) gammalooprs::test_renormalization finit_part_ghlo
  558. 36.44 s > stdout ---
  559. 36.44 s >
  560. 36.44 s > running 1 test
  561. 36.44 s > ren part: 1/2*GC_10^2*dot(P(0,mink(dim)),P(0,mink(dim)))*cas(2,coad(8))/ε
  562. 36.44 s > ━━━━━━━━━━━━━━━━━━━━━━━━━━━━━━━ Snapshot Summary ━━━━━━━━━━━━━━━━━━━━━━━━━━━━━━━
  563. 36.44 s > Snapshot: finit_part_ghlo
  564. 36.44 s > Source: crates/gammalooprs/tests/test_renormalization.rs:557
  565. 36.44 s > ────────────────────────────────────────────────────────────────────────────────
  566. 36.44 s > Expression: align_to_rqft(&a, &model).to_bare_ordered_string()
  567. 36.44 s > ────────────────────────────────────────────────────────────────────────────────
  568. 36.44 s > -old snapshot
  569. 36.44 s > +new results
  570. 36.44 s > ────────────┬───────────────────────────────────────────────────────────────────
  571. 36.44 s > 1 │--1/2*cas(2,coad(8))*dot(P(0,mink(4)),P(0,mink(4)))*gs^2*ε^(-1)
  572. 36.44 s > 1 │+1/2*cas(2,coad(8))*dot(P(0,mink(4)),P(0,mink(4)))*gs^2*ε^(-1)
  573. 36.44 s > ────────────┴───────────────────────────────────────────────────────────────────
  574. 36.44 s > To update snapshots run `cargo insta review`
  575. 36.44 s > Stopped on the first failure. Run `cargo insta test` to run all snapshots.
  576. 36.44 s > test finit_part_ghlo ... FAILED
  577. 36.44 s >
  578. 36.44 s > failures:
  579. 36.44 s >
  580. 36.44 s > failures:
  581. 36.44 s > finit_part_ghlo
  582. 36.44 s >
  583. 36.44 s > test result: FAILED. 0 passed; 1 failed; 0 ignored; 0 measured; 5 filtered out; finished in 0.40s
  584. 36.44 s >
  585. 36.44 s > stderr ---
  586. 36.44 s > The application panicked (crashed).
  587. 36.44 s > Message: snapshot assertion for 'finit_part_ghlo' failed in line 557
  588. 36.44 s > Location: /nix/store/9a12dww58xis3an3kmn597llpijv83b1-vendor-cargo-deps/c19b7c6f923b580ac259164a89f2577984ad5ab09ee9d583b888f934adbbe8d0/insta-1.47.2/src/runtime.rs:719
  589. 36.44 s >
  590. 36.44 s > ━━━━━━━━━━━━━━━━━━━━━━━━━━━━━━━━━━ BACKTRACE ━━━━━━━━━━━━━━━━━━━━━━━━━━━━━━━━━━━
  591. 36.44 s > 1: <color_eyre[51793ea62743adbd]::config::PanicHook>::panic_report<unknown>
  592. 36.44 s > at <unknown source file>:<unknown line>
  593. 36.44 s > 2: <color_eyre[51793ea62743adbd]::config::PanicHook>::into_panic_hook::{closure#0}<unknown>
  594. 36.44 s > at <unknown source file>:<unknown line>
  595. 36.44 s > 3: std[bcb96dfbba0ab899]::panicking::panic_with_hook<unknown>
  596. 36.44 s > at <unknown source file>:<unknown line>
  597. 36.44 s > 4: std[bcb96dfbba0ab899]::panicking::panic_handler::{closure#0}<unknown>
  598. 36.44 s > at <unknown source file>:<unknown line>
  599. 36.44 s > 5: std[bcb96dfbba0ab899]::sys::backtrace::__rust_end_short_backtrace::<std[bcb96dfbba0ab899]::panicking::panic_handler::{closure#0}, !><unknown>
  600. 36.44 s > at <unknown source file>:<unknown line>
  601. 36.44 s > 6: __rustc[6c289b9f9c454d21]::rust_begin_unwind<unknown>
  602. 36.44 s > at <unknown source file>:<unknown line>
  603. 36.44 s > 7: core[940e698046960fd5]::panicking::panic_fmt<unknown>
  604. 36.44 s > at <unknown source file>:<unknown line>
  605. 36.44 s > 8: insta[307a548ac79ef4d9]::runtime::assert_snapshot<unknown>
  606. 36.44 s > at <unknown source file>:<unknown line>
  607. 36.44 s > 9: <test_renormalization[e6829672f1ddb150]::finit_part_ghlo::{closure#0} as core[940e698046960fd5]::ops::function::FnOnce<()>>::call_once<unknown>
  608. 36.44 s > at <unknown source file>:<unknown line>
  609. 36.44 s > 10: test[75d6903177b1d7e9]::__rust_begin_short_backtrace::<core[940e698046960fd5]::result::Result<(), alloc[2ea6bcb46fca0c42]::string::String>, fn() -> core[940e698046960fd5]::result::Result<(), alloc[2ea6bcb46fca0c42]::string::String>><unknown>
  610. 36.44 s > at <unknown source file>:<unknown line>
  611. 36.44 s > 11: test[75d6903177b1d7e9]::run_test::{closure#0}<unknown>
  612. 36.44 s > at <unknown source file>:<unknown line>
  613. 36.44 s > 12: std[bcb96dfbba0ab899]::sys::backtrace::__rust_begin_short_backtrace::<test[75d6903177b1d7e9]::run_test::{closure#1}, ()><unknown>
  614. 36.44 s > at <unknown source file>:<unknown line>
  615. 36.44 s > 13: <std[bcb96dfbba0ab899]::thread::lifecycle::spawn_unchecked<test[75d6903177b1d7e9]::run_test::{closure#1}, ()>::{closure#1} as core[940e698046960fd5]::ops::function::FnOnce<()>>::call_once::{shim:vtable#0}<unknown>
  616. 36.44 s > at <unknown source file>:<unknown line>
  617. 36.44 s > 14: <std[bcb96dfbba0ab899]::sys::thread::unix::Thread>::new::thread_start<unknown>
  618. 36.44 s > at <unknown source file>:<unknown line>
  619. 36.44 s > 15: start_thread<unknown>
  620. 36.44 s > at <unknown source file>:<unknown line>
  621. 36.44 s > 16: __clone3<unknown>
  622. 36.44 s > at <unknown source file>:<unknown line>
  623. 36.44 s >
  624. 36.44 s > Run with COLORBT_SHOW_HIDDEN=1 environment variable to disable frame filtering.
  625. 36.44 s > Run with RUST_BACKTRACE=full to include source snippets.
  626. 36.44 s >
  627. 36.44 s > FAIL [ 3.212s] (452/456) gammalooprs::test_renormalization finite_part_ghost_2loop
  628. 36.44 s > stdout ---
  629. 36.44 s >
  630. 36.44 s > running 1 test
  631. 36.44 s > ━━━━━━━━━━━━━━━━━━━━━━━━━━━━━━━ Snapshot Summary ━━━━━━━━━━━━━━━━━━━━━━━━━━━━━━━
  632. 36.44 s > Snapshot: finite_part_ghost_2loop-3
  633. 36.44 s > Source: crates/gammalooprs/tests/test_renormalization.rs:464
  634. 36.44 s > ────────────────────────────────────────────────────────────────────────────────
  635. 36.44 s > Expression: align_to_rqft(&a, &model).to_bare_ordered_string()
  636. 36.44 s > ────────────────────────────────────────────────────────────────────────────────
  637. 36.44 s > -old snapshot
  638. 36.44 s > +new results
  639. 36.44 s > ────────────┬───────────────────────────────────────────────────────────────────
  640. 36.44 s > 1 │-(-1𝑖/32*ε+1𝑖/16)*(cas(2,coad(8)))^2*dot(P(0,mink(4)),P(0,mink(4)))*gs^4*ε^(-2)
  641. 36.44 s > 1 │+(-1𝑖/16+1𝑖/32*ε)*(cas(2,coad(8)))^2*dot(P(0,mink(4)),P(0,mink(4)))*gs^4*ε^(-2)
  642. 36.44 s > ────────────┴───────────────────────────────────────────────────────────────────
  643. 36.44 s > To update snapshots run `cargo insta review`
  644. 36.44 s > Stopped on the first failure. Run `cargo insta test` to run all snapshots.
  645. 36.44 s > test finite_part_ghost_2loop ... FAILED
  646. 36.44 s >
  647. 36.44 s > failures:
  648. 36.44 s >
  649. 36.44 s > failures:
  650. 36.44 s > finite_part_ghost_2loop
  651. 36.44 s >
  652. 36.44 s > test result: FAILED. 0 passed; 1 failed; 0 ignored; 0 measured; 5 filtered out; finished in 3.20s
  653. 36.44 s >
  654. 36.44 s > stderr ---
  655. 36.44 s > The application panicked (crashed).
  656. 36.44 s > Message: snapshot assertion for 'finite_part_ghost_2loop-3' failed in line 464
  657. 36.44 s > Location: /nix/store/9a12dww58xis3an3kmn597llpijv83b1-vendor-cargo-deps/c19b7c6f923b580ac259164a89f2577984ad5ab09ee9d583b888f934adbbe8d0/insta-1.47.2/src/runtime.rs:719
  658. 36.44 s >
  659. 36.44 s > ━━━━━━━━━━━━━━━━━━━━━━━━━━━━━━━━━━ BACKTRACE ━━━━━━━━━━━━━━━━━━━━━━━━━━━━━━━━━━━
  660. 36.44 s > 1: <color_eyre[51793ea62743adbd]::config::PanicHook>::panic_report<unknown>
  661. 36.44 s > at <unknown source file>:<unknown line>
  662. 36.44 s > 2: <color_eyre[51793ea62743adbd]::config::PanicHook>::into_panic_hook::{closure#0}<unknown>
  663. 36.44 s > at <unknown source file>:<unknown line>
  664. 36.44 s > 3: std[bcb96dfbba0ab899]::panicking::panic_with_hook<unknown>
  665. 36.44 s > at <unknown source file>:<unknown line>
  666. 36.44 s > 4: std[bcb96dfbba0ab899]::panicking::panic_handler::{closure#0}<unknown>
  667. 36.44 s > at <unknown source file>:<unknown line>
  668. 36.44 s > 5: std[bcb96dfbba0ab899]::sys::backtrace::__rust_end_short_backtrace::<std[bcb96dfbba0ab899]::panicking::panic_handler::{closure#0}, !><unknown>
  669. 36.44 s > at <unknown source file>:<unknown line>
  670. 36.44 s > 6: __rustc[6c289b9f9c454d21]::rust_begin_unwind<unknown>
  671. 36.44 s > at <unknown source file>:<unknown line>
  672. 36.44 s > 7: core[940e698046960fd5]::panicking::panic_fmt<unknown>
  673. 36.44 s > at <unknown source file>:<unknown line>
  674. 36.44 s > 8: insta[307a548ac79ef4d9]::runtime::assert_snapshot<unknown>
  675. 36.44 s > at <unknown source file>:<unknown line>
  676. 36.44 s > 9: test_renormalization[e6829672f1ddb150]::finite_part_ghost_2loop<unknown>
  677. 36.44 s > at <unknown source file>:<unknown line>
  678. 36.44 s > 10: <test_renormalization[e6829672f1ddb150]::finite_part_ghost_2loop::{closure#0} as core[940e698046960fd5]::ops::function::FnOnce<()>>::call_once<unknown>
  679. 36.44 s > at <unknown source file>:<unknown line>
  680. 36.44 s > 11: test[75d6903177b1d7e9]::__rust_begin_short_backtrace::<core[940e698046960fd5]::result::Result<(), alloc[2ea6bcb46fca0c42]::string::String>, fn() -> core[940e698046960fd5]::result::Result<(), alloc[2ea6bcb46fca0c42]::string::String>><unknown>
  681. 36.44 s > at <unknown source file>:<unknown line>
  682. 36.44 s > 12: test[75d6903177b1d7e9]::run_test::{closure#0}<unknown>
  683. 36.44 s > at <unknown source file>:<unknown line>
  684. 36.44 s > 13: std[bcb96dfbba0ab899]::sys::backtrace::__rust_begin_short_backtrace::<test[75d6903177b1d7e9]::run_test::{closure#1}, ()><unknown>
  685. 36.44 s > at <unknown source file>:<unknown line>
  686. 36.44 s > 14: <std[bcb96dfbba0ab899]::thread::lifecycle::spawn_unchecked<test[75d6903177b1d7e9]::run_test::{closure#1}, ()>::{closure#1} as core[940e698046960fd5]::ops::function::FnOnce<()>>::call_once::{shim:vtable#0}<unknown>
  687. 36.44 s > at <unknown source file>:<unknown line>
  688. 36.44 s > 15: <std[bcb96dfbba0ab899]::sys::thread::unix::Thread>::new::thread_start<unknown>
  689. 36.44 s > at <unknown source file>:<unknown line>
  690. 36.44 s > 16: start_thread<unknown>
  691. 36.44 s > at <unknown source file>:<unknown line>
  692. 36.44 s > 17: __clone3<unknown>
  693. 36.44 s > at <unknown source file>:<unknown line>
  694. 36.44 s >
  695. 36.44 s > Run with COLORBT_SHOW_HIDDEN=1 environment variable to disable frame filtering.
  696. 36.44 s > Run with RUST_BACKTRACE=full to include source snippets.
  697. 36.44 s >
  698. 36.44 s > ------------
  699. 36.44 s > Summary [ 12.115s] 456 tests run: 454 passed, 2 failed, 61 skipped
  700. 36.44 s > FAIL [ 0.419s] (445/456) gammalooprs::test_renormalization finit_part_ghlo
  701. 36.44 s > stdout ---
  702. 36.44 s >
  703. 36.44 s > running 1 test
  704. 36.44 s > ren part: 1/2*GC_10^2*dot(P(0,mink(dim)),P(0,mink(dim)))*cas(2,coad(8))/ε
  705. 36.44 s > ━━━━━━━━━━━━━━━━━━━━━━━━━━━━━━━ Snapshot Summary ━━━━━━━━━━━━━━━━━━━━━━━━━━━━━━━
  706. 36.44 s > Snapshot: finit_part_ghlo
  707. 36.44 s > Source: crates/gammalooprs/tests/test_renormalization.rs:557
  708. 36.44 s > ────────────────────────────────────────────────────────────────────────────────
  709. 36.44 s > Expression: align_to_rqft(&a, &model).to_bare_ordered_string()
  710. 36.44 s > ────────────────────────────────────────────────────────────────────────────────
  711. 36.44 s > -old snapshot
  712. 36.44 s > +new results
  713. 36.44 s > ────────────┬───────────────────────────────────────────────────────────────────
  714. 36.44 s > 1 │--1/2*cas(2,coad(8))*dot(P(0,mink(4)),P(0,mink(4)))*gs^2*ε^(-1)
  715. 36.44 s > 1 │+1/2*cas(2,coad(8))*dot(P(0,mink(4)),P(0,mink(4)))*gs^2*ε^(-1)
  716. 36.44 s > ────────────┴───────────────────────────────────────────────────────────────────
  717. 36.44 s > To update snapshots run `cargo insta review`
  718. 36.44 s > Stopped on the first failure. Run `cargo insta test` to run all snapshots.
  719. 36.44 s > test finit_part_ghlo ... FAILED
  720. 36.44 s >
  721. 36.44 s > failures:
  722. 36.44 s >
  723. 36.44 s > failures:
  724. 36.44 s > finit_part_ghlo
  725. 36.44 s >
  726. 36.44 s > test result: FAILED. 0 passed; 1 failed; 0 ignored; 0 measured; 5 filtered out; finished in 0.40s
  727. 36.44 s >
  728. 36.44 s > stderr ---
  729. 36.44 s > The application panicked (crashed).
  730. 36.44 s > Message: snapshot assertion for 'finit_part_ghlo' failed in line 557
  731. 36.44 s > Location: /nix/store/9a12dww58xis3an3kmn597llpijv83b1-vendor-cargo-deps/c19b7c6f923b580ac259164a89f2577984ad5ab09ee9d583b888f934adbbe8d0/insta-1.47.2/src/runtime.rs:719
  732. 36.44 s >
  733. 36.44 s > ━━━━━━━━━━━━━━━━━━━━━━━━━━━━━━━━━━ BACKTRACE ━━━━━━━━━━━━━━━━━━━━━━━━━━━━━━━━━━━
  734. 36.44 s > 1: <color_eyre[51793ea62743adbd]::config::PanicHook>::panic_report<unknown>
  735. 36.44 s > at <unknown source file>:<unknown line>
  736. 36.44 s > 2: <color_eyre[51793ea62743adbd]::config::PanicHook>::into_panic_hook::{closure#0}<unknown>
  737. 36.44 s > at <unknown source file>:<unknown line>
  738. 36.44 s > 3: std[bcb96dfbba0ab899]::panicking::panic_with_hook<unknown>
  739. 36.44 s > at <unknown source file>:<unknown line>
  740. 36.44 s > 4: std[bcb96dfbba0ab899]::panicking::panic_handler::{closure#0}<unknown>
  741. 36.44 s > at <unknown source file>:<unknown line>
  742. 36.44 s > 5: std[bcb96dfbba0ab899]::sys::backtrace::__rust_end_short_backtrace::<std[bcb96dfbba0ab899]::panicking::panic_handler::{closure#0}, !><unknown>
  743. 36.44 s > at <unknown source file>:<unknown line>
  744. 36.44 s > 6: __rustc[6c289b9f9c454d21]::rust_begin_unwind<unknown>
  745. 36.44 s > at <unknown source file>:<unknown line>
  746. 36.44 s > 7: core[940e698046960fd5]::panicking::panic_fmt<unknown>
  747. 36.44 s > at <unknown source file>:<unknown line>
  748. 36.44 s > 8: insta[307a548ac79ef4d9]::runtime::assert_snapshot<unknown>
  749. 36.44 s > at <unknown source file>:<unknown line>
  750. 36.44 s > 9: <test_renormalization[e6829672f1ddb150]::finit_part_ghlo::{closure#0} as core[940e698046960fd5]::ops::function::FnOnce<()>>::call_once<unknown>
  751. 36.44 s > at <unknown source file>:<unknown line>
  752. 36.44 s > 10: test[75d6903177b1d7e9]::__rust_begin_short_backtrace::<core[940e698046960fd5]::result::Result<(), alloc[2ea6bcb46fca0c42]::string::String>, fn() -> core[940e698046960fd5]::result::Result<(), alloc[2ea6bcb46fca0c42]::string::String>><unknown>
  753. 36.44 s > at <unknown source file>:<unknown line>
  754. 36.44 s > 11: test[75d6903177b1d7e9]::run_test::{closure#0}<unknown>
  755. 36.44 s > at <unknown source file>:<unknown line>
  756. 36.44 s > 12: std[bcb96dfbba0ab899]::sys::backtrace::__rust_begin_short_backtrace::<test[75d6903177b1d7e9]::run_test::{closure#1}, ()><unknown>
  757. 36.44 s > at <unknown source file>:<unknown line>
  758. 36.44 s > 13: <std[bcb96dfbba0ab899]::thread::lifecycle::spawn_unchecked<test[75d6903177b1d7e9]::run_test::{closure#1}, ()>::{closure#1} as core[940e698046960fd5]::ops::function::FnOnce<()>>::call_once::{shim:vtable#0}<unknown>
  759. 36.44 s > at <unknown source file>:<unknown line>
  760. 36.44 s > 14: <std[bcb96dfbba0ab899]::sys::thread::unix::Thread>::new::thread_start<unknown>
  761. 36.44 s > at <unknown source file>:<unknown line>
  762. 36.44 s > 15: start_thread<unknown>
  763. 36.44 s > at <unknown source file>:<unknown line>
  764. 36.44 s > 16: __clone3<unknown>
  765. 36.44 s > at <unknown source file>:<unknown line>
  766. 36.44 s >
  767. 36.44 s > Run with COLORBT_SHOW_HIDDEN=1 environment variable to disable frame filtering.
  768. 36.44 s > Run with RUST_BACKTRACE=full to include source snippets.
  769. 36.44 s >
  770. 36.44 s > FAIL [ 3.212s] (452/456) gammalooprs::test_renormalization finite_part_ghost_2loop
  771. 36.44 s > stdout ---
  772. 36.44 s >
  773. 36.44 s > running 1 test
  774. 36.44 s > ━━━━━━━━━━━━━━━━━━━━━━━━━━━━━━━ Snapshot Summary ━━━━━━━━━━━━━━━━━━━━━━━━━━━━━━━
  775. 36.44 s > Snapshot: finite_part_ghost_2loop-3
  776. 36.44 s > Source: crates/gammalooprs/tests/test_renormalization.rs:464
  777. 36.44 s > ────────────────────────────────────────────────────────────────────────────────
  778. 36.44 s > Expression: align_to_rqft(&a, &model).to_bare_ordered_string()
  779. 36.44 s > ────────────────────────────────────────────────────────────────────────────────
  780. 36.44 s > -old snapshot
  781. 36.44 s > +new results
  782. 36.44 s > ────────────┬───────────────────────────────────────────────────────────────────
  783. 36.44 s > 1 │-(-1𝑖/32*ε+1𝑖/16)*(cas(2,coad(8)))^2*dot(P(0,mink(4)),P(0,mink(4)))*gs^4*ε^(-2)
  784. 36.44 s > 1 │+(-1𝑖/16+1𝑖/32*ε)*(cas(2,coad(8)))^2*dot(P(0,mink(4)),P(0,mink(4)))*gs^4*ε^(-2)
  785. 36.44 s > ────────────┴───────────────────────────────────────────────────────────────────
  786. 36.44 s > To update snapshots run `cargo insta review`
  787. 36.44 s > Stopped on the first failure. Run `cargo insta test` to run all snapshots.
  788. 36.44 s > test finite_part_ghost_2loop ... FAILED
  789. 36.44 s >
  790. 36.44 s > failures:
  791. 36.44 s >
  792. 36.44 s > failures:
  793. 36.44 s > finite_part_ghost_2loop
  794. 36.44 s >
  795. 36.44 s > test result: FAILED. 0 passed; 1 failed; 0 ignored; 0 measured; 5 filtered out; finished in 3.20s
  796. 36.44 s >
  797. 36.44 s > stderr ---
  798. 36.44 s > The application panicked (crashed).
  799. 36.44 s > Message: snapshot assertion for 'finite_part_ghost_2loop-3' failed in line 464
  800. 36.44 s > Location: /nix/store/9a12dww58xis3an3kmn597llpijv83b1-vendor-cargo-deps/c19b7c6f923b580ac259164a89f2577984ad5ab09ee9d583b888f934adbbe8d0/insta-1.47.2/src/runtime.rs:719
  801. 36.44 s >
  802. 36.44 s > ━━━━━━━━━━━━━━━━━━━━━━━━━━━━━━━━━━ BACKTRACE ━━━━━━━━━━━━━━━━━━━━━━━━━━━━━━━━━━━
  803. 36.44 s > 1: <color_eyre[51793ea62743adbd]::config::PanicHook>::panic_report<unknown>
  804. 36.44 s > at <unknown source file>:<unknown line>
  805. 36.44 s > 2: <color_eyre[51793ea62743adbd]::config::PanicHook>::into_panic_hook::{closure#0}<unknown>
  806. 36.44 s > at <unknown source file>:<unknown line>
  807. 36.44 s > 3: std[bcb96dfbba0ab899]::panicking::panic_with_hook<unknown>
  808. 36.44 s > at <unknown source file>:<unknown line>
  809. 36.44 s > 4: std[bcb96dfbba0ab899]::panicking::panic_handler::{closure#0}<unknown>
  810. 36.44 s > at <unknown source file>:<unknown line>
  811. 36.44 s > 5: std[bcb96dfbba0ab899]::sys::backtrace::__rust_end_short_backtrace::<std[bcb96dfbba0ab899]::panicking::panic_handler::{closure#0}, !><unknown>
  812. 36.44 s > at <unknown source file>:<unknown line>
  813. 36.44 s > 6: __rustc[6c289b9f9c454d21]::rust_begin_unwind<unknown>
  814. 36.44 s > at <unknown source file>:<unknown line>
  815. 36.44 s > 7: core[940e698046960fd5]::panicking::panic_fmt<unknown>
  816. 36.44 s > at <unknown source file>:<unknown line>
  817. 36.44 s > 8: insta[307a548ac79ef4d9]::runtime::assert_snapshot<unknown>
  818. 36.44 s > at <unknown source file>:<unknown line>
  819. 36.44 s > 9: test_renormalization[e6829672f1ddb150]::finite_part_ghost_2loop<unknown>
  820. 36.44 s > at <unknown source file>:<unknown line>
  821. 36.44 s > 10: <test_renormalization[e6829672f1ddb150]::finite_part_ghost_2loop::{closure#0} as core[940e698046960fd5]::ops::function::FnOnce<()>>::call_once<unknown>
  822. 36.44 s > at <unknown source file>:<unknown line>
  823. 36.44 s > 11: test[75d6903177b1d7e9]::__rust_begin_short_backtrace::<core[940e698046960fd5]::result::Result<(), alloc[2ea6bcb46fca0c42]::string::String>, fn() -> core[940e698046960fd5]::result::Result<(), alloc[2ea6bcb46fca0c42]::string::String>><unknown>
  824. 36.44 s > at <unknown source file>:<unknown line>
  825. 36.44 s > 12: test[75d6903177b1d7e9]::run_test::{closure#0}<unknown>
  826. 36.44 s > at <unknown source file>:<unknown line>
  827. 36.44 s > 13: std[bcb96dfbba0ab899]::sys::backtrace::__rust_begin_short_backtrace::<test[75d6903177b1d7e9]::run_test::{closure#1}, ()><unknown>
  828. 36.44 s > at <unknown source file>:<unknown line>
  829. 36.44 s > 14: <std[bcb96dfbba0ab899]::thread::lifecycle::spawn_unchecked<test[75d6903177b1d7e9]::run_test::{closure#1}, ()>::{closure#1} as core[940e698046960fd5]::ops::function::FnOnce<()>>::call_once::{shim:vtable#0}<unknown>
  830. 36.44 s > at <unknown source file>:<unknown line>
  831. 36.44 s > 15: <std[bcb96dfbba0ab899]::sys::thread::unix::Thread>::new::thread_start<unknown>
  832. 36.44 s > at <unknown source file>:<unknown line>
  833. 36.44 s > 16: start_thread<unknown>
  834. 36.44 s > at <unknown source file>:<unknown line>
  835. 36.44 s > 17: __clone3<unknown>
  836. 36.44 s > at <unknown source file>:<unknown line>
  837. 36.44 s >
  838. 36.44 s > Run with COLORBT_SHOW_HIDDEN=1 environment variable to disable frame filtering.
  839. 36.44 s > Run with RUST_BACKTRACE=full to include source snippets.
  840. 36.44 s >
  841. 36.44 s > error: test run failed
  842. 36.44 s >
  843. 36.44 s > ========== nextest test summary ==========
  844. 36.44 s > report: target/nextest/ci_gammaloop/junit.xml
  845. 36.44 s > tests: 456, failures: 2, errors: 0
  846. 36.44 s >
  847. 36.44 s > 1. gammalooprs::test_renormalization::finit_part_ghlo
  848. 36.44 s > failure: test failure with exit code 101
  849. 36.44 s > system-out
  850. 36.44 s > running 1 test
  851. 36.44 s > ren part: 1/2*GC_10^2*dot(P(0,mink(dim)),P(0,mink(dim)))*cas(2,coad(8))/ε
  852. 36.44 s > ━━━━━━━━━━━━━━━━━━━━━━━━━━━━━━━ Snapshot Summary ━━━━━━━━━━━━━━━━━━━━━━━━━━━━━━━
  853. 36.44 s > Snapshot: finit_part_ghlo
  854. 36.44 s > Source: crates/gammalooprs/tests/test_renormalization.rs:557
  855. 36.44 s > ────────────────────────────────────────────────────────────────────────────────
  856. 36.44 s > Expression: align_to_rqft(&a, &model).to_bare_ordered_string()
  857. 36.44 s > ────────────────────────────────────────────────────────────────────────────────
  858. 36.44 s > -old snapshot
  859. 36.44 s > +new results
  860. 36.44 s > ────────────┬───────────────────────────────────────────────────────────────────
  861. 36.44 s > 1 │--1/2*cas(2,coad(8))*dot(P(0,mink(4)),P(0,mink(4)))*gs^2*ε^(-1)
  862. 36.44 s > 1 │+1/2*cas(2,coad(8))*dot(P(0,mink(4)),P(0,mink(4)))*gs^2*ε^(-1)
  863. 36.44 s > ────────────┴───────────────────────────────────────────────────────────────────
  864. 36.44 s > To update snapshots run `cargo insta review`
  865. 36.44 s > Stopped on the first failure. Run `cargo insta test` to run all snapshots.
  866. 36.44 s > test finit_part_ghlo ... FAILED
  867. 36.44 s >
  868. 36.44 s > failures:
  869. 36.44 s >
  870. 36.44 s > failures:
  871. 36.44 s > finit_part_ghlo
  872. 36.44 s >
  873. 36.44 s > test result: FAILED. 0 passed; 1 failed; 0 ignored; 0 measured; 5 filtered out; finished in 0.40s
  874. 36.44 s > system-err
  875. 36.44 s > The application panicked (crashed).
  876. 36.44 s > Message: snapshot assertion for 'finit_part_ghlo' failed in line 557
  877. 36.44 s > Location: /nix/store/9a12dww58xis3an3kmn597llpijv83b1-vendor-cargo-deps/c19b7c6f923b580ac259164a89f2577984ad5ab09ee9d583b888f934adbbe8d0/insta-1.47.2/src/runtime.rs:719
  878. 36.44 s >
  879. 36.44 s > ━━━━━━━━━━━━━━━━━━━━━━━━━━━━━━━━━━ BACKTRACE ━━━━━━━━━━━━━━━━━━━━━━━━━━━━━━━━━━━
  880. 36.44 s > 1: <color_eyre[51793ea62743adbd]::config::PanicHook>::panic_report<unknown>
  881. 36.44 s > at <unknown source file>:<unknown line>
  882. 36.44 s > 2: <color_eyre[51793ea62743adbd]::config::PanicHook>::into_panic_hook::{closure#0}<unknown>
  883. 36.44 s > at <unknown source file>:<unknown line>
  884. 36.44 s > 3: std[bcb96dfbba0ab899]::panicking::panic_with_hook<unknown>
  885. 36.44 s > at <unknown source file>:<unknown line>
  886. 36.44 s > 4: std[bcb96dfbba0ab899]::panicking::panic_handler::{closure#0}<unknown>
  887. 36.44 s > at <unknown source file>:<unknown line>
  888. 36.44 s > 5: std[bcb96dfbba0ab899]::sys::backtrace::__rust_end_short_backtrace::<std[bcb96dfbba0ab899]::panicking::panic_handler::{closure#0}, !><unknown>
  889. 36.44 s > at <unknown source file>:<unknown line>
  890. 36.44 s > 6: __rustc[6c289b9f9c454d21]::rust_begin_unwind<unknown>
  891. 36.44 s > at <unknown source file>:<unknown line>
  892. 36.44 s > 7: core[940e698046960fd5]::panicking::panic_fmt<unknown>
  893. 36.44 s > at <unknown source file>:<unknown line>
  894. 36.44 s > 8: insta[307a548ac79ef4d9]::runtime::assert_snapshot<unknown>
  895. 36.44 s > at <unknown source file>:<unknown line>
  896. 36.44 s > 9: <test_renormalization[e6829672f1ddb150]::finit_part_ghlo::{closure#0} as core[940e698046960fd5]::ops::function::FnOnce<()>>::call_once<unknown>
  897. 36.44 s > at <unknown source file>:<unknown line>
  898. 36.44 s > 10: test[75d6903177b1d7e9]::__rust_begin_short_backtrace::<core[940e698046960fd5]::result::Result<(), alloc[2ea6bcb46fca0c42]::string::String>, fn() -> core[940e698046960fd5]::result::Result<(), alloc[2ea6bcb46fca0c42]::string::String>><unknown>
  899. 36.44 s > at <unknown source file>:<unknown line>
  900. 36.44 s > 11: test[75d6903177b1d7e9]::run_test::{closure#0}<unknown>
  901. 36.44 s > at <unknown source file>:<unknown line>
  902. 36.44 s > 12: std[bcb96dfbba0ab899]::sys::backtrace::__rust_begin_short_backtrace::<test[75d6903177b1d7e9]::run_test::{closure#1}, ()><unknown>
  903. 36.44 s > at <unknown source file>:<unknown line>
  904. 36.44 s > 13: <std[bcb96dfbba0ab899]::thread::lifecycle::spawn_unchecked<test[75d6903177b1d7e9]::run_test::{closure#1}, ()>::{closure#1} as core[940e698046960fd5]::ops::function::FnOnce<()>>::call_once::{shim:vtable#0}<unknown>
  905. 36.44 s > at <unknown source file>:<unknown line>
  906. 36.44 s > 14: <std[bcb96dfbba0ab899]::sys::thread::unix::Thread>::new::thread_start<unknown>
  907. 36.44 s > at <unknown source file>:<unknown line>
  908. 36.44 s > 15: start_thread<unknown>
  909. 36.44 s > at <unknown source file>:<unknown line>
  910. 36.44 s > 16: __clone3<unknown>
  911. 36.44 s > at <unknown source file>:<unknown line>
  912. 36.44 s >
  913. 36.44 s > Run with COLORBT_SHOW_HIDDEN=1 environment variable to disable frame filtering.
  914. 36.44 s > Run with RUST_BACKTRACE=full to include source snippets.
  915. 36.44 s >
  916. 36.44 s > 2. gammalooprs::test_renormalization::finite_part_ghost_2loop
  917. 36.44 s > failure: test failure with exit code 101
  918. 36.44 s > system-out
  919. 36.44 s > running 1 test
  920. 36.44 s > ━━━━━━━━━━━━━━━━━━━━━━━━━━━━━━━ Snapshot Summary ━━━━━━━━━━━━━━━━━━━━━━━━━━━━━━━
  921. 36.44 s > Snapshot: finite_part_ghost_2loop-3
  922. 36.44 s > Source: crates/gammalooprs/tests/test_renormalization.rs:464
  923. 36.44 s > ────────────────────────────────────────────────────────────────────────────────
  924. 36.44 s > Expression: align_to_rqft(&a, &model).to_bare_ordered_string()
  925. 36.44 s > ────────────────────────────────────────────────────────────────────────────────
  926. 36.44 s > -old snapshot
  927. 36.44 s > +new results
  928. 36.44 s > ────────────┬───────────────────────────────────────────────────────────────────
  929. 36.44 s > 1 │-(-1𝑖/32*ε+1𝑖/16)*(cas(2,coad(8)))^2*dot(P(0,mink(4)),P(0,mink(4)))*gs^4*ε^(-2)
  930. 36.44 s > 1 │+(-1𝑖/16+1𝑖/32*ε)*(cas(2,coad(8)))^2*dot(P(0,mink(4)),P(0,mink(4)))*gs^4*ε^(-2)
  931. 36.44 s > ────────────┴───────────────────────────────────────────────────────────────────
  932. 36.44 s > To update snapshots run `cargo insta review`
  933. 36.44 s > Stopped on the first failure. Run `cargo insta test` to run all snapshots.
  934. 36.44 s > test finite_part_ghost_2loop ... FAILED
  935. 36.44 s >
  936. 36.44 s > failures:
  937. 36.44 s >
  938. 36.44 s > failures:
  939. 36.44 s > finite_part_ghost_2loop
  940. 36.44 s >
  941. 36.44 s > test result: FAILED. 0 passed; 1 failed; 0 ignored; 0 measured; 5 filtered out; finished in 3.20s
  942. 36.44 s > system-err
  943. 36.44 s > The application panicked (crashed).
  944. 36.44 s > Message: snapshot assertion for 'finite_part_ghost_2loop-3' failed in line 464
  945. 36.44 s > Location: /nix/store/9a12dww58xis3an3kmn597llpijv83b1-vendor-cargo-deps/c19b7c6f923b580ac259164a89f2577984ad5ab09ee9d583b888f934adbbe8d0/insta-1.47.2/src/runtime.rs:719
  946. 36.44 s >
  947. 36.44 s > ━━━━━━━━━━━━━━━━━━━━━━━━━━━━━━━━━━ BACKTRACE ━━━━━━━━━━━━━━━━━━━━━━━━━━━━━━━━━━━
  948. 36.44 s > 1: <color_eyre[51793ea62743adbd]::config::PanicHook>::panic_report<unknown>
  949. 36.44 s > at <unknown source file>:<unknown line>
  950. 36.44 s > 2: <color_eyre[51793ea62743adbd]::config::PanicHook>::into_panic_hook::{closure#0}<unknown>
  951. 36.44 s > at <unknown source file>:<unknown line>
  952. 36.44 s > 3: std[bcb96dfbba0ab899]::panicking::panic_with_hook<unknown>
  953. 36.44 s > at <unknown source file>:<unknown line>
  954. 36.44 s > 4: std[bcb96dfbba0ab899]::panicking::panic_handler::{closure#0}<unknown>
  955. 36.44 s > at <unknown source file>:<unknown line>
  956. 36.44 s > 5: std[bcb96dfbba0ab899]::sys::backtrace::__rust_end_short_backtrace::<std[bcb96dfbba0ab899]::panicking::panic_handler::{closure#0}, !><unknown>
  957. 36.44 s > at <unknown source file>:<unknown line>
  958. 36.44 s > 6: __rustc[6c289b9f9c454d21]::rust_begin_unwind<unknown>
  959. 36.44 s > at <unknown source file>:<unknown line>
  960. 36.44 s > 7: core[940e698046960fd5]::panicking::panic_fmt<unknown>
  961. 36.44 s > at <unknown source file>:<unknown line>
  962. 36.44 s > 8: insta[307a548ac79ef4d9]::runtime::assert_snapshot<unknown>
  963. 36.44 s > at <unknown source file>:<unknown line>
  964. 36.44 s > 9: test_renormalization[e6829672f1ddb150]::finite_part_ghost_2loop<unknown>
  965. 36.44 s > at <unknown source file>:<unknown line>
  966. 36.44 s > 10: <test_renormalization[e6829672f1ddb150]::finite_part_ghost_2loop::{closure#0} as core[940e698046960fd5]::ops::function::FnOnce<()>>::call_once<unknown>
  967. 36.44 s > at <unknown source file>:<unknown line>
  968. 36.44 s > 11: test[75d6903177b1d7e9]::__rust_begin_short_backtrace::<core[940e698046960fd5]::result::Result<(), alloc[2ea6bcb46fca0c42]::string::String>, fn() -> core[940e698046960fd5]::result::Result<(), alloc[2ea6bcb46fca0c42]::string::String>><unknown>
  969. 36.44 s > at <unknown source file>:<unknown line>
  970. 36.44 s > 12: test[75d6903177b1d7e9]::run_test::{closure#0}<unknown>
  971. 36.44 s > at <unknown source file>:<unknown line>
  972. 36.44 s > 13: std[bcb96dfbba0ab899]::sys::backtrace::__rust_begin_short_backtrace::<test[75d6903177b1d7e9]::run_test::{closure#1}, ()><unknown>
  973. 36.44 s > at <unknown source file>:<unknown line>
  974. 36.44 s > 14: <std[bcb96dfbba0ab899]::thread::lifecycle::spawn_unchecked<test[75d6903177b1d7e9]::run_test::{closure#1}, ()>::{closure#1} as core[940e698046960fd5]::ops::function::FnOnce<()>>::call_once::{shim:vtable#0}<unknown>
  975. 36.44 s > at <unknown source file>:<unknown line>
  976. 36.44 s > 15: <std[bcb96dfbba0ab899]::sys::thread::unix::Thread>::new::thread_start<unknown>
  977. 36.44 s > at <unknown source file>:<unknown line>
  978. 36.44 s > 16: start_thread<unknown>
  979. 36.44 s > at <unknown source file>:<unknown line>
  980. 36.44 s > 17: __clone3<unknown>
  981. 36.44 s > at <unknown source file>:<unknown line>
  982. 36.44 s >
  983. 36.44 s > Run with COLORBT_SHOW_HIDDEN=1 environment variable to disable frame filtering.
  984. 36.44 s > Run with RUST_BACKTRACE=full to include source snippets.
  985. 36.44 s > =========================================
  986. 36.44 s For full logs, run:
  987. 36.44 s nix log /nix/store/w43vq41dm53nli0ffchnccbgvz2afac5-gammaloop-nextest-core.drv
  988. 36.58 s Run failed.