0.70 s
$ /nix/store/9ypz3flqsrl5xl495mm8h645gadjsxi1-coreutils-9.11/bin/timeout --kill-after=15s 7200s /nix/store/23zk8sgzamrbmj1fday15szf7f2279s8-nix-2.34.7/bin/nix --extra-experimental-features nix-command --extra-experimental-features flakes flake clone git+https://github.com/alphal00p/gammaloop --dest /tmp/nix-ci-worker/stable-pwd/repo/
0.92 s
Cloning into '/tmp/nix-ci-worker/stable-pwd/repo'...
1.19 s
remote: Enumerating objects: 65018, done.
1.31 s
remote: Counting objects: 0% (1/7690)
remote: Counting objects: 1% (77/7690)
remote: Counting objects: 2% (154/7690)
remote: Counting objects: 3% (231/7690)
remote: Counting objects: 4% (308/7690)
remote: Counting objects: 5% (385/7690)
remote: Counting objects: 6% (462/7690)
remote: Counting objects: 7% (539/7690)
remote: Counting objects: 8% (616/7690)
remote: Counting objects: 9% (693/7690)
remote: Counting objects: 10% (769/7690)
remote: Counting objects: 11% (846/7690)
remote: Counting objects: 12% (923/7690)
remote: Counting objects: 13% (1000/7690)
remote: Counting objects: 14% (1077/7690)
remote: Counting objects: 15% (1154/7690)
remote: Counting objects: 16% (1231/7690)
remote: Counting objects: 17% (1308/7690)
remote: Counting objects: 18% (1385/7690)
remote: Counting objects: 19% (1462/7690)
remote: Counting objects: 20% (1538/7690)
remote: Counting objects: 21% (1615/7690)
remote: Counting objects: 22% (1692/7690)
remote: Counting objects: 23% (1769/7690)
remote: Counting objects: 24% (1846/7690)
remote: Counting objects: 25% (1923/7690)
remote: Counting objects: 26% (2000/7690)
remote: Counting objects: 27% (2077/7690)
remote: Counting objects: 28% (2154/7690)
remote: Counting objects: 29% (2231/7690)
remote: Counting objects: 30% (2307/7690)
remote: Counting objects: 31% (2384/7690)
remote: Counting objects: 32% (2461/7690)
remote: Counting objects: 33% (2538/7690)
remote: Counting objects: 34% (2615/7690)
remote: Counting objects: 35% (2692/7690)
remote: Counting objects: 36% (2769/7690)
remote: Counting objects: 37% (2846/7690)
remote: Counting objects: 38% (2923/7690)
remote: Counting objects: 39% (3000/7690)
remote: Counting objects: 40% (3076/7690)
remote: Counting objects: 41% (3153/7690)
remote: Counting objects: 42% (3230/7690)
remote: Counting objects: 43% (3307/7690)
remote: Counting objects: 44% (3384/7690)
remote: Counting objects: 45% (3461/7690)
remote: Counting objects: 46% (3538/7690)
remote: Counting objects: 47% (3615/7690)
remote: Counting objects: 48% (3692/7690)
remote: Counting objects: 49% (3769/7690)
remote: Counting objects: 50% (3845/7690)
remote: Counting objects: 51% (3922/7690)
remote: Counting objects: 52% (3999/7690)
remote: Counting objects: 53% (4076/7690)
remote: Counting objects: 54% (4153/7690)
remote: Counting objects: 55% (4230/7690)
remote: Counting objects: 56% (4307/7690)
remote: Counting objects: 57% (4384/7690)
remote: Counting objects: 58% (4461/7690)
remote: Counting objects: 59% (4538/7690)
remote: Counting objects: 60% (4614/7690)
remote: Counting objects: 61% (4691/7690)
remote: Counting objects: 62% (4768/7690)
remote: Counting objects: 63% (4845/7690)
remote: Counting objects: 64% (4922/7690)
remote: Counting objects: 65% (4999/7690)
remote: Counting objects: 66% (5076/7690)
remote: Counting objects: 67% (5153/7690)
remote: Counting objects: 68% (5230/7690)
remote: Counting objects: 69% (5307/7690)
remote: Counting objects: 70% (5383/7690)
remote: Counting objects: 71% (5460/7690)
remote: Counting objects: 72% (5537/7690)
remote: Counting objects: 73% (5614/7690)
remote: Counting objects: 74% (5691/7690)
remote: Counting objects: 75% (5768/7690)
remote: Counting objects: 76% (5845/7690)
remote: Counting objects: 77% (5922/7690)
remote: Counting objects: 78% (5999/7690)
remote: Counting objects: 79% (6076/7690)
remote: Counting objects: 80% (6152/7690)
remote: Counting objects: 81% (6229/7690)
remote: Counting objects: 82% (6306/7690)
remote: Counting objects: 83% (6383/7690)
remote: Counting objects: 84% (6460/7690)
remote: Counting objects: 85% (6537/7690)
remote: Counting objects: 86% (6614/7690)
remote: Counting objects: 87% (6691/7690)
remote: Counting objects: 88% (6768/7690)
remote: Counting objects: 89% (6845/7690)
remote: Counting objects: 90% (6921/7690)
remote: Counting objects: 91% (6998/7690)
remote: Counting objects: 92% (7075/7690)
remote: Counting objects: 93% (7152/7690)
remote: Counting objects: 94% (7229/7690)
remote: Counting objects: 95% (7306/7690)
remote: Counting objects: 96% (7383/7690)
remote: Counting objects: 97% (7460/7690)
remote: Counting objects: 98% (7537/7690)
remote: Counting objects: 99% (7614/7690)
remote: Counting objects: 100% (7690/7690)
remote: Counting objects: 100% (7690/7690), done.
2.77 s
remote: Compressing objects: 0% (1/1405)
remote: Compressing objects: 1% (15/1405)
remote: Compressing objects: 2% (29/1405)
remote: Compressing objects: 3% (43/1405)
remote: Compressing objects: 4% (57/1405)
remote: Compressing objects: 5% (71/1405)
remote: Compressing objects: 6% (85/1405)
remote: Compressing objects: 7% (99/1405)
remote: Compressing objects: 8% (113/1405)
remote: Compressing objects: 9% (127/1405)
remote: Compressing objects: 10% (141/1405)
remote: Compressing objects: 11% (155/1405)
remote: Compressing objects: 11% (163/1405)
remote: Compressing objects: 12% (169/1405)
remote: Compressing objects: 13% (183/1405)
remote: Compressing objects: 14% (197/1405)
remote: Compressing objects: 15% (211/1405)
remote: Compressing objects: 16% (225/1405)
remote: Compressing objects: 17% (239/1405)
remote: Compressing objects: 18% (253/1405)
remote: Compressing objects: 19% (267/1405)
remote: Compressing objects: 20% (281/1405)
remote: Compressing objects: 21% (296/1405)
remote: Compressing objects: 22% (310/1405)
remote: Compressing objects: 23% (324/1405)
remote: Compressing objects: 24% (338/1405)
remote: Compressing objects: 25% (352/1405)
remote: Compressing objects: 26% (366/1405)
remote: Compressing objects: 27% (380/1405)
remote: Compressing objects: 28% (394/1405)
remote: Compressing objects: 29% (408/1405)
remote: Compressing objects: 30% (422/1405)
remote: Compressing objects: 31% (436/1405)
remote: Compressing objects: 32% (450/1405)
remote: Compressing objects: 33% (464/1405)
remote: Compressing objects: 34% (478/1405)
remote: Compressing objects: 35% (492/1405)
remote: Compressing objects: 36% (506/1405)
remote: Compressing objects: 37% (520/1405)
remote: Compressing objects: 38% (534/1405)
remote: Compressing objects: 39% (548/1405)
remote: Compressing objects: 40% (562/1405)
remote: Compressing objects: 41% (577/1405)
remote: Compressing objects: 42% (591/1405)
remote: Compressing objects: 43% (605/1405)
remote: Compressing objects: 44% (619/1405)
remote: Compressing objects: 45% (633/1405)
remote: Compressing objects: 46% (647/1405)
remote: Compressing objects: 47% (661/1405)
remote: Compressing objects: 48% (675/1405)
remote: Compressing objects: 49% (689/1405)
remote: Compressing objects: 50% (703/1405)
remote: Compressing objects: 51% (717/1405)
remote: Compressing objects: 52% (731/1405)
remote: Compressing objects: 53% (745/1405)
remote: Compressing objects: 54% (759/1405)
remote: Compressing objects: 55% (773/1405)
remote: Compressing objects: 56% (787/1405)
remote: Compressing objects: 57% (801/1405)
remote: Compressing objects: 58% (815/1405)
remote: Compressing objects: 59% (829/1405)
remote: Compressing objects: 60% (843/1405)
remote: Compressing objects: 61% (858/1405)
remote: Compressing objects: 62% (872/1405)
remote: Compressing objects: 63% (886/1405)
remote: Compressing objects: 64% (900/1405)
remote: Compressing objects: 65% (914/1405)
remote: Compressing objects: 66% (928/1405)
remote: Compressing objects: 67% (942/1405)
remote: Compressing objects: 68% (956/1405)
remote: Compressing objects: 69% (970/1405)
remote: Compressing objects: 70% (984/1405)
remote: Compressing objects: 71% (998/1405)
remote: Compressing objects: 72% (1012/1405)
remote: Compressing objects: 73% (1026/1405)
remote: Compressing objects: 74% (1040/1405)
remote: Compressing objects: 75% (1054/1405)
remote: Compressing objects: 76% (1068/1405)
remote: Compressing objects: 77% (1082/1405)
remote: Compressing objects: 78% (1096/1405)
remote: Compressing objects: 79% (1110/1405)
remote: Compressing objects: 80% (1124/1405)
remote: Compressing objects: 81% (1139/1405)
remote: Compressing objects: 82% (1153/1405)
remote: Compressing objects: 83% (1167/1405)
remote: Compressing objects: 84% (1181/1405)
remote: Compressing objects: 85% (1195/1405)
remote: Compressing objects: 86% (1209/1405)
remote: Compressing objects: 87% (1223/1405)
remote: Compressing objects: 88% (1237/1405)
remote: Compressing objects: 89% (1251/1405)
remote: Compressing objects: 90% (1265/1405)
remote: Compressing objects: 91% (1279/1405)
remote: Compressing objects: 92% (1293/1405)
remote: Compressing objects: 93% (1307/1405)
remote: Compressing objects: 94% (1321/1405)
remote: Compressing objects: 95% (1335/1405)
remote: Compressing objects: 96% (1349/1405)
remote: Compressing objects: 97% (1363/1405)
remote: Compressing objects: 98% (1377/1405)
remote: Compressing objects: 99% (1391/1405)
remote: Compressing objects: 100% (1405/1405)
remote: Compressing objects: 100% (1405/1405), done.
5.40 s
Receiving objects: 0% (1/65018)
Receiving objects: 1% (651/65018)
Receiving objects: 2% (1301/65018)
Receiving objects: 3% (1951/65018)
Receiving objects: 4% (2601/65018)
Receiving objects: 5% (3251/65018)
Receiving objects: 6% (3902/65018)
Receiving objects: 7% (4552/65018)
Receiving objects: 8% (5202/65018)
Receiving objects: 9% (5852/65018)
Receiving objects: 10% (6502/65018)
Receiving objects: 11% (7152/65018)
Receiving objects: 12% (7803/65018), 16.24 MiB | 32.47 MiB/s
Receiving objects: 13% (8453/65018), 16.24 MiB | 32.47 MiB/s
Receiving objects: 14% (9103/65018), 16.24 MiB | 32.47 MiB/s
Receiving objects: 15% (9753/65018), 16.24 MiB | 32.47 MiB/s
Receiving objects: 16% (10403/65018), 16.24 MiB | 32.47 MiB/s
Receiving objects: 17% (11054/65018), 16.24 MiB | 32.47 MiB/s
Receiving objects: 18% (11704/65018), 16.24 MiB | 32.47 MiB/s
Receiving objects: 19% (12354/65018), 16.24 MiB | 32.47 MiB/s
Receiving objects: 20% (13004/65018), 16.24 MiB | 32.47 MiB/s
Receiving objects: 21% (13654/65018), 16.24 MiB | 32.47 MiB/s
Receiving objects: 22% (14304/65018), 16.24 MiB | 32.47 MiB/s
Receiving objects: 23% (14955/65018), 16.24 MiB | 32.47 MiB/s
Receiving objects: 24% (15605/65018), 16.24 MiB | 32.47 MiB/s
Receiving objects: 25% (16255/65018), 16.24 MiB | 32.47 MiB/s
Receiving objects: 26% (16905/65018), 16.24 MiB | 32.47 MiB/s
Receiving objects: 27% (17555/65018), 16.24 MiB | 32.47 MiB/s
Receiving objects: 28% (18206/65018), 16.24 MiB | 32.47 MiB/s
Receiving objects: 29% (18856/65018), 16.24 MiB | 32.47 MiB/s
Receiving objects: 30% (19506/65018), 16.24 MiB | 32.47 MiB/s
Receiving objects: 31% (20156/65018), 16.24 MiB | 32.47 MiB/s
Receiving objects: 32% (20806/65018), 16.24 MiB | 32.47 MiB/s
Receiving objects: 33% (21456/65018), 16.24 MiB | 32.47 MiB/s
Receiving objects: 34% (22107/65018), 16.24 MiB | 32.47 MiB/s
Receiving objects: 35% (22757/65018), 16.24 MiB | 32.47 MiB/s
Receiving objects: 36% (23407/65018), 16.24 MiB | 32.47 MiB/s
Receiving objects: 37% (24057/65018), 16.24 MiB | 32.47 MiB/s
Receiving objects: 38% (24707/65018), 16.24 MiB | 32.47 MiB/s
Receiving objects: 39% (25358/65018), 16.24 MiB | 32.47 MiB/s
Receiving objects: 40% (26008/65018), 16.24 MiB | 32.47 MiB/s
Receiving objects: 41% (26658/65018), 16.24 MiB | 32.47 MiB/s
Receiving objects: 42% (27308/65018), 16.24 MiB | 32.47 MiB/s
Receiving objects: 43% (27958/65018), 16.24 MiB | 32.47 MiB/s
Receiving objects: 44% (28608/65018), 16.24 MiB | 32.47 MiB/s
Receiving objects: 45% (29259/65018), 16.24 MiB | 32.47 MiB/s
Receiving objects: 46% (29909/65018), 16.24 MiB | 32.47 MiB/s
Receiving objects: 47% (30559/65018), 16.24 MiB | 32.47 MiB/s
Receiving objects: 48% (31209/65018), 16.24 MiB | 32.47 MiB/s
Receiving objects: 49% (31859/65018), 16.24 MiB | 32.47 MiB/s
Receiving objects: 50% (32509/65018), 16.24 MiB | 32.47 MiB/s
Receiving objects: 51% (33160/65018), 16.24 MiB | 32.47 MiB/s
Receiving objects: 52% (33810/65018), 16.24 MiB | 32.47 MiB/s
Receiving objects: 52% (33908/65018), 16.24 MiB | 32.47 MiB/s
Receiving objects: 53% (34460/65018), 32.57 MiB | 32.53 MiB/s
Receiving objects: 54% (35110/65018), 32.57 MiB | 32.53 MiB/s
Receiving objects: 55% (35760/65018), 32.57 MiB | 32.53 MiB/s
Receiving objects: 56% (36411/65018), 32.57 MiB | 32.53 MiB/s
Receiving objects: 57% (37061/65018), 32.57 MiB | 32.53 MiB/s
Receiving objects: 58% (37711/65018), 32.57 MiB | 32.53 MiB/s
Receiving objects: 59% (38361/65018), 32.57 MiB | 32.53 MiB/s
Receiving objects: 60% (39011/65018), 32.57 MiB | 32.53 MiB/s
Receiving objects: 61% (39661/65018), 32.57 MiB | 32.53 MiB/s
Receiving objects: 62% (40312/65018), 32.57 MiB | 32.53 MiB/s
Receiving objects: 63% (40962/65018), 32.57 MiB | 32.53 MiB/s
Receiving objects: 64% (41612/65018), 49.82 MiB | 33.19 MiB/s
Receiving objects: 65% (42262/65018), 49.82 MiB | 33.19 MiB/s
Receiving objects: 66% (42912/65018), 49.82 MiB | 33.19 MiB/s
Receiving objects: 67% (43563/65018), 49.82 MiB | 33.19 MiB/s
Receiving objects: 68% (44213/65018), 49.82 MiB | 33.19 MiB/s
Receiving objects: 69% (44863/65018), 49.82 MiB | 33.19 MiB/s
Receiving objects: 70% (45513/65018), 49.82 MiB | 33.19 MiB/s
Receiving objects: 71% (46163/65018), 49.82 MiB | 33.19 MiB/s
Receiving objects: 72% (46813/65018), 49.82 MiB | 33.19 MiB/s
Receiving objects: 73% (47464/65018), 49.82 MiB | 33.19 MiB/s
Receiving objects: 74% (48114/65018), 49.82 MiB | 33.19 MiB/s
Receiving objects: 75% (48764/65018), 49.82 MiB | 33.19 MiB/s
Receiving objects: 75% (48902/65018), 66.10 MiB | 32.80 MiB/s
Receiving objects: 76% (49414/65018), 66.10 MiB | 32.80 MiB/s
Receiving objects: 77% (50064/65018), 66.10 MiB | 32.80 MiB/s
Receiving objects: 78% (50715/65018), 66.10 MiB | 32.80 MiB/s
Receiving objects: 79% (51365/65018), 66.10 MiB | 32.80 MiB/s
Receiving objects: 80% (52015/65018), 66.10 MiB | 32.80 MiB/s
Receiving objects: 81% (52665/65018), 66.10 MiB | 32.80 MiB/s
Receiving objects: 82% (53315/65018), 66.10 MiB | 32.80 MiB/s
Receiving objects: 83% (53965/65018), 66.10 MiB | 32.80 MiB/s
Receiving objects: 84% (54616/65018), 66.10 MiB | 32.80 MiB/s
Receiving objects: 85% (55266/65018), 66.10 MiB | 32.80 MiB/s
Receiving objects: 86% (55916/65018), 66.10 MiB | 32.80 MiB/s
Receiving objects: 87% (56566/65018), 66.10 MiB | 32.80 MiB/s
Receiving objects: 88% (57216/65018), 66.10 MiB | 32.80 MiB/s
Receiving objects: 89% (57867/65018), 66.10 MiB | 32.80 MiB/s
Receiving objects: 90% (58517/65018), 66.10 MiB | 32.80 MiB/s
Receiving objects: 91% (59167/65018), 66.10 MiB | 32.80 MiB/s
Receiving objects: 92% (59817/65018), 66.10 MiB | 32.80 MiB/s
Receiving objects: 93% (60467/65018), 66.10 MiB | 32.80 MiB/s
Receiving objects: 94% (61117/65018), 83.30 MiB | 33.12 MiB/s
Receiving objects: 95% (61768/65018), 83.30 MiB | 33.12 MiB/s
Receiving objects: 96% (62418/65018), 83.30 MiB | 33.12 MiB/s
Receiving objects: 97% (63068/65018), 83.30 MiB | 33.12 MiB/s
Receiving objects: 98% (63718/65018), 83.30 MiB | 33.12 MiB/s
Receiving objects: 99% (64368/65018), 83.30 MiB | 33.12 MiB/s
remote: Total 65018 (delta 6803), reused 6286 (delta 6285), pack-reused 57328 (from 1)
5.40 s
Receiving objects: 100% (65018/65018), 83.30 MiB | 33.12 MiB/s
Receiving objects: 100% (65018/65018), 86.93 MiB | 33.14 MiB/s, done.
6.12 s
Resolving deltas: 0% (0/45900)
Resolving deltas: 1% (459/45900)
Resolving deltas: 2% (918/45900)
Resolving deltas: 3% (1377/45900)
Resolving deltas: 4% (1837/45900)
Resolving deltas: 5% (2296/45900)
Resolving deltas: 6% (2756/45900)
Resolving deltas: 7% (3213/45900)
Resolving deltas: 8% (3672/45900)
Resolving deltas: 9% (4131/45900)
Resolving deltas: 10% (4590/45900)
Resolving deltas: 11% (5049/45900)
Resolving deltas: 12% (5508/45900)
Resolving deltas: 13% (5967/45900)
Resolving deltas: 14% (6426/45900)
Resolving deltas: 15% (6885/45900)
Resolving deltas: 16% (7346/45900)
Resolving deltas: 17% (7803/45900)
Resolving deltas: 18% (8263/45900)
Resolving deltas: 19% (8721/45900)
Resolving deltas: 20% (9184/45900)
Resolving deltas: 21% (9639/45900)
Resolving deltas: 22% (10101/45900)
Resolving deltas: 23% (10557/45900)
Resolving deltas: 24% (11016/45900)
Resolving deltas: 25% (11477/45900)
Resolving deltas: 26% (11934/45900)
Resolving deltas: 27% (12393/45900)
Resolving deltas: 28% (12852/45900)
Resolving deltas: 29% (13313/45900)
Resolving deltas: 30% (13770/45900)
Resolving deltas: 31% (14229/45900)
Resolving deltas: 32% (14688/45900)
Resolving deltas: 33% (15150/45900)
Resolving deltas: 34% (15607/45900)
Resolving deltas: 35% (16065/45900)
Resolving deltas: 36% (16524/45900)
Resolving deltas: 37% (16984/45900)
Resolving deltas: 38% (17442/45900)
Resolving deltas: 39% (17901/45900)
Resolving deltas: 40% (18360/45900)
Resolving deltas: 41% (18819/45900)
Resolving deltas: 42% (19278/45900)
Resolving deltas: 43% (19737/45900)
Resolving deltas: 44% (20196/45900)
Resolving deltas: 45% (20655/45900)
Resolving deltas: 46% (21114/45900)
Resolving deltas: 47% (21573/45900)
Resolving deltas: 48% (22032/45900)
Resolving deltas: 49% (22491/45900)
Resolving deltas: 50% (22950/45900)
Resolving deltas: 51% (23409/45900)
Resolving deltas: 52% (23868/45900)
Resolving deltas: 53% (24327/45900)
Resolving deltas: 54% (24786/45900)
Resolving deltas: 55% (25246/45900)
Resolving deltas: 56% (25704/45900)
Resolving deltas: 57% (26163/45900)
Resolving deltas: 58% (26622/45900)
Resolving deltas: 59% (27084/45900)
Resolving deltas: 60% (27540/45900)
Resolving deltas: 61% (27999/45900)
Resolving deltas: 62% (28458/45900)
Resolving deltas: 63% (28917/45900)
Resolving deltas: 64% (29376/45900)
Resolving deltas: 65% (29835/45900)
Resolving deltas: 66% (30294/45900)
Resolving deltas: 67% (30754/45900)
Resolving deltas: 68% (31212/45900)
Resolving deltas: 69% (31671/45900)
Resolving deltas: 70% (32130/45900)
Resolving deltas: 71% (32589/45900)
Resolving deltas: 72% (33048/45900)
Resolving deltas: 73% (33507/45900)
Resolving deltas: 74% (33966/45900)
Resolving deltas: 75% (34427/45900)
Resolving deltas: 76% (34884/45900)
Resolving deltas: 77% (35343/45900)
Resolving deltas: 78% (35802/45900)
Resolving deltas: 79% (36261/45900)
Resolving deltas: 80% (36720/45900)
Resolving deltas: 81% (37179/45900)
Resolving deltas: 82% (37638/45900)
Resolving deltas: 83% (38099/45900)
Resolving deltas: 84% (38556/45900)
Resolving deltas: 85% (39015/45900)
Resolving deltas: 86% (39474/45900)
Resolving deltas: 87% (39933/45900)
Resolving deltas: 88% (40392/45900)
Resolving deltas: 89% (40851/45900)
Resolving deltas: 90% (41310/45900)
Resolving deltas: 91% (41769/45900)
Resolving deltas: 92% (42228/45900)
Resolving deltas: 93% (42687/45900)
Resolving deltas: 94% (43146/45900)
Resolving deltas: 95% (43605/45900)
Resolving deltas: 96% (44064/45900)
Resolving deltas: 97% (44523/45900)
Resolving deltas: 98% (44982/45900)
Resolving deltas: 99% (45441/45900)
Resolving deltas: 100% (45900/45900)
Resolving deltas: 100% (45900/45900), done.
6.47 s
Fetching commit 5c37e36355998a98df0d7791c7daeeae576fd7ee for vakint_rustred ...
6.47 s
$ /nix/store/bcnisk3ydfgv26v2gw3zlky24g00yww2-git-2.54.0/bin/git fetch origin 5c37e36355998a98df0d7791c7daeeae576fd7ee
6.89 s
From https://github.com/alphal00p/gammaloop
6.89 s
* branch 5c37e36355998a98df0d7791c7daeeae576fd7ee -> FETCH_HEAD
6.91 s
$ /nix/store/9ypz3flqsrl5xl495mm8h645gadjsxi1-coreutils-9.11/bin/timeout --kill-after=15s 7200s /nix/store/bcnisk3ydfgv26v2gw3zlky24g00yww2-git-2.54.0/bin/git -c advice.detachedHead=false checkout 5c37e36355998a98df0d7791c7daeeae576fd7ee
7.07 s
HEAD is now at 5c37e363 Advance RustRed dependency to refactored core
7.08 s
$ /nix/store/9ypz3flqsrl5xl495mm8h645gadjsxi1-coreutils-9.11/bin/timeout --kill-after=15s 7200s /nix/store/23zk8sgzamrbmj1fday15szf7f2279s8-nix-2.34.7/bin/nix --extra-experimental-features nix-command --extra-experimental-features flakes --log-format internal-json run .#packages.x86_64-linux.nix-ci-check-gammaloop-nextest-core --print-build-logs
13.20 s
13.26 s
Downloading cached gammaloop-nextest-binaries-core-gammaloop-api from https://cache.nix-ci.com
13.27 s
Downloading cached gammaloop-nextest-binaries-core-gammaloop-tracing-filter-macros from https://cache.nix-ci.com
13.27 s
Downloading cached gammaloop-nextest-binaries-core-gammaloop-tracing-filter from https://cache.nix-ci.com
13.27 s
Downloading cached gammaloop-nextest-binaries-core-gammalooprs from https://cache.nix-ci.com
13.32 s
Downloaded cached gammaloop-nextest-binaries-core-gammaloop-tracing-filter-macros (1.7 MiB) in 54ms
13.32 s
Progress: 0 of 1 built, 1 of 6 downloaded from cache (3 downloading)
13.45 s
Downloaded cached gammaloop-nextest-binaries-core-gammaloop-tracing-filter (6.6 MiB) in 183ms
13.45 s
Progress: 0 of 1 built, 2 of 6 downloaded from cache (2 downloading)
14.42 s
Downloaded cached gammaloop-nextest-binaries-core-gammaloop-api (66.7 MiB) in 1.1s
14.42 s
Progress: 0 of 1 built, 3 of 6 downloaded from cache (1 downloading)
14.49 s
Downloaded cached gammaloop-nextest-binaries-core-gammalooprs (76.7 MiB) in 1.2s
14.49 s
Progress: 0 of 1 built, 4 of 6 downloaded from cache
14.49 s
Downloading cached gammaloop-nextest-binaries-core from https://cache.nix-ci.com
14.50 s
Downloaded cached gammaloop-nextest-binaries-core (1640 B) in 4ms
14.50 s
Progress: 0 of 1 built, 5 of 6 downloaded from cache
14.50 s
Downloading cached nix-ci-check-gammaloop-nextest-core from https://cache.nix-ci.com
14.50 s
Downloaded cached nix-ci-check-gammaloop-nextest-core (1016 B) in 3ms
14.50 s
Progress: 0 of 1 built, 6 of 6 downloaded from cache
21.79 s
evaluating derivation 'g
copying '/nix/store/p93a
evaluating derivation 'g
copying '/nix/store/p93a
evaluating derivation 'g
copying '/nix/store/p93a
evaluating derivation 'g
copying '/nix/store/p93a
evaluating derivation 'g
copying '/nix/store/p93a
evaluating derivation 'g
copying '/nix/store/p93a
evaluating derivation 'g
copying '/nix/store/p93a
evaluating derivation 'g
copying '/nix/store/p93a
evaluating derivation 'g
copying '/nix/store/p93a
evaluating derivation 'g
querying gammaloop-nexte
[0 /14 built, 0.0 KiB DL]
[0 /1 built, 0.0 KiB DL]
[1 /0 /1 built, 0.0 KiB DLgammaloop-nextest-core> Extracting 3 binaries (including 1 non-test binary), 1 build script output directory, and 2 linked paths to /build/nextest-archive-nyldlM
22.39 s
gammaloop-nextest-core> Extracted 18 files to /build/nextest-archive-nyldlM in 0.60s
22.40 s
gammaloop-nextest-core> ------------
22.40 s
gammaloop-nextest-core> Nextest run ID bfda6f3f-8720-484f-ae35-14479e94918f with nextest profile: ci_gammaloop
22.40 s
gammaloop-nextest-core> Starting 339 tests across 2 binaries
23.02 s
gammaloop-nextest-core> ------------
23.02 s
gammaloop-nextest-core> Summary [ 0.615s] 339 tests run: 339 passed , 0 skipped
23.13 s
gammaloop-nextest-core>
23.13 s
gammaloop-nextest-core> ========== nextest test summary ==========
23.13 s
gammaloop-nextest-core> report: target/nextest/ci_gammaloop/junit.xml
23.13 s
gammaloop-nextest-core> tests: 339, failures: 0, errors: 0
23.13 s
gammaloop-nextest-core> No failing testcases found.
23.13 s
gammaloop-nextest-core> =========================================
23.15 s
gammaloop-nextest-core> Extracting 1 binary and 1 linked path to /build/nextest-archive-2iXYJp
23.24 s
gammaloop-nextest-core> Extracted 7 files to /build/nextest-archive-2iXYJp in 0.09s
23.26 s
gammaloop-nextest-core> ------------
23.26 s
gammaloop-nextest-core> Nextest run ID 20109795-2eec-456a-b7d7-04cf0c5e45db with nextest profile: ci_gammaloop
23.26 s
gammaloop-nextest-core> Starting 19 tests across 1 binary
23.28 s
gammaloop-nextest-core> ------------
23.28 s
gammaloop-nextest-core> Summary [ 0.019s] 19 tests run: 19 passed , 0 skipped
23.33 s
gammaloop-nextest-core>
23.33 s
gammaloop-nextest-core> ========== nextest test summary ==========
23.33 s
gammaloop-nextest-core> report: target/nextest/ci_gammaloop/junit.xml
23.33 s
gammaloop-nextest-core> tests: 19, failures: 0, errors: 0
23.33 s
gammaloop-nextest-core> No failing testcases found.
23.33 s
gammaloop-nextest-core> =========================================
23.35 s
gammaloop-nextest-core> Extracting 1 binary to /build/nextest-archive-k32YYn
23.39 s
gammaloop-nextest-core> Extracted 4 files to /build/nextest-archive-k32YYn in 0.05s
23.41 s
gammaloop-nextest-core> ------------
23.41 s
gammaloop-nextest-core> Nextest run ID a7fca9db-d5af-4947-acd5-82acb4a73716 with nextest profile: ci_gammaloop
23.41 s
gammaloop-nextest-core> Starting 0 tests across 1 binary
23.41 s
gammaloop-nextest-core> ------------
23.41 s
gammaloop-nextest-core> Summary [ 0.000s] 0 tests run: 0 passed , 0 skipped
23.45 s
gammaloop-nextest-core>
23.45 s
gammaloop-nextest-core> ========== nextest test summary ==========
23.45 s
gammaloop-nextest-core> report: target/nextest/ci_gammaloop/junit.xml
23.45 s
gammaloop-nextest-core> tests: 0, failures: 0, errors: 0
23.45 s
gammaloop-nextest-core> No failing testcases found.
23.45 s
gammaloop-nextest-core> =========================================
23.47 s
gammaloop-nextest-core> Extracting 4 binaries, 1 build script output directory, and 2 linked paths to /build/nextest-archive-ucW3zz
24.14 s
gammaloop-nextest-core> Extracted 18 files to /build/nextest-archive-ucW3zz in 0.67s
24.15 s
gammaloop-nextest-core> ------------
24.15 s
gammaloop-nextest-core> Nextest run ID 7fb19012-f195-46d7-86c0-7c6cd448fdac with nextest profile: ci_gammaloop
24.15 s
gammaloop-nextest-core> Starting 456 tests across 4 binaries (61 tests skipped , including 60 tests via profile.ci_gammaloop.default-filter )
25.72 s
gammaloop-nextest-core> FAIL [ 0.419s] (445/456) gammalooprs::test_renormalization finit_part_ghlo
25.73 s
gammaloop-nextest-core> stdout ---
25.73 s
gammaloop-nextest-core>
25.73 s
gammaloop-nextest-core> running 1 test
25.73 s
gammaloop-nextest-core> ren part: 1/2*GC_10^2*dot(P(0,mink (dim)),P(0,mink (dim)))*cas(2,coad (8))/ε
25.73 s
gammaloop-nextest-core> ━━━━━━━━━━━━━━━━━━━━━━━━━━━━━━━ Snapshot Summary ━━━━━━━━━━━━━━━━━━━━━━━━━━━━━━━
25.73 s
gammaloop-nextest-core> Snapshot: finit_part_ghlo
25.73 s
gammaloop-nextest-core> Source: crates/gammalooprs/tests/test_renormalization.rs:557
25.73 s
gammaloop-nextest-core> ────────────────────────────────────────────────────────────────────────────────
25.73 s
gammaloop-nextest-core> Expression: align_to_rqft(&a, &model).to_bare_ordered_string()
25.73 s
gammaloop-nextest-core> ────────────────────────────────────────────────────────────────────────────────
25.73 s
gammaloop-nextest-core> -old snapshot
25.73 s
gammaloop-nextest-core> +new results
25.73 s
gammaloop-nextest-core> ────────────┬───────────────────────────────────────────────────────────────────
25.73 s
gammaloop-nextest-core> 1 │--1/2*cas(2,coad(8))*dot(P(0,mink(4)),P(0,mink(4)))*gs^2*ε^(-1)
25.73 s
gammaloop-nextest-core> 1 │+1/2*cas(2,coad(8))*dot(P(0,mink(4)),P(0,mink(4)))*gs^2*ε^(-1)
25.73 s
gammaloop-nextest-core> ────────────┴───────────────────────────────────────────────────────────────────
25.73 s
gammaloop-nextest-core> To update snapshots run `cargo insta review`
25.73 s
gammaloop-nextest-core> Stopped on the first failure. Run `cargo insta test` to run all snapshots.
25.73 s
gammaloop-nextest-core> test finit_part_ghlo ... FAILED
25.73 s
gammaloop-nextest-core>
25.73 s
gammaloop-nextest-core> failures:
25.73 s
gammaloop-nextest-core>
25.73 s
gammaloop-nextest-core> failures:
25.73 s
gammaloop-nextest-core> finit_part_ghlo
25.73 s
gammaloop-nextest-core>
25.73 s
gammaloop-nextest-core> test result: FAILED. 0 passed; 1 failed; 0 ignored; 0 measured; 5 filtered out; finished in 0.40s
25.73 s
gammaloop-nextest-core>
25.73 s
gammaloop-nextest-core> stderr ---
25.73 s
gammaloop-nextest-core> The application panicked (crashed).
25.73 s
gammaloop-nextest-core> Message: snapshot assertion for 'finit_part_ghlo' failed in line 557
25.73 s
gammaloop-nextest-core> Location: /nix/store/9a12dww58xis3an3kmn597llpijv83b1-vendor-cargo-deps/c19b7c6f923b580ac259164a89f2577984ad5ab09ee9d583b888f934adbbe8d0/insta-1.47.2/src/runtime.rs :719
25.73 s
gammaloop-nextest-core>
25.73 s
gammaloop-nextest-core> ━━━━━━━━━━━━━━━━━━━━━━━━━━━━━━━━━━ BACKTRACE ━━━━━━━━━━━━━━━━━━━━━━━━━━━━━━━━━━━
25.73 s
gammaloop-nextest-core> 1: <color_eyre[51793ea62743adbd]::config::PanicHook>::panic_report <unknown>
25.73 s
gammaloop-nextest-core> at <unknown source file> :<unknown line>
25.73 s
gammaloop-nextest-core> 2: <color_eyre[51793ea62743adbd]::config::PanicHook>::into_panic_hook::{closure#0} <unknown>
25.73 s
gammaloop-nextest-core> at <unknown source file> :<unknown line>
25.73 s
gammaloop-nextest-core> 3: std[bcb96dfbba0ab899]::panicking::panic_with_hook <unknown>
25.73 s
gammaloop-nextest-core> at <unknown source file> :<unknown line>
25.73 s
gammaloop-nextest-core> 4: std[bcb96dfbba0ab899]::panicking::panic_handler::{closure#0} <unknown>
25.73 s
gammaloop-nextest-core> at <unknown source file> :<unknown line>
25.73 s
gammaloop-nextest-core> 5: std[bcb96dfbba0ab899]::sys::backtrace::__rust_end_short_backtrace::<std[bcb96dfbba0ab899]::panicking::panic_handler::{closure#0}, !> <unknown>
25.73 s
gammaloop-nextest-core> at <unknown source file> :<unknown line>
25.73 s
gammaloop-nextest-core> 6: __rustc[6c289b9f9c454d21]::rust_begin_unwind <unknown>
25.73 s
gammaloop-nextest-core> at <unknown source file> :<unknown line>
25.73 s
gammaloop-nextest-core> 7: core[940e698046960fd5]::panicking::panic_fmt <unknown>
25.73 s
gammaloop-nextest-core> at <unknown source file> :<unknown line>
25.73 s
gammaloop-nextest-core> 8: insta[307a548ac79ef4d9]::runtime::assert_snapshot <unknown>
25.73 s
gammaloop-nextest-core> at <unknown source file> :<unknown line>
25.73 s
gammaloop-nextest-core> 9: <test_renormalization[e6829672f1ddb150]::finit_part_ghlo::{closure#0} as core[940e698046960fd5]::ops::function::FnOnce<()>>::call_once <unknown>
25.73 s
gammaloop-nextest-core> at <unknown source file> :<unknown line>
25.73 s
gammaloop-nextest-core> 10: test[75d6903177b1d7e9]::__rust_begin_short_backtrace::<core[940e698046960fd5]::result::Result<(), alloc[2ea6bcb46fca0c42]::string::String>, fn() -> core[940e698046960fd5]::result::Result<(), alloc[2ea6bcb46fca0c42]::string::String>> <unknown>
25.73 s
gammaloop-nextest-core> at <unknown source file> :<unknown line>
25.73 s
gammaloop-nextest-core> 11: test[75d6903177b1d7e9]::run_test::{closure#0} <unknown>
25.73 s
gammaloop-nextest-core> at <unknown source file> :<unknown line>
25.73 s
gammaloop-nextest-core> 12: std[bcb96dfbba0ab899]::sys::backtrace::__rust_begin_short_backtrace::<test[75d6903177b1d7e9]::run_test::{closure#1}, ()> <unknown>
25.73 s
gammaloop-nextest-core> at <unknown source file> :<unknown line>
25.73 s
gammaloop-nextest-core> 13: <std[bcb96dfbba0ab899]::thread::lifecycle::spawn_unchecked<test[75d6903177b1d7e9]::run_test::{closure#1}, ()>::{closure#1} as core[940e698046960fd5]::ops::function::FnOnce<()>>::call_once::{shim:vtable#0} <unknown>
25.73 s
gammaloop-nextest-core> at <unknown source file> :<unknown line>
25.73 s
gammaloop-nextest-core> 14: <std[bcb96dfbba0ab899]::sys::thread::unix::Thread>::new::thread_start <unknown>
25.73 s
gammaloop-nextest-core> at <unknown source file> :<unknown line>
25.73 s
gammaloop-nextest-core> 15: start_thread <unknown>
25.73 s
gammaloop-nextest-core> at <unknown source file> :<unknown line>
25.73 s
gammaloop-nextest-core> 16: __clone3 <unknown>
25.73 s
gammaloop-nextest-core> at <unknown source file> :<unknown line>
25.73 s
gammaloop-nextest-core>
25.73 s
gammaloop-nextest-core> Run with COLORBT_SHOW_HIDDEN=1 environment variable to disable frame filtering.
25.73 s
gammaloop-nextest-core> Run with RUST_BACKTRACE=full to include source snippets.
25.73 s
gammaloop-nextest-core>
28.52 s
gammaloop-nextest-core> FAIL [ 3.212s] (452/456) gammalooprs::test_renormalization finite_part_ghost_2loop
28.55 s
gammaloop-nextest-core> stdout ---
28.55 s
gammaloop-nextest-core>
28.55 s
gammaloop-nextest-core> running 1 test
28.55 s
gammaloop-nextest-core> ━━━━━━━━━━━━━━━━━━━━━━━━━━━━━━━ Snapshot Summary ━━━━━━━━━━━━━━━━━━━━━━━━━━━━━━━
28.55 s
gammaloop-nextest-core> Snapshot: finite_part_ghost_2loop-3
28.55 s
gammaloop-nextest-core> Source: crates/gammalooprs/tests/test_renormalization.rs:464
28.55 s
gammaloop-nextest-core> ────────────────────────────────────────────────────────────────────────────────
28.55 s
gammaloop-nextest-core> Expression: align_to_rqft(&a, &model).to_bare_ordered_string()
28.55 s
gammaloop-nextest-core> ────────────────────────────────────────────────────────────────────────────────
28.55 s
gammaloop-nextest-core> -old snapshot
28.55 s
gammaloop-nextest-core> +new results
28.55 s
gammaloop-nextest-core> ────────────┬───────────────────────────────────────────────────────────────────
28.55 s
gammaloop-nextest-core> 1 │-(-1𝑖/32*ε+1𝑖/16)*(cas(2,coad(8)))^2*dot(P(0,mink(4)),P(0,mink(4)))*gs^4*ε^(-2)
28.55 s
gammaloop-nextest-core> 1 │+(-1𝑖/16+1𝑖/32*ε)*(cas(2,coad(8)))^2*dot(P(0,mink(4)),P(0,mink(4)))*gs^4*ε^(-2)
28.55 s
gammaloop-nextest-core> ────────────┴───────────────────────────────────────────────────────────────────
28.55 s
gammaloop-nextest-core> To update snapshots run `cargo insta review`
28.55 s
gammaloop-nextest-core> Stopped on the first failure. Run `cargo insta test` to run all snapshots.
28.55 s
gammaloop-nextest-core> test finite_part_ghost_2loop ... FAILED
28.55 s
gammaloop-nextest-core>
28.55 s
gammaloop-nextest-core> failures:
28.55 s
gammaloop-nextest-core>
28.55 s
gammaloop-nextest-core> failures:
28.55 s
gammaloop-nextest-core> finite_part_ghost_2loop
28.55 s
gammaloop-nextest-core>
28.55 s
gammaloop-nextest-core> test result: FAILED. 0 passed; 1 failed; 0 ignored; 0 measured; 5 filtered out; finished in 3.20s
28.55 s
gammaloop-nextest-core>
28.55 s
gammaloop-nextest-core> stderr ---
28.55 s
gammaloop-nextest-core> The application panicked (crashed).
28.55 s
gammaloop-nextest-core> Message: snapshot assertion for 'finite_part_ghost_2loop-3' failed in line 464
28.55 s
gammaloop-nextest-core> Location: /nix/store/9a12dww58xis3an3kmn597llpijv83b1-vendor-cargo-deps/c19b7c6f923b580ac259164a89f2577984ad5ab09ee9d583b888f934adbbe8d0/insta-1.47.2/src/runtime.rs :719
28.55 s
gammaloop-nextest-core>
28.55 s
gammaloop-nextest-core> ━━━━━━━━━━━━━━━━━━━━━━━━━━━━━━━━━━ BACKTRACE ━━━━━━━━━━━━━━━━━━━━━━━━━━━━━━━━━━━
28.55 s
gammaloop-nextest-core> 1: <color_eyre[51793ea62743adbd]::config::PanicHook>::panic_report <unknown>
28.55 s
gammaloop-nextest-core> at <unknown source file> :<unknown line>
28.55 s
gammaloop-nextest-core> 2: <color_eyre[51793ea62743adbd]::config::PanicHook>::into_panic_hook::{closure#0} <unknown>
28.55 s
gammaloop-nextest-core> at <unknown source file> :<unknown line>
28.55 s
gammaloop-nextest-core> 3: std[bcb96dfbba0ab899]::panicking::panic_with_hook <unknown>
28.55 s
gammaloop-nextest-core> at <unknown source file> :<unknown line>
28.55 s
gammaloop-nextest-core> 4: std[bcb96dfbba0ab899]::panicking::panic_handler::{closure#0} <unknown>
28.55 s
gammaloop-nextest-core> at <unknown source file> :<unknown line>
28.55 s
gammaloop-nextest-core> 5: std[bcb96dfbba0ab899]::sys::backtrace::__rust_end_short_backtrace::<std[bcb96dfbba0ab899]::panicking::panic_handler::{closure#0}, !> <unknown>
28.55 s
gammaloop-nextest-core> at <unknown source file> :<unknown line>
28.55 s
gammaloop-nextest-core> 6: __rustc[6c289b9f9c454d21]::rust_begin_unwind <unknown>
28.55 s
gammaloop-nextest-core> at <unknown source file> :<unknown line>
28.55 s
gammaloop-nextest-core> 7: core[940e698046960fd5]::panicking::panic_fmt <unknown>
28.55 s
gammaloop-nextest-core> at <unknown source file> :<unknown line>
28.55 s
gammaloop-nextest-core> 8: insta[307a548ac79ef4d9]::runtime::assert_snapshot <unknown>
28.55 s
gammaloop-nextest-core> at <unknown source file> :<unknown line>
28.55 s
gammaloop-nextest-core> 9: test_renormalization[e6829672f1ddb150]::finite_part_ghost_2loop <unknown>
28.55 s
gammaloop-nextest-core> at <unknown source file> :<unknown line>
28.55 s
gammaloop-nextest-core> 10: <test_renormalization[e6829672f1ddb150]::finite_part_ghost_2loop::{closure#0} as core[940e698046960fd5]::ops::function::FnOnce<()>>::call_once <unknown>
28.55 s
gammaloop-nextest-core> at <unknown source file> :<unknown line>
28.55 s
gammaloop-nextest-core> 11: test[75d6903177b1d7e9]::__rust_begin_short_backtrace::<core[940e698046960fd5]::result::Result<(), alloc[2ea6bcb46fca0c42]::string::String>, fn() -> core[940e698046960fd5]::result::Result<(), alloc[2ea6bcb46fca0c42]::string::String>> <unknown>
28.55 s
gammaloop-nextest-core> at <unknown source file> :<unknown line>
28.55 s
gammaloop-nextest-core> 12: test[75d6903177b1d7e9]::run_test::{closure#0} <unknown>
28.55 s
gammaloop-nextest-core> at <unknown source file> :<unknown line>
28.55 s
gammaloop-nextest-core> 13: std[bcb96dfbba0ab899]::sys::backtrace::__rust_begin_short_backtrace::<test[75d6903177b1d7e9]::run_test::{closure#1}, ()> <unknown>
28.55 s
gammaloop-nextest-core> at <unknown source file> :<unknown line>
28.55 s
gammaloop-nextest-core> 14: <std[bcb96dfbba0ab899]::thread::lifecycle::spawn_unchecked<test[75d6903177b1d7e9]::run_test::{closure#1}, ()>::{closure#1} as core[940e698046960fd5]::ops::function::FnOnce<()>>::call_once::{shim:vtable#0} <unknown>
28.55 s
gammaloop-nextest-core> at <unknown source file> :<unknown line>
28.55 s
gammaloop-nextest-core> 15: <std[bcb96dfbba0ab899]::sys::thread::unix::Thread>::new::thread_start <unknown>
28.55 s
gammaloop-nextest-core> at <unknown source file> :<unknown line>
28.55 s
gammaloop-nextest-core> 16: start_thread <unknown>
28.55 s
gammaloop-nextest-core> at <unknown source file> :<unknown line>
28.55 s
gammaloop-nextest-core> 17: __clone3 <unknown>
28.55 s
gammaloop-nextest-core> at <unknown source file> :<unknown line>
28.55 s
gammaloop-nextest-core>
28.55 s
gammaloop-nextest-core> Run with COLORBT_SHOW_HIDDEN=1 environment variable to disable frame filtering.
28.55 s
gammaloop-nextest-core> Run with RUST_BACKTRACE=full to include source snippets.
28.55 s
gammaloop-nextest-core>
36.27 s
gammaloop-nextest-core> ------------
36.28 s
gammaloop-nextest-core> Summary [ 12.115s] 456 tests run: 454 passed , 2 failed , 61 skipped
36.28 s
gammaloop-nextest-core> FAIL [ 0.419s] (445/456) gammalooprs::test_renormalization finit_part_ghlo
36.28 s
gammaloop-nextest-core> stdout ---
36.28 s
gammaloop-nextest-core>
36.28 s
gammaloop-nextest-core> running 1 test
36.28 s
gammaloop-nextest-core> ren part: 1/2*GC_10^2*dot(P(0,mink (dim)),P(0,mink (dim)))*cas(2,coad (8))/ε
36.28 s
gammaloop-nextest-core> ━━━━━━━━━━━━━━━━━━━━━━━━━━━━━━━ Snapshot Summary ━━━━━━━━━━━━━━━━━━━━━━━━━━━━━━━
36.28 s
gammaloop-nextest-core> Snapshot: finit_part_ghlo
36.28 s
gammaloop-nextest-core> Source: crates/gammalooprs/tests/test_renormalization.rs:557
36.28 s
gammaloop-nextest-core> ────────────────────────────────────────────────────────────────────────────────
36.28 s
gammaloop-nextest-core> Expression: align_to_rqft(&a, &model).to_bare_ordered_string()
36.28 s
gammaloop-nextest-core> ────────────────────────────────────────────────────────────────────────────────
36.28 s
gammaloop-nextest-core> -old snapshot
36.28 s
gammaloop-nextest-core> +new results
36.28 s
gammaloop-nextest-core> ────────────┬───────────────────────────────────────────────────────────────────
36.28 s
gammaloop-nextest-core> 1 │--1/2*cas(2,coad(8))*dot(P(0,mink(4)),P(0,mink(4)))*gs^2*ε^(-1)
36.28 s
gammaloop-nextest-core> 1 │+1/2*cas(2,coad(8))*dot(P(0,mink(4)),P(0,mink(4)))*gs^2*ε^(-1)
36.28 s
gammaloop-nextest-core> ────────────┴───────────────────────────────────────────────────────────────────
36.28 s
gammaloop-nextest-core> To update snapshots run `cargo insta review`
36.28 s
gammaloop-nextest-core> Stopped on the first failure. Run `cargo insta test` to run all snapshots.
36.28 s
gammaloop-nextest-core> test finit_part_ghlo ... FAILED
36.28 s
gammaloop-nextest-core>
36.28 s
gammaloop-nextest-core> failures:
36.28 s
gammaloop-nextest-core>
36.28 s
gammaloop-nextest-core> failures:
36.28 s
gammaloop-nextest-core> finit_part_ghlo
36.28 s
gammaloop-nextest-core>
36.28 s
gammaloop-nextest-core> test result: FAILED. 0 passed; 1 failed; 0 ignored; 0 measured; 5 filtered out; finished in 0.40s
36.28 s
gammaloop-nextest-core>
36.28 s
gammaloop-nextest-core> stderr ---
36.28 s
gammaloop-nextest-core> The application panicked (crashed).
36.28 s
gammaloop-nextest-core> Message: snapshot assertion for 'finit_part_ghlo' failed in line 557
36.28 s
gammaloop-nextest-core> Location: /nix/store/9a12dww58xis3an3kmn597llpijv83b1-vendor-cargo-deps/c19b7c6f923b580ac259164a89f2577984ad5ab09ee9d583b888f934adbbe8d0/insta-1.47.2/src/runtime.rs :719
36.28 s
gammaloop-nextest-core>
36.28 s
gammaloop-nextest-core> ━━━━━━━━━━━━━━━━━━━━━━━━━━━━━━━━━━ BACKTRACE ━━━━━━━━━━━━━━━━━━━━━━━━━━━━━━━━━━━
36.28 s
gammaloop-nextest-core> 1: <color_eyre[51793ea62743adbd]::config::PanicHook>::panic_report <unknown>
36.28 s
gammaloop-nextest-core> at <unknown source file> :<unknown line>
36.28 s
gammaloop-nextest-core> 2: <color_eyre[51793ea62743adbd]::config::PanicHook>::into_panic_hook::{closure#0} <unknown>
36.28 s
gammaloop-nextest-core> at <unknown source file> :<unknown line>
36.28 s
gammaloop-nextest-core> 3: std[bcb96dfbba0ab899]::panicking::panic_with_hook <unknown>
36.28 s
gammaloop-nextest-core> at <unknown source file> :<unknown line>
36.28 s
gammaloop-nextest-core> 4: std[bcb96dfbba0ab899]::panicking::panic_handler::{closure#0} <unknown>
36.28 s
gammaloop-nextest-core> at <unknown source file> :<unknown line>
36.28 s
gammaloop-nextest-core> 5: std[bcb96dfbba0ab899]::sys::backtrace::__rust_end_short_backtrace::<std[bcb96dfbba0ab899]::panicking::panic_handler::{closure#0}, !> <unknown>
36.28 s
gammaloop-nextest-core> at <unknown source file> :<unknown line>
36.28 s
gammaloop-nextest-core> 6: __rustc[6c289b9f9c454d21]::rust_begin_unwind <unknown>
36.28 s
gammaloop-nextest-core> at <unknown source file> :<unknown line>
36.28 s
gammaloop-nextest-core> 7: core[940e698046960fd5]::panicking::panic_fmt <unknown>
36.28 s
gammaloop-nextest-core> at <unknown source file> :<unknown line>
36.28 s
gammaloop-nextest-core> 8: insta[307a548ac79ef4d9]::runtime::assert_snapshot <unknown>
36.28 s
gammaloop-nextest-core> at <unknown source file> :<unknown line>
36.28 s
gammaloop-nextest-core> 9: <test_renormalization[e6829672f1ddb150]::finit_part_ghlo::{closure#0} as core[940e698046960fd5]::ops::function::FnOnce<()>>::call_once <unknown>
36.28 s
gammaloop-nextest-core> at <unknown source file> :<unknown line>
36.28 s
gammaloop-nextest-core> 10: test[75d6903177b1d7e9]::__rust_begin_short_backtrace::<core[940e698046960fd5]::result::Result<(), alloc[2ea6bcb46fca0c42]::string::String>, fn() -> core[940e698046960fd5]::result::Result<(), alloc[2ea6bcb46fca0c42]::string::String>> <unknown>
36.28 s
gammaloop-nextest-core> at <unknown source file> :<unknown line>
36.28 s
gammaloop-nextest-core> 11: test[75d6903177b1d7e9]::run_test::{closure#0} <unknown>
36.28 s
gammaloop-nextest-core> at <unknown source file> :<unknown line>
36.28 s
gammaloop-nextest-core> 12: std[bcb96dfbba0ab899]::sys::backtrace::__rust_begin_short_backtrace::<test[75d6903177b1d7e9]::run_test::{closure#1}, ()> <unknown>
36.28 s
gammaloop-nextest-core> at <unknown source file> :<unknown line>
36.28 s
gammaloop-nextest-core> 13: <std[bcb96dfbba0ab899]::thread::lifecycle::spawn_unchecked<test[75d6903177b1d7e9]::run_test::{closure#1}, ()>::{closure#1} as core[940e698046960fd5]::ops::function::FnOnce<()>>::call_once::{shim:vtable#0} <unknown>
36.28 s
gammaloop-nextest-core> at <unknown source file> :<unknown line>
36.28 s
gammaloop-nextest-core> 14: <std[bcb96dfbba0ab899]::sys::thread::unix::Thread>::new::thread_start <unknown>
36.28 s
gammaloop-nextest-core> at <unknown source file> :<unknown line>
36.28 s
gammaloop-nextest-core> 15: start_thread <unknown>
36.28 s
gammaloop-nextest-core> at <unknown source file> :<unknown line>
36.28 s
gammaloop-nextest-core> 16: __clone3 <unknown>
36.28 s
gammaloop-nextest-core> at <unknown source file> :<unknown line>
36.28 s
gammaloop-nextest-core>
36.28 s
gammaloop-nextest-core> Run with COLORBT_SHOW_HIDDEN=1 environment variable to disable frame filtering.
36.28 s
gammaloop-nextest-core> Run with RUST_BACKTRACE=full to include source snippets.
36.28 s
gammaloop-nextest-core>
36.28 s
gammaloop-nextest-core> FAIL [ 3.212s] (452/456) gammalooprs::test_renormalization finite_part_ghost_2loop
36.28 s
gammaloop-nextest-core> stdout ---
36.28 s
gammaloop-nextest-core>
36.28 s
gammaloop-nextest-core> running 1 test
36.28 s
gammaloop-nextest-core> ━━━━━━━━━━━━━━━━━━━━━━━━━━━━━━━ Snapshot Summary ━━━━━━━━━━━━━━━━━━━━━━━━━━━━━━━
36.28 s
gammaloop-nextest-core> Snapshot: finite_part_ghost_2loop-3
36.28 s
gammaloop-nextest-core> Source: crates/gammalooprs/tests/test_renormalization.rs:464
36.28 s
gammaloop-nextest-core> ────────────────────────────────────────────────────────────────────────────────
36.28 s
gammaloop-nextest-core> Expression: align_to_rqft(&a, &model).to_bare_ordered_string()
36.28 s
gammaloop-nextest-core> ────────────────────────────────────────────────────────────────────────────────
36.28 s
gammaloop-nextest-core> -old snapshot
36.28 s
gammaloop-nextest-core> +new results
36.28 s
gammaloop-nextest-core> ────────────┬───────────────────────────────────────────────────────────────────
36.28 s
gammaloop-nextest-core> 1 │-(-1𝑖/32*ε+1𝑖/16)*(cas(2,coad(8)))^2*dot(P(0,mink(4)),P(0,mink(4)))*gs^4*ε^(-2)
36.28 s
gammaloop-nextest-core> 1 │+(-1𝑖/16+1𝑖/32*ε)*(cas(2,coad(8)))^2*dot(P(0,mink(4)),P(0,mink(4)))*gs^4*ε^(-2)
36.28 s
gammaloop-nextest-core> ────────────┴───────────────────────────────────────────────────────────────────
36.28 s
gammaloop-nextest-core> To update snapshots run `cargo insta review`
36.28 s
gammaloop-nextest-core> Stopped on the first failure. Run `cargo insta test` to run all snapshots.
36.28 s
gammaloop-nextest-core> test finite_part_ghost_2loop ... FAILED
36.28 s
gammaloop-nextest-core>
36.28 s
gammaloop-nextest-core> failures:
36.28 s
gammaloop-nextest-core>
36.28 s
gammaloop-nextest-core> failures:
36.28 s
gammaloop-nextest-core> finite_part_ghost_2loop
36.28 s
gammaloop-nextest-core>
36.28 s
gammaloop-nextest-core> test result: FAILED. 0 passed; 1 failed; 0 ignored; 0 measured; 5 filtered out; finished in 3.20s
36.28 s
gammaloop-nextest-core>
36.28 s
gammaloop-nextest-core> stderr ---
36.28 s
gammaloop-nextest-core> The application panicked (crashed).
36.28 s
gammaloop-nextest-core> Message: snapshot assertion for 'finite_part_ghost_2loop-3' failed in line 464
36.28 s
gammaloop-nextest-core> Location: /nix/store/9a12dww58xis3an3kmn597llpijv83b1-vendor-cargo-deps/c19b7c6f923b580ac259164a89f2577984ad5ab09ee9d583b888f934adbbe8d0/insta-1.47.2/src/runtime.rs :719
36.28 s
gammaloop-nextest-core>
36.28 s
gammaloop-nextest-core> ━━━━━━━━━━━━━━━━━━━━━━━━━━━━━━━━━━ BACKTRACE ━━━━━━━━━━━━━━━━━━━━━━━━━━━━━━━━━━━
36.28 s
gammaloop-nextest-core> 1: <color_eyre[51793ea62743adbd]::config::PanicHook>::panic_report <unknown>
36.28 s
gammaloop-nextest-core> at <unknown source file> :<unknown line>
36.28 s
gammaloop-nextest-core> 2: <color_eyre[51793ea62743adbd]::config::PanicHook>::into_panic_hook::{closure#0} <unknown>
36.28 s
gammaloop-nextest-core> at <unknown source file> :<unknown line>
36.28 s
gammaloop-nextest-core> 3: std[bcb96dfbba0ab899]::panicking::panic_with_hook <unknown>
36.28 s
gammaloop-nextest-core> at <unknown source file> :<unknown line>
36.28 s
gammaloop-nextest-core> 4: std[bcb96dfbba0ab899]::panicking::panic_handler::{closure#0} <unknown>
36.28 s
gammaloop-nextest-core> at <unknown source file> :<unknown line>
36.28 s
gammaloop-nextest-core> 5: std[bcb96dfbba0ab899]::sys::backtrace::__rust_end_short_backtrace::<std[bcb96dfbba0ab899]::panicking::panic_handler::{closure#0}, !> <unknown>
36.28 s
gammaloop-nextest-core> at <unknown source file> :<unknown line>
36.28 s
gammaloop-nextest-core> 6: __rustc[6c289b9f9c454d21]::rust_begin_unwind <unknown>
36.28 s
gammaloop-nextest-core> at <unknown source file> :<unknown line>
36.28 s
gammaloop-nextest-core> 7: core[940e698046960fd5]::panicking::panic_fmt <unknown>
36.28 s
gammaloop-nextest-core> at <unknown source file> :<unknown line>
36.28 s
gammaloop-nextest-core> 8: insta[307a548ac79ef4d9]::runtime::assert_snapshot <unknown>
36.28 s
gammaloop-nextest-core> at <unknown source file> :<unknown line>
36.28 s
gammaloop-nextest-core> 9: test_renormalization[e6829672f1ddb150]::finite_part_ghost_2loop <unknown>
36.28 s
gammaloop-nextest-core> at <unknown source file> :<unknown line>
36.28 s
gammaloop-nextest-core> 10: <test_renormalization[e6829672f1ddb150]::finite_part_ghost_2loop::{closure#0} as core[940e698046960fd5]::ops::function::FnOnce<()>>::call_once <unknown>
36.28 s
gammaloop-nextest-core> at <unknown source file> :<unknown line>
36.28 s
gammaloop-nextest-core> 11: test[75d6903177b1d7e9]::__rust_begin_short_backtrace::<core[940e698046960fd5]::result::Result<(), alloc[2ea6bcb46fca0c42]::string::String>, fn() -> core[940e698046960fd5]::result::Result<(), alloc[2ea6bcb46fca0c42]::string::String>> <unknown>
36.28 s
gammaloop-nextest-core> at <unknown source file> :<unknown line>
36.28 s
gammaloop-nextest-core> 12: test[75d6903177b1d7e9]::run_test::{closure#0} <unknown>
36.28 s
gammaloop-nextest-core> at <unknown source file> :<unknown line>
36.28 s
gammaloop-nextest-core> 13: std[bcb96dfbba0ab899]::sys::backtrace::__rust_begin_short_backtrace::<test[75d6903177b1d7e9]::run_test::{closure#1}, ()> <unknown>
36.28 s
gammaloop-nextest-core> at <unknown source file> :<unknown line>
36.28 s
gammaloop-nextest-core> 14: <std[bcb96dfbba0ab899]::thread::lifecycle::spawn_unchecked<test[75d6903177b1d7e9]::run_test::{closure#1}, ()>::{closure#1} as core[940e698046960fd5]::ops::function::FnOnce<()>>::call_once::{shim:vtable#0} <unknown>
36.28 s
gammaloop-nextest-core> at <unknown source file> :<unknown line>
36.28 s
gammaloop-nextest-core> 15: <std[bcb96dfbba0ab899]::sys::thread::unix::Thread>::new::thread_start <unknown>
36.28 s
gammaloop-nextest-core> at <unknown source file> :<unknown line>
36.28 s
gammaloop-nextest-core> 16: start_thread <unknown>
36.28 s
gammaloop-nextest-core> at <unknown source file> :<unknown line>
36.28 s
gammaloop-nextest-core> 17: __clone3 <unknown>
36.28 s
gammaloop-nextest-core> at <unknown source file> :<unknown line>
36.28 s
gammaloop-nextest-core>
36.28 s
gammaloop-nextest-core> Run with COLORBT_SHOW_HIDDEN=1 environment variable to disable frame filtering.
36.28 s
gammaloop-nextest-core> Run with RUST_BACKTRACE=full to include source snippets.
36.28 s
gammaloop-nextest-core>
36.35 s
gammaloop-nextest-core> error : test run failed
36.39 s
gammaloop-nextest-core>
36.39 s
gammaloop-nextest-core> ========== nextest test summary ==========
36.39 s
gammaloop-nextest-core> report: target/nextest/ci_gammaloop/junit.xml
36.39 s
gammaloop-nextest-core> tests: 456, failures: 2, errors: 0
36.39 s
gammaloop-nextest-core>
36.39 s
gammaloop-nextest-core> 1. gammalooprs::test_renormalization::finit_part_ghlo
36.39 s
gammaloop-nextest-core> failure: test failure with exit code 101
36.39 s
gammaloop-nextest-core> system-out
36.39 s
gammaloop-nextest-core> running 1 test
36.39 s
gammaloop-nextest-core> ren part: 1/2*GC_10^2*dot(P(0,mink(dim)),P(0,mink(dim)))*cas(2,coad(8))/ε
36.39 s
gammaloop-nextest-core> ━━━━━━━━━━━━━━━━━━━━━━━━━━━━━━━ Snapshot Summary ━━━━━━━━━━━━━━━━━━━━━━━━━━━━━━━
36.39 s
gammaloop-nextest-core> Snapshot: finit_part_ghlo
36.39 s
gammaloop-nextest-core> Source: crates/gammalooprs/tests/test_renormalization.rs:557
36.39 s
gammaloop-nextest-core> ────────────────────────────────────────────────────────────────────────────────
36.39 s
gammaloop-nextest-core> Expression: align_to_rqft(&a, &model).to_bare_ordered_string()
36.39 s
gammaloop-nextest-core> ────────────────────────────────────────────────────────────────────────────────
36.39 s
gammaloop-nextest-core> -old snapshot
36.39 s
gammaloop-nextest-core> +new results
36.39 s
gammaloop-nextest-core> ────────────┬───────────────────────────────────────────────────────────────────
36.39 s
gammaloop-nextest-core> 1 │--1/2*cas(2,coad(8))*dot(P(0,mink(4)),P(0,mink(4)))*gs^2*ε^(-1)
36.39 s
gammaloop-nextest-core> 1 │+1/2*cas(2,coad(8))*dot(P(0,mink(4)),P(0,mink(4)))*gs^2*ε^(-1)
36.39 s
gammaloop-nextest-core> ────────────┴───────────────────────────────────────────────────────────────────
36.39 s
gammaloop-nextest-core> To update snapshots run `cargo insta review`
36.39 s
gammaloop-nextest-core> Stopped on the first failure. Run `cargo insta test` to run all snapshots.
36.39 s
gammaloop-nextest-core> test finit_part_ghlo ... FAILED
36.39 s
gammaloop-nextest-core>
36.39 s
gammaloop-nextest-core> failures:
36.39 s
gammaloop-nextest-core>
36.39 s
gammaloop-nextest-core> failures:
36.39 s
gammaloop-nextest-core> finit_part_ghlo
36.39 s
gammaloop-nextest-core>
36.39 s
gammaloop-nextest-core> test result: FAILED. 0 passed; 1 failed; 0 ignored; 0 measured; 5 filtered out; finished in 0.40s
36.39 s
gammaloop-nextest-core> system-err
36.39 s
gammaloop-nextest-core> The application panicked (crashed).
36.39 s
gammaloop-nextest-core> Message: snapshot assertion for 'finit_part_ghlo' failed in line 557
36.39 s
gammaloop-nextest-core> Location: /nix/store/9a12dww58xis3an3kmn597llpijv83b1-vendor-cargo-deps/c19b7c6f923b580ac259164a89f2577984ad5ab09ee9d583b888f934adbbe8d0/insta-1.47.2/src/runtime.rs:719
36.39 s
gammaloop-nextest-core>
36.39 s
gammaloop-nextest-core> ━━━━━━━━━━━━━━━━━━━━━━━━━━━━━━━━━━ BACKTRACE ━━━━━━━━━━━━━━━━━━━━━━━━━━━━━━━━━━━
36.39 s
gammaloop-nextest-core> 1: <color_eyre[51793ea62743adbd]::config::PanicHook>::panic_report<unknown>
36.39 s
gammaloop-nextest-core> at <unknown source file>:<unknown line>
36.39 s
gammaloop-nextest-core> 2: <color_eyre[51793ea62743adbd]::config::PanicHook>::into_panic_hook::{closure#0}<unknown>
36.39 s
gammaloop-nextest-core> at <unknown source file>:<unknown line>
36.39 s
gammaloop-nextest-core> 3: std[bcb96dfbba0ab899]::panicking::panic_with_hook<unknown>
36.39 s
gammaloop-nextest-core> at <unknown source file>:<unknown line>
36.39 s
gammaloop-nextest-core> 4: std[bcb96dfbba0ab899]::panicking::panic_handler::{closure#0}<unknown>
36.39 s
gammaloop-nextest-core> at <unknown source file>:<unknown line>
36.39 s
gammaloop-nextest-core> 5: std[bcb96dfbba0ab899]::sys::backtrace::__rust_end_short_backtrace::<std[bcb96dfbba0ab899]::panicking::panic_handler::{closure#0}, !><unknown>
36.39 s
gammaloop-nextest-core> at <unknown source file>:<unknown line>
36.39 s
gammaloop-nextest-core> 6: __rustc[6c289b9f9c454d21]::rust_begin_unwind<unknown>
36.39 s
gammaloop-nextest-core> at <unknown source file>:<unknown line>
36.39 s
gammaloop-nextest-core> 7: core[940e698046960fd5]::panicking::panic_fmt<unknown>
36.39 s
gammaloop-nextest-core> at <unknown source file>:<unknown line>
36.39 s
gammaloop-nextest-core> 8: insta[307a548ac79ef4d9]::runtime::assert_snapshot<unknown>
36.39 s
gammaloop-nextest-core> at <unknown source file>:<unknown line>
36.39 s
gammaloop-nextest-core> 9: <test_renormalization[e6829672f1ddb150]::finit_part_ghlo::{closure#0} as core[940e698046960fd5]::ops::function::FnOnce<()>>::call_once<unknown>
36.39 s
gammaloop-nextest-core> at <unknown source file>:<unknown line>
36.39 s
gammaloop-nextest-core> 10: test[75d6903177b1d7e9]::__rust_begin_short_backtrace::<core[940e698046960fd5]::result::Result<(), alloc[2ea6bcb46fca0c42]::string::String>, fn() -> core[940e698046960fd5]::result::Result<(), alloc[2ea6bcb46fca0c42]::string::String>><unknown>
36.39 s
gammaloop-nextest-core> at <unknown source file>:<unknown line>
36.39 s
gammaloop-nextest-core> 11: test[75d6903177b1d7e9]::run_test::{closure#0}<unknown>
36.39 s
gammaloop-nextest-core> at <unknown source file>:<unknown line>
36.39 s
gammaloop-nextest-core> 12: std[bcb96dfbba0ab899]::sys::backtrace::__rust_begin_short_backtrace::<test[75d6903177b1d7e9]::run_test::{closure#1}, ()><unknown>
36.39 s
gammaloop-nextest-core> at <unknown source file>:<unknown line>
36.39 s
gammaloop-nextest-core> 13: <std[bcb96dfbba0ab899]::thread::lifecycle::spawn_unchecked<test[75d6903177b1d7e9]::run_test::{closure#1}, ()>::{closure#1} as core[940e698046960fd5]::ops::function::FnOnce<()>>::call_once::{shim:vtable#0}<unknown>
36.39 s
gammaloop-nextest-core> at <unknown source file>:<unknown line>
36.39 s
gammaloop-nextest-core> 14: <std[bcb96dfbba0ab899]::sys::thread::unix::Thread>::new::thread_start<unknown>
36.39 s
gammaloop-nextest-core> at <unknown source file>:<unknown line>
36.39 s
gammaloop-nextest-core> 15: start_thread<unknown>
36.39 s
gammaloop-nextest-core> at <unknown source file>:<unknown line>
36.39 s
gammaloop-nextest-core> 16: __clone3<unknown>
36.39 s
gammaloop-nextest-core> at <unknown source file>:<unknown line>
36.39 s
gammaloop-nextest-core>
36.39 s
gammaloop-nextest-core> Run with COLORBT_SHOW_HIDDEN=1 environment variable to disable frame filtering.
36.39 s
gammaloop-nextest-core> Run with RUST_BACKTRACE=full to include source snippets.
36.39 s
gammaloop-nextest-core>
36.39 s
gammaloop-nextest-core> 2. gammalooprs::test_renormalization::finite_part_ghost_2loop
36.39 s
gammaloop-nextest-core> failure: test failure with exit code 101
36.39 s
gammaloop-nextest-core> system-out
36.39 s
gammaloop-nextest-core> running 1 test
36.39 s
gammaloop-nextest-core> ━━━━━━━━━━━━━━━━━━━━━━━━━━━━━━━ Snapshot Summary ━━━━━━━━━━━━━━━━━━━━━━━━━━━━━━━
36.39 s
gammaloop-nextest-core> Snapshot: finite_part_ghost_2loop-3
36.39 s
gammaloop-nextest-core> Source: crates/gammalooprs/tests/test_renormalization.rs:464
36.39 s
gammaloop-nextest-core> ────────────────────────────────────────────────────────────────────────────────
36.39 s
gammaloop-nextest-core> Expression: align_to_rqft(&a, &model).to_bare_ordered_string()
36.39 s
gammaloop-nextest-core> ────────────────────────────────────────────────────────────────────────────────
36.39 s
gammaloop-nextest-core> -old snapshot
36.39 s
gammaloop-nextest-core> +new results
36.39 s
gammaloop-nextest-core> ────────────┬───────────────────────────────────────────────────────────────────
36.39 s
gammaloop-nextest-core> 1 │-(-1𝑖/32*ε+1𝑖/16)*(cas(2,coad(8)))^2*dot(P(0,mink(4)),P(0,mink(4)))*gs^4*ε^(-2)
36.39 s
gammaloop-nextest-core> 1 │+(-1𝑖/16+1𝑖/32*ε)*(cas(2,coad(8)))^2*dot(P(0,mink(4)),P(0,mink(4)))*gs^4*ε^(-2)
36.39 s
gammaloop-nextest-core> ────────────┴───────────────────────────────────────────────────────────────────
36.39 s
gammaloop-nextest-core> To update snapshots run `cargo insta review`
36.39 s
gammaloop-nextest-core> Stopped on the first failure. Run `cargo insta test` to run all snapshots.
36.39 s
gammaloop-nextest-core> test finite_part_ghost_2loop ... FAILED
36.39 s
gammaloop-nextest-core>
36.39 s
gammaloop-nextest-core> failures:
36.39 s
gammaloop-nextest-core>
36.39 s
gammaloop-nextest-core> failures:
36.39 s
gammaloop-nextest-core> finite_part_ghost_2loop
36.39 s
gammaloop-nextest-core>
36.39 s
gammaloop-nextest-core> test result: FAILED. 0 passed; 1 failed; 0 ignored; 0 measured; 5 filtered out; finished in 3.20s
36.39 s
gammaloop-nextest-core> system-err
36.39 s
gammaloop-nextest-core> The application panicked (crashed).
36.39 s
gammaloop-nextest-core> Message: snapshot assertion for 'finite_part_ghost_2loop-3' failed in line 464
36.39 s
gammaloop-nextest-core> Location: /nix/store/9a12dww58xis3an3kmn597llpijv83b1-vendor-cargo-deps/c19b7c6f923b580ac259164a89f2577984ad5ab09ee9d583b888f934adbbe8d0/insta-1.47.2/src/runtime.rs:719
36.39 s
gammaloop-nextest-core>
36.39 s
gammaloop-nextest-core> ━━━━━━━━━━━━━━━━━━━━━━━━━━━━━━━━━━ BACKTRACE ━━━━━━━━━━━━━━━━━━━━━━━━━━━━━━━━━━━
36.39 s
gammaloop-nextest-core> 1: <color_eyre[51793ea62743adbd]::config::PanicHook>::panic_report<unknown>
36.39 s
gammaloop-nextest-core> at <unknown source file>:<unknown line>
36.39 s
gammaloop-nextest-core> 2: <color_eyre[51793ea62743adbd]::config::PanicHook>::into_panic_hook::{closure#0}<unknown>
36.39 s
gammaloop-nextest-core> at <unknown source file>:<unknown line>
36.39 s
gammaloop-nextest-core> 3: std[bcb96dfbba0ab899]::panicking::panic_with_hook<unknown>
36.39 s
gammaloop-nextest-core> at <unknown source file>:<unknown line>
36.39 s
gammaloop-nextest-core> 4: std[bcb96dfbba0ab899]::panicking::panic_handler::{closure#0}<unknown>
36.39 s
gammaloop-nextest-core> at <unknown source file>:<unknown line>
36.39 s
gammaloop-nextest-core> 5: std[bcb96dfbba0ab899]::sys::backtrace::__rust_end_short_backtrace::<std[bcb96dfbba0ab899]::panicking::panic_handler::{closure#0}, !><unknown>
36.39 s
gammaloop-nextest-core> at <unknown source file>:<unknown line>
36.39 s
gammaloop-nextest-core> 6: __rustc[6c289b9f9c454d21]::rust_begin_unwind<unknown>
36.39 s
gammaloop-nextest-core> at <unknown source file>:<unknown line>
36.39 s
gammaloop-nextest-core> 7: core[940e698046960fd5]::panicking::panic_fmt<unknown>
36.39 s
gammaloop-nextest-core> at <unknown source file>:<unknown line>
36.39 s
gammaloop-nextest-core> 8: insta[307a548ac79ef4d9]::runtime::assert_snapshot<unknown>
36.39 s
gammaloop-nextest-core> at <unknown source file>:<unknown line>
36.39 s
gammaloop-nextest-core> 9: test_renormalization[e6829672f1ddb150]::finite_part_ghost_2loop<unknown>
36.39 s
gammaloop-nextest-core> at <unknown source file>:<unknown line>
36.39 s
gammaloop-nextest-core> 10: <test_renormalization[e6829672f1ddb150]::finite_part_ghost_2loop::{closure#0} as core[940e698046960fd5]::ops::function::FnOnce<()>>::call_once<unknown>
36.39 s
gammaloop-nextest-core> at <unknown source file>:<unknown line>
36.39 s
gammaloop-nextest-core> 11: test[75d6903177b1d7e9]::__rust_begin_short_backtrace::<core[940e698046960fd5]::result::Result<(), alloc[2ea6bcb46fca0c42]::string::String>, fn() -> core[940e698046960fd5]::result::Result<(), alloc[2ea6bcb46fca0c42]::string::String>><unknown>
36.39 s
gammaloop-nextest-core> at <unknown source file>:<unknown line>
36.39 s
gammaloop-nextest-core> 12: test[75d6903177b1d7e9]::run_test::{closure#0}<unknown>
36.39 s
gammaloop-nextest-core> at <unknown source file>:<unknown line>
36.39 s
gammaloop-nextest-core> 13: std[bcb96dfbba0ab899]::sys::backtrace::__rust_begin_short_backtrace::<test[75d6903177b1d7e9]::run_test::{closure#1}, ()><unknown>
36.39 s
gammaloop-nextest-core> at <unknown source file>:<unknown line>
36.39 s
gammaloop-nextest-core> 14: <std[bcb96dfbba0ab899]::thread::lifecycle::spawn_unchecked<test[75d6903177b1d7e9]::run_test::{closure#1}, ()>::{closure#1} as core[940e698046960fd5]::ops::function::FnOnce<()>>::call_once::{shim:vtable#0}<unknown>
36.39 s
gammaloop-nextest-core> at <unknown source file>:<unknown line>
36.39 s
gammaloop-nextest-core> 15: <std[bcb96dfbba0ab899]::sys::thread::unix::Thread>::new::thread_start<unknown>
36.39 s
gammaloop-nextest-core> at <unknown source file>:<unknown line>
36.39 s
gammaloop-nextest-core> 16: start_thread<unknown>
36.39 s
gammaloop-nextest-core> at <unknown source file>:<unknown line>
36.39 s
gammaloop-nextest-core> 17: __clone3<unknown>
36.39 s
gammaloop-nextest-core> at <unknown source file>:<unknown line>
36.39 s
gammaloop-nextest-core>
36.39 s
gammaloop-nextest-core> Run with COLORBT_SHOW_HIDDEN=1 environment variable to disable frame filtering.
36.39 s
gammaloop-nextest-core> Run with RUST_BACKTRACE=full to include source snippets.
36.39 s
gammaloop-nextest-core> =========================================
36.44 s
[0 built (1 failed ), 0.0 error: Cannot build '/nix/store/w43vq41dm53nli0ffchnccbgvz2afac5-gammaloop-nextest-core.drv '.
36.44 s
Reason: builder failed with exit code 100 .
36.44 s
Output paths:
36.44 s
/nix/store/x4h8vjy5svl931716ykng98sg4fkfhp2-gammaloop-nextest-core
36.44 s
Last 473 log lines:
36.44 s
> Extracting 3 binaries (including 1 non-test binary), 1 build script output directory, and 2 linked paths to /build/nextest-archive-nyldlM
36.44 s
> Extracted 18 files to /build/nextest-archive-nyldlM in 0.60s
36.44 s
> ------------
36.44 s
> Nextest run ID bfda6f3f-8720-484f-ae35-14479e94918f with nextest profile: ci_gammaloop
36.44 s
> Starting 339 tests across 2 binaries
36.44 s
> ------------
36.44 s
> Summary [ 0.615s] 339 tests run: 339 passed , 0 skipped
36.44 s
>
36.44 s
> ========== nextest test summary ==========
36.44 s
> report: target/nextest/ci_gammaloop/junit.xml
36.44 s
> tests: 339, failures: 0, errors: 0
36.44 s
> No failing testcases found.
36.44 s
> =========================================
36.44 s
> Extracting 1 binary and 1 linked path to /build/nextest-archive-2iXYJp
36.44 s
> Extracted 7 files to /build/nextest-archive-2iXYJp in 0.09s
36.44 s
> ------------
36.44 s
> Nextest run ID 20109795-2eec-456a-b7d7-04cf0c5e45db with nextest profile: ci_gammaloop
36.44 s
> Starting 19 tests across 1 binary
36.44 s
> ------------
36.44 s
> Summary [ 0.019s] 19 tests run: 19 passed , 0 skipped
36.44 s
>
36.44 s
> ========== nextest test summary ==========
36.44 s
> report: target/nextest/ci_gammaloop/junit.xml
36.44 s
> tests: 19, failures: 0, errors: 0
36.44 s
> No failing testcases found.
36.44 s
> =========================================
36.44 s
> Extracting 1 binary to /build/nextest-archive-k32YYn
36.44 s
> Extracted 4 files to /build/nextest-archive-k32YYn in 0.05s
36.44 s
> ------------
36.44 s
> Nextest run ID a7fca9db-d5af-4947-acd5-82acb4a73716 with nextest profile: ci_gammaloop
36.44 s
> Starting 0 tests across 1 binary
36.44 s
> ------------
36.44 s
> Summary [ 0.000s] 0 tests run: 0 passed , 0 skipped
36.44 s
>
36.44 s
> ========== nextest test summary ==========
36.44 s
> report: target/nextest/ci_gammaloop/junit.xml
36.44 s
> tests: 0, failures: 0, errors: 0
36.44 s
> No failing testcases found.
36.44 s
> =========================================
36.44 s
> Extracting 4 binaries, 1 build script output directory, and 2 linked paths to /build/nextest-archive-ucW3zz
36.44 s
> Extracted 18 files to /build/nextest-archive-ucW3zz in 0.67s
36.44 s
> ------------
36.44 s
> Nextest run ID 7fb19012-f195-46d7-86c0-7c6cd448fdac with nextest profile: ci_gammaloop
36.44 s
> Starting 456 tests across 4 binaries (61 tests skipped , including 60 tests via profile.ci_gammaloop.default-filter )
36.44 s
> FAIL [ 0.419s] (445/456) gammalooprs::test_renormalization finit_part_ghlo
36.44 s
> stdout ---
36.44 s
>
36.44 s
> running 1 test
36.44 s
> ren part: 1/2*GC_10^2*dot(P(0,mink (dim)),P(0,mink (dim)))*cas(2,coad (8))/ε
36.44 s
> ━━━━━━━━━━━━━━━━━━━━━━━━━━━━━━━ Snapshot Summary ━━━━━━━━━━━━━━━━━━━━━━━━━━━━━━━
36.44 s
> Snapshot: finit_part_ghlo
36.44 s
> Source: crates/gammalooprs/tests/test_renormalization.rs:557
36.44 s
> ────────────────────────────────────────────────────────────────────────────────
36.44 s
> Expression: align_to_rqft(&a, &model).to_bare_ordered_string()
36.44 s
> ────────────────────────────────────────────────────────────────────────────────
36.44 s
> -old snapshot
36.44 s
> +new results
36.44 s
> ────────────┬───────────────────────────────────────────────────────────────────
36.44 s
> 1 │--1/2*cas(2,coad(8))*dot(P(0,mink(4)),P(0,mink(4)))*gs^2*ε^(-1)
36.44 s
> 1 │+1/2*cas(2,coad(8))*dot(P(0,mink(4)),P(0,mink(4)))*gs^2*ε^(-1)
36.44 s
> ────────────┴───────────────────────────────────────────────────────────────────
36.44 s
> To update snapshots run `cargo insta review`
36.44 s
> Stopped on the first failure. Run `cargo insta test` to run all snapshots.
36.44 s
> test finit_part_ghlo ... FAILED
36.44 s
>
36.44 s
> failures:
36.44 s
>
36.44 s
> failures:
36.44 s
> finit_part_ghlo
36.44 s
>
36.44 s
> test result: FAILED. 0 passed; 1 failed; 0 ignored; 0 measured; 5 filtered out; finished in 0.40s
36.44 s
>
36.44 s
> stderr ---
36.44 s
> The application panicked (crashed).
36.44 s
> Message: snapshot assertion for 'finit_part_ghlo' failed in line 557
36.44 s
> Location: /nix/store/9a12dww58xis3an3kmn597llpijv83b1-vendor-cargo-deps/c19b7c6f923b580ac259164a89f2577984ad5ab09ee9d583b888f934adbbe8d0/insta-1.47.2/src/runtime.rs :719
36.44 s
>
36.44 s
> ━━━━━━━━━━━━━━━━━━━━━━━━━━━━━━━━━━ BACKTRACE ━━━━━━━━━━━━━━━━━━━━━━━━━━━━━━━━━━━
36.44 s
> 1: <color_eyre[51793ea62743adbd]::config::PanicHook>::panic_report <unknown>
36.44 s
> at <unknown source file> :<unknown line>
36.44 s
> 2: <color_eyre[51793ea62743adbd]::config::PanicHook>::into_panic_hook::{closure#0} <unknown>
36.44 s
> at <unknown source file> :<unknown line>
36.44 s
> 3: std[bcb96dfbba0ab899]::panicking::panic_with_hook <unknown>
36.44 s
> at <unknown source file> :<unknown line>
36.44 s
> 4: std[bcb96dfbba0ab899]::panicking::panic_handler::{closure#0} <unknown>
36.44 s
> at <unknown source file> :<unknown line>
36.44 s
> 5: std[bcb96dfbba0ab899]::sys::backtrace::__rust_end_short_backtrace::<std[bcb96dfbba0ab899]::panicking::panic_handler::{closure#0}, !> <unknown>
36.44 s
> at <unknown source file> :<unknown line>
36.44 s
> 6: __rustc[6c289b9f9c454d21]::rust_begin_unwind <unknown>
36.44 s
> at <unknown source file> :<unknown line>
36.44 s
> 7: core[940e698046960fd5]::panicking::panic_fmt <unknown>
36.44 s
> at <unknown source file> :<unknown line>
36.44 s
> 8: insta[307a548ac79ef4d9]::runtime::assert_snapshot <unknown>
36.44 s
> at <unknown source file> :<unknown line>
36.44 s
> 9: <test_renormalization[e6829672f1ddb150]::finit_part_ghlo::{closure#0} as core[940e698046960fd5]::ops::function::FnOnce<()>>::call_once <unknown>
36.44 s
> at <unknown source file> :<unknown line>
36.44 s
> 10: test[75d6903177b1d7e9]::__rust_begin_short_backtrace::<core[940e698046960fd5]::result::Result<(), alloc[2ea6bcb46fca0c42]::string::String>, fn() -> core[940e698046960fd5]::result::Result<(), alloc[2ea6bcb46fca0c42]::string::String>> <unknown>
36.44 s
> at <unknown source file> :<unknown line>
36.44 s
> 11: test[75d6903177b1d7e9]::run_test::{closure#0} <unknown>
36.44 s
> at <unknown source file> :<unknown line>
36.44 s
> 12: std[bcb96dfbba0ab899]::sys::backtrace::__rust_begin_short_backtrace::<test[75d6903177b1d7e9]::run_test::{closure#1}, ()> <unknown>
36.44 s
> at <unknown source file> :<unknown line>
36.44 s
> 13: <std[bcb96dfbba0ab899]::thread::lifecycle::spawn_unchecked<test[75d6903177b1d7e9]::run_test::{closure#1}, ()>::{closure#1} as core[940e698046960fd5]::ops::function::FnOnce<()>>::call_once::{shim:vtable#0} <unknown>
36.44 s
> at <unknown source file> :<unknown line>
36.44 s
> 14: <std[bcb96dfbba0ab899]::sys::thread::unix::Thread>::new::thread_start <unknown>
36.44 s
> at <unknown source file> :<unknown line>
36.44 s
> 15: start_thread <unknown>
36.44 s
> at <unknown source file> :<unknown line>
36.44 s
> 16: __clone3 <unknown>
36.44 s
> at <unknown source file> :<unknown line>
36.44 s
>
36.44 s
> Run with COLORBT_SHOW_HIDDEN=1 environment variable to disable frame filtering.
36.44 s
> Run with RUST_BACKTRACE=full to include source snippets.
36.44 s
>
36.44 s
> FAIL [ 3.212s] (452/456) gammalooprs::test_renormalization finite_part_ghost_2loop
36.44 s
> stdout ---
36.44 s
>
36.44 s
> running 1 test
36.44 s
> ━━━━━━━━━━━━━━━━━━━━━━━━━━━━━━━ Snapshot Summary ━━━━━━━━━━━━━━━━━━━━━━━━━━━━━━━
36.44 s
> Snapshot: finite_part_ghost_2loop-3
36.44 s
> Source: crates/gammalooprs/tests/test_renormalization.rs:464
36.44 s
> ────────────────────────────────────────────────────────────────────────────────
36.44 s
> Expression: align_to_rqft(&a, &model).to_bare_ordered_string()
36.44 s
> ────────────────────────────────────────────────────────────────────────────────
36.44 s
> -old snapshot
36.44 s
> +new results
36.44 s
> ────────────┬───────────────────────────────────────────────────────────────────
36.44 s
> 1 │-(-1𝑖/32*ε+1𝑖/16)*(cas(2,coad(8)))^2*dot(P(0,mink(4)),P(0,mink(4)))*gs^4*ε^(-2)
36.44 s
> 1 │+(-1𝑖/16+1𝑖/32*ε)*(cas(2,coad(8)))^2*dot(P(0,mink(4)),P(0,mink(4)))*gs^4*ε^(-2)
36.44 s
> ────────────┴───────────────────────────────────────────────────────────────────
36.44 s
> To update snapshots run `cargo insta review`
36.44 s
> Stopped on the first failure. Run `cargo insta test` to run all snapshots.
36.44 s
> test finite_part_ghost_2loop ... FAILED
36.44 s
>
36.44 s
> failures:
36.44 s
>
36.44 s
> failures:
36.44 s
> finite_part_ghost_2loop
36.44 s
>
36.44 s
> test result: FAILED. 0 passed; 1 failed; 0 ignored; 0 measured; 5 filtered out; finished in 3.20s
36.44 s
>
36.44 s
> stderr ---
36.44 s
> The application panicked (crashed).
36.44 s
> Message: snapshot assertion for 'finite_part_ghost_2loop-3' failed in line 464
36.44 s
> Location: /nix/store/9a12dww58xis3an3kmn597llpijv83b1-vendor-cargo-deps/c19b7c6f923b580ac259164a89f2577984ad5ab09ee9d583b888f934adbbe8d0/insta-1.47.2/src/runtime.rs :719
36.44 s
>
36.44 s
> ━━━━━━━━━━━━━━━━━━━━━━━━━━━━━━━━━━ BACKTRACE ━━━━━━━━━━━━━━━━━━━━━━━━━━━━━━━━━━━
36.44 s
> 1: <color_eyre[51793ea62743adbd]::config::PanicHook>::panic_report <unknown>
36.44 s
> at <unknown source file> :<unknown line>
36.44 s
> 2: <color_eyre[51793ea62743adbd]::config::PanicHook>::into_panic_hook::{closure#0} <unknown>
36.44 s
> at <unknown source file> :<unknown line>
36.44 s
> 3: std[bcb96dfbba0ab899]::panicking::panic_with_hook <unknown>
36.44 s
> at <unknown source file> :<unknown line>
36.44 s
> 4: std[bcb96dfbba0ab899]::panicking::panic_handler::{closure#0} <unknown>
36.44 s
> at <unknown source file> :<unknown line>
36.44 s
> 5: std[bcb96dfbba0ab899]::sys::backtrace::__rust_end_short_backtrace::<std[bcb96dfbba0ab899]::panicking::panic_handler::{closure#0}, !> <unknown>
36.44 s
> at <unknown source file> :<unknown line>
36.44 s
> 6: __rustc[6c289b9f9c454d21]::rust_begin_unwind <unknown>
36.44 s
> at <unknown source file> :<unknown line>
36.44 s
> 7: core[940e698046960fd5]::panicking::panic_fmt <unknown>
36.44 s
> at <unknown source file> :<unknown line>
36.44 s
> 8: insta[307a548ac79ef4d9]::runtime::assert_snapshot <unknown>
36.44 s
> at <unknown source file> :<unknown line>
36.44 s
> 9: test_renormalization[e6829672f1ddb150]::finite_part_ghost_2loop <unknown>
36.44 s
> at <unknown source file> :<unknown line>
36.44 s
> 10: <test_renormalization[e6829672f1ddb150]::finite_part_ghost_2loop::{closure#0} as core[940e698046960fd5]::ops::function::FnOnce<()>>::call_once <unknown>
36.44 s
> at <unknown source file> :<unknown line>
36.44 s
> 11: test[75d6903177b1d7e9]::__rust_begin_short_backtrace::<core[940e698046960fd5]::result::Result<(), alloc[2ea6bcb46fca0c42]::string::String>, fn() -> core[940e698046960fd5]::result::Result<(), alloc[2ea6bcb46fca0c42]::string::String>> <unknown>
36.44 s
> at <unknown source file> :<unknown line>
36.44 s
> 12: test[75d6903177b1d7e9]::run_test::{closure#0} <unknown>
36.44 s
> at <unknown source file> :<unknown line>
36.44 s
> 13: std[bcb96dfbba0ab899]::sys::backtrace::__rust_begin_short_backtrace::<test[75d6903177b1d7e9]::run_test::{closure#1}, ()> <unknown>
36.44 s
> at <unknown source file> :<unknown line>
36.44 s
> 14: <std[bcb96dfbba0ab899]::thread::lifecycle::spawn_unchecked<test[75d6903177b1d7e9]::run_test::{closure#1}, ()>::{closure#1} as core[940e698046960fd5]::ops::function::FnOnce<()>>::call_once::{shim:vtable#0} <unknown>
36.44 s
> at <unknown source file> :<unknown line>
36.44 s
> 15: <std[bcb96dfbba0ab899]::sys::thread::unix::Thread>::new::thread_start <unknown>
36.44 s
> at <unknown source file> :<unknown line>
36.44 s
> 16: start_thread <unknown>
36.44 s
> at <unknown source file> :<unknown line>
36.44 s
> 17: __clone3 <unknown>
36.44 s
> at <unknown source file> :<unknown line>
36.44 s
>
36.44 s
> Run with COLORBT_SHOW_HIDDEN=1 environment variable to disable frame filtering.
36.44 s
> Run with RUST_BACKTRACE=full to include source snippets.
36.44 s
>
36.44 s
> ------------
36.44 s
> Summary [ 12.115s] 456 tests run: 454 passed , 2 failed , 61 skipped
36.44 s
> FAIL [ 0.419s] (445/456) gammalooprs::test_renormalization finit_part_ghlo
36.44 s
> stdout ---
36.44 s
>
36.44 s
> running 1 test
36.44 s
> ren part: 1/2*GC_10^2*dot(P(0,mink (dim)),P(0,mink (dim)))*cas(2,coad (8))/ε
36.44 s
> ━━━━━━━━━━━━━━━━━━━━━━━━━━━━━━━ Snapshot Summary ━━━━━━━━━━━━━━━━━━━━━━━━━━━━━━━
36.44 s
> Snapshot: finit_part_ghlo
36.44 s
> Source: crates/gammalooprs/tests/test_renormalization.rs:557
36.44 s
> ────────────────────────────────────────────────────────────────────────────────
36.44 s
> Expression: align_to_rqft(&a, &model).to_bare_ordered_string()
36.44 s
> ────────────────────────────────────────────────────────────────────────────────
36.44 s
> -old snapshot
36.44 s
> +new results
36.44 s
> ────────────┬───────────────────────────────────────────────────────────────────
36.44 s
> 1 │--1/2*cas(2,coad(8))*dot(P(0,mink(4)),P(0,mink(4)))*gs^2*ε^(-1)
36.44 s
> 1 │+1/2*cas(2,coad(8))*dot(P(0,mink(4)),P(0,mink(4)))*gs^2*ε^(-1)
36.44 s
> ────────────┴───────────────────────────────────────────────────────────────────
36.44 s
> To update snapshots run `cargo insta review`
36.44 s
> Stopped on the first failure. Run `cargo insta test` to run all snapshots.
36.44 s
> test finit_part_ghlo ... FAILED
36.44 s
>
36.44 s
> failures:
36.44 s
>
36.44 s
> failures:
36.44 s
> finit_part_ghlo
36.44 s
>
36.44 s
> test result: FAILED. 0 passed; 1 failed; 0 ignored; 0 measured; 5 filtered out; finished in 0.40s
36.44 s
>
36.44 s
> stderr ---
36.44 s
> The application panicked (crashed).
36.44 s
> Message: snapshot assertion for 'finit_part_ghlo' failed in line 557
36.44 s
> Location: /nix/store/9a12dww58xis3an3kmn597llpijv83b1-vendor-cargo-deps/c19b7c6f923b580ac259164a89f2577984ad5ab09ee9d583b888f934adbbe8d0/insta-1.47.2/src/runtime.rs :719
36.44 s
>
36.44 s
> ━━━━━━━━━━━━━━━━━━━━━━━━━━━━━━━━━━ BACKTRACE ━━━━━━━━━━━━━━━━━━━━━━━━━━━━━━━━━━━
36.44 s
> 1: <color_eyre[51793ea62743adbd]::config::PanicHook>::panic_report <unknown>
36.44 s
> at <unknown source file> :<unknown line>
36.44 s
> 2: <color_eyre[51793ea62743adbd]::config::PanicHook>::into_panic_hook::{closure#0} <unknown>
36.44 s
> at <unknown source file> :<unknown line>
36.44 s
> 3: std[bcb96dfbba0ab899]::panicking::panic_with_hook <unknown>
36.44 s
> at <unknown source file> :<unknown line>
36.44 s
> 4: std[bcb96dfbba0ab899]::panicking::panic_handler::{closure#0} <unknown>
36.44 s
> at <unknown source file> :<unknown line>
36.44 s
> 5: std[bcb96dfbba0ab899]::sys::backtrace::__rust_end_short_backtrace::<std[bcb96dfbba0ab899]::panicking::panic_handler::{closure#0}, !> <unknown>
36.44 s
> at <unknown source file> :<unknown line>
36.44 s
> 6: __rustc[6c289b9f9c454d21]::rust_begin_unwind <unknown>
36.44 s
> at <unknown source file> :<unknown line>
36.44 s
> 7: core[940e698046960fd5]::panicking::panic_fmt <unknown>
36.44 s
> at <unknown source file> :<unknown line>
36.44 s
> 8: insta[307a548ac79ef4d9]::runtime::assert_snapshot <unknown>
36.44 s
> at <unknown source file> :<unknown line>
36.44 s
> 9: <test_renormalization[e6829672f1ddb150]::finit_part_ghlo::{closure#0} as core[940e698046960fd5]::ops::function::FnOnce<()>>::call_once <unknown>
36.44 s
> at <unknown source file> :<unknown line>
36.44 s
> 10: test[75d6903177b1d7e9]::__rust_begin_short_backtrace::<core[940e698046960fd5]::result::Result<(), alloc[2ea6bcb46fca0c42]::string::String>, fn() -> core[940e698046960fd5]::result::Result<(), alloc[2ea6bcb46fca0c42]::string::String>> <unknown>
36.44 s
> at <unknown source file> :<unknown line>
36.44 s
> 11: test[75d6903177b1d7e9]::run_test::{closure#0} <unknown>
36.44 s
> at <unknown source file> :<unknown line>
36.44 s
> 12: std[bcb96dfbba0ab899]::sys::backtrace::__rust_begin_short_backtrace::<test[75d6903177b1d7e9]::run_test::{closure#1}, ()> <unknown>
36.44 s
> at <unknown source file> :<unknown line>
36.44 s
> 13: <std[bcb96dfbba0ab899]::thread::lifecycle::spawn_unchecked<test[75d6903177b1d7e9]::run_test::{closure#1}, ()>::{closure#1} as core[940e698046960fd5]::ops::function::FnOnce<()>>::call_once::{shim:vtable#0} <unknown>
36.44 s
> at <unknown source file> :<unknown line>
36.44 s
> 14: <std[bcb96dfbba0ab899]::sys::thread::unix::Thread>::new::thread_start <unknown>
36.44 s
> at <unknown source file> :<unknown line>
36.44 s
> 15: start_thread <unknown>
36.44 s
> at <unknown source file> :<unknown line>
36.44 s
> 16: __clone3 <unknown>
36.44 s
> at <unknown source file> :<unknown line>
36.44 s
>
36.44 s
> Run with COLORBT_SHOW_HIDDEN=1 environment variable to disable frame filtering.
36.44 s
> Run with RUST_BACKTRACE=full to include source snippets.
36.44 s
>
36.44 s
> FAIL [ 3.212s] (452/456) gammalooprs::test_renormalization finite_part_ghost_2loop
36.44 s
> stdout ---
36.44 s
>
36.44 s
> running 1 test
36.44 s
> ━━━━━━━━━━━━━━━━━━━━━━━━━━━━━━━ Snapshot Summary ━━━━━━━━━━━━━━━━━━━━━━━━━━━━━━━
36.44 s
> Snapshot: finite_part_ghost_2loop-3
36.44 s
> Source: crates/gammalooprs/tests/test_renormalization.rs:464
36.44 s
> ────────────────────────────────────────────────────────────────────────────────
36.44 s
> Expression: align_to_rqft(&a, &model).to_bare_ordered_string()
36.44 s
> ────────────────────────────────────────────────────────────────────────────────
36.44 s
> -old snapshot
36.44 s
> +new results
36.44 s
> ────────────┬───────────────────────────────────────────────────────────────────
36.44 s
> 1 │-(-1𝑖/32*ε+1𝑖/16)*(cas(2,coad(8)))^2*dot(P(0,mink(4)),P(0,mink(4)))*gs^4*ε^(-2)
36.44 s
> 1 │+(-1𝑖/16+1𝑖/32*ε)*(cas(2,coad(8)))^2*dot(P(0,mink(4)),P(0,mink(4)))*gs^4*ε^(-2)
36.44 s
> ────────────┴───────────────────────────────────────────────────────────────────
36.44 s
> To update snapshots run `cargo insta review`
36.44 s
> Stopped on the first failure. Run `cargo insta test` to run all snapshots.
36.44 s
> test finite_part_ghost_2loop ... FAILED
36.44 s
>
36.44 s
> failures:
36.44 s
>
36.44 s
> failures:
36.44 s
> finite_part_ghost_2loop
36.44 s
>
36.44 s
> test result: FAILED. 0 passed; 1 failed; 0 ignored; 0 measured; 5 filtered out; finished in 3.20s
36.44 s
>
36.44 s
> stderr ---
36.44 s
> The application panicked (crashed).
36.44 s
> Message: snapshot assertion for 'finite_part_ghost_2loop-3' failed in line 464
36.44 s
> Location: /nix/store/9a12dww58xis3an3kmn597llpijv83b1-vendor-cargo-deps/c19b7c6f923b580ac259164a89f2577984ad5ab09ee9d583b888f934adbbe8d0/insta-1.47.2/src/runtime.rs :719
36.44 s
>
36.44 s
> ━━━━━━━━━━━━━━━━━━━━━━━━━━━━━━━━━━ BACKTRACE ━━━━━━━━━━━━━━━━━━━━━━━━━━━━━━━━━━━
36.44 s
> 1: <color_eyre[51793ea62743adbd]::config::PanicHook>::panic_report <unknown>
36.44 s
> at <unknown source file> :<unknown line>
36.44 s
> 2: <color_eyre[51793ea62743adbd]::config::PanicHook>::into_panic_hook::{closure#0} <unknown>
36.44 s
> at <unknown source file> :<unknown line>
36.44 s
> 3: std[bcb96dfbba0ab899]::panicking::panic_with_hook <unknown>
36.44 s
> at <unknown source file> :<unknown line>
36.44 s
> 4: std[bcb96dfbba0ab899]::panicking::panic_handler::{closure#0} <unknown>
36.44 s
> at <unknown source file> :<unknown line>
36.44 s
> 5: std[bcb96dfbba0ab899]::sys::backtrace::__rust_end_short_backtrace::<std[bcb96dfbba0ab899]::panicking::panic_handler::{closure#0}, !> <unknown>
36.44 s
> at <unknown source file> :<unknown line>
36.44 s
> 6: __rustc[6c289b9f9c454d21]::rust_begin_unwind <unknown>
36.44 s
> at <unknown source file> :<unknown line>
36.44 s
> 7: core[940e698046960fd5]::panicking::panic_fmt <unknown>
36.44 s
> at <unknown source file> :<unknown line>
36.44 s
> 8: insta[307a548ac79ef4d9]::runtime::assert_snapshot <unknown>
36.44 s
> at <unknown source file> :<unknown line>
36.44 s
> 9: test_renormalization[e6829672f1ddb150]::finite_part_ghost_2loop <unknown>
36.44 s
> at <unknown source file> :<unknown line>
36.44 s
> 10: <test_renormalization[e6829672f1ddb150]::finite_part_ghost_2loop::{closure#0} as core[940e698046960fd5]::ops::function::FnOnce<()>>::call_once <unknown>
36.44 s
> at <unknown source file> :<unknown line>
36.44 s
> 11: test[75d6903177b1d7e9]::__rust_begin_short_backtrace::<core[940e698046960fd5]::result::Result<(), alloc[2ea6bcb46fca0c42]::string::String>, fn() -> core[940e698046960fd5]::result::Result<(), alloc[2ea6bcb46fca0c42]::string::String>> <unknown>
36.44 s
> at <unknown source file> :<unknown line>
36.44 s
> 12: test[75d6903177b1d7e9]::run_test::{closure#0} <unknown>
36.44 s
> at <unknown source file> :<unknown line>
36.44 s
> 13: std[bcb96dfbba0ab899]::sys::backtrace::__rust_begin_short_backtrace::<test[75d6903177b1d7e9]::run_test::{closure#1}, ()> <unknown>
36.44 s
> at <unknown source file> :<unknown line>
36.44 s
> 14: <std[bcb96dfbba0ab899]::thread::lifecycle::spawn_unchecked<test[75d6903177b1d7e9]::run_test::{closure#1}, ()>::{closure#1} as core[940e698046960fd5]::ops::function::FnOnce<()>>::call_once::{shim:vtable#0} <unknown>
36.44 s
> at <unknown source file> :<unknown line>
36.44 s
> 15: <std[bcb96dfbba0ab899]::sys::thread::unix::Thread>::new::thread_start <unknown>
36.44 s
> at <unknown source file> :<unknown line>
36.44 s
> 16: start_thread <unknown>
36.44 s
> at <unknown source file> :<unknown line>
36.44 s
> 17: __clone3 <unknown>
36.44 s
> at <unknown source file> :<unknown line>
36.44 s
>
36.44 s
> Run with COLORBT_SHOW_HIDDEN=1 environment variable to disable frame filtering.
36.44 s
> Run with RUST_BACKTRACE=full to include source snippets.
36.44 s
>
36.44 s
> error : test run failed
36.44 s
>
36.44 s
> ========== nextest test summary ==========
36.44 s
> report: target/nextest/ci_gammaloop/junit.xml
36.44 s
> tests: 456, failures: 2, errors: 0
36.44 s
>
36.44 s
> 1. gammalooprs::test_renormalization::finit_part_ghlo
36.44 s
> failure: test failure with exit code 101
36.44 s
> system-out
36.44 s
> running 1 test
36.44 s
> ren part: 1/2*GC_10^2*dot(P(0,mink(dim)),P(0,mink(dim)))*cas(2,coad(8))/ε
36.44 s
> ━━━━━━━━━━━━━━━━━━━━━━━━━━━━━━━ Snapshot Summary ━━━━━━━━━━━━━━━━━━━━━━━━━━━━━━━
36.44 s
> Snapshot: finit_part_ghlo
36.44 s
> Source: crates/gammalooprs/tests/test_renormalization.rs:557
36.44 s
> ────────────────────────────────────────────────────────────────────────────────
36.44 s
> Expression: align_to_rqft(&a, &model).to_bare_ordered_string()
36.44 s
> ────────────────────────────────────────────────────────────────────────────────
36.44 s
> -old snapshot
36.44 s
> +new results
36.44 s
> ────────────┬───────────────────────────────────────────────────────────────────
36.44 s
> 1 │--1/2*cas(2,coad(8))*dot(P(0,mink(4)),P(0,mink(4)))*gs^2*ε^(-1)
36.44 s
> 1 │+1/2*cas(2,coad(8))*dot(P(0,mink(4)),P(0,mink(4)))*gs^2*ε^(-1)
36.44 s
> ────────────┴───────────────────────────────────────────────────────────────────
36.44 s
> To update snapshots run `cargo insta review`
36.44 s
> Stopped on the first failure. Run `cargo insta test` to run all snapshots.
36.44 s
> test finit_part_ghlo ... FAILED
36.44 s
>
36.44 s
> failures:
36.44 s
>
36.44 s
> failures:
36.44 s
> finit_part_ghlo
36.44 s
>
36.44 s
> test result: FAILED. 0 passed; 1 failed; 0 ignored; 0 measured; 5 filtered out; finished in 0.40s
36.44 s
> system-err
36.44 s
> The application panicked (crashed).
36.44 s
> Message: snapshot assertion for 'finit_part_ghlo' failed in line 557
36.44 s
> Location: /nix/store/9a12dww58xis3an3kmn597llpijv83b1-vendor-cargo-deps/c19b7c6f923b580ac259164a89f2577984ad5ab09ee9d583b888f934adbbe8d0/insta-1.47.2/src/runtime.rs:719
36.44 s
>
36.44 s
> ━━━━━━━━━━━━━━━━━━━━━━━━━━━━━━━━━━ BACKTRACE ━━━━━━━━━━━━━━━━━━━━━━━━━━━━━━━━━━━
36.44 s
> 1: <color_eyre[51793ea62743adbd]::config::PanicHook>::panic_report<unknown>
36.44 s
> at <unknown source file>:<unknown line>
36.44 s
> 2: <color_eyre[51793ea62743adbd]::config::PanicHook>::into_panic_hook::{closure#0}<unknown>
36.44 s
> at <unknown source file>:<unknown line>
36.44 s
> 3: std[bcb96dfbba0ab899]::panicking::panic_with_hook<unknown>
36.44 s
> at <unknown source file>:<unknown line>
36.44 s
> 4: std[bcb96dfbba0ab899]::panicking::panic_handler::{closure#0}<unknown>
36.44 s
> at <unknown source file>:<unknown line>
36.44 s
> 5: std[bcb96dfbba0ab899]::sys::backtrace::__rust_end_short_backtrace::<std[bcb96dfbba0ab899]::panicking::panic_handler::{closure#0}, !><unknown>
36.44 s
> at <unknown source file>:<unknown line>
36.44 s
> 6: __rustc[6c289b9f9c454d21]::rust_begin_unwind<unknown>
36.44 s
> at <unknown source file>:<unknown line>
36.44 s
> 7: core[940e698046960fd5]::panicking::panic_fmt<unknown>
36.44 s
> at <unknown source file>:<unknown line>
36.44 s
> 8: insta[307a548ac79ef4d9]::runtime::assert_snapshot<unknown>
36.44 s
> at <unknown source file>:<unknown line>
36.44 s
> 9: <test_renormalization[e6829672f1ddb150]::finit_part_ghlo::{closure#0} as core[940e698046960fd5]::ops::function::FnOnce<()>>::call_once<unknown>
36.44 s
> at <unknown source file>:<unknown line>
36.44 s
> 10: test[75d6903177b1d7e9]::__rust_begin_short_backtrace::<core[940e698046960fd5]::result::Result<(), alloc[2ea6bcb46fca0c42]::string::String>, fn() -> core[940e698046960fd5]::result::Result<(), alloc[2ea6bcb46fca0c42]::string::String>><unknown>
36.44 s
> at <unknown source file>:<unknown line>
36.44 s
> 11: test[75d6903177b1d7e9]::run_test::{closure#0}<unknown>
36.44 s
> at <unknown source file>:<unknown line>
36.44 s
> 12: std[bcb96dfbba0ab899]::sys::backtrace::__rust_begin_short_backtrace::<test[75d6903177b1d7e9]::run_test::{closure#1}, ()><unknown>
36.44 s
> at <unknown source file>:<unknown line>
36.44 s
> 13: <std[bcb96dfbba0ab899]::thread::lifecycle::spawn_unchecked<test[75d6903177b1d7e9]::run_test::{closure#1}, ()>::{closure#1} as core[940e698046960fd5]::ops::function::FnOnce<()>>::call_once::{shim:vtable#0}<unknown>
36.44 s
> at <unknown source file>:<unknown line>
36.44 s
> 14: <std[bcb96dfbba0ab899]::sys::thread::unix::Thread>::new::thread_start<unknown>
36.44 s
> at <unknown source file>:<unknown line>
36.44 s
> 15: start_thread<unknown>
36.44 s
> at <unknown source file>:<unknown line>
36.44 s
> 16: __clone3<unknown>
36.44 s
> at <unknown source file>:<unknown line>
36.44 s
>
36.44 s
> Run with COLORBT_SHOW_HIDDEN=1 environment variable to disable frame filtering.
36.44 s
> Run with RUST_BACKTRACE=full to include source snippets.
36.44 s
>
36.44 s
> 2. gammalooprs::test_renormalization::finite_part_ghost_2loop
36.44 s
> failure: test failure with exit code 101
36.44 s
> system-out
36.44 s
> running 1 test
36.44 s
> ━━━━━━━━━━━━━━━━━━━━━━━━━━━━━━━ Snapshot Summary ━━━━━━━━━━━━━━━━━━━━━━━━━━━━━━━
36.44 s
> Snapshot: finite_part_ghost_2loop-3
36.44 s
> Source: crates/gammalooprs/tests/test_renormalization.rs:464
36.44 s
> ────────────────────────────────────────────────────────────────────────────────
36.44 s
> Expression: align_to_rqft(&a, &model).to_bare_ordered_string()
36.44 s
> ────────────────────────────────────────────────────────────────────────────────
36.44 s
> -old snapshot
36.44 s
> +new results
36.44 s
> ────────────┬───────────────────────────────────────────────────────────────────
36.44 s
> 1 │-(-1𝑖/32*ε+1𝑖/16)*(cas(2,coad(8)))^2*dot(P(0,mink(4)),P(0,mink(4)))*gs^4*ε^(-2)
36.44 s
> 1 │+(-1𝑖/16+1𝑖/32*ε)*(cas(2,coad(8)))^2*dot(P(0,mink(4)),P(0,mink(4)))*gs^4*ε^(-2)
36.44 s
> ────────────┴───────────────────────────────────────────────────────────────────
36.44 s
> To update snapshots run `cargo insta review`
36.44 s
> Stopped on the first failure. Run `cargo insta test` to run all snapshots.
36.44 s
> test finite_part_ghost_2loop ... FAILED
36.44 s
>
36.44 s
> failures:
36.44 s
>
36.44 s
> failures:
36.44 s
> finite_part_ghost_2loop
36.44 s
>
36.44 s
> test result: FAILED. 0 passed; 1 failed; 0 ignored; 0 measured; 5 filtered out; finished in 3.20s
36.44 s
> system-err
36.44 s
> The application panicked (crashed).
36.44 s
> Message: snapshot assertion for 'finite_part_ghost_2loop-3' failed in line 464
36.44 s
> Location: /nix/store/9a12dww58xis3an3kmn597llpijv83b1-vendor-cargo-deps/c19b7c6f923b580ac259164a89f2577984ad5ab09ee9d583b888f934adbbe8d0/insta-1.47.2/src/runtime.rs:719
36.44 s
>
36.44 s
> ━━━━━━━━━━━━━━━━━━━━━━━━━━━━━━━━━━ BACKTRACE ━━━━━━━━━━━━━━━━━━━━━━━━━━━━━━━━━━━
36.44 s
> 1: <color_eyre[51793ea62743adbd]::config::PanicHook>::panic_report<unknown>
36.44 s
> at <unknown source file>:<unknown line>
36.44 s
> 2: <color_eyre[51793ea62743adbd]::config::PanicHook>::into_panic_hook::{closure#0}<unknown>
36.44 s
> at <unknown source file>:<unknown line>
36.44 s
> 3: std[bcb96dfbba0ab899]::panicking::panic_with_hook<unknown>
36.44 s
> at <unknown source file>:<unknown line>
36.44 s
> 4: std[bcb96dfbba0ab899]::panicking::panic_handler::{closure#0}<unknown>
36.44 s
> at <unknown source file>:<unknown line>
36.44 s
> 5: std[bcb96dfbba0ab899]::sys::backtrace::__rust_end_short_backtrace::<std[bcb96dfbba0ab899]::panicking::panic_handler::{closure#0}, !><unknown>
36.44 s
> at <unknown source file>:<unknown line>
36.44 s
> 6: __rustc[6c289b9f9c454d21]::rust_begin_unwind<unknown>
36.44 s
> at <unknown source file>:<unknown line>
36.44 s
> 7: core[940e698046960fd5]::panicking::panic_fmt<unknown>
36.44 s
> at <unknown source file>:<unknown line>
36.44 s
> 8: insta[307a548ac79ef4d9]::runtime::assert_snapshot<unknown>
36.44 s
> at <unknown source file>:<unknown line>
36.44 s
> 9: test_renormalization[e6829672f1ddb150]::finite_part_ghost_2loop<unknown>
36.44 s
> at <unknown source file>:<unknown line>
36.44 s
> 10: <test_renormalization[e6829672f1ddb150]::finite_part_ghost_2loop::{closure#0} as core[940e698046960fd5]::ops::function::FnOnce<()>>::call_once<unknown>
36.44 s
> at <unknown source file>:<unknown line>
36.44 s
> 11: test[75d6903177b1d7e9]::__rust_begin_short_backtrace::<core[940e698046960fd5]::result::Result<(), alloc[2ea6bcb46fca0c42]::string::String>, fn() -> core[940e698046960fd5]::result::Result<(), alloc[2ea6bcb46fca0c42]::string::String>><unknown>
36.44 s
> at <unknown source file>:<unknown line>
36.44 s
> 12: test[75d6903177b1d7e9]::run_test::{closure#0}<unknown>
36.44 s
> at <unknown source file>:<unknown line>
36.44 s
> 13: std[bcb96dfbba0ab899]::sys::backtrace::__rust_begin_short_backtrace::<test[75d6903177b1d7e9]::run_test::{closure#1}, ()><unknown>
36.44 s
> at <unknown source file>:<unknown line>
36.44 s
> 14: <std[bcb96dfbba0ab899]::thread::lifecycle::spawn_unchecked<test[75d6903177b1d7e9]::run_test::{closure#1}, ()>::{closure#1} as core[940e698046960fd5]::ops::function::FnOnce<()>>::call_once::{shim:vtable#0}<unknown>
36.44 s
> at <unknown source file>:<unknown line>
36.44 s
> 15: <std[bcb96dfbba0ab899]::sys::thread::unix::Thread>::new::thread_start<unknown>
36.44 s
> at <unknown source file>:<unknown line>
36.44 s
> 16: start_thread<unknown>
36.44 s
> at <unknown source file>:<unknown line>
36.44 s
> 17: __clone3<unknown>
36.44 s
> at <unknown source file>:<unknown line>
36.44 s
>
36.44 s
> Run with COLORBT_SHOW_HIDDEN=1 environment variable to disable frame filtering.
36.44 s
> Run with RUST_BACKTRACE=full to include source snippets.
36.44 s
> =========================================
36.44 s
For full logs, run:
36.44 s
nix log /nix/store/w43vq41dm53nli0ffchnccbgvz2afac5-gammaloop-nextest-core.drv
36.58 s
Run failed.