test packages.x86_64-linux.nix-ci-check-gammaloop-nextest-spenso
0.14 s
$ /nix/store/9ypz3flqsrl5xl495mm8h645gadjsxi1-coreutils-9.11/bin/timeout --kill-after=15s 7200s /nix/store/23zk8sgzamrbmj1fday15szf7f2279s8-nix-2.34.7/bin/nix --extra-experimental-features nix-command --extra-experimental-features flakes flake clone git+https://github.com/alphal00p/gammaloop --dest /tmp/nix-ci-worker/stable-pwd/repo/
0.17 s
Cloning into '/tmp/nix-ci-worker/stable-pwd/repo'...
1.07 s
remote: Enumerating objects: 65311, done.
1.16 s
remote: Counting objects: 0% (1/7962)
remote: Counting objects: 1% (80/7962)
remote: Counting objects: 2% (160/7962)
remote: Counting objects: 3% (239/7962)
remote: Counting objects: 4% (319/7962)
remote: Counting objects: 5% (399/7962)
remote: Counting objects: 6% (478/7962)
remote: Counting objects: 7% (558/7962)
remote: Counting objects: 8% (637/7962)
remote: Counting objects: 9% (717/7962)
remote: Counting objects: 10% (797/7962)
remote: Counting objects: 11% (876/7962)
remote: Counting objects: 12% (956/7962)
remote: Counting objects: 13% (1036/7962)
remote: Counting objects: 14% (1115/7962)
remote: Counting objects: 15% (1195/7962)
remote: Counting objects: 16% (1274/7962)
remote: Counting objects: 17% (1354/7962)
remote: Counting objects: 18% (1434/7962)
remote: Counting objects: 19% (1513/7962)
remote: Counting objects: 20% (1593/7962)
remote: Counting objects: 21% (1673/7962)
remote: Counting objects: 22% (1752/7962)
remote: Counting objects: 23% (1832/7962)
remote: Counting objects: 24% (1911/7962)
remote: Counting objects: 25% (1991/7962)
remote: Counting objects: 26% (2071/7962)
remote: Counting objects: 27% (2150/7962)
remote: Counting objects: 28% (2230/7962)
remote: Counting objects: 29% (2309/7962)
remote: Counting objects: 30% (2389/7962)
remote: Counting objects: 31% (2469/7962)
remote: Counting objects: 32% (2548/7962)
remote: Counting objects: 33% (2628/7962)
remote: Counting objects: 34% (2708/7962)
remote: Counting objects: 35% (2787/7962)
remote: Counting objects: 36% (2867/7962)
remote: Counting objects: 37% (2946/7962)
remote: Counting objects: 38% (3026/7962)
remote: Counting objects: 39% (3106/7962)
remote: Counting objects: 40% (3185/7962)
remote: Counting objects: 41% (3265/7962)
remote: Counting objects: 42% (3345/7962)
remote: Counting objects: 43% (3424/7962)
remote: Counting objects: 44% (3504/7962)
remote: Counting objects: 45% (3583/7962)
remote: Counting objects: 46% (3663/7962)
remote: Counting objects: 47% (3743/7962)
remote: Counting objects: 48% (3822/7962)
remote: Counting objects: 49% (3902/7962)
remote: Counting objects: 50% (3981/7962)
remote: Counting objects: 51% (4061/7962)
remote: Counting objects: 52% (4141/7962)
remote: Counting objects: 53% (4220/7962)
remote: Counting objects: 54% (4300/7962)
remote: Counting objects: 55% (4380/7962)
remote: Counting objects: 56% (4459/7962)
remote: Counting objects: 57% (4539/7962)
remote: Counting objects: 58% (4618/7962)
remote: Counting objects: 59% (4698/7962)
remote: Counting objects: 60% (4778/7962)
remote: Counting objects: 61% (4857/7962)
remote: Counting objects: 62% (4937/7962)
remote: Counting objects: 63% (5017/7962)
remote: Counting objects: 64% (5096/7962)
remote: Counting objects: 65% (5176/7962)
remote: Counting objects: 66% (5255/7962)
remote: Counting objects: 67% (5335/7962)
remote: Counting objects: 68% (5415/7962)
remote: Counting objects: 69% (5494/7962)
remote: Counting objects: 70% (5574/7962)
remote: Counting objects: 71% (5654/7962)
remote: Counting objects: 72% (5733/7962)
remote: Counting objects: 73% (5813/7962)
remote: Counting objects: 74% (5892/7962)
remote: Counting objects: 75% (5972/7962)
remote: Counting objects: 76% (6052/7962)
remote: Counting objects: 77% (6131/7962)
remote: Counting objects: 78% (6211/7962)
remote: Counting objects: 79% (6290/7962)
remote: Counting objects: 80% (6370/7962)
remote: Counting objects: 81% (6450/7962)
remote: Counting objects: 82% (6529/7962)
remote: Counting objects: 83% (6609/7962)
remote: Counting objects: 84% (6689/7962)
remote: Counting objects: 85% (6768/7962)
remote: Counting objects: 86% (6848/7962)
remote: Counting objects: 87% (6927/7962)
remote: Counting objects: 88% (7007/7962)
remote: Counting objects: 89% (7087/7962)
remote: Counting objects: 90% (7166/7962)
remote: Counting objects: 91% (7246/7962)
remote: Counting objects: 92% (7326/7962)
remote: Counting objects: 93% (7405/7962)
remote: Counting objects: 94% (7485/7962)
remote: Counting objects: 95% (7564/7962)
remote: Counting objects: 96% (7644/7962)
remote: Counting objects: 97% (7724/7962)
remote: Counting objects: 98% (7803/7962)
remote: Counting objects: 99% (7883/7962)
remote: Counting objects: 100% (7962/7962)
remote: Counting objects: 100% (7962/7962), done.
2.73 s
remote: Compressing objects: 0% (1/1618)
remote: Compressing objects: 1% (17/1618)
remote: Compressing objects: 2% (33/1618)
remote: Compressing objects: 3% (49/1618)
remote: Compressing objects: 4% (65/1618)
remote: Compressing objects: 5% (81/1618)
remote: Compressing objects: 6% (98/1618)
remote: Compressing objects: 7% (114/1618)
remote: Compressing objects: 8% (130/1618)
remote: Compressing objects: 9% (146/1618)
remote: Compressing objects: 10% (162/1618)
remote: Compressing objects: 11% (178/1618)
remote: Compressing objects: 12% (195/1618)
remote: Compressing objects: 13% (211/1618)
remote: Compressing objects: 14% (227/1618)
remote: Compressing objects: 15% (243/1618)
remote: Compressing objects: 16% (259/1618)
remote: Compressing objects: 16% (261/1618)
remote: Compressing objects: 17% (276/1618)
remote: Compressing objects: 18% (292/1618)
remote: Compressing objects: 19% (308/1618)
remote: Compressing objects: 20% (324/1618)
remote: Compressing objects: 21% (340/1618)
remote: Compressing objects: 22% (356/1618)
remote: Compressing objects: 23% (373/1618)
remote: Compressing objects: 24% (389/1618)
remote: Compressing objects: 25% (405/1618)
remote: Compressing objects: 26% (421/1618)
remote: Compressing objects: 27% (437/1618)
remote: Compressing objects: 28% (454/1618)
remote: Compressing objects: 29% (470/1618)
remote: Compressing objects: 30% (486/1618)
remote: Compressing objects: 31% (502/1618)
remote: Compressing objects: 32% (518/1618)
remote: Compressing objects: 33% (534/1618)
remote: Compressing objects: 34% (551/1618)
remote: Compressing objects: 35% (567/1618)
remote: Compressing objects: 36% (583/1618)
remote: Compressing objects: 37% (599/1618)
remote: Compressing objects: 38% (615/1618)
remote: Compressing objects: 39% (632/1618)
remote: Compressing objects: 40% (648/1618)
remote: Compressing objects: 41% (664/1618)
remote: Compressing objects: 42% (680/1618)
remote: Compressing objects: 43% (696/1618)
remote: Compressing objects: 44% (712/1618)
remote: Compressing objects: 45% (729/1618)
remote: Compressing objects: 46% (745/1618)
remote: Compressing objects: 47% (761/1618)
remote: Compressing objects: 48% (777/1618)
remote: Compressing objects: 49% (793/1618)
remote: Compressing objects: 50% (809/1618)
remote: Compressing objects: 51% (826/1618)
remote: Compressing objects: 52% (842/1618)
remote: Compressing objects: 53% (858/1618)
remote: Compressing objects: 54% (874/1618)
remote: Compressing objects: 55% (890/1618)
remote: Compressing objects: 56% (907/1618)
remote: Compressing objects: 57% (923/1618)
remote: Compressing objects: 58% (939/1618)
remote: Compressing objects: 59% (955/1618)
remote: Compressing objects: 60% (971/1618)
remote: Compressing objects: 61% (987/1618)
remote: Compressing objects: 62% (1004/1618)
remote: Compressing objects: 63% (1020/1618)
remote: Compressing objects: 64% (1036/1618)
remote: Compressing objects: 65% (1052/1618)
remote: Compressing objects: 66% (1068/1618)
remote: Compressing objects: 67% (1085/1618)
remote: Compressing objects: 68% (1101/1618)
remote: Compressing objects: 69% (1117/1618)
remote: Compressing objects: 70% (1133/1618)
remote: Compressing objects: 71% (1149/1618)
remote: Compressing objects: 72% (1165/1618)
remote: Compressing objects: 73% (1182/1618)
remote: Compressing objects: 74% (1198/1618)
remote: Compressing objects: 75% (1214/1618)
remote: Compressing objects: 76% (1230/1618)
remote: Compressing objects: 77% (1246/1618)
remote: Compressing objects: 78% (1263/1618)
remote: Compressing objects: 79% (1279/1618)
remote: Compressing objects: 80% (1295/1618)
remote: Compressing objects: 81% (1311/1618)
remote: Compressing objects: 82% (1327/1618)
remote: Compressing objects: 83% (1343/1618)
remote: Compressing objects: 84% (1360/1618)
remote: Compressing objects: 85% (1376/1618)
remote: Compressing objects: 86% (1392/1618)
remote: Compressing objects: 87% (1408/1618)
remote: Compressing objects: 88% (1424/1618)
remote: Compressing objects: 89% (1441/1618)
remote: Compressing objects: 90% (1457/1618)
remote: Compressing objects: 91% (1473/1618)
remote: Compressing objects: 92% (1489/1618)
remote: Compressing objects: 93% (1505/1618)
remote: Compressing objects: 94% (1521/1618)
remote: Compressing objects: 95% (1538/1618)
remote: Compressing objects: 96% (1554/1618)
remote: Compressing objects: 97% (1570/1618)
remote: Compressing objects: 98% (1586/1618)
remote: Compressing objects: 99% (1602/1618)
remote: Compressing objects: 100% (1618/1618)
remote: Compressing objects: 100% (1618/1618), done.
5.42 s
Receiving objects: 0% (1/65311)
Receiving objects: 1% (654/65311)
Receiving objects: 2% (1307/65311)
Receiving objects: 3% (1960/65311)
Receiving objects: 4% (2613/65311)
Receiving objects: 5% (3266/65311)
Receiving objects: 6% (3919/65311)
Receiving objects: 7% (4572/65311)
Receiving objects: 8% (5225/65311)
Receiving objects: 9% (5878/65311)
Receiving objects: 10% (6532/65311)
Receiving objects: 11% (7185/65311)
Receiving objects: 12% (7838/65311), 12.80 MiB | 25.58 MiB/s
Receiving objects: 13% (8491/65311), 12.80 MiB | 25.58 MiB/s
Receiving objects: 14% (9144/65311), 12.80 MiB | 25.58 MiB/s
Receiving objects: 15% (9797/65311), 12.80 MiB | 25.58 MiB/s
Receiving objects: 16% (10450/65311), 12.80 MiB | 25.58 MiB/s
Receiving objects: 17% (11103/65311), 12.80 MiB | 25.58 MiB/s
Receiving objects: 18% (11756/65311), 12.80 MiB | 25.58 MiB/s
Receiving objects: 19% (12410/65311), 12.80 MiB | 25.58 MiB/s
Receiving objects: 20% (13063/65311), 12.80 MiB | 25.58 MiB/s
Receiving objects: 21% (13716/65311), 12.80 MiB | 25.58 MiB/s
Receiving objects: 22% (14369/65311), 12.80 MiB | 25.58 MiB/s
Receiving objects: 23% (15022/65311), 12.80 MiB | 25.58 MiB/s
Receiving objects: 24% (15675/65311), 12.80 MiB | 25.58 MiB/s
Receiving objects: 25% (16328/65311), 12.80 MiB | 25.58 MiB/s
Receiving objects: 26% (16981/65311), 12.80 MiB | 25.58 MiB/s
Receiving objects: 27% (17634/65311), 12.80 MiB | 25.58 MiB/s
Receiving objects: 28% (18288/65311), 12.80 MiB | 25.58 MiB/s
Receiving objects: 29% (18941/65311), 12.80 MiB | 25.58 MiB/s
Receiving objects: 30% (19594/65311), 12.80 MiB | 25.58 MiB/s
Receiving objects: 31% (20247/65311), 12.80 MiB | 25.58 MiB/s
Receiving objects: 32% (20900/65311), 12.80 MiB | 25.58 MiB/s
Receiving objects: 33% (21553/65311), 12.80 MiB | 25.58 MiB/s
Receiving objects: 34% (22206/65311), 12.80 MiB | 25.58 MiB/s
Receiving objects: 35% (22859/65311), 12.80 MiB | 25.58 MiB/s
Receiving objects: 36% (23512/65311), 12.80 MiB | 25.58 MiB/s
Receiving objects: 37% (24166/65311), 12.80 MiB | 25.58 MiB/s
Receiving objects: 38% (24819/65311), 12.80 MiB | 25.58 MiB/s
Receiving objects: 39% (25472/65311), 12.80 MiB | 25.58 MiB/s
Receiving objects: 40% (26125/65311), 12.80 MiB | 25.58 MiB/s
Receiving objects: 41% (26778/65311), 12.80 MiB | 25.58 MiB/s
Receiving objects: 42% (27431/65311), 12.80 MiB | 25.58 MiB/s
Receiving objects: 43% (28084/65311), 12.80 MiB | 25.58 MiB/s
Receiving objects: 44% (28737/65311), 12.80 MiB | 25.58 MiB/s
Receiving objects: 45% (29390/65311), 12.80 MiB | 25.58 MiB/s
Receiving objects: 46% (30044/65311), 12.80 MiB | 25.58 MiB/s
Receiving objects: 47% (30697/65311), 12.80 MiB | 25.58 MiB/s
Receiving objects: 48% (31350/65311), 12.80 MiB | 25.58 MiB/s
Receiving objects: 49% (32003/65311), 12.80 MiB | 25.58 MiB/s
Receiving objects: 50% (32656/65311), 12.80 MiB | 25.58 MiB/s
Receiving objects: 50% (32753/65311), 30.50 MiB | 30.25 MiB/s
Receiving objects: 51% (33309/65311), 30.50 MiB | 30.25 MiB/s
Receiving objects: 52% (33962/65311), 30.50 MiB | 30.25 MiB/s
Receiving objects: 53% (34615/65311), 30.50 MiB | 30.25 MiB/s
Receiving objects: 54% (35268/65311), 30.50 MiB | 30.25 MiB/s
Receiving objects: 55% (35922/65311), 30.50 MiB | 30.25 MiB/s
Receiving objects: 56% (36575/65311), 30.50 MiB | 30.25 MiB/s
Receiving objects: 57% (37228/65311), 30.50 MiB | 30.25 MiB/s
Receiving objects: 58% (37881/65311), 30.50 MiB | 30.25 MiB/s
Receiving objects: 59% (38534/65311), 30.50 MiB | 30.25 MiB/s
Receiving objects: 60% (39187/65311), 30.50 MiB | 30.25 MiB/s
Receiving objects: 61% (39840/65311), 30.50 MiB | 30.25 MiB/s
Receiving objects: 62% (40493/65311), 47.26 MiB | 31.34 MiB/s
Receiving objects: 63% (41146/65311), 47.26 MiB | 31.34 MiB/s
Receiving objects: 64% (41800/65311), 47.26 MiB | 31.34 MiB/s
Receiving objects: 65% (42453/65311), 47.26 MiB | 31.34 MiB/s
Receiving objects: 66% (43106/65311), 47.26 MiB | 31.34 MiB/s
Receiving objects: 67% (43759/65311), 47.26 MiB | 31.34 MiB/s
Receiving objects: 68% (44412/65311), 47.26 MiB | 31.34 MiB/s
Receiving objects: 69% (45065/65311), 47.26 MiB | 31.34 MiB/s
Receiving objects: 70% (45718/65311), 47.26 MiB | 31.34 MiB/s
Receiving objects: 71% (46371/65311), 47.26 MiB | 31.34 MiB/s
Receiving objects: 72% (47024/65311), 47.26 MiB | 31.34 MiB/s
Receiving objects: 73% (47678/65311), 47.26 MiB | 31.34 MiB/s
Receiving objects: 74% (48331/65311), 47.26 MiB | 31.34 MiB/s
Receiving objects: 74% (48916/65311), 64.12 MiB | 31.93 MiB/s
Receiving objects: 75% (48984/65311), 64.12 MiB | 31.93 MiB/s
Receiving objects: 76% (49637/65311), 64.12 MiB | 31.93 MiB/s
Receiving objects: 77% (50290/65311), 64.12 MiB | 31.93 MiB/s
Receiving objects: 78% (50943/65311), 64.12 MiB | 31.93 MiB/s
Receiving objects: 79% (51596/65311), 64.12 MiB | 31.93 MiB/s
Receiving objects: 80% (52249/65311), 64.12 MiB | 31.93 MiB/s
Receiving objects: 81% (52902/65311), 64.12 MiB | 31.93 MiB/s
Receiving objects: 82% (53556/65311), 64.12 MiB | 31.93 MiB/s
Receiving objects: 83% (54209/65311), 64.12 MiB | 31.93 MiB/s
Receiving objects: 84% (54862/65311), 64.12 MiB | 31.93 MiB/s
Receiving objects: 85% (55515/65311), 64.12 MiB | 31.93 MiB/s
Receiving objects: 86% (56168/65311), 81.08 MiB | 32.21 MiB/s
Receiving objects: 87% (56821/65311), 81.08 MiB | 32.21 MiB/s
Receiving objects: 88% (57474/65311), 81.08 MiB | 32.21 MiB/s
Receiving objects: 89% (58127/65311), 81.08 MiB | 32.21 MiB/s
Receiving objects: 90% (58780/65311), 81.08 MiB | 32.21 MiB/s
Receiving objects: 91% (59434/65311), 81.08 MiB | 32.21 MiB/s
Receiving objects: 92% (60087/65311), 81.08 MiB | 32.21 MiB/s
Receiving objects: 93% (60740/65311), 81.08 MiB | 32.21 MiB/s
Receiving objects: 94% (61393/65311), 81.08 MiB | 32.21 MiB/s
Receiving objects: 95% (62046/65311), 81.08 MiB | 32.21 MiB/s
Receiving objects: 96% (62699/65311), 81.08 MiB | 32.21 MiB/s
Receiving objects: 97% (63352/65311), 81.08 MiB | 32.21 MiB/s
Receiving objects: 98% (64005/65311), 81.08 MiB | 32.21 MiB/s
Receiving objects: 99% (64658/65311), 81.08 MiB | 32.21 MiB/s
remote: Total 65311 (delta 6894), reused 6436 (delta 6334), pack-reused 57349 (from 1)
5.48 s
Receiving objects: 100% (65311/65311), 81.08 MiB | 32.21 MiB/s
Receiving objects: 100% (65311/65311), 87.63 MiB | 32.57 MiB/s, done.
6.07 s
Resolving deltas: 0% (0/46012)
Resolving deltas: 1% (461/46012)
Resolving deltas: 2% (921/46012)
Resolving deltas: 3% (1381/46012)
Resolving deltas: 4% (1841/46012)
Resolving deltas: 5% (2302/46012)
Resolving deltas: 6% (2761/46012)
Resolving deltas: 7% (3221/46012)
Resolving deltas: 8% (3681/46012)
Resolving deltas: 9% (4145/46012)
Resolving deltas: 10% (4602/46012)
Resolving deltas: 11% (5066/46012)
Resolving deltas: 12% (5522/46012)
Resolving deltas: 13% (5982/46012)
Resolving deltas: 14% (6442/46012)
Resolving deltas: 15% (6902/46012)
Resolving deltas: 16% (7362/46012)
Resolving deltas: 17% (7823/46012)
Resolving deltas: 18% (8283/46012)
Resolving deltas: 19% (8743/46012)
Resolving deltas: 20% (9203/46012)
Resolving deltas: 21% (9663/46012)
Resolving deltas: 22% (10123/46012)
Resolving deltas: 23% (10583/46012)
Resolving deltas: 24% (11043/46012)
Resolving deltas: 25% (11504/46012)
Resolving deltas: 26% (11964/46012)
Resolving deltas: 27% (12424/46012)
Resolving deltas: 28% (12884/46012)
Resolving deltas: 29% (13344/46012)
Resolving deltas: 30% (13804/46012)
Resolving deltas: 31% (14265/46012)
Resolving deltas: 32% (14725/46012)
Resolving deltas: 33% (15184/46012)
Resolving deltas: 34% (15645/46012)
Resolving deltas: 35% (16108/46012)
Resolving deltas: 36% (16565/46012)
Resolving deltas: 37% (17026/46012)
Resolving deltas: 38% (17485/46012)
Resolving deltas: 39% (17945/46012)
Resolving deltas: 40% (18405/46012)
Resolving deltas: 41% (18865/46012)
Resolving deltas: 42% (19326/46012)
Resolving deltas: 43% (19786/46012)
Resolving deltas: 44% (20246/46012)
Resolving deltas: 45% (20708/46012)
Resolving deltas: 46% (21167/46012)
Resolving deltas: 47% (21626/46012)
Resolving deltas: 48% (22087/46012)
Resolving deltas: 49% (22546/46012)
Resolving deltas: 50% (23006/46012)
Resolving deltas: 51% (23469/46012)
Resolving deltas: 52% (23927/46012)
Resolving deltas: 53% (24387/46012)
Resolving deltas: 54% (24847/46012)
Resolving deltas: 55% (25312/46012)
Resolving deltas: 56% (25767/46012)
Resolving deltas: 57% (26227/46012)
Resolving deltas: 58% (26687/46012)
Resolving deltas: 59% (27148/46012)
Resolving deltas: 60% (27608/46012)
Resolving deltas: 61% (28068/46012)
Resolving deltas: 62% (28529/46012)
Resolving deltas: 63% (28989/46012)
Resolving deltas: 64% (29448/46012)
Resolving deltas: 65% (29908/46012)
Resolving deltas: 66% (30368/46012)
Resolving deltas: 67% (30829/46012)
Resolving deltas: 68% (31289/46012)
Resolving deltas: 69% (31749/46012)
Resolving deltas: 70% (32209/46012)
Resolving deltas: 71% (32669/46012)
Resolving deltas: 72% (33129/46012)
Resolving deltas: 73% (33589/46012)
Resolving deltas: 74% (34049/46012)
Resolving deltas: 75% (34509/46012)
Resolving deltas: 76% (34970/46012)
Resolving deltas: 77% (35430/46012)
Resolving deltas: 78% (35890/46012)
Resolving deltas: 79% (36352/46012)
Resolving deltas: 80% (36810/46012)
Resolving deltas: 81% (37270/46012)
Resolving deltas: 82% (37730/46012)
Resolving deltas: 83% (38190/46012)
Resolving deltas: 84% (38651/46012)
Resolving deltas: 85% (39111/46012)
Resolving deltas: 86% (39571/46012)
Resolving deltas: 87% (40032/46012)
Resolving deltas: 88% (40491/46012)
Resolving deltas: 89% (40951/46012)
Resolving deltas: 90% (41411/46012)
Resolving deltas: 91% (41871/46012)
Resolving deltas: 92% (42332/46012)
Resolving deltas: 93% (42792/46012)
Resolving deltas: 94% (43252/46012)
Resolving deltas: 95% (43712/46012)
Resolving deltas: 96% (44173/46012)
Resolving deltas: 97% (44633/46012)
Resolving deltas: 98% (45092/46012)
Resolving deltas: 99% (45552/46012)
Resolving deltas: 100% (46012/46012)
Resolving deltas: 100% (46012/46012), done.
6.34 s
Fetching commit 7b5358c6b7be5a42e56da6160542ea0d424ced97 for vakint_rustred ...
6.34 s
$ /nix/store/bcnisk3ydfgv26v2gw3zlky24g00yww2-git-2.54.0/bin/git fetch origin 7b5358c6b7be5a42e56da6160542ea0d424ced97
6.83 s
From https://github.com/alphal00p/gammaloop
6.83 s
* branch 7b5358c6b7be5a42e56da6160542ea0d424ced97 -> FETCH_HEAD
6.84 s
$ /nix/store/9ypz3flqsrl5xl495mm8h645gadjsxi1-coreutils-9.11/bin/timeout --kill-after=15s 7200s /nix/store/bcnisk3ydfgv26v2gw3zlky24g00yww2-git-2.54.0/bin/git -c advice.detachedHead=false checkout 7b5358c6b7be5a42e56da6160542ea0d424ced97
6.98 s
HEAD is now at 7b5358c6 Bind RustRed artifacts to terminal catalogs
6.99 s
$ /nix/store/9ypz3flqsrl5xl495mm8h645gadjsxi1-coreutils-9.11/bin/timeout --kill-after=15s 7200s /nix/store/23zk8sgzamrbmj1fday15szf7f2279s8-nix-2.34.7/bin/nix --extra-experimental-features nix-command --extra-experimental-features flakes --log-format internal-json run .#packages.x86_64-linux.nix-ci-check-gammaloop-nextest-spenso --print-build-logs
10.44 s
10.76 s
Downloading cached gammaloop-nextest-binaries-spenso-idenso from https://cache.nix-ci.com
10.81 s
Downloading cached gammaloop-nextest-binaries-spenso-spenso from https://cache.nix-ci.com
10.81 s
Downloading cached gammaloop-nextest-binaries-spenso-spenso-hep-lib from https://cache.nix-ci.com
10.81 s
Downloading cached gammaloop-nextest-binaries-spenso-spenso-macros from https://cache.nix-ci.com
10.81 s
Downloading cached gammaloop-nextest-binaries-spenso-symbolica-utils from https://cache.nix-ci.com
11.33 s
Downloaded cached gammaloop-nextest-binaries-spenso-idenso (29.3 MiB) in 565ms
11.33 s
Progress: 0 of 1 built, 1 of 7 downloaded from cache (4 downloading)
11.48 s
Downloaded cached gammaloop-nextest-binaries-spenso-spenso-macros (6.5 MiB) in 669ms
11.48 s
Progress: 0 of 1 built, 2 of 7 downloaded from cache (3 downloading)
11.49 s
Downloaded cached gammaloop-nextest-binaries-spenso-symbolica-utils (6.3 MiB) in 685ms
11.49 s
Progress: 0 of 1 built, 3 of 7 downloaded from cache (2 downloading)
11.73 s
Downloaded cached gammaloop-nextest-binaries-spenso-spenso-hep-lib (34 MiB) in 920ms
11.73 s
Progress: 0 of 1 built, 4 of 7 downloaded from cache (1 downloading)
11.79 s
Downloaded cached gammaloop-nextest-binaries-spenso-spenso (10.2 MiB) in 981ms
11.79 s
Progress: 0 of 1 built, 5 of 7 downloaded from cache
11.79 s
Downloading cached gammaloop-nextest-binaries-spenso from https://cache.nix-ci.com
11.82 s
Downloaded cached gammaloop-nextest-binaries-spenso (1920 B) in 28ms
11.82 s
Progress: 0 of 1 built, 6 of 7 downloaded from cache
11.82 s
Downloading cached nix-ci-check-gammaloop-nextest-spenso from https://cache.nix-ci.com
11.84 s
Downloaded cached nix-ci-check-gammaloop-nextest-spenso (1016 B) in 28ms
11.84 s
Progress: 0 of 1 built, 7 of 7 downloaded from cache
15.35 s
evaluating derivation 'g
querying gammaloop-nexte
[0 /1 built, 0.0 KiB DL]
[1 /0 /1 built, 0.0 KiB DLgammaloop-nextest-spenso> Extracting 5 binaries and 2 linked paths to /build/nextest-archive-J2DSg6
15.51 s
gammaloop-nextest-spenso> Extracted 19 files to /build/nextest-archive-J2DSg6 in 0.16s
15.52 s
gammaloop-nextest-spenso> ------------
15.52 s
gammaloop-nextest-spenso> Nextest run ID c7e42a0d-b4ce-4a33-9da8-0ab5807af8e0 with nextest profile: ci_gammaloop
15.52 s
gammaloop-nextest-spenso> Starting 224 tests across 5 binaries (26 tests skipped , including 2 tests via profile.ci_gammaloop.default-filter )
15.60 s
gammaloop-nextest-spenso> FAIL [ 0.009s] ( 44/224) idenso color::test::form_reference :: metric_contraction_respects_antisymmetric_normalization
15.60 s
gammaloop-nextest-spenso> stdout ---
15.60 s
gammaloop-nextest-spenso>
15.60 s
gammaloop-nextest-spenso> running 1 test
15.60 s
gammaloop-nextest-spenso> test color::test::form_reference::metric_contraction_respects_antisymmetric_normalization ... FAILED
15.60 s
gammaloop-nextest-spenso>
15.60 s
gammaloop-nextest-spenso> failures:
15.60 s
gammaloop-nextest-spenso>
15.60 s
gammaloop-nextest-spenso> failures:
15.60 s
gammaloop-nextest-spenso> color::test::form_reference::metric_contraction_respects_antisymmetric_normalization
15.60 s
gammaloop-nextest-spenso>
15.60 s
gammaloop-nextest-spenso> test result: FAILED. 0 passed; 1 failed; 0 ignored; 0 measured; 240 filtered out; finished in 0.00s
15.60 s
gammaloop-nextest-spenso>
15.60 s
gammaloop-nextest-spenso> stderr ---
15.60 s
gammaloop-nextest-spenso>
15.60 s
gammaloop-nextest-spenso> thread 'color::test::form_reference::metric_contraction_respects_antisymmetric_normalization' (331) panicked at crates/idenso/src/color/test/form_reference.rs:171:5:
15.60 s
gammaloop-nextest-spenso> assertion `left == right` failed
15.60 s
gammaloop-nextest-spenso> left: "-1*f(coad(8,standalone_metric_j),coad(8,standalone_metric_s),coad(8,standalone_metric_u))"
15.60 s
gammaloop-nextest-spenso> right: "f(coad(8,standalone_metric_j),coad(8,standalone_metric_s),coad(8,standalone_metric_u))"
15.60 s
gammaloop-nextest-spenso> stack backtrace:
15.60 s
gammaloop-nextest-spenso> 0: __rustc::rust_begin_unwind
15.60 s
gammaloop-nextest-spenso> 1: core::panicking::panic_fmt
15.60 s
gammaloop-nextest-spenso> 2: core::panicking::assert_failed_inner
15.60 s
gammaloop-nextest-spenso> 3: core::panicking::assert_failed::<alloc::string::String, alloc::string::String>
15.60 s
gammaloop-nextest-spenso> 4: idenso::color::test::form_reference::metric_contraction_respects_antisymmetric_normalization
15.60 s
gammaloop-nextest-spenso> 5: <idenso::color::test::form_reference::metric_contraction_respects_antisymmetric_normalization::{closure#0} as core::ops::function::FnOnce<()>>::call_once
15.60 s
gammaloop-nextest-spenso> note: Some details are omitted, run with `RUST_BACKTRACE=full` for a verbose backtrace.
15.60 s
gammaloop-nextest-spenso>
15.80 s
gammaloop-nextest-spenso> FAIL [ 0.034s] (218/224) idenso tensor::tests::parsing :: infinite_execution
15.85 s
gammaloop-nextest-spenso> stdout ---
15.85 s
gammaloop-nextest-spenso>
15.85 s
gammaloop-nextest-spenso> running 1 test
15.85 s
gammaloop-nextest-spenso> ━━━━━━━━━━━━━━━━━━━━━━━━━━━━━━━ Snapshot Summary ━━━━━━━━━━━━━━━━━━━━━━━━━━━━━━━
15.85 s
gammaloop-nextest-spenso> Snapshot: infinite_execution
15.85 s
gammaloop-nextest-spenso> Source: crates/idenso/src/tensor/tests/parsing.rs:910
15.85 s
gammaloop-nextest-spenso> ────────────────────────────────────────────────────────────────────────────────
15.85 s
gammaloop-nextest-spenso> Expression: net_iter.snapshot_dot()
15.85 s
gammaloop-nextest-spenso> ────────────────────────────────────────────────────────────────────────────────
15.85 s
gammaloop-nextest-spenso> -old snapshot
15.85 s
gammaloop-nextest-spenso> +new results
15.85 s
gammaloop-nextest-spenso> ────────────┬───────────────────────────────────────────────────────────────────
15.85 s
gammaloop-nextest-spenso> 8 8 │ 0:0:s -> ext0 [id=0 color="red"];
15.85 s
gammaloop-nextest-spenso> 9 9 │ ext1 [style=invis];
15.85 s
gammaloop-nextest-spenso> 10 10 │ 0:5:s -> ext1 [id=1 dir=none color="red" label="mink4|l_0"];
15.85 s
gammaloop-nextest-spenso> 11 11 │ ext2 [style=invis];
15.85 s
gammaloop-nextest-spenso> 12 │- 0:4:s -> ext2 [id=2 dir=none color="red" label="bis4|l_2"];
15.85 s
gammaloop-nextest-spenso> 12 │+ 0:3:s -> ext2 [id=2 dir=none color="red" label="mink4|l_1"];
15.85 s
gammaloop-nextest-spenso> 13 13 │ ext3 [style=invis];
15.85 s
gammaloop-nextest-spenso> 14 │- 0:3:s -> ext3 [id=3 dir=none color="red" label="bis4|l_3"];
15.85 s
gammaloop-nextest-spenso> 14 │+ 0:1:s -> ext3 [id=3 dir=none color="red" label="bis4|l_2"];
15.85 s
gammaloop-nextest-spenso> 15 15 │ ext4 [style=invis];
15.85 s
gammaloop-nextest-spenso> 16 │- 0:1:s -> ext4 [id=4 dir=none color="red" label="mink4|l_1"];
15.85 s
gammaloop-nextest-spenso> 16 │+ 0:2:s -> ext4 [id=4 dir=none color="red" label="mink4|l_4"];
15.85 s
gammaloop-nextest-spenso> 17 17 │ ext5 [style=invis];
15.85 s
gammaloop-nextest-spenso> 18 │- 0:2:s -> ext5 [id=5 dir=none color="red" label="mink4|l_4"];
15.85 s
gammaloop-nextest-spenso> 18 │+ 0:4:s -> ext5 [id=5 dir=none color="red" label="bis4|l_3"];
15.85 s
gammaloop-nextest-spenso> 19 19 │ }
15.85 s
gammaloop-nextest-spenso> ────────────┴───────────────────────────────────────────────────────────────────
15.85 s
gammaloop-nextest-spenso> To update snapshots run `cargo insta review`
15.85 s
gammaloop-nextest-spenso> Stopped on the first failure. Run `cargo insta test` to run all snapshots.
15.85 s
gammaloop-nextest-spenso> test tensor::tests::parsing::infinite_execution ... FAILED
15.85 s
gammaloop-nextest-spenso>
15.85 s
gammaloop-nextest-spenso> failures:
15.85 s
gammaloop-nextest-spenso>
15.85 s
gammaloop-nextest-spenso> failures:
15.85 s
gammaloop-nextest-spenso> tensor::tests::parsing::infinite_execution
15.85 s
gammaloop-nextest-spenso>
15.85 s
gammaloop-nextest-spenso> test result: FAILED. 0 passed; 1 failed; 0 ignored; 0 measured; 240 filtered out; finished in 0.03s
15.85 s
gammaloop-nextest-spenso>
15.85 s
gammaloop-nextest-spenso> stderr ---
15.85 s
gammaloop-nextest-spenso>
15.85 s
gammaloop-nextest-spenso> thread 'tensor::tests::parsing::infinite_execution' (849) panicked at /nix/store/p13pfw1gvvk8m860apfhvzcgidxhbs7g-vendor-cargo-deps/c19b7c6f923b580ac259164a89f2577984ad5ab09ee9d583b888f934adbbe8d0/insta-1.47.2/src/runtime.rs:719:13:
15.85 s
gammaloop-nextest-spenso> snapshot assertion for 'infinite_execution' failed in line 910
15.85 s
gammaloop-nextest-spenso> stack backtrace:
15.85 s
gammaloop-nextest-spenso> 0: __rustc::rust_begin_unwind
15.85 s
gammaloop-nextest-spenso> 1: core::panicking::panic_fmt
15.85 s
gammaloop-nextest-spenso> 2: insta::runtime::assert_snapshot
15.85 s
gammaloop-nextest-spenso> 3: idenso::tensor::tests::parsing::infinite_execution
15.85 s
gammaloop-nextest-spenso> 4: <idenso::tensor::tests::parsing::infinite_execution::{closure#0} as core::ops::function::FnOnce<()>>::call_once
15.85 s
gammaloop-nextest-spenso> note: Some details are omitted, run with `RUST_BACKTRACE=full` for a verbose backtrace.
15.85 s
gammaloop-nextest-spenso>
17.03 s
gammaloop-nextest-spenso> ------------
17.03 s
gammaloop-nextest-spenso> Summary [ 1.510s] 224 tests run: 222 passed , 2 failed , 26 skipped
17.03 s
gammaloop-nextest-spenso> FAIL [ 0.009s] ( 44/224) idenso color::test::form_reference :: metric_contraction_respects_antisymmetric_normalization
17.03 s
gammaloop-nextest-spenso> stdout ---
17.03 s
gammaloop-nextest-spenso>
17.03 s
gammaloop-nextest-spenso> running 1 test
17.03 s
gammaloop-nextest-spenso> test color::test::form_reference::metric_contraction_respects_antisymmetric_normalization ... FAILED
17.03 s
gammaloop-nextest-spenso>
17.03 s
gammaloop-nextest-spenso> failures:
17.03 s
gammaloop-nextest-spenso>
17.03 s
gammaloop-nextest-spenso> failures:
17.03 s
gammaloop-nextest-spenso> color::test::form_reference::metric_contraction_respects_antisymmetric_normalization
17.03 s
gammaloop-nextest-spenso>
17.03 s
gammaloop-nextest-spenso> test result: FAILED. 0 passed; 1 failed; 0 ignored; 0 measured; 240 filtered out; finished in 0.00s
17.03 s
gammaloop-nextest-spenso>
17.03 s
gammaloop-nextest-spenso> stderr ---
17.03 s
gammaloop-nextest-spenso>
17.03 s
gammaloop-nextest-spenso> thread 'color::test::form_reference::metric_contraction_respects_antisymmetric_normalization' (331) panicked at crates/idenso/src/color/test/form_reference.rs:171:5:
17.03 s
gammaloop-nextest-spenso> assertion `left == right` failed
17.03 s
gammaloop-nextest-spenso> left: "-1*f(coad(8,standalone_metric_j),coad(8,standalone_metric_s),coad(8,standalone_metric_u))"
17.03 s
gammaloop-nextest-spenso> right: "f(coad(8,standalone_metric_j),coad(8,standalone_metric_s),coad(8,standalone_metric_u))"
17.03 s
gammaloop-nextest-spenso> stack backtrace:
17.03 s
gammaloop-nextest-spenso> 0: __rustc::rust_begin_unwind
17.03 s
gammaloop-nextest-spenso> 1: core::panicking::panic_fmt
17.03 s
gammaloop-nextest-spenso> 2: core::panicking::assert_failed_inner
17.03 s
gammaloop-nextest-spenso> 3: core::panicking::assert_failed::<alloc::string::String, alloc::string::String>
17.03 s
gammaloop-nextest-spenso> 4: idenso::color::test::form_reference::metric_contraction_respects_antisymmetric_normalization
17.03 s
gammaloop-nextest-spenso> 5: <idenso::color::test::form_reference::metric_contraction_respects_antisymmetric_normalization::{closure#0} as core::ops::function::FnOnce<()>>::call_once
17.03 s
gammaloop-nextest-spenso> note: Some details are omitted, run with `RUST_BACKTRACE=full` for a verbose backtrace.
17.03 s
gammaloop-nextest-spenso>
17.03 s
gammaloop-nextest-spenso> FAIL [ 0.034s] (218/224) idenso tensor::tests::parsing :: infinite_execution
17.03 s
gammaloop-nextest-spenso> stdout ---
17.03 s
gammaloop-nextest-spenso>
17.03 s
gammaloop-nextest-spenso> running 1 test
17.03 s
gammaloop-nextest-spenso> ━━━━━━━━━━━━━━━━━━━━━━━━━━━━━━━ Snapshot Summary ━━━━━━━━━━━━━━━━━━━━━━━━━━━━━━━
17.03 s
gammaloop-nextest-spenso> Snapshot: infinite_execution
17.03 s
gammaloop-nextest-spenso> Source: crates/idenso/src/tensor/tests/parsing.rs:910
17.03 s
gammaloop-nextest-spenso> ────────────────────────────────────────────────────────────────────────────────
17.03 s
gammaloop-nextest-spenso> Expression: net_iter.snapshot_dot()
17.03 s
gammaloop-nextest-spenso> ────────────────────────────────────────────────────────────────────────────────
17.03 s
gammaloop-nextest-spenso> -old snapshot
17.03 s
gammaloop-nextest-spenso> +new results
17.03 s
gammaloop-nextest-spenso> ────────────┬───────────────────────────────────────────────────────────────────
17.03 s
gammaloop-nextest-spenso> 8 8 │ 0:0:s -> ext0 [id=0 color="red"];
17.03 s
gammaloop-nextest-spenso> 9 9 │ ext1 [style=invis];
17.03 s
gammaloop-nextest-spenso> 10 10 │ 0:5:s -> ext1 [id=1 dir=none color="red" label="mink4|l_0"];
17.03 s
gammaloop-nextest-spenso> 11 11 │ ext2 [style=invis];
17.03 s
gammaloop-nextest-spenso> 12 │- 0:4:s -> ext2 [id=2 dir=none color="red" label="bis4|l_2"];
17.03 s
gammaloop-nextest-spenso> 12 │+ 0:3:s -> ext2 [id=2 dir=none color="red" label="mink4|l_1"];
17.03 s
gammaloop-nextest-spenso> 13 13 │ ext3 [style=invis];
17.03 s
gammaloop-nextest-spenso> 14 │- 0:3:s -> ext3 [id=3 dir=none color="red" label="bis4|l_3"];
17.03 s
gammaloop-nextest-spenso> 14 │+ 0:1:s -> ext3 [id=3 dir=none color="red" label="bis4|l_2"];
17.03 s
gammaloop-nextest-spenso> 15 15 │ ext4 [style=invis];
17.03 s
gammaloop-nextest-spenso> 16 │- 0:1:s -> ext4 [id=4 dir=none color="red" label="mink4|l_1"];
17.03 s
gammaloop-nextest-spenso> 16 │+ 0:2:s -> ext4 [id=4 dir=none color="red" label="mink4|l_4"];
17.03 s
gammaloop-nextest-spenso> 17 17 │ ext5 [style=invis];
17.03 s
gammaloop-nextest-spenso> 18 │- 0:2:s -> ext5 [id=5 dir=none color="red" label="mink4|l_4"];
17.03 s
gammaloop-nextest-spenso> 18 │+ 0:4:s -> ext5 [id=5 dir=none color="red" label="bis4|l_3"];
17.03 s
gammaloop-nextest-spenso> 19 19 │ }
17.03 s
gammaloop-nextest-spenso> ────────────┴───────────────────────────────────────────────────────────────────
17.03 s
gammaloop-nextest-spenso> To update snapshots run `cargo insta review`
17.03 s
gammaloop-nextest-spenso> Stopped on the first failure. Run `cargo insta test` to run all snapshots.
17.03 s
gammaloop-nextest-spenso> test tensor::tests::parsing::infinite_execution ... FAILED
17.03 s
gammaloop-nextest-spenso>
17.03 s
gammaloop-nextest-spenso> failures:
17.03 s
gammaloop-nextest-spenso>
17.03 s
gammaloop-nextest-spenso> failures:
17.03 s
gammaloop-nextest-spenso> tensor::tests::parsing::infinite_execution
17.03 s
gammaloop-nextest-spenso>
17.03 s
gammaloop-nextest-spenso> test result: FAILED. 0 passed; 1 failed; 0 ignored; 0 measured; 240 filtered out; finished in 0.03s
17.03 s
gammaloop-nextest-spenso>
17.03 s
gammaloop-nextest-spenso> stderr ---
17.03 s
gammaloop-nextest-spenso>
17.03 s
gammaloop-nextest-spenso> thread 'tensor::tests::parsing::infinite_execution' (849) panicked at /nix/store/p13pfw1gvvk8m860apfhvzcgidxhbs7g-vendor-cargo-deps/c19b7c6f923b580ac259164a89f2577984ad5ab09ee9d583b888f934adbbe8d0/insta-1.47.2/src/runtime.rs:719:13:
17.03 s
gammaloop-nextest-spenso> snapshot assertion for 'infinite_execution' failed in line 910
17.03 s
gammaloop-nextest-spenso> stack backtrace:
17.03 s
gammaloop-nextest-spenso> 0: __rustc::rust_begin_unwind
17.03 s
gammaloop-nextest-spenso> 1: core::panicking::panic_fmt
17.03 s
gammaloop-nextest-spenso> 2: insta::runtime::assert_snapshot
17.03 s
gammaloop-nextest-spenso> 3: idenso::tensor::tests::parsing::infinite_execution
17.03 s
gammaloop-nextest-spenso> 4: <idenso::tensor::tests::parsing::infinite_execution::{closure#0} as core::ops::function::FnOnce<()>>::call_once
17.03 s
gammaloop-nextest-spenso> note: Some details are omitted, run with `RUST_BACKTRACE=full` for a verbose backtrace.
17.03 s
gammaloop-nextest-spenso>
17.06 s
gammaloop-nextest-spenso> error : test run failed
17.08 s
gammaloop-nextest-spenso>
17.08 s
gammaloop-nextest-spenso> ========== nextest test summary ==========
17.08 s
gammaloop-nextest-spenso> report: target/nextest/ci_gammaloop/junit.xml
17.08 s
gammaloop-nextest-spenso> tests: 224, failures: 2, errors: 0
17.08 s
gammaloop-nextest-spenso>
17.08 s
gammaloop-nextest-spenso> 1. idenso::color::test::form_reference::metric_contraction_respects_antisymmetric_normalization
17.08 s
gammaloop-nextest-spenso> failure: test failure with exit code 101
17.08 s
gammaloop-nextest-spenso> thread 'color::test::form_reference::metric_contraction_respects_antisymmetric_normalization' (331) panicked at crates/idenso/src/color/test/form_reference.rs:171:5:
17.08 s
gammaloop-nextest-spenso> assertion `left == right` failed
17.08 s
gammaloop-nextest-spenso> left: "-1*f(coad(8,standalone_metric_j),coad(8,standalone_metric_s),coad(8,standalone_metric_u))"
17.08 s
gammaloop-nextest-spenso> right: "f(coad(8,standalone_metric_j),coad(8,standalone_metric_s),coad(8,standalone_metric_u))"
17.08 s
gammaloop-nextest-spenso> stack backtrace:
17.08 s
gammaloop-nextest-spenso> 0: __rustc::rust_begin_unwind
17.08 s
gammaloop-nextest-spenso> 1: core::panicking::panic_fmt
17.08 s
gammaloop-nextest-spenso> 2: core::panicking::assert_failed_inner
17.08 s
gammaloop-nextest-spenso> 3: core::panicking::assert_failed::<alloc::string::String, alloc::string::String>
17.08 s
gammaloop-nextest-spenso> 4: idenso::color::test::form_reference::metric_contraction_respects_antisymmetric_normalization
17.08 s
gammaloop-nextest-spenso> 5: <idenso::color::test::form_reference::metric_contraction_respects_antisymmetric_normalization::{closure#0} as core::ops::function::FnOnce<()>>::call_once
17.08 s
gammaloop-nextest-spenso> note: Some details are omitted, run with `RUST_BACKTRACE=full` for a verbose backtrace.
17.08 s
gammaloop-nextest-spenso> system-out
17.08 s
gammaloop-nextest-spenso> running 1 test
17.08 s
gammaloop-nextest-spenso> test color::test::form_reference::metric_contraction_respects_antisymmetric_normalization ... FAILED
17.08 s
gammaloop-nextest-spenso>
17.08 s
gammaloop-nextest-spenso> failures:
17.08 s
gammaloop-nextest-spenso>
17.08 s
gammaloop-nextest-spenso> failures:
17.08 s
gammaloop-nextest-spenso> color::test::form_reference::metric_contraction_respects_antisymmetric_normalization
17.08 s
gammaloop-nextest-spenso>
17.08 s
gammaloop-nextest-spenso> test result: FAILED. 0 passed; 1 failed; 0 ignored; 0 measured; 240 filtered out; finished in 0.00s
17.08 s
gammaloop-nextest-spenso> system-err
17.08 s
gammaloop-nextest-spenso> thread 'color::test::form_reference::metric_contraction_respects_antisymmetric_normalization' (331) panicked at crates/idenso/src/color/test/form_reference.rs:171:5:
17.08 s
gammaloop-nextest-spenso> assertion `left == right` failed
17.08 s
gammaloop-nextest-spenso> left: "-1*f(coad(8,standalone_metric_j),coad(8,standalone_metric_s),coad(8,standalone_metric_u))"
17.08 s
gammaloop-nextest-spenso> right: "f(coad(8,standalone_metric_j),coad(8,standalone_metric_s),coad(8,standalone_metric_u))"
17.08 s
gammaloop-nextest-spenso> stack backtrace:
17.08 s
gammaloop-nextest-spenso> 0: __rustc::rust_begin_unwind
17.08 s
gammaloop-nextest-spenso> 1: core::panicking::panic_fmt
17.08 s
gammaloop-nextest-spenso> 2: core::panicking::assert_failed_inner
17.08 s
gammaloop-nextest-spenso> 3: core::panicking::assert_failed::<alloc::string::String, alloc::string::String>
17.08 s
gammaloop-nextest-spenso> 4: idenso::color::test::form_reference::metric_contraction_respects_antisymmetric_normalization
17.08 s
gammaloop-nextest-spenso> 5: <idenso::color::test::form_reference::metric_contraction_respects_antisymmetric_normalization::{closure#0} as core::ops::function::FnOnce<()>>::call_once
17.08 s
gammaloop-nextest-spenso> note: Some details are omitted, run with `RUST_BACKTRACE=full` for a verbose backtrace.
17.08 s
gammaloop-nextest-spenso>
17.08 s
gammaloop-nextest-spenso> 2. idenso::tensor::tests::parsing::infinite_execution
17.08 s
gammaloop-nextest-spenso> failure: test failure with exit code 101
17.08 s
gammaloop-nextest-spenso> thread 'tensor::tests::parsing::infinite_execution' (849) panicked at /nix/store/p13pfw1gvvk8m860apfhvzcgidxhbs7g-vendor-cargo-deps/c19b7c6f923b580ac259164a89f2577984ad5ab09ee9d583b888f934adbbe8d0/insta-1.47.2/src/runtime.rs:719:13:
17.08 s
gammaloop-nextest-spenso> snapshot assertion for 'infinite_execution' failed in line 910
17.08 s
gammaloop-nextest-spenso> stack backtrace:
17.08 s
gammaloop-nextest-spenso> 0: __rustc::rust_begin_unwind
17.08 s
gammaloop-nextest-spenso> 1: core::panicking::panic_fmt
17.08 s
gammaloop-nextest-spenso> 2: insta::runtime::assert_snapshot
17.08 s
gammaloop-nextest-spenso> 3: idenso::tensor::tests::parsing::infinite_execution
17.08 s
gammaloop-nextest-spenso> 4: <idenso::tensor::tests::parsing::infinite_execution::{closure#0} as core::ops::function::FnOnce<()>>::call_once
17.08 s
gammaloop-nextest-spenso> note: Some details are omitted, run with `RUST_BACKTRACE=full` for a verbose backtrace.
17.08 s
gammaloop-nextest-spenso> system-out
17.08 s
gammaloop-nextest-spenso> running 1 test
17.08 s
gammaloop-nextest-spenso> ━━━━━━━━━━━━━━━━━━━━━━━━━━━━━━━ Snapshot Summary ━━━━━━━━━━━━━━━━━━━━━━━━━━━━━━━
17.08 s
gammaloop-nextest-spenso> Snapshot: infinite_execution
17.08 s
gammaloop-nextest-spenso> Source: crates/idenso/src/tensor/tests/parsing.rs:910
17.08 s
gammaloop-nextest-spenso> ────────────────────────────────────────────────────────────────────────────────
17.08 s
gammaloop-nextest-spenso> Expression: net_iter.snapshot_dot()
17.08 s
gammaloop-nextest-spenso> ────────────────────────────────────────────────────────────────────────────────
17.08 s
gammaloop-nextest-spenso> -old snapshot
17.08 s
gammaloop-nextest-spenso> +new results
17.08 s
gammaloop-nextest-spenso> ────────────┬───────────────────────────────────────────────────────────────────
17.08 s
gammaloop-nextest-spenso> 8 8 │ 0:0:s-> ext0 [id=0 color="red"];
17.08 s
gammaloop-nextest-spenso> 9 9 │ ext1 [style=invis];
17.08 s
gammaloop-nextest-spenso> 10 10 │ 0:5:s-> ext1 [id=1 dir=none color="red" label="mink4|l_0"];
17.08 s
gammaloop-nextest-spenso> 11 11 │ ext2 [style=invis];
17.08 s
gammaloop-nextest-spenso> 12 │- 0:4:s-> ext2 [id=2 dir=none color="red" label="bis4|l_2"];
17.08 s
gammaloop-nextest-spenso> 12 │+ 0:3:s-> ext2 [id=2 dir=none color="red" label="mink4|l_1"];
17.08 s
gammaloop-nextest-spenso> 13 13 │ ext3 [style=invis];
17.08 s
gammaloop-nextest-spenso> 14 │- 0:3:s-> ext3 [id=3 dir=none color="red" label="bis4|l_3"];
17.08 s
gammaloop-nextest-spenso> 14 │+ 0:1:s-> ext3 [id=3 dir=none color="red" label="bis4|l_2"];
17.08 s
gammaloop-nextest-spenso> 15 15 │ ext4 [style=invis];
17.08 s
gammaloop-nextest-spenso> 16 │- 0:1:s-> ext4 [id=4 dir=none color="red" label="mink4|l_1"];
17.08 s
gammaloop-nextest-spenso> 16 │+ 0:2:s-> ext4 [id=4 dir=none color="red" label="mink4|l_4"];
17.08 s
gammaloop-nextest-spenso> 17 17 │ ext5 [style=invis];
17.08 s
gammaloop-nextest-spenso> 18 │- 0:2:s-> ext5 [id=5 dir=none color="red" label="mink4|l_4"];
17.08 s
gammaloop-nextest-spenso> 18 │+ 0:4:s-> ext5 [id=5 dir=none color="red" label="bis4|l_3"];
17.08 s
gammaloop-nextest-spenso> 19 19 │ }
17.08 s
gammaloop-nextest-spenso> ────────────┴───────────────────────────────────────────────────────────────────
17.08 s
gammaloop-nextest-spenso> To update snapshots run `cargo insta review`
17.08 s
gammaloop-nextest-spenso> Stopped on the first failure. Run `cargo insta test` to run all snapshots.
17.08 s
gammaloop-nextest-spenso> test tensor::tests::parsing::infinite_execution ... FAILED
17.08 s
gammaloop-nextest-spenso>
17.08 s
gammaloop-nextest-spenso> failures:
17.08 s
gammaloop-nextest-spenso>
17.08 s
gammaloop-nextest-spenso> failures:
17.08 s
gammaloop-nextest-spenso> tensor::tests::parsing::infinite_execution
17.08 s
gammaloop-nextest-spenso>
17.08 s
gammaloop-nextest-spenso> test result: FAILED. 0 passed; 1 failed; 0 ignored; 0 measured; 240 filtered out; finished in 0.03s
17.08 s
gammaloop-nextest-spenso> system-err
17.08 s
gammaloop-nextest-spenso> thread 'tensor::tests::parsing::infinite_execution' (849) panicked at /nix/store/p13pfw1gvvk8m860apfhvzcgidxhbs7g-vendor-cargo-deps/c19b7c6f923b580ac259164a89f2577984ad5ab09ee9d583b888f934adbbe8d0/insta-1.47.2/src/runtime.rs:719:13:
17.08 s
gammaloop-nextest-spenso> snapshot assertion for 'infinite_execution' failed in line 910
17.08 s
gammaloop-nextest-spenso> stack backtrace:
17.08 s
gammaloop-nextest-spenso> 0: __rustc::rust_begin_unwind
17.08 s
gammaloop-nextest-spenso> 1: core::panicking::panic_fmt
17.08 s
gammaloop-nextest-spenso> 2: insta::runtime::assert_snapshot
17.08 s
gammaloop-nextest-spenso> 3: idenso::tensor::tests::parsing::infinite_execution
17.08 s
gammaloop-nextest-spenso> 4: <idenso::tensor::tests::parsing::infinite_execution::{closure#0} as core::ops::function::FnOnce<()>>::call_once
17.08 s
gammaloop-nextest-spenso> note: Some details are omitted, run with `RUST_BACKTRACE=full` for a verbose backtrace.
17.08 s
gammaloop-nextest-spenso> =========================================
17.09 s
gammaloop-nextest-spenso> Extracting 2 binaries and 1 linked path to /build/nextest-archive-xlsAXh
17.16 s
gammaloop-nextest-spenso> Extracted 8 files to /build/nextest-archive-xlsAXh in 0.07s
17.17 s
gammaloop-nextest-spenso> ------------
17.17 s
gammaloop-nextest-spenso> Nextest run ID 528bd5f1-0336-4d34-850c-671816e8fe32 with nextest profile: ci_gammaloop
17.17 s
gammaloop-nextest-spenso> Starting 135 tests across 2 binaries
17.24 s
gammaloop-nextest-spenso> ------------
17.24 s
gammaloop-nextest-spenso> Summary [ 0.070s] 135 tests run: 135 passed , 0 skipped
17.28 s
gammaloop-nextest-spenso>
17.28 s
gammaloop-nextest-spenso> ========== nextest test summary ==========
17.28 s
gammaloop-nextest-spenso> report: target/nextest/ci_gammaloop/junit.xml
17.28 s
gammaloop-nextest-spenso> tests: 135, failures: 0, errors: 0
17.28 s
gammaloop-nextest-spenso> No failing testcases found.
17.28 s
gammaloop-nextest-spenso> =========================================
17.29 s
gammaloop-nextest-spenso> Extracting 5 binaries and 2 linked paths to /build/nextest-archive-bg1bQ4
17.47 s
gammaloop-nextest-spenso> Extracted 19 files to /build/nextest-archive-bg1bQ4 in 0.18s
17.48 s
gammaloop-nextest-spenso> ------------
17.48 s
gammaloop-nextest-spenso> Nextest run ID f8cfeda4-4ec3-4a3b-9364-fb3e85ebfa04 with nextest profile: ci_gammaloop
17.48 s
gammaloop-nextest-spenso> Starting 25 tests across 5 binaries (1 test skipped via profile.ci_gammaloop.default-filter )
17.66 s
gammaloop-nextest-spenso> ------------
17.66 s
gammaloop-nextest-spenso> Summary [ 0.180s] 25 tests run: 25 passed , 1 skipped
17.71 s
gammaloop-nextest-spenso>
17.71 s
gammaloop-nextest-spenso> ========== nextest test summary ==========
17.71 s
gammaloop-nextest-spenso> report: target/nextest/ci_gammaloop/junit.xml
17.71 s
gammaloop-nextest-spenso> tests: 25, failures: 0, errors: 0
17.71 s
gammaloop-nextest-spenso> No failing testcases found.
17.71 s
gammaloop-nextest-spenso> =========================================
17.72 s
gammaloop-nextest-spenso> Extracting 2 binaries and 1 linked path to /build/nextest-archive-Ok3XKx
17.77 s
gammaloop-nextest-spenso> Extracted 8 files to /build/nextest-archive-Ok3XKx in 0.05s
17.78 s
gammaloop-nextest-spenso> ------------
17.78 s
gammaloop-nextest-spenso> Nextest run ID e273a417-bd96-414b-8de3-4dcf8a8dfec5 with nextest profile: ci_gammaloop
17.78 s
gammaloop-nextest-spenso> Starting 1 test across 2 binaries
17.79 s
gammaloop-nextest-spenso> ------------
17.79 s
gammaloop-nextest-spenso> Summary [ 0.005s] 1 test run: 1 passed , 0 skipped
17.82 s
gammaloop-nextest-spenso>
17.82 s
gammaloop-nextest-spenso> ========== nextest test summary ==========
17.82 s
gammaloop-nextest-spenso> report: target/nextest/ci_gammaloop/junit.xml
17.82 s
gammaloop-nextest-spenso> tests: 1, failures: 0, errors: 0
17.82 s
gammaloop-nextest-spenso> No failing testcases found.
17.82 s
gammaloop-nextest-spenso> =========================================
17.83 s
gammaloop-nextest-spenso> Extracting 1 binary and 1 linked path to /build/nextest-archive-e6suVl
17.88 s
gammaloop-nextest-spenso> Extracted 7 files to /build/nextest-archive-e6suVl in 0.05s
17.89 s
gammaloop-nextest-spenso> ------------
17.89 s
gammaloop-nextest-spenso> Nextest run ID bcf613c4-b6fe-43ef-ac61-09dd69c394aa with nextest profile: ci_gammaloop
17.89 s
gammaloop-nextest-spenso> Starting 0 tests across 1 binary
17.89 s
gammaloop-nextest-spenso> ------------
17.89 s
gammaloop-nextest-spenso> Summary [ 0.000s] 0 tests run: 0 passed , 0 skipped
17.92 s
gammaloop-nextest-spenso>
17.92 s
gammaloop-nextest-spenso> ========== nextest test summary ==========
17.92 s
gammaloop-nextest-spenso> report: target/nextest/ci_gammaloop/junit.xml
17.92 s
gammaloop-nextest-spenso> tests: 0, failures: 0, errors: 0
17.92 s
gammaloop-nextest-spenso> No failing testcases found.
17.92 s
gammaloop-nextest-spenso> =========================================
17.95 s
error: Cannot build '/nix/store/8hj2j3n1562bs62vvl44s3db1hsxblr2-gammaloop-nextest-spenso.drv '.
17.95 s
Reason: builder failed with exit code 100 .
17.95 s
Output paths:
17.95 s
/nix/store/q6zi5vs0q3wnr64456imbjpsvsayaj2c-gammaloop-nextest-spenso
17.95 s
Last 325 log lines:
17.95 s
> Extracting 5 binaries and 2 linked paths to /build/nextest-archive-J2DSg6
17.95 s
> Extracted 19 files to /build/nextest-archive-J2DSg6 in 0.16s
17.95 s
> ------------
17.95 s
> Nextest run ID c7e42a0d-b4ce-4a33-9da8-0ab5807af8e0 with nextest profile: ci_gammaloop
17.95 s
> Starting 224 tests across 5 binaries (26 tests skipped , including 2 tests via profile.ci_gammaloop.default-filter )
17.95 s
> FAIL [ 0.009s] ( 44/224) idenso color::test::form_reference :: metric_contraction_respects_antisymmetric_normalization
17.95 s
> stdout ---
17.95 s
>
17.95 s
> running 1 test
17.95 s
> test color::test::form_reference::metric_contraction_respects_antisymmetric_normalization ... FAILED
17.95 s
>
17.95 s
> failures:
17.95 s
>
17.95 s
> failures:
17.95 s
> color::test::form_reference::metric_contraction_respects_antisymmetric_normalization
17.95 s
>
17.95 s
> test result: FAILED. 0 passed; 1 failed; 0 ignored; 0 measured; 240 filtered out; finished in 0.00s
17.95 s
>
17.95 s
> stderr ---
17.95 s
>
17.95 s
> thread 'color::test::form_reference::metric_contraction_respects_antisymmetric_normalization' (331) panicked at crates/idenso/src/color/test/form_reference.rs:171:5:
17.95 s
> assertion `left == right` failed
17.95 s
> left: "-1*f(coad(8,standalone_metric_j),coad(8,standalone_metric_s),coad(8,standalone_metric_u))"
17.95 s
> right: "f(coad(8,standalone_metric_j),coad(8,standalone_metric_s),coad(8,standalone_metric_u))"
17.95 s
> stack backtrace:
17.95 s
> 0: __rustc::rust_begin_unwind
17.95 s
> 1: core::panicking::panic_fmt
17.95 s
> 2: core::panicking::assert_failed_inner
17.95 s
> 3: core::panicking::assert_failed::<alloc::string::String, alloc::string::String>
17.95 s
> 4: idenso::color::test::form_reference::metric_contraction_respects_antisymmetric_normalization
17.95 s
> 5: <idenso::color::test::form_reference::metric_contraction_respects_antisymmetric_normalization::{closure#0} as core::ops::function::FnOnce<()>>::call_once
17.95 s
> note: Some details are omitted, run with `RUST_BACKTRACE=full` for a verbose backtrace.
17.95 s
>
17.95 s
> FAIL [ 0.034s] (218/224) idenso tensor::tests::parsing :: infinite_execution
17.95 s
> stdout ---
17.95 s
>
17.95 s
> running 1 test
17.95 s
> ━━━━━━━━━━━━━━━━━━━━━━━━━━━━━━━ Snapshot Summary ━━━━━━━━━━━━━━━━━━━━━━━━━━━━━━━
17.95 s
> Snapshot: infinite_execution
17.95 s
> Source: crates/idenso/src/tensor/tests/parsing.rs:910
17.95 s
> ────────────────────────────────────────────────────────────────────────────────
17.95 s
> Expression: net_iter.snapshot_dot()
17.95 s
> ────────────────────────────────────────────────────────────────────────────────
17.95 s
> -old snapshot
17.95 s
> +new results
17.95 s
> ────────────┬───────────────────────────────────────────────────────────────────
17.95 s
> 8 8 │ 0:0:s -> ext0 [id=0 color="red"];
17.95 s
> 9 9 │ ext1 [style=invis];
17.95 s
> 10 10 │ 0:5:s -> ext1 [id=1 dir=none color="red" label="mink4|l_0"];
17.95 s
> 11 11 │ ext2 [style=invis];
17.95 s
> 12 │- 0:4:s -> ext2 [id=2 dir=none color="red" label="bis4|l_2"];
17.95 s
> 12 │+ 0:3:s -> ext2 [id=2 dir=none color="red" label="mink4|l_1"];
17.95 s
> 13 13 │ ext3 [style=invis];
17.95 s
> 14 │- 0:3:s -> ext3 [id=3 dir=none color="red" label="bis4|l_3"];
17.95 s
> 14 │+ 0:1:s -> ext3 [id=3 dir=none color="red" label="bis4|l_2"];
17.95 s
> 15 15 │ ext4 [style=invis];
17.95 s
> 16 │- 0:1:s -> ext4 [id=4 dir=none color="red" label="mink4|l_1"];
17.95 s
> 16 │+ 0:2:s -> ext4 [id=4 dir=none color="red" label="mink4|l_4"];
17.95 s
> 17 17 │ ext5 [style=invis];
17.95 s
> 18 │- 0:2:s -> ext5 [id=5 dir=none color="red" label="mink4|l_4"];
17.95 s
> 18 │+ 0:4:s -> ext5 [id=5 dir=none color="red" label="bis4|l_3"];
17.95 s
> 19 19 │ }
17.95 s
> ────────────┴───────────────────────────────────────────────────────────────────
17.95 s
> To update snapshots run `cargo insta review`
17.95 s
> Stopped on the first failure. Run `cargo insta test` to run all snapshots.
17.95 s
> test tensor::tests::parsing::infinite_execution ... FAILED
17.95 s
>
17.95 s
> failures:
17.95 s
>
17.95 s
> failures:
17.95 s
> tensor::tests::parsing::infinite_execution
17.95 s
>
17.95 s
> test result: FAILED. 0 passed; 1 failed; 0 ignored; 0 measured; 240 filtered out; finished in 0.03s
17.95 s
>
17.95 s
> stderr ---
17.95 s
>
17.95 s
> thread 'tensor::tests::parsing::infinite_execution' (849) panicked at /nix/store/p13pfw1gvvk8m860apfhvzcgidxhbs7g-vendor-cargo-deps/c19b7c6f923b580ac259164a89f2577984ad5ab09ee9d583b888f934adbbe8d0/insta-1.47.2/src/runtime.rs:719:13:
17.95 s
> snapshot assertion for 'infinite_execution' failed in line 910
17.95 s
> stack backtrace:
17.95 s
> 0: __rustc::rust_begin_unwind
17.95 s
> 1: core::panicking::panic_fmt
17.95 s
> 2: insta::runtime::assert_snapshot
17.95 s
> 3: idenso::tensor::tests::parsing::infinite_execution
17.95 s
> 4: <idenso::tensor::tests::parsing::infinite_execution::{closure#0} as core::ops::function::FnOnce<()>>::call_once
17.95 s
> note: Some details are omitted, run with `RUST_BACKTRACE=full` for a verbose backtrace.
17.95 s
>
17.95 s
> ------------
17.95 s
> Summary [ 1.510s] 224 tests run: 222 passed , 2 failed , 26 skipped
17.95 s
> FAIL [ 0.009s] ( 44/224) idenso color::test::form_reference :: metric_contraction_respects_antisymmetric_normalization
17.95 s
> stdout ---
17.95 s
>
17.95 s
> running 1 test
17.95 s
> test color::test::form_reference::metric_contraction_respects_antisymmetric_normalization ... FAILED
17.95 s
>
17.95 s
> failures:
17.95 s
>
17.95 s
> failures:
17.95 s
> color::test::form_reference::metric_contraction_respects_antisymmetric_normalization
17.95 s
>
17.95 s
> test result: FAILED. 0 passed; 1 failed; 0 ignored; 0 measured; 240 filtered out; finished in 0.00s
17.95 s
>
17.95 s
> stderr ---
17.95 s
>
17.95 s
> thread 'color::test::form_reference::metric_contraction_respects_antisymmetric_normalization' (331) panicked at crates/idenso/src/color/test/form_reference.rs:171:5:
17.95 s
> assertion `left == right` failed
17.95 s
> left: "-1*f(coad(8,standalone_metric_j),coad(8,standalone_metric_s),coad(8,standalone_metric_u))"
17.95 s
> right: "f(coad(8,standalone_metric_j),coad(8,standalone_metric_s),coad(8,standalone_metric_u))"
17.95 s
> stack backtrace:
17.95 s
> 0: __rustc::rust_begin_unwind
17.95 s
> 1: core::panicking::panic_fmt
17.95 s
> 2: core::panicking::assert_failed_inner
17.95 s
> 3: core::panicking::assert_failed::<alloc::string::String, alloc::string::String>
17.95 s
> 4: idenso::color::test::form_reference::metric_contraction_respects_antisymmetric_normalization
17.95 s
> 5: <idenso::color::test::form_reference::metric_contraction_respects_antisymmetric_normalization::{closure#0} as core::ops::function::FnOnce<()>>::call_once
17.95 s
> note: Some details are omitted, run with `RUST_BACKTRACE=full` for a verbose backtrace.
17.95 s
>
17.95 s
> FAIL [ 0.034s] (218/224) idenso tensor::tests::parsing :: infinite_execution
17.95 s
> stdout ---
17.95 s
>
17.95 s
> running 1 test
17.95 s
> ━━━━━━━━━━━━━━━━━━━━━━━━━━━━━━━ Snapshot Summary ━━━━━━━━━━━━━━━━━━━━━━━━━━━━━━━
17.95 s
> Snapshot: infinite_execution
17.95 s
> Source: crates/idenso/src/tensor/tests/parsing.rs:910
17.95 s
> ────────────────────────────────────────────────────────────────────────────────
17.95 s
> Expression: net_iter.snapshot_dot()
17.95 s
> ────────────────────────────────────────────────────────────────────────────────
17.95 s
> -old snapshot
17.95 s
> +new results
17.95 s
> ────────────┬───────────────────────────────────────────────────────────────────
17.95 s
> 8 8 │ 0:0:s -> ext0 [id=0 color="red"];
17.95 s
> 9 9 │ ext1 [style=invis];
17.95 s
> 10 10 │ 0:5:s -> ext1 [id=1 dir=none color="red" label="mink4|l_0"];
17.95 s
> 11 11 │ ext2 [style=invis];
17.95 s
> 12 │- 0:4:s -> ext2 [id=2 dir=none color="red" label="bis4|l_2"];
17.95 s
> 12 │+ 0:3:s -> ext2 [id=2 dir=none color="red" label="mink4|l_1"];
17.95 s
> 13 13 │ ext3 [style=invis];
17.95 s
> 14 │- 0:3:s -> ext3 [id=3 dir=none color="red" label="bis4|l_3"];
17.95 s
> 14 │+ 0:1:s -> ext3 [id=3 dir=none color="red" label="bis4|l_2"];
17.95 s
> 15 15 │ ext4 [style=invis];
17.95 s
> 16 │- 0:1:s -> ext4 [id=4 dir=none color="red" label="mink4|l_1"];
17.95 s
> 16 │+ 0:2:s -> ext4 [id=4 dir=none color="red" label="mink4|l_4"];
17.95 s
> 17 17 │ ext5 [style=invis];
17.95 s
> 18 │- 0:2:s -> ext5 [id=5 dir=none color="red" label="mink4|l_4"];
17.95 s
> 18 │+ 0:4:s -> ext5 [id=5 dir=none color="red" label="bis4|l_3"];
17.95 s
> 19 19 │ }
17.95 s
> ────────────┴───────────────────────────────────────────────────────────────────
17.95 s
> To update snapshots run `cargo insta review`
17.95 s
> Stopped on the first failure. Run `cargo insta test` to run all snapshots.
17.95 s
> test tensor::tests::parsing::infinite_execution ... FAILED
17.95 s
>
17.95 s
> failures:
17.95 s
>
17.95 s
> failures:
17.95 s
> tensor::tests::parsing::infinite_execution
17.95 s
>
17.95 s
> test result: FAILED. 0 passed; 1 failed; 0 ignored; 0 measured; 240 filtered out; finished in 0.03s
17.95 s
>
17.95 s
> stderr ---
17.95 s
>
17.95 s
> thread 'tensor::tests::parsing::infinite_execution' (849) panicked at /nix/store/p13pfw1gvvk8m860apfhvzcgidxhbs7g-vendor-cargo-deps/c19b7c6f923b580ac259164a89f2577984ad5ab09ee9d583b888f934adbbe8d0/insta-1.47.2/src/runtime.rs:719:13:
17.95 s
> snapshot assertion for 'infinite_execution' failed in line 910
17.95 s
> stack backtrace:
17.95 s
> 0: __rustc::rust_begin_unwind
17.95 s
> 1: core::panicking::panic_fmt
17.95 s
> 2: insta::runtime::assert_snapshot
17.95 s
> 3: idenso::tensor::tests::parsing::infinite_execution
17.95 s
> 4: <idenso::tensor::tests::parsing::infinite_execution::{closure#0} as core::ops::function::FnOnce<()>>::call_once
17.95 s
> note: Some details are omitted, run with `RUST_BACKTRACE=full` for a verbose backtrace.
17.95 s
>
17.95 s
> error : test run failed
17.95 s
>
17.95 s
> ========== nextest test summary ==========
17.95 s
> report: target/nextest/ci_gammaloop/junit.xml
17.95 s
> tests: 224, failures: 2, errors: 0
17.95 s
>
17.95 s
> 1. idenso::color::test::form_reference::metric_contraction_respects_antisymmetric_normalization
17.95 s
> failure: test failure with exit code 101
17.95 s
> thread 'color::test::form_reference::metric_contraction_respects_antisymmetric_normalization' (331) panicked at crates/idenso/src/color/test/form_reference.rs:171:5:
17.95 s
> assertion `left == right` failed
17.95 s
> left: "-1*f(coad(8,standalone_metric_j),coad(8,standalone_metric_s),coad(8,standalone_metric_u))"
17.95 s
> right: "f(coad(8,standalone_metric_j),coad(8,standalone_metric_s),coad(8,standalone_metric_u))"
17.95 s
> stack backtrace:
17.95 s
> 0: __rustc::rust_begin_unwind
17.95 s
> 1: core::panicking::panic_fmt
17.95 s
> 2: core::panicking::assert_failed_inner
17.95 s
> 3: core::panicking::assert_failed::<alloc::string::String, alloc::string::String>
17.95 s
> 4: idenso::color::test::form_reference::metric_contraction_respects_antisymmetric_normalization
17.95 s
> 5: <idenso::color::test::form_reference::metric_contraction_respects_antisymmetric_normalization::{closure#0} as core::ops::function::FnOnce<()>>::call_once
17.95 s
> note: Some details are omitted, run with `RUST_BACKTRACE=full` for a verbose backtrace.
17.95 s
> system-out
17.95 s
> running 1 test
17.95 s
> test color::test::form_reference::metric_contraction_respects_antisymmetric_normalization ... FAILED
17.95 s
>
17.95 s
> failures:
17.95 s
>
17.95 s
> failures:
17.95 s
> color::test::form_reference::metric_contraction_respects_antisymmetric_normalization
17.95 s
>
17.95 s
> test result: FAILED. 0 passed; 1 failed; 0 ignored; 0 measured; 240 filtered out; finished in 0.00s
17.95 s
> system-err
17.95 s
> thread 'color::test::form_reference::metric_contraction_respects_antisymmetric_normalization' (331) panicked at crates/idenso/src/color/test/form_reference.rs:171:5:
17.95 s
> assertion `left == right` failed
17.95 s
> left: "-1*f(coad(8,standalone_metric_j),coad(8,standalone_metric_s),coad(8,standalone_metric_u))"
17.95 s
> right: "f(coad(8,standalone_metric_j),coad(8,standalone_metric_s),coad(8,standalone_metric_u))"
17.95 s
> stack backtrace:
17.95 s
> 0: __rustc::rust_begin_unwind
17.95 s
> 1: core::panicking::panic_fmt
17.95 s
> 2: core::panicking::assert_failed_inner
17.95 s
> 3: core::panicking::assert_failed::<alloc::string::String, alloc::string::String>
17.95 s
> 4: idenso::color::test::form_reference::metric_contraction_respects_antisymmetric_normalization
17.95 s
> 5: <idenso::color::test::form_reference::metric_contraction_respects_antisymmetric_normalization::{closure#0} as core::ops::function::FnOnce<()>>::call_once
17.95 s
> note: Some details are omitted, run with `RUST_BACKTRACE=full` for a verbose backtrace.
17.95 s
>
17.95 s
> 2. idenso::tensor::tests::parsing::infinite_execution
17.95 s
> failure: test failure with exit code 101
17.95 s
> thread 'tensor::tests::parsing::infinite_execution' (849) panicked at /nix/store/p13pfw1gvvk8m860apfhvzcgidxhbs7g-vendor-cargo-deps/c19b7c6f923b580ac259164a89f2577984ad5ab09ee9d583b888f934adbbe8d0/insta-1.47.2/src/runtime.rs:719:13:
17.95 s
> snapshot assertion for 'infinite_execution' failed in line 910
17.95 s
> stack backtrace:
17.95 s
> 0: __rustc::rust_begin_unwind
17.95 s
> 1: core::panicking::panic_fmt
17.95 s
> 2: insta::runtime::assert_snapshot
17.95 s
> 3: idenso::tensor::tests::parsing::infinite_execution
17.95 s
> 4: <idenso::tensor::tests::parsing::infinite_execution::{closure#0} as core::ops::function::FnOnce<()>>::call_once
17.95 s
> note: Some details are omitted, run with `RUST_BACKTRACE=full` for a verbose backtrace.
17.95 s
> system-out
17.95 s
> running 1 test
17.95 s
> ━━━━━━━━━━━━━━━━━━━━━━━━━━━━━━━ Snapshot Summary ━━━━━━━━━━━━━━━━━━━━━━━━━━━━━━━
17.95 s
> Snapshot: infinite_execution
17.95 s
> Source: crates/idenso/src/tensor/tests/parsing.rs:910
17.95 s
> ────────────────────────────────────────────────────────────────────────────────
17.95 s
> Expression: net_iter.snapshot_dot()
17.95 s
> ────────────────────────────────────────────────────────────────────────────────
17.95 s
> -old snapshot
17.95 s
> +new results
17.95 s
> ────────────┬───────────────────────────────────────────────────────────────────
17.95 s
> 8 8 │ 0:0:s-> ext0 [id=0 color="red"];
17.95 s
> 9 9 │ ext1 [style=invis];
17.95 s
> 10 10 │ 0:5:s-> ext1 [id=1 dir=none color="red" label="mink4|l_0"];
17.95 s
> 11 11 │ ext2 [style=invis];
17.95 s
> 12 │- 0:4:s-> ext2 [id=2 dir=none color="red" label="bis4|l_2"];
17.95 s
> 12 │+ 0:3:s-> ext2 [id=2 dir=none color="red" label="mink4|l_1"];
17.95 s
> 13 13 │ ext3 [style=invis];
17.95 s
> 14 │- 0:3:s-> ext3 [id=3 dir=none color="red" label="bis4|l_3"];
17.95 s
> 14 │+ 0:1:s-> ext3 [id=3 dir=none color="red" label="bis4|l_2"];
17.95 s
> 15 15 │ ext4 [style=invis];
17.95 s
> 16 │- 0:1:s-> ext4 [id=4 dir=none color="red" label="mink4|l_1"];
17.95 s
> 16 │+ 0:2:s-> ext4 [id=4 dir=none color="red" label="mink4|l_4"];
17.95 s
> 17 17 │ ext5 [style=invis];
17.95 s
> 18 │- 0:2:s-> ext5 [id=5 dir=none color="red" label="mink4|l_4"];
17.95 s
> 18 │+ 0:4:s-> ext5 [id=5 dir=none color="red" label="bis4|l_3"];
17.95 s
> 19 19 │ }
17.95 s
> ────────────┴───────────────────────────────────────────────────────────────────
17.95 s
> To update snapshots run `cargo insta review`
17.95 s
> Stopped on the first failure. Run `cargo insta test` to run all snapshots.
17.95 s
> test tensor::tests::parsing::infinite_execution ... FAILED
17.95 s
>
17.95 s
> failures:
17.95 s
>
17.95 s
> failures:
17.95 s
> tensor::tests::parsing::infinite_execution
17.95 s
>
17.95 s
> test result: FAILED. 0 passed; 1 failed; 0 ignored; 0 measured; 240 filtered out; finished in 0.03s
17.95 s
> system-err
17.95 s
> thread 'tensor::tests::parsing::infinite_execution' (849) panicked at /nix/store/p13pfw1gvvk8m860apfhvzcgidxhbs7g-vendor-cargo-deps/c19b7c6f923b580ac259164a89f2577984ad5ab09ee9d583b888f934adbbe8d0/insta-1.47.2/src/runtime.rs:719:13:
17.95 s
> snapshot assertion for 'infinite_execution' failed in line 910
17.95 s
> stack backtrace:
17.95 s
> 0: __rustc::rust_begin_unwind
17.95 s
> 1: core::panicking::panic_fmt
17.95 s
> 2: insta::runtime::assert_snapshot
17.95 s
> 3: idenso::tensor::tests::parsing::infinite_execution
17.95 s
> 4: <idenso::tensor::tests::parsing::infinite_execution::{closure#0} as core::ops::function::FnOnce<()>>::call_once
17.95 s
> note: Some details are omitted, run with `RUST_BACKTRACE=full` for a verbose backtrace.
17.95 s
> =========================================
17.95 s
> Extracting 2 binaries and 1 linked path to /build/nextest-archive-xlsAXh
17.95 s
> Extracted 8 files to /build/nextest-archive-xlsAXh in 0.07s
17.95 s
> ------------
17.95 s
> Nextest run ID 528bd5f1-0336-4d34-850c-671816e8fe32 with nextest profile: ci_gammaloop
17.95 s
> Starting 135 tests across 2 binaries
17.95 s
> ------------
17.95 s
> Summary [ 0.070s] 135 tests run: 135 passed , 0 skipped
17.95 s
>
17.95 s
> ========== nextest test summary ==========
17.95 s
> report: target/nextest/ci_gammaloop/junit.xml
17.95 s
> tests: 135, failures: 0, errors: 0
17.95 s
> No failing testcases found.
17.95 s
> =========================================
17.95 s
> Extracting 5 binaries and 2 linked paths to /build/nextest-archive-bg1bQ4
17.95 s
> Extracted 19 files to /build/nextest-archive-bg1bQ4 in 0.18s
17.95 s
> ------------
17.95 s
> Nextest run ID f8cfeda4-4ec3-4a3b-9364-fb3e85ebfa04 with nextest profile: ci_gammaloop
17.95 s
> Starting 25 tests across 5 binaries (1 test skipped via profile.ci_gammaloop.default-filter )
17.95 s
> ------------
17.95 s
> Summary [ 0.180s] 25 tests run: 25 passed , 1 skipped
17.95 s
>
17.95 s
> ========== nextest test summary ==========
17.95 s
> report: target/nextest/ci_gammaloop/junit.xml
17.95 s
> tests: 25, failures: 0, errors: 0
17.95 s
> No failing testcases found.
17.95 s
> =========================================
17.95 s
> Extracting 2 binaries and 1 linked path to /build/nextest-archive-Ok3XKx
17.95 s
> Extracted 8 files to /build/nextest-archive-Ok3XKx in 0.05s
17.95 s
> ------------
17.95 s
> Nextest run ID e273a417-bd96-414b-8de3-4dcf8a8dfec5 with nextest profile: ci_gammaloop
17.95 s
> Starting 1 test across 2 binaries
17.95 s
> ------------
17.95 s
> Summary [ 0.005s] 1 test run: 1 passed , 0 skipped
17.95 s
>
17.95 s
> ========== nextest test summary ==========
17.95 s
> report: target/nextest/ci_gammaloop/junit.xml
17.95 s
> tests: 1, failures: 0, errors: 0
17.95 s
> No failing testcases found.
17.95 s
> =========================================
17.95 s
> Extracting 1 binary and 1 linked path to /build/nextest-archive-e6suVl
17.95 s
> Extracted 7 files to /build/nextest-archive-e6suVl in 0.05s
17.95 s
> ------------
17.95 s
> Nextest run ID bcf613c4-b6fe-43ef-ac61-09dd69c394aa with nextest profile: ci_gammaloop
17.95 s
> Starting 0 tests across 1 binary
17.95 s
> ------------
17.95 s
> Summary [ 0.000s] 0 tests run: 0 passed , 0 skipped
17.95 s
>
17.95 s
> ========== nextest test summary ==========
17.95 s
> report: target/nextest/ci_gammaloop/junit.xml
17.95 s
> tests: 0, failures: 0, errors: 0
17.95 s
> No failing testcases found.
17.95 s
> =========================================
17.95 s
For full logs, run:
17.95 s
nix log /nix/store/8hj2j3n1562bs62vvl44s3db1hsxblr2-gammaloop-nextest-spenso.drv
18.04 s
[0 built (1 failed ), 0.0 Run failed.