1. 0.14 s $ /nix/store/9ypz3flqsrl5xl495mm8h645gadjsxi1-coreutils-9.11/bin/timeout --kill-after=15s 7200s /nix/store/23zk8sgzamrbmj1fday15szf7f2279s8-nix-2.34.7/bin/nix --extra-experimental-features nix-command --extra-experimental-features flakes flake clone git+https://github.com/alphal00p/gammaloop --dest /tmp/nix-ci-worker/stable-pwd/repo/
  2. 0.17 s Cloning into '/tmp/nix-ci-worker/stable-pwd/repo'...
  3. 1.07 s remote: Enumerating objects: 65311, done.
  4. 1.16 s remote: Counting objects: 0% (1/7962) remote: Counting objects: 1% (80/7962) remote: Counting objects: 2% (160/7962) remote: Counting objects: 3% (239/7962) remote: Counting objects: 4% (319/7962) remote: Counting objects: 5% (399/7962) remote: Counting objects: 6% (478/7962) remote: Counting objects: 7% (558/7962) remote: Counting objects: 8% (637/7962) remote: Counting objects: 9% (717/7962) remote: Counting objects: 10% (797/7962) remote: Counting objects: 11% (876/7962) remote: Counting objects: 12% (956/7962) remote: Counting objects: 13% (1036/7962) remote: Counting objects: 14% (1115/7962) remote: Counting objects: 15% (1195/7962) remote: Counting objects: 16% (1274/7962) remote: Counting objects: 17% (1354/7962) remote: Counting objects: 18% (1434/7962) remote: Counting objects: 19% (1513/7962) remote: Counting objects: 20% (1593/7962) remote: Counting objects: 21% (1673/7962) remote: Counting objects: 22% (1752/7962) remote: Counting objects: 23% (1832/7962) remote: Counting objects: 24% (1911/7962) remote: Counting objects: 25% (1991/7962) remote: Counting objects: 26% (2071/7962) remote: Counting objects: 27% (2150/7962) remote: Counting objects: 28% (2230/7962) remote: Counting objects: 29% (2309/7962) remote: Counting objects: 30% (2389/7962) remote: Counting objects: 31% (2469/7962) remote: Counting objects: 32% (2548/7962) remote: Counting objects: 33% (2628/7962) remote: Counting objects: 34% (2708/7962) remote: Counting objects: 35% (2787/7962) remote: Counting objects: 36% (2867/7962) remote: Counting objects: 37% (2946/7962) remote: Counting objects: 38% (3026/7962) remote: Counting objects: 39% (3106/7962) remote: Counting objects: 40% (3185/7962) remote: Counting objects: 41% (3265/7962) remote: Counting objects: 42% (3345/7962) remote: Counting objects: 43% (3424/7962) remote: Counting objects: 44% (3504/7962) remote: Counting objects: 45% (3583/7962) remote: Counting objects: 46% (3663/7962) remote: Counting objects: 47% (3743/7962) remote: Counting objects: 48% (3822/7962) remote: Counting objects: 49% (3902/7962) remote: Counting objects: 50% (3981/7962) remote: Counting objects: 51% (4061/7962) remote: Counting objects: 52% (4141/7962) remote: Counting objects: 53% (4220/7962) remote: Counting objects: 54% (4300/7962) remote: Counting objects: 55% (4380/7962) remote: Counting objects: 56% (4459/7962) remote: Counting objects: 57% (4539/7962) remote: Counting objects: 58% (4618/7962) remote: Counting objects: 59% (4698/7962) remote: Counting objects: 60% (4778/7962) remote: Counting objects: 61% (4857/7962) remote: Counting objects: 62% (4937/7962) remote: Counting objects: 63% (5017/7962) remote: Counting objects: 64% (5096/7962) remote: Counting objects: 65% (5176/7962) remote: Counting objects: 66% (5255/7962) remote: Counting objects: 67% (5335/7962) remote: Counting objects: 68% (5415/7962) remote: Counting objects: 69% (5494/7962) remote: Counting objects: 70% (5574/7962) remote: Counting objects: 71% (5654/7962) remote: Counting objects: 72% (5733/7962) remote: Counting objects: 73% (5813/7962) remote: Counting objects: 74% (5892/7962) remote: Counting objects: 75% (5972/7962) remote: Counting objects: 76% (6052/7962) remote: Counting objects: 77% (6131/7962) remote: Counting objects: 78% (6211/7962) remote: Counting objects: 79% (6290/7962) remote: Counting objects: 80% (6370/7962) remote: Counting objects: 81% (6450/7962) remote: Counting objects: 82% (6529/7962) remote: Counting objects: 83% (6609/7962) remote: Counting objects: 84% (6689/7962) remote: Counting objects: 85% (6768/7962) remote: Counting objects: 86% (6848/7962) remote: Counting objects: 87% (6927/7962) remote: Counting objects: 88% (7007/7962) remote: Counting objects: 89% (7087/7962) remote: Counting objects: 90% (7166/7962) remote: Counting objects: 91% (7246/7962) remote: Counting objects: 92% (7326/7962) remote: Counting objects: 93% (7405/7962) remote: Counting objects: 94% (7485/7962) remote: Counting objects: 95% (7564/7962) remote: Counting objects: 96% (7644/7962) remote: Counting objects: 97% (7724/7962) remote: Counting objects: 98% (7803/7962) remote: Counting objects: 99% (7883/7962) remote: Counting objects: 100% (7962/7962) remote: Counting objects: 100% (7962/7962), done.
  5. 2.73 s remote: Compressing objects: 0% (1/1618) remote: Compressing objects: 1% (17/1618) remote: Compressing objects: 2% (33/1618) remote: Compressing objects: 3% (49/1618) remote: Compressing objects: 4% (65/1618) remote: Compressing objects: 5% (81/1618) remote: Compressing objects: 6% (98/1618) remote: Compressing objects: 7% (114/1618) remote: Compressing objects: 8% (130/1618) remote: Compressing objects: 9% (146/1618) remote: Compressing objects: 10% (162/1618) remote: Compressing objects: 11% (178/1618) remote: Compressing objects: 12% (195/1618) remote: Compressing objects: 13% (211/1618) remote: Compressing objects: 14% (227/1618) remote: Compressing objects: 15% (243/1618) remote: Compressing objects: 16% (259/1618) remote: Compressing objects: 16% (261/1618) remote: Compressing objects: 17% (276/1618) remote: Compressing objects: 18% (292/1618) remote: Compressing objects: 19% (308/1618) remote: Compressing objects: 20% (324/1618) remote: Compressing objects: 21% (340/1618) remote: Compressing objects: 22% (356/1618) remote: Compressing objects: 23% (373/1618) remote: Compressing objects: 24% (389/1618) remote: Compressing objects: 25% (405/1618) remote: Compressing objects: 26% (421/1618) remote: Compressing objects: 27% (437/1618) remote: Compressing objects: 28% (454/1618) remote: Compressing objects: 29% (470/1618) remote: Compressing objects: 30% (486/1618) remote: Compressing objects: 31% (502/1618) remote: Compressing objects: 32% (518/1618) remote: Compressing objects: 33% (534/1618) remote: Compressing objects: 34% (551/1618) remote: Compressing objects: 35% (567/1618) remote: Compressing objects: 36% (583/1618) remote: Compressing objects: 37% (599/1618) remote: Compressing objects: 38% (615/1618) remote: Compressing objects: 39% (632/1618) remote: Compressing objects: 40% (648/1618) remote: Compressing objects: 41% (664/1618) remote: Compressing objects: 42% (680/1618) remote: Compressing objects: 43% (696/1618) remote: Compressing objects: 44% (712/1618) remote: Compressing objects: 45% (729/1618) remote: Compressing objects: 46% (745/1618) remote: Compressing objects: 47% (761/1618) remote: Compressing objects: 48% (777/1618) remote: Compressing objects: 49% (793/1618) remote: Compressing objects: 50% (809/1618) remote: Compressing objects: 51% (826/1618) remote: Compressing objects: 52% (842/1618) remote: Compressing objects: 53% (858/1618) remote: Compressing objects: 54% (874/1618) remote: Compressing objects: 55% (890/1618) remote: Compressing objects: 56% (907/1618) remote: Compressing objects: 57% (923/1618) remote: Compressing objects: 58% (939/1618) remote: Compressing objects: 59% (955/1618) remote: Compressing objects: 60% (971/1618) remote: Compressing objects: 61% (987/1618) remote: Compressing objects: 62% (1004/1618) remote: Compressing objects: 63% (1020/1618) remote: Compressing objects: 64% (1036/1618) remote: Compressing objects: 65% (1052/1618) remote: Compressing objects: 66% (1068/1618) remote: Compressing objects: 67% (1085/1618) remote: Compressing objects: 68% (1101/1618) remote: Compressing objects: 69% (1117/1618) remote: Compressing objects: 70% (1133/1618) remote: Compressing objects: 71% (1149/1618) remote: Compressing objects: 72% (1165/1618) remote: Compressing objects: 73% (1182/1618) remote: Compressing objects: 74% (1198/1618) remote: Compressing objects: 75% (1214/1618) remote: Compressing objects: 76% (1230/1618) remote: Compressing objects: 77% (1246/1618) remote: Compressing objects: 78% (1263/1618) remote: Compressing objects: 79% (1279/1618) remote: Compressing objects: 80% (1295/1618) remote: Compressing objects: 81% (1311/1618) remote: Compressing objects: 82% (1327/1618) remote: Compressing objects: 83% (1343/1618) remote: Compressing objects: 84% (1360/1618) remote: Compressing objects: 85% (1376/1618) remote: Compressing objects: 86% (1392/1618) remote: Compressing objects: 87% (1408/1618) remote: Compressing objects: 88% (1424/1618) remote: Compressing objects: 89% (1441/1618) remote: Compressing objects: 90% (1457/1618) remote: Compressing objects: 91% (1473/1618) remote: Compressing objects: 92% (1489/1618) remote: Compressing objects: 93% (1505/1618) remote: Compressing objects: 94% (1521/1618) remote: Compressing objects: 95% (1538/1618) remote: Compressing objects: 96% (1554/1618) remote: Compressing objects: 97% (1570/1618) remote: Compressing objects: 98% (1586/1618) remote: Compressing objects: 99% (1602/1618) remote: Compressing objects: 100% (1618/1618) remote: Compressing objects: 100% (1618/1618), done.
  6. 5.42 s Receiving objects: 0% (1/65311) Receiving objects: 1% (654/65311) Receiving objects: 2% (1307/65311) Receiving objects: 3% (1960/65311) Receiving objects: 4% (2613/65311) Receiving objects: 5% (3266/65311) Receiving objects: 6% (3919/65311) Receiving objects: 7% (4572/65311) Receiving objects: 8% (5225/65311) Receiving objects: 9% (5878/65311) Receiving objects: 10% (6532/65311) Receiving objects: 11% (7185/65311) Receiving objects: 12% (7838/65311), 12.80 MiB | 25.58 MiB/s Receiving objects: 13% (8491/65311), 12.80 MiB | 25.58 MiB/s Receiving objects: 14% (9144/65311), 12.80 MiB | 25.58 MiB/s Receiving objects: 15% (9797/65311), 12.80 MiB | 25.58 MiB/s Receiving objects: 16% (10450/65311), 12.80 MiB | 25.58 MiB/s Receiving objects: 17% (11103/65311), 12.80 MiB | 25.58 MiB/s Receiving objects: 18% (11756/65311), 12.80 MiB | 25.58 MiB/s Receiving objects: 19% (12410/65311), 12.80 MiB | 25.58 MiB/s Receiving objects: 20% (13063/65311), 12.80 MiB | 25.58 MiB/s Receiving objects: 21% (13716/65311), 12.80 MiB | 25.58 MiB/s Receiving objects: 22% (14369/65311), 12.80 MiB | 25.58 MiB/s Receiving objects: 23% (15022/65311), 12.80 MiB | 25.58 MiB/s Receiving objects: 24% (15675/65311), 12.80 MiB | 25.58 MiB/s Receiving objects: 25% (16328/65311), 12.80 MiB | 25.58 MiB/s Receiving objects: 26% (16981/65311), 12.80 MiB | 25.58 MiB/s Receiving objects: 27% (17634/65311), 12.80 MiB | 25.58 MiB/s Receiving objects: 28% (18288/65311), 12.80 MiB | 25.58 MiB/s Receiving objects: 29% (18941/65311), 12.80 MiB | 25.58 MiB/s Receiving objects: 30% (19594/65311), 12.80 MiB | 25.58 MiB/s Receiving objects: 31% (20247/65311), 12.80 MiB | 25.58 MiB/s Receiving objects: 32% (20900/65311), 12.80 MiB | 25.58 MiB/s Receiving objects: 33% (21553/65311), 12.80 MiB | 25.58 MiB/s Receiving objects: 34% (22206/65311), 12.80 MiB | 25.58 MiB/s Receiving objects: 35% (22859/65311), 12.80 MiB | 25.58 MiB/s Receiving objects: 36% (23512/65311), 12.80 MiB | 25.58 MiB/s Receiving objects: 37% (24166/65311), 12.80 MiB | 25.58 MiB/s Receiving objects: 38% (24819/65311), 12.80 MiB | 25.58 MiB/s Receiving objects: 39% (25472/65311), 12.80 MiB | 25.58 MiB/s Receiving objects: 40% (26125/65311), 12.80 MiB | 25.58 MiB/s Receiving objects: 41% (26778/65311), 12.80 MiB | 25.58 MiB/s Receiving objects: 42% (27431/65311), 12.80 MiB | 25.58 MiB/s Receiving objects: 43% (28084/65311), 12.80 MiB | 25.58 MiB/s Receiving objects: 44% (28737/65311), 12.80 MiB | 25.58 MiB/s Receiving objects: 45% (29390/65311), 12.80 MiB | 25.58 MiB/s Receiving objects: 46% (30044/65311), 12.80 MiB | 25.58 MiB/s Receiving objects: 47% (30697/65311), 12.80 MiB | 25.58 MiB/s Receiving objects: 48% (31350/65311), 12.80 MiB | 25.58 MiB/s Receiving objects: 49% (32003/65311), 12.80 MiB | 25.58 MiB/s Receiving objects: 50% (32656/65311), 12.80 MiB | 25.58 MiB/s Receiving objects: 50% (32753/65311), 30.50 MiB | 30.25 MiB/s Receiving objects: 51% (33309/65311), 30.50 MiB | 30.25 MiB/s Receiving objects: 52% (33962/65311), 30.50 MiB | 30.25 MiB/s Receiving objects: 53% (34615/65311), 30.50 MiB | 30.25 MiB/s Receiving objects: 54% (35268/65311), 30.50 MiB | 30.25 MiB/s Receiving objects: 55% (35922/65311), 30.50 MiB | 30.25 MiB/s Receiving objects: 56% (36575/65311), 30.50 MiB | 30.25 MiB/s Receiving objects: 57% (37228/65311), 30.50 MiB | 30.25 MiB/s Receiving objects: 58% (37881/65311), 30.50 MiB | 30.25 MiB/s Receiving objects: 59% (38534/65311), 30.50 MiB | 30.25 MiB/s Receiving objects: 60% (39187/65311), 30.50 MiB | 30.25 MiB/s Receiving objects: 61% (39840/65311), 30.50 MiB | 30.25 MiB/s Receiving objects: 62% (40493/65311), 47.26 MiB | 31.34 MiB/s Receiving objects: 63% (41146/65311), 47.26 MiB | 31.34 MiB/s Receiving objects: 64% (41800/65311), 47.26 MiB | 31.34 MiB/s Receiving objects: 65% (42453/65311), 47.26 MiB | 31.34 MiB/s Receiving objects: 66% (43106/65311), 47.26 MiB | 31.34 MiB/s Receiving objects: 67% (43759/65311), 47.26 MiB | 31.34 MiB/s Receiving objects: 68% (44412/65311), 47.26 MiB | 31.34 MiB/s Receiving objects: 69% (45065/65311), 47.26 MiB | 31.34 MiB/s Receiving objects: 70% (45718/65311), 47.26 MiB | 31.34 MiB/s Receiving objects: 71% (46371/65311), 47.26 MiB | 31.34 MiB/s Receiving objects: 72% (47024/65311), 47.26 MiB | 31.34 MiB/s Receiving objects: 73% (47678/65311), 47.26 MiB | 31.34 MiB/s Receiving objects: 74% (48331/65311), 47.26 MiB | 31.34 MiB/s Receiving objects: 74% (48916/65311), 64.12 MiB | 31.93 MiB/s Receiving objects: 75% (48984/65311), 64.12 MiB | 31.93 MiB/s Receiving objects: 76% (49637/65311), 64.12 MiB | 31.93 MiB/s Receiving objects: 77% (50290/65311), 64.12 MiB | 31.93 MiB/s Receiving objects: 78% (50943/65311), 64.12 MiB | 31.93 MiB/s Receiving objects: 79% (51596/65311), 64.12 MiB | 31.93 MiB/s Receiving objects: 80% (52249/65311), 64.12 MiB | 31.93 MiB/s Receiving objects: 81% (52902/65311), 64.12 MiB | 31.93 MiB/s Receiving objects: 82% (53556/65311), 64.12 MiB | 31.93 MiB/s Receiving objects: 83% (54209/65311), 64.12 MiB | 31.93 MiB/s Receiving objects: 84% (54862/65311), 64.12 MiB | 31.93 MiB/s Receiving objects: 85% (55515/65311), 64.12 MiB | 31.93 MiB/s Receiving objects: 86% (56168/65311), 81.08 MiB | 32.21 MiB/s Receiving objects: 87% (56821/65311), 81.08 MiB | 32.21 MiB/s Receiving objects: 88% (57474/65311), 81.08 MiB | 32.21 MiB/s Receiving objects: 89% (58127/65311), 81.08 MiB | 32.21 MiB/s Receiving objects: 90% (58780/65311), 81.08 MiB | 32.21 MiB/s Receiving objects: 91% (59434/65311), 81.08 MiB | 32.21 MiB/s Receiving objects: 92% (60087/65311), 81.08 MiB | 32.21 MiB/s Receiving objects: 93% (60740/65311), 81.08 MiB | 32.21 MiB/s Receiving objects: 94% (61393/65311), 81.08 MiB | 32.21 MiB/s Receiving objects: 95% (62046/65311), 81.08 MiB | 32.21 MiB/s Receiving objects: 96% (62699/65311), 81.08 MiB | 32.21 MiB/s Receiving objects: 97% (63352/65311), 81.08 MiB | 32.21 MiB/s Receiving objects: 98% (64005/65311), 81.08 MiB | 32.21 MiB/s Receiving objects: 99% (64658/65311), 81.08 MiB | 32.21 MiB/s remote: Total 65311 (delta 6894), reused 6436 (delta 6334), pack-reused 57349 (from 1)
  7. 5.48 s Receiving objects: 100% (65311/65311), 81.08 MiB | 32.21 MiB/s Receiving objects: 100% (65311/65311), 87.63 MiB | 32.57 MiB/s, done.
  8. 6.07 s Resolving deltas: 0% (0/46012) Resolving deltas: 1% (461/46012) Resolving deltas: 2% (921/46012) Resolving deltas: 3% (1381/46012) Resolving deltas: 4% (1841/46012) Resolving deltas: 5% (2302/46012) Resolving deltas: 6% (2761/46012) Resolving deltas: 7% (3221/46012) Resolving deltas: 8% (3681/46012) Resolving deltas: 9% (4145/46012) Resolving deltas: 10% (4602/46012) Resolving deltas: 11% (5066/46012) Resolving deltas: 12% (5522/46012) Resolving deltas: 13% (5982/46012) Resolving deltas: 14% (6442/46012) Resolving deltas: 15% (6902/46012) Resolving deltas: 16% (7362/46012) Resolving deltas: 17% (7823/46012) Resolving deltas: 18% (8283/46012) Resolving deltas: 19% (8743/46012) Resolving deltas: 20% (9203/46012) Resolving deltas: 21% (9663/46012) Resolving deltas: 22% (10123/46012) Resolving deltas: 23% (10583/46012) Resolving deltas: 24% (11043/46012) Resolving deltas: 25% (11504/46012) Resolving deltas: 26% (11964/46012) Resolving deltas: 27% (12424/46012) Resolving deltas: 28% (12884/46012) Resolving deltas: 29% (13344/46012) Resolving deltas: 30% (13804/46012) Resolving deltas: 31% (14265/46012) Resolving deltas: 32% (14725/46012) Resolving deltas: 33% (15184/46012) Resolving deltas: 34% (15645/46012) Resolving deltas: 35% (16108/46012) Resolving deltas: 36% (16565/46012) Resolving deltas: 37% (17026/46012) Resolving deltas: 38% (17485/46012) Resolving deltas: 39% (17945/46012) Resolving deltas: 40% (18405/46012) Resolving deltas: 41% (18865/46012) Resolving deltas: 42% (19326/46012) Resolving deltas: 43% (19786/46012) Resolving deltas: 44% (20246/46012) Resolving deltas: 45% (20708/46012) Resolving deltas: 46% (21167/46012) Resolving deltas: 47% (21626/46012) Resolving deltas: 48% (22087/46012) Resolving deltas: 49% (22546/46012) Resolving deltas: 50% (23006/46012) Resolving deltas: 51% (23469/46012) Resolving deltas: 52% (23927/46012) Resolving deltas: 53% (24387/46012) Resolving deltas: 54% (24847/46012) Resolving deltas: 55% (25312/46012) Resolving deltas: 56% (25767/46012) Resolving deltas: 57% (26227/46012) Resolving deltas: 58% (26687/46012) Resolving deltas: 59% (27148/46012) Resolving deltas: 60% (27608/46012) Resolving deltas: 61% (28068/46012) Resolving deltas: 62% (28529/46012) Resolving deltas: 63% (28989/46012) Resolving deltas: 64% (29448/46012) Resolving deltas: 65% (29908/46012) Resolving deltas: 66% (30368/46012) Resolving deltas: 67% (30829/46012) Resolving deltas: 68% (31289/46012) Resolving deltas: 69% (31749/46012) Resolving deltas: 70% (32209/46012) Resolving deltas: 71% (32669/46012) Resolving deltas: 72% (33129/46012) Resolving deltas: 73% (33589/46012) Resolving deltas: 74% (34049/46012) Resolving deltas: 75% (34509/46012) Resolving deltas: 76% (34970/46012) Resolving deltas: 77% (35430/46012) Resolving deltas: 78% (35890/46012) Resolving deltas: 79% (36352/46012) Resolving deltas: 80% (36810/46012) Resolving deltas: 81% (37270/46012) Resolving deltas: 82% (37730/46012) Resolving deltas: 83% (38190/46012) Resolving deltas: 84% (38651/46012) Resolving deltas: 85% (39111/46012) Resolving deltas: 86% (39571/46012) Resolving deltas: 87% (40032/46012) Resolving deltas: 88% (40491/46012) Resolving deltas: 89% (40951/46012) Resolving deltas: 90% (41411/46012) Resolving deltas: 91% (41871/46012) Resolving deltas: 92% (42332/46012) Resolving deltas: 93% (42792/46012) Resolving deltas: 94% (43252/46012) Resolving deltas: 95% (43712/46012) Resolving deltas: 96% (44173/46012) Resolving deltas: 97% (44633/46012) Resolving deltas: 98% (45092/46012) Resolving deltas: 99% (45552/46012) Resolving deltas: 100% (46012/46012) Resolving deltas: 100% (46012/46012), done.
  9. 6.34 s Fetching commit 7b5358c6b7be5a42e56da6160542ea0d424ced97 for vakint_rustred ...
  10. 6.34 s $ /nix/store/bcnisk3ydfgv26v2gw3zlky24g00yww2-git-2.54.0/bin/git fetch origin 7b5358c6b7be5a42e56da6160542ea0d424ced97
  11. 6.83 s From https://github.com/alphal00p/gammaloop
  12. 6.83 s * branch 7b5358c6b7be5a42e56da6160542ea0d424ced97 -> FETCH_HEAD
  13. 6.84 s $ /nix/store/9ypz3flqsrl5xl495mm8h645gadjsxi1-coreutils-9.11/bin/timeout --kill-after=15s 7200s /nix/store/bcnisk3ydfgv26v2gw3zlky24g00yww2-git-2.54.0/bin/git -c advice.detachedHead=false checkout 7b5358c6b7be5a42e56da6160542ea0d424ced97
  14. 6.98 s HEAD is now at 7b5358c6 Bind RustRed artifacts to terminal catalogs
  15. 6.99 s $ /nix/store/9ypz3flqsrl5xl495mm8h645gadjsxi1-coreutils-9.11/bin/timeout --kill-after=15s 7200s /nix/store/23zk8sgzamrbmj1fday15szf7f2279s8-nix-2.34.7/bin/nix --extra-experimental-features nix-command --extra-experimental-features flakes --log-format internal-json run .#packages.x86_64-linux.nix-ci-check-gammaloop-nextest-spenso --print-build-logs
  16. 10.44 s
  17. 10.76 s Downloading cached gammaloop-nextest-binaries-spenso-idenso from https://cache.nix-ci.com
  18. 10.81 s Downloading cached gammaloop-nextest-binaries-spenso-spenso from https://cache.nix-ci.com
  19. 10.81 s Downloading cached gammaloop-nextest-binaries-spenso-spenso-hep-lib from https://cache.nix-ci.com
  20. 10.81 s Downloading cached gammaloop-nextest-binaries-spenso-spenso-macros from https://cache.nix-ci.com
  21. 10.81 s Downloading cached gammaloop-nextest-binaries-spenso-symbolica-utils from https://cache.nix-ci.com
  22. 11.33 s Downloaded cached gammaloop-nextest-binaries-spenso-idenso (29.3 MiB) in 565ms
  23. 11.33 s Progress: 0 of 1 built, 1 of 7 downloaded from cache (4 downloading)
  24. 11.48 s Downloaded cached gammaloop-nextest-binaries-spenso-spenso-macros (6.5 MiB) in 669ms
  25. 11.48 s Progress: 0 of 1 built, 2 of 7 downloaded from cache (3 downloading)
  26. 11.49 s Downloaded cached gammaloop-nextest-binaries-spenso-symbolica-utils (6.3 MiB) in 685ms
  27. 11.49 s Progress: 0 of 1 built, 3 of 7 downloaded from cache (2 downloading)
  28. 11.73 s Downloaded cached gammaloop-nextest-binaries-spenso-spenso-hep-lib (34 MiB) in 920ms
  29. 11.73 s Progress: 0 of 1 built, 4 of 7 downloaded from cache (1 downloading)
  30. 11.79 s Downloaded cached gammaloop-nextest-binaries-spenso-spenso (10.2 MiB) in 981ms
  31. 11.79 s Progress: 0 of 1 built, 5 of 7 downloaded from cache
  32. 11.79 s Downloading cached gammaloop-nextest-binaries-spenso from https://cache.nix-ci.com
  33. 11.82 s Downloaded cached gammaloop-nextest-binaries-spenso (1920 B) in 28ms
  34. 11.82 s Progress: 0 of 1 built, 6 of 7 downloaded from cache
  35. 11.82 s Downloading cached nix-ci-check-gammaloop-nextest-spenso from https://cache.nix-ci.com
  36. 11.84 s Downloaded cached nix-ci-check-gammaloop-nextest-spenso (1016 B) in 28ms
  37. 11.84 s Progress: 0 of 1 built, 7 of 7 downloaded from cache
  38. 15.35 s evaluating derivation 'g querying gammaloop-nexte [0/1 built, 0.0 KiB DL] [1/0/1 built, 0.0 KiB DLgammaloop-nextest-spenso> Extracting 5 binaries and 2 linked paths to /build/nextest-archive-J2DSg6
  39. 15.51 s gammaloop-nextest-spenso> Extracted 19 files to /build/nextest-archive-J2DSg6 in 0.16s
  40. 15.52 s gammaloop-nextest-spenso> ------------
  41. 15.52 s gammaloop-nextest-spenso> Nextest run ID c7e42a0d-b4ce-4a33-9da8-0ab5807af8e0 with nextest profile: ci_gammaloop
  42. 15.52 s gammaloop-nextest-spenso> Starting 224 tests across 5 binaries (26 tests skipped, including 2 tests via profile.ci_gammaloop.default-filter)
  43. 15.60 s gammaloop-nextest-spenso> FAIL [ 0.009s] ( 44/224) idenso color::test::form_reference::metric_contraction_respects_antisymmetric_normalization
  44. 15.60 s gammaloop-nextest-spenso> stdout ---
  45. 15.60 s gammaloop-nextest-spenso>
  46. 15.60 s gammaloop-nextest-spenso> running 1 test
  47. 15.60 s gammaloop-nextest-spenso> test color::test::form_reference::metric_contraction_respects_antisymmetric_normalization ... FAILED
  48. 15.60 s gammaloop-nextest-spenso>
  49. 15.60 s gammaloop-nextest-spenso> failures:
  50. 15.60 s gammaloop-nextest-spenso>
  51. 15.60 s gammaloop-nextest-spenso> failures:
  52. 15.60 s gammaloop-nextest-spenso> color::test::form_reference::metric_contraction_respects_antisymmetric_normalization
  53. 15.60 s gammaloop-nextest-spenso>
  54. 15.60 s gammaloop-nextest-spenso> test result: FAILED. 0 passed; 1 failed; 0 ignored; 0 measured; 240 filtered out; finished in 0.00s
  55. 15.60 s gammaloop-nextest-spenso>
  56. 15.60 s gammaloop-nextest-spenso> stderr ---
  57. 15.60 s gammaloop-nextest-spenso>
  58. 15.60 s gammaloop-nextest-spenso> thread 'color::test::form_reference::metric_contraction_respects_antisymmetric_normalization' (331) panicked at crates/idenso/src/color/test/form_reference.rs:171:5:
  59. 15.60 s gammaloop-nextest-spenso> assertion `left == right` failed
  60. 15.60 s gammaloop-nextest-spenso> left: "-1*f(coad(8,standalone_metric_j),coad(8,standalone_metric_s),coad(8,standalone_metric_u))"
  61. 15.60 s gammaloop-nextest-spenso> right: "f(coad(8,standalone_metric_j),coad(8,standalone_metric_s),coad(8,standalone_metric_u))"
  62. 15.60 s gammaloop-nextest-spenso> stack backtrace:
  63. 15.60 s gammaloop-nextest-spenso> 0: __rustc::rust_begin_unwind
  64. 15.60 s gammaloop-nextest-spenso> 1: core::panicking::panic_fmt
  65. 15.60 s gammaloop-nextest-spenso> 2: core::panicking::assert_failed_inner
  66. 15.60 s gammaloop-nextest-spenso> 3: core::panicking::assert_failed::<alloc::string::String, alloc::string::String>
  67. 15.60 s gammaloop-nextest-spenso> 4: idenso::color::test::form_reference::metric_contraction_respects_antisymmetric_normalization
  68. 15.60 s gammaloop-nextest-spenso> 5: <idenso::color::test::form_reference::metric_contraction_respects_antisymmetric_normalization::{closure#0} as core::ops::function::FnOnce<()>>::call_once
  69. 15.60 s gammaloop-nextest-spenso> note: Some details are omitted, run with `RUST_BACKTRACE=full` for a verbose backtrace.
  70. 15.60 s gammaloop-nextest-spenso>
  71. 15.80 s gammaloop-nextest-spenso> FAIL [ 0.034s] (218/224) idenso tensor::tests::parsing::infinite_execution
  72. 15.85 s gammaloop-nextest-spenso> stdout ---
  73. 15.85 s gammaloop-nextest-spenso>
  74. 15.85 s gammaloop-nextest-spenso> running 1 test
  75. 15.85 s gammaloop-nextest-spenso> ━━━━━━━━━━━━━━━━━━━━━━━━━━━━━━━ Snapshot Summary ━━━━━━━━━━━━━━━━━━━━━━━━━━━━━━━
  76. 15.85 s gammaloop-nextest-spenso> Snapshot: infinite_execution
  77. 15.85 s gammaloop-nextest-spenso> Source: crates/idenso/src/tensor/tests/parsing.rs:910
  78. 15.85 s gammaloop-nextest-spenso> ────────────────────────────────────────────────────────────────────────────────
  79. 15.85 s gammaloop-nextest-spenso> Expression: net_iter.snapshot_dot()
  80. 15.85 s gammaloop-nextest-spenso> ────────────────────────────────────────────────────────────────────────────────
  81. 15.85 s gammaloop-nextest-spenso> -old snapshot
  82. 15.85 s gammaloop-nextest-spenso> +new results
  83. 15.85 s gammaloop-nextest-spenso> ────────────┬───────────────────────────────────────────────────────────────────
  84. 15.85 s gammaloop-nextest-spenso> 8 8 │ 0:0:s -> ext0 [id=0 color="red"];
  85. 15.85 s gammaloop-nextest-spenso> 9 9 │ ext1 [style=invis];
  86. 15.85 s gammaloop-nextest-spenso> 10 10 │ 0:5:s -> ext1 [id=1 dir=none color="red" label="mink4|l_0"];
  87. 15.85 s gammaloop-nextest-spenso> 11 11 │ ext2 [style=invis];
  88. 15.85 s gammaloop-nextest-spenso> 12 │- 0:4:s -> ext2 [id=2 dir=none color="red" label="bis4|l_2"];
  89. 15.85 s gammaloop-nextest-spenso> 12 │+ 0:3:s -> ext2 [id=2 dir=none color="red" label="mink4|l_1"];
  90. 15.85 s gammaloop-nextest-spenso> 13 13 │ ext3 [style=invis];
  91. 15.85 s gammaloop-nextest-spenso> 14 │- 0:3:s -> ext3 [id=3 dir=none color="red" label="bis4|l_3"];
  92. 15.85 s gammaloop-nextest-spenso> 14 │+ 0:1:s -> ext3 [id=3 dir=none color="red" label="bis4|l_2"];
  93. 15.85 s gammaloop-nextest-spenso> 15 15 │ ext4 [style=invis];
  94. 15.85 s gammaloop-nextest-spenso> 16 │- 0:1:s -> ext4 [id=4 dir=none color="red" label="mink4|l_1"];
  95. 15.85 s gammaloop-nextest-spenso> 16 │+ 0:2:s -> ext4 [id=4 dir=none color="red" label="mink4|l_4"];
  96. 15.85 s gammaloop-nextest-spenso> 17 17 │ ext5 [style=invis];
  97. 15.85 s gammaloop-nextest-spenso> 18 │- 0:2:s -> ext5 [id=5 dir=none color="red" label="mink4|l_4"];
  98. 15.85 s gammaloop-nextest-spenso> 18 │+ 0:4:s -> ext5 [id=5 dir=none color="red" label="bis4|l_3"];
  99. 15.85 s gammaloop-nextest-spenso> 19 19 │ }
  100. 15.85 s gammaloop-nextest-spenso> ────────────┴───────────────────────────────────────────────────────────────────
  101. 15.85 s gammaloop-nextest-spenso> To update snapshots run `cargo insta review`
  102. 15.85 s gammaloop-nextest-spenso> Stopped on the first failure. Run `cargo insta test` to run all snapshots.
  103. 15.85 s gammaloop-nextest-spenso> test tensor::tests::parsing::infinite_execution ... FAILED
  104. 15.85 s gammaloop-nextest-spenso>
  105. 15.85 s gammaloop-nextest-spenso> failures:
  106. 15.85 s gammaloop-nextest-spenso>
  107. 15.85 s gammaloop-nextest-spenso> failures:
  108. 15.85 s gammaloop-nextest-spenso> tensor::tests::parsing::infinite_execution
  109. 15.85 s gammaloop-nextest-spenso>
  110. 15.85 s gammaloop-nextest-spenso> test result: FAILED. 0 passed; 1 failed; 0 ignored; 0 measured; 240 filtered out; finished in 0.03s
  111. 15.85 s gammaloop-nextest-spenso>
  112. 15.85 s gammaloop-nextest-spenso> stderr ---
  113. 15.85 s gammaloop-nextest-spenso>
  114. 15.85 s gammaloop-nextest-spenso> thread 'tensor::tests::parsing::infinite_execution' (849) panicked at /nix/store/p13pfw1gvvk8m860apfhvzcgidxhbs7g-vendor-cargo-deps/c19b7c6f923b580ac259164a89f2577984ad5ab09ee9d583b888f934adbbe8d0/insta-1.47.2/src/runtime.rs:719:13:
  115. 15.85 s gammaloop-nextest-spenso> snapshot assertion for 'infinite_execution' failed in line 910
  116. 15.85 s gammaloop-nextest-spenso> stack backtrace:
  117. 15.85 s gammaloop-nextest-spenso> 0: __rustc::rust_begin_unwind
  118. 15.85 s gammaloop-nextest-spenso> 1: core::panicking::panic_fmt
  119. 15.85 s gammaloop-nextest-spenso> 2: insta::runtime::assert_snapshot
  120. 15.85 s gammaloop-nextest-spenso> 3: idenso::tensor::tests::parsing::infinite_execution
  121. 15.85 s gammaloop-nextest-spenso> 4: <idenso::tensor::tests::parsing::infinite_execution::{closure#0} as core::ops::function::FnOnce<()>>::call_once
  122. 15.85 s gammaloop-nextest-spenso> note: Some details are omitted, run with `RUST_BACKTRACE=full` for a verbose backtrace.
  123. 15.85 s gammaloop-nextest-spenso>
  124. 17.03 s gammaloop-nextest-spenso> ------------
  125. 17.03 s gammaloop-nextest-spenso> Summary [ 1.510s] 224 tests run: 222 passed, 2 failed, 26 skipped
  126. 17.03 s gammaloop-nextest-spenso> FAIL [ 0.009s] ( 44/224) idenso color::test::form_reference::metric_contraction_respects_antisymmetric_normalization
  127. 17.03 s gammaloop-nextest-spenso> stdout ---
  128. 17.03 s gammaloop-nextest-spenso>
  129. 17.03 s gammaloop-nextest-spenso> running 1 test
  130. 17.03 s gammaloop-nextest-spenso> test color::test::form_reference::metric_contraction_respects_antisymmetric_normalization ... FAILED
  131. 17.03 s gammaloop-nextest-spenso>
  132. 17.03 s gammaloop-nextest-spenso> failures:
  133. 17.03 s gammaloop-nextest-spenso>
  134. 17.03 s gammaloop-nextest-spenso> failures:
  135. 17.03 s gammaloop-nextest-spenso> color::test::form_reference::metric_contraction_respects_antisymmetric_normalization
  136. 17.03 s gammaloop-nextest-spenso>
  137. 17.03 s gammaloop-nextest-spenso> test result: FAILED. 0 passed; 1 failed; 0 ignored; 0 measured; 240 filtered out; finished in 0.00s
  138. 17.03 s gammaloop-nextest-spenso>
  139. 17.03 s gammaloop-nextest-spenso> stderr ---
  140. 17.03 s gammaloop-nextest-spenso>
  141. 17.03 s gammaloop-nextest-spenso> thread 'color::test::form_reference::metric_contraction_respects_antisymmetric_normalization' (331) panicked at crates/idenso/src/color/test/form_reference.rs:171:5:
  142. 17.03 s gammaloop-nextest-spenso> assertion `left == right` failed
  143. 17.03 s gammaloop-nextest-spenso> left: "-1*f(coad(8,standalone_metric_j),coad(8,standalone_metric_s),coad(8,standalone_metric_u))"
  144. 17.03 s gammaloop-nextest-spenso> right: "f(coad(8,standalone_metric_j),coad(8,standalone_metric_s),coad(8,standalone_metric_u))"
  145. 17.03 s gammaloop-nextest-spenso> stack backtrace:
  146. 17.03 s gammaloop-nextest-spenso> 0: __rustc::rust_begin_unwind
  147. 17.03 s gammaloop-nextest-spenso> 1: core::panicking::panic_fmt
  148. 17.03 s gammaloop-nextest-spenso> 2: core::panicking::assert_failed_inner
  149. 17.03 s gammaloop-nextest-spenso> 3: core::panicking::assert_failed::<alloc::string::String, alloc::string::String>
  150. 17.03 s gammaloop-nextest-spenso> 4: idenso::color::test::form_reference::metric_contraction_respects_antisymmetric_normalization
  151. 17.03 s gammaloop-nextest-spenso> 5: <idenso::color::test::form_reference::metric_contraction_respects_antisymmetric_normalization::{closure#0} as core::ops::function::FnOnce<()>>::call_once
  152. 17.03 s gammaloop-nextest-spenso> note: Some details are omitted, run with `RUST_BACKTRACE=full` for a verbose backtrace.
  153. 17.03 s gammaloop-nextest-spenso>
  154. 17.03 s gammaloop-nextest-spenso> FAIL [ 0.034s] (218/224) idenso tensor::tests::parsing::infinite_execution
  155. 17.03 s gammaloop-nextest-spenso> stdout ---
  156. 17.03 s gammaloop-nextest-spenso>
  157. 17.03 s gammaloop-nextest-spenso> running 1 test
  158. 17.03 s gammaloop-nextest-spenso> ━━━━━━━━━━━━━━━━━━━━━━━━━━━━━━━ Snapshot Summary ━━━━━━━━━━━━━━━━━━━━━━━━━━━━━━━
  159. 17.03 s gammaloop-nextest-spenso> Snapshot: infinite_execution
  160. 17.03 s gammaloop-nextest-spenso> Source: crates/idenso/src/tensor/tests/parsing.rs:910
  161. 17.03 s gammaloop-nextest-spenso> ────────────────────────────────────────────────────────────────────────────────
  162. 17.03 s gammaloop-nextest-spenso> Expression: net_iter.snapshot_dot()
  163. 17.03 s gammaloop-nextest-spenso> ────────────────────────────────────────────────────────────────────────────────
  164. 17.03 s gammaloop-nextest-spenso> -old snapshot
  165. 17.03 s gammaloop-nextest-spenso> +new results
  166. 17.03 s gammaloop-nextest-spenso> ────────────┬───────────────────────────────────────────────────────────────────
  167. 17.03 s gammaloop-nextest-spenso> 8 8 │ 0:0:s -> ext0 [id=0 color="red"];
  168. 17.03 s gammaloop-nextest-spenso> 9 9 │ ext1 [style=invis];
  169. 17.03 s gammaloop-nextest-spenso> 10 10 │ 0:5:s -> ext1 [id=1 dir=none color="red" label="mink4|l_0"];
  170. 17.03 s gammaloop-nextest-spenso> 11 11 │ ext2 [style=invis];
  171. 17.03 s gammaloop-nextest-spenso> 12 │- 0:4:s -> ext2 [id=2 dir=none color="red" label="bis4|l_2"];
  172. 17.03 s gammaloop-nextest-spenso> 12 │+ 0:3:s -> ext2 [id=2 dir=none color="red" label="mink4|l_1"];
  173. 17.03 s gammaloop-nextest-spenso> 13 13 │ ext3 [style=invis];
  174. 17.03 s gammaloop-nextest-spenso> 14 │- 0:3:s -> ext3 [id=3 dir=none color="red" label="bis4|l_3"];
  175. 17.03 s gammaloop-nextest-spenso> 14 │+ 0:1:s -> ext3 [id=3 dir=none color="red" label="bis4|l_2"];
  176. 17.03 s gammaloop-nextest-spenso> 15 15 │ ext4 [style=invis];
  177. 17.03 s gammaloop-nextest-spenso> 16 │- 0:1:s -> ext4 [id=4 dir=none color="red" label="mink4|l_1"];
  178. 17.03 s gammaloop-nextest-spenso> 16 │+ 0:2:s -> ext4 [id=4 dir=none color="red" label="mink4|l_4"];
  179. 17.03 s gammaloop-nextest-spenso> 17 17 │ ext5 [style=invis];
  180. 17.03 s gammaloop-nextest-spenso> 18 │- 0:2:s -> ext5 [id=5 dir=none color="red" label="mink4|l_4"];
  181. 17.03 s gammaloop-nextest-spenso> 18 │+ 0:4:s -> ext5 [id=5 dir=none color="red" label="bis4|l_3"];
  182. 17.03 s gammaloop-nextest-spenso> 19 19 │ }
  183. 17.03 s gammaloop-nextest-spenso> ────────────┴───────────────────────────────────────────────────────────────────
  184. 17.03 s gammaloop-nextest-spenso> To update snapshots run `cargo insta review`
  185. 17.03 s gammaloop-nextest-spenso> Stopped on the first failure. Run `cargo insta test` to run all snapshots.
  186. 17.03 s gammaloop-nextest-spenso> test tensor::tests::parsing::infinite_execution ... FAILED
  187. 17.03 s gammaloop-nextest-spenso>
  188. 17.03 s gammaloop-nextest-spenso> failures:
  189. 17.03 s gammaloop-nextest-spenso>
  190. 17.03 s gammaloop-nextest-spenso> failures:
  191. 17.03 s gammaloop-nextest-spenso> tensor::tests::parsing::infinite_execution
  192. 17.03 s gammaloop-nextest-spenso>
  193. 17.03 s gammaloop-nextest-spenso> test result: FAILED. 0 passed; 1 failed; 0 ignored; 0 measured; 240 filtered out; finished in 0.03s
  194. 17.03 s gammaloop-nextest-spenso>
  195. 17.03 s gammaloop-nextest-spenso> stderr ---
  196. 17.03 s gammaloop-nextest-spenso>
  197. 17.03 s gammaloop-nextest-spenso> thread 'tensor::tests::parsing::infinite_execution' (849) panicked at /nix/store/p13pfw1gvvk8m860apfhvzcgidxhbs7g-vendor-cargo-deps/c19b7c6f923b580ac259164a89f2577984ad5ab09ee9d583b888f934adbbe8d0/insta-1.47.2/src/runtime.rs:719:13:
  198. 17.03 s gammaloop-nextest-spenso> snapshot assertion for 'infinite_execution' failed in line 910
  199. 17.03 s gammaloop-nextest-spenso> stack backtrace:
  200. 17.03 s gammaloop-nextest-spenso> 0: __rustc::rust_begin_unwind
  201. 17.03 s gammaloop-nextest-spenso> 1: core::panicking::panic_fmt
  202. 17.03 s gammaloop-nextest-spenso> 2: insta::runtime::assert_snapshot
  203. 17.03 s gammaloop-nextest-spenso> 3: idenso::tensor::tests::parsing::infinite_execution
  204. 17.03 s gammaloop-nextest-spenso> 4: <idenso::tensor::tests::parsing::infinite_execution::{closure#0} as core::ops::function::FnOnce<()>>::call_once
  205. 17.03 s gammaloop-nextest-spenso> note: Some details are omitted, run with `RUST_BACKTRACE=full` for a verbose backtrace.
  206. 17.03 s gammaloop-nextest-spenso>
  207. 17.06 s gammaloop-nextest-spenso> error: test run failed
  208. 17.08 s gammaloop-nextest-spenso>
  209. 17.08 s gammaloop-nextest-spenso> ========== nextest test summary ==========
  210. 17.08 s gammaloop-nextest-spenso> report: target/nextest/ci_gammaloop/junit.xml
  211. 17.08 s gammaloop-nextest-spenso> tests: 224, failures: 2, errors: 0
  212. 17.08 s gammaloop-nextest-spenso>
  213. 17.08 s gammaloop-nextest-spenso> 1. idenso::color::test::form_reference::metric_contraction_respects_antisymmetric_normalization
  214. 17.08 s gammaloop-nextest-spenso> failure: test failure with exit code 101
  215. 17.08 s gammaloop-nextest-spenso> thread 'color::test::form_reference::metric_contraction_respects_antisymmetric_normalization' (331) panicked at crates/idenso/src/color/test/form_reference.rs:171:5:
  216. 17.08 s gammaloop-nextest-spenso> assertion `left == right` failed
  217. 17.08 s gammaloop-nextest-spenso> left: "-1*f(coad(8,standalone_metric_j),coad(8,standalone_metric_s),coad(8,standalone_metric_u))"
  218. 17.08 s gammaloop-nextest-spenso> right: "f(coad(8,standalone_metric_j),coad(8,standalone_metric_s),coad(8,standalone_metric_u))"
  219. 17.08 s gammaloop-nextest-spenso> stack backtrace:
  220. 17.08 s gammaloop-nextest-spenso> 0: __rustc::rust_begin_unwind
  221. 17.08 s gammaloop-nextest-spenso> 1: core::panicking::panic_fmt
  222. 17.08 s gammaloop-nextest-spenso> 2: core::panicking::assert_failed_inner
  223. 17.08 s gammaloop-nextest-spenso> 3: core::panicking::assert_failed::<alloc::string::String, alloc::string::String>
  224. 17.08 s gammaloop-nextest-spenso> 4: idenso::color::test::form_reference::metric_contraction_respects_antisymmetric_normalization
  225. 17.08 s gammaloop-nextest-spenso> 5: <idenso::color::test::form_reference::metric_contraction_respects_antisymmetric_normalization::{closure#0} as core::ops::function::FnOnce<()>>::call_once
  226. 17.08 s gammaloop-nextest-spenso> note: Some details are omitted, run with `RUST_BACKTRACE=full` for a verbose backtrace.
  227. 17.08 s gammaloop-nextest-spenso> system-out
  228. 17.08 s gammaloop-nextest-spenso> running 1 test
  229. 17.08 s gammaloop-nextest-spenso> test color::test::form_reference::metric_contraction_respects_antisymmetric_normalization ... FAILED
  230. 17.08 s gammaloop-nextest-spenso>
  231. 17.08 s gammaloop-nextest-spenso> failures:
  232. 17.08 s gammaloop-nextest-spenso>
  233. 17.08 s gammaloop-nextest-spenso> failures:
  234. 17.08 s gammaloop-nextest-spenso> color::test::form_reference::metric_contraction_respects_antisymmetric_normalization
  235. 17.08 s gammaloop-nextest-spenso>
  236. 17.08 s gammaloop-nextest-spenso> test result: FAILED. 0 passed; 1 failed; 0 ignored; 0 measured; 240 filtered out; finished in 0.00s
  237. 17.08 s gammaloop-nextest-spenso> system-err
  238. 17.08 s gammaloop-nextest-spenso> thread 'color::test::form_reference::metric_contraction_respects_antisymmetric_normalization' (331) panicked at crates/idenso/src/color/test/form_reference.rs:171:5:
  239. 17.08 s gammaloop-nextest-spenso> assertion `left == right` failed
  240. 17.08 s gammaloop-nextest-spenso> left: "-1*f(coad(8,standalone_metric_j),coad(8,standalone_metric_s),coad(8,standalone_metric_u))"
  241. 17.08 s gammaloop-nextest-spenso> right: "f(coad(8,standalone_metric_j),coad(8,standalone_metric_s),coad(8,standalone_metric_u))"
  242. 17.08 s gammaloop-nextest-spenso> stack backtrace:
  243. 17.08 s gammaloop-nextest-spenso> 0: __rustc::rust_begin_unwind
  244. 17.08 s gammaloop-nextest-spenso> 1: core::panicking::panic_fmt
  245. 17.08 s gammaloop-nextest-spenso> 2: core::panicking::assert_failed_inner
  246. 17.08 s gammaloop-nextest-spenso> 3: core::panicking::assert_failed::<alloc::string::String, alloc::string::String>
  247. 17.08 s gammaloop-nextest-spenso> 4: idenso::color::test::form_reference::metric_contraction_respects_antisymmetric_normalization
  248. 17.08 s gammaloop-nextest-spenso> 5: <idenso::color::test::form_reference::metric_contraction_respects_antisymmetric_normalization::{closure#0} as core::ops::function::FnOnce<()>>::call_once
  249. 17.08 s gammaloop-nextest-spenso> note: Some details are omitted, run with `RUST_BACKTRACE=full` for a verbose backtrace.
  250. 17.08 s gammaloop-nextest-spenso>
  251. 17.08 s gammaloop-nextest-spenso> 2. idenso::tensor::tests::parsing::infinite_execution
  252. 17.08 s gammaloop-nextest-spenso> failure: test failure with exit code 101
  253. 17.08 s gammaloop-nextest-spenso> thread 'tensor::tests::parsing::infinite_execution' (849) panicked at /nix/store/p13pfw1gvvk8m860apfhvzcgidxhbs7g-vendor-cargo-deps/c19b7c6f923b580ac259164a89f2577984ad5ab09ee9d583b888f934adbbe8d0/insta-1.47.2/src/runtime.rs:719:13:
  254. 17.08 s gammaloop-nextest-spenso> snapshot assertion for 'infinite_execution' failed in line 910
  255. 17.08 s gammaloop-nextest-spenso> stack backtrace:
  256. 17.08 s gammaloop-nextest-spenso> 0: __rustc::rust_begin_unwind
  257. 17.08 s gammaloop-nextest-spenso> 1: core::panicking::panic_fmt
  258. 17.08 s gammaloop-nextest-spenso> 2: insta::runtime::assert_snapshot
  259. 17.08 s gammaloop-nextest-spenso> 3: idenso::tensor::tests::parsing::infinite_execution
  260. 17.08 s gammaloop-nextest-spenso> 4: <idenso::tensor::tests::parsing::infinite_execution::{closure#0} as core::ops::function::FnOnce<()>>::call_once
  261. 17.08 s gammaloop-nextest-spenso> note: Some details are omitted, run with `RUST_BACKTRACE=full` for a verbose backtrace.
  262. 17.08 s gammaloop-nextest-spenso> system-out
  263. 17.08 s gammaloop-nextest-spenso> running 1 test
  264. 17.08 s gammaloop-nextest-spenso> ━━━━━━━━━━━━━━━━━━━━━━━━━━━━━━━ Snapshot Summary ━━━━━━━━━━━━━━━━━━━━━━━━━━━━━━━
  265. 17.08 s gammaloop-nextest-spenso> Snapshot: infinite_execution
  266. 17.08 s gammaloop-nextest-spenso> Source: crates/idenso/src/tensor/tests/parsing.rs:910
  267. 17.08 s gammaloop-nextest-spenso> ────────────────────────────────────────────────────────────────────────────────
  268. 17.08 s gammaloop-nextest-spenso> Expression: net_iter.snapshot_dot()
  269. 17.08 s gammaloop-nextest-spenso> ────────────────────────────────────────────────────────────────────────────────
  270. 17.08 s gammaloop-nextest-spenso> -old snapshot
  271. 17.08 s gammaloop-nextest-spenso> +new results
  272. 17.08 s gammaloop-nextest-spenso> ────────────┬───────────────────────────────────────────────────────────────────
  273. 17.08 s gammaloop-nextest-spenso> 8 8 │ 0:0:s-> ext0 [id=0 color="red"];
  274. 17.08 s gammaloop-nextest-spenso> 9 9 │ ext1 [style=invis];
  275. 17.08 s gammaloop-nextest-spenso> 10 10 │ 0:5:s-> ext1 [id=1 dir=none color="red" label="mink4|l_0"];
  276. 17.08 s gammaloop-nextest-spenso> 11 11 │ ext2 [style=invis];
  277. 17.08 s gammaloop-nextest-spenso> 12 │- 0:4:s-> ext2 [id=2 dir=none color="red" label="bis4|l_2"];
  278. 17.08 s gammaloop-nextest-spenso> 12 │+ 0:3:s-> ext2 [id=2 dir=none color="red" label="mink4|l_1"];
  279. 17.08 s gammaloop-nextest-spenso> 13 13 │ ext3 [style=invis];
  280. 17.08 s gammaloop-nextest-spenso> 14 │- 0:3:s-> ext3 [id=3 dir=none color="red" label="bis4|l_3"];
  281. 17.08 s gammaloop-nextest-spenso> 14 │+ 0:1:s-> ext3 [id=3 dir=none color="red" label="bis4|l_2"];
  282. 17.08 s gammaloop-nextest-spenso> 15 15 │ ext4 [style=invis];
  283. 17.08 s gammaloop-nextest-spenso> 16 │- 0:1:s-> ext4 [id=4 dir=none color="red" label="mink4|l_1"];
  284. 17.08 s gammaloop-nextest-spenso> 16 │+ 0:2:s-> ext4 [id=4 dir=none color="red" label="mink4|l_4"];
  285. 17.08 s gammaloop-nextest-spenso> 17 17 │ ext5 [style=invis];
  286. 17.08 s gammaloop-nextest-spenso> 18 │- 0:2:s-> ext5 [id=5 dir=none color="red" label="mink4|l_4"];
  287. 17.08 s gammaloop-nextest-spenso> 18 │+ 0:4:s-> ext5 [id=5 dir=none color="red" label="bis4|l_3"];
  288. 17.08 s gammaloop-nextest-spenso> 19 19 │ }
  289. 17.08 s gammaloop-nextest-spenso> ────────────┴───────────────────────────────────────────────────────────────────
  290. 17.08 s gammaloop-nextest-spenso> To update snapshots run `cargo insta review`
  291. 17.08 s gammaloop-nextest-spenso> Stopped on the first failure. Run `cargo insta test` to run all snapshots.
  292. 17.08 s gammaloop-nextest-spenso> test tensor::tests::parsing::infinite_execution ... FAILED
  293. 17.08 s gammaloop-nextest-spenso>
  294. 17.08 s gammaloop-nextest-spenso> failures:
  295. 17.08 s gammaloop-nextest-spenso>
  296. 17.08 s gammaloop-nextest-spenso> failures:
  297. 17.08 s gammaloop-nextest-spenso> tensor::tests::parsing::infinite_execution
  298. 17.08 s gammaloop-nextest-spenso>
  299. 17.08 s gammaloop-nextest-spenso> test result: FAILED. 0 passed; 1 failed; 0 ignored; 0 measured; 240 filtered out; finished in 0.03s
  300. 17.08 s gammaloop-nextest-spenso> system-err
  301. 17.08 s gammaloop-nextest-spenso> thread 'tensor::tests::parsing::infinite_execution' (849) panicked at /nix/store/p13pfw1gvvk8m860apfhvzcgidxhbs7g-vendor-cargo-deps/c19b7c6f923b580ac259164a89f2577984ad5ab09ee9d583b888f934adbbe8d0/insta-1.47.2/src/runtime.rs:719:13:
  302. 17.08 s gammaloop-nextest-spenso> snapshot assertion for 'infinite_execution' failed in line 910
  303. 17.08 s gammaloop-nextest-spenso> stack backtrace:
  304. 17.08 s gammaloop-nextest-spenso> 0: __rustc::rust_begin_unwind
  305. 17.08 s gammaloop-nextest-spenso> 1: core::panicking::panic_fmt
  306. 17.08 s gammaloop-nextest-spenso> 2: insta::runtime::assert_snapshot
  307. 17.08 s gammaloop-nextest-spenso> 3: idenso::tensor::tests::parsing::infinite_execution
  308. 17.08 s gammaloop-nextest-spenso> 4: <idenso::tensor::tests::parsing::infinite_execution::{closure#0} as core::ops::function::FnOnce<()>>::call_once
  309. 17.08 s gammaloop-nextest-spenso> note: Some details are omitted, run with `RUST_BACKTRACE=full` for a verbose backtrace.
  310. 17.08 s gammaloop-nextest-spenso> =========================================
  311. 17.09 s gammaloop-nextest-spenso> Extracting 2 binaries and 1 linked path to /build/nextest-archive-xlsAXh
  312. 17.16 s gammaloop-nextest-spenso> Extracted 8 files to /build/nextest-archive-xlsAXh in 0.07s
  313. 17.17 s gammaloop-nextest-spenso> ------------
  314. 17.17 s gammaloop-nextest-spenso> Nextest run ID 528bd5f1-0336-4d34-850c-671816e8fe32 with nextest profile: ci_gammaloop
  315. 17.17 s gammaloop-nextest-spenso> Starting 135 tests across 2 binaries
  316. 17.24 s gammaloop-nextest-spenso> ------------
  317. 17.24 s gammaloop-nextest-spenso> Summary [ 0.070s] 135 tests run: 135 passed, 0 skipped
  318. 17.28 s gammaloop-nextest-spenso>
  319. 17.28 s gammaloop-nextest-spenso> ========== nextest test summary ==========
  320. 17.28 s gammaloop-nextest-spenso> report: target/nextest/ci_gammaloop/junit.xml
  321. 17.28 s gammaloop-nextest-spenso> tests: 135, failures: 0, errors: 0
  322. 17.28 s gammaloop-nextest-spenso> No failing testcases found.
  323. 17.28 s gammaloop-nextest-spenso> =========================================
  324. 17.29 s gammaloop-nextest-spenso> Extracting 5 binaries and 2 linked paths to /build/nextest-archive-bg1bQ4
  325. 17.47 s gammaloop-nextest-spenso> Extracted 19 files to /build/nextest-archive-bg1bQ4 in 0.18s
  326. 17.48 s gammaloop-nextest-spenso> ------------
  327. 17.48 s gammaloop-nextest-spenso> Nextest run ID f8cfeda4-4ec3-4a3b-9364-fb3e85ebfa04 with nextest profile: ci_gammaloop
  328. 17.48 s gammaloop-nextest-spenso> Starting 25 tests across 5 binaries (1 test skipped via profile.ci_gammaloop.default-filter)
  329. 17.66 s gammaloop-nextest-spenso> ------------
  330. 17.66 s gammaloop-nextest-spenso> Summary [ 0.180s] 25 tests run: 25 passed, 1 skipped
  331. 17.71 s gammaloop-nextest-spenso>
  332. 17.71 s gammaloop-nextest-spenso> ========== nextest test summary ==========
  333. 17.71 s gammaloop-nextest-spenso> report: target/nextest/ci_gammaloop/junit.xml
  334. 17.71 s gammaloop-nextest-spenso> tests: 25, failures: 0, errors: 0
  335. 17.71 s gammaloop-nextest-spenso> No failing testcases found.
  336. 17.71 s gammaloop-nextest-spenso> =========================================
  337. 17.72 s gammaloop-nextest-spenso> Extracting 2 binaries and 1 linked path to /build/nextest-archive-Ok3XKx
  338. 17.77 s gammaloop-nextest-spenso> Extracted 8 files to /build/nextest-archive-Ok3XKx in 0.05s
  339. 17.78 s gammaloop-nextest-spenso> ------------
  340. 17.78 s gammaloop-nextest-spenso> Nextest run ID e273a417-bd96-414b-8de3-4dcf8a8dfec5 with nextest profile: ci_gammaloop
  341. 17.78 s gammaloop-nextest-spenso> Starting 1 test across 2 binaries
  342. 17.79 s gammaloop-nextest-spenso> ------------
  343. 17.79 s gammaloop-nextest-spenso> Summary [ 0.005s] 1 test run: 1 passed, 0 skipped
  344. 17.82 s gammaloop-nextest-spenso>
  345. 17.82 s gammaloop-nextest-spenso> ========== nextest test summary ==========
  346. 17.82 s gammaloop-nextest-spenso> report: target/nextest/ci_gammaloop/junit.xml
  347. 17.82 s gammaloop-nextest-spenso> tests: 1, failures: 0, errors: 0
  348. 17.82 s gammaloop-nextest-spenso> No failing testcases found.
  349. 17.82 s gammaloop-nextest-spenso> =========================================
  350. 17.83 s gammaloop-nextest-spenso> Extracting 1 binary and 1 linked path to /build/nextest-archive-e6suVl
  351. 17.88 s gammaloop-nextest-spenso> Extracted 7 files to /build/nextest-archive-e6suVl in 0.05s
  352. 17.89 s gammaloop-nextest-spenso> ------------
  353. 17.89 s gammaloop-nextest-spenso> Nextest run ID bcf613c4-b6fe-43ef-ac61-09dd69c394aa with nextest profile: ci_gammaloop
  354. 17.89 s gammaloop-nextest-spenso> Starting 0 tests across 1 binary
  355. 17.89 s gammaloop-nextest-spenso> ------------
  356. 17.89 s gammaloop-nextest-spenso> Summary [ 0.000s] 0 tests run: 0 passed, 0 skipped
  357. 17.92 s gammaloop-nextest-spenso>
  358. 17.92 s gammaloop-nextest-spenso> ========== nextest test summary ==========
  359. 17.92 s gammaloop-nextest-spenso> report: target/nextest/ci_gammaloop/junit.xml
  360. 17.92 s gammaloop-nextest-spenso> tests: 0, failures: 0, errors: 0
  361. 17.92 s gammaloop-nextest-spenso> No failing testcases found.
  362. 17.92 s gammaloop-nextest-spenso> =========================================
  363. 17.95 s error: Cannot build '/nix/store/8hj2j3n1562bs62vvl44s3db1hsxblr2-gammaloop-nextest-spenso.drv'.
  364. 17.95 s Reason: builder failed with exit code 100.
  365. 17.95 s Output paths:
  366. 17.95 s /nix/store/q6zi5vs0q3wnr64456imbjpsvsayaj2c-gammaloop-nextest-spenso
  367. 17.95 s Last 325 log lines:
  368. 17.95 s > Extracting 5 binaries and 2 linked paths to /build/nextest-archive-J2DSg6
  369. 17.95 s > Extracted 19 files to /build/nextest-archive-J2DSg6 in 0.16s
  370. 17.95 s > ------------
  371. 17.95 s > Nextest run ID c7e42a0d-b4ce-4a33-9da8-0ab5807af8e0 with nextest profile: ci_gammaloop
  372. 17.95 s > Starting 224 tests across 5 binaries (26 tests skipped, including 2 tests via profile.ci_gammaloop.default-filter)
  373. 17.95 s > FAIL [ 0.009s] ( 44/224) idenso color::test::form_reference::metric_contraction_respects_antisymmetric_normalization
  374. 17.95 s > stdout ---
  375. 17.95 s >
  376. 17.95 s > running 1 test
  377. 17.95 s > test color::test::form_reference::metric_contraction_respects_antisymmetric_normalization ... FAILED
  378. 17.95 s >
  379. 17.95 s > failures:
  380. 17.95 s >
  381. 17.95 s > failures:
  382. 17.95 s > color::test::form_reference::metric_contraction_respects_antisymmetric_normalization
  383. 17.95 s >
  384. 17.95 s > test result: FAILED. 0 passed; 1 failed; 0 ignored; 0 measured; 240 filtered out; finished in 0.00s
  385. 17.95 s >
  386. 17.95 s > stderr ---
  387. 17.95 s >
  388. 17.95 s > thread 'color::test::form_reference::metric_contraction_respects_antisymmetric_normalization' (331) panicked at crates/idenso/src/color/test/form_reference.rs:171:5:
  389. 17.95 s > assertion `left == right` failed
  390. 17.95 s > left: "-1*f(coad(8,standalone_metric_j),coad(8,standalone_metric_s),coad(8,standalone_metric_u))"
  391. 17.95 s > right: "f(coad(8,standalone_metric_j),coad(8,standalone_metric_s),coad(8,standalone_metric_u))"
  392. 17.95 s > stack backtrace:
  393. 17.95 s > 0: __rustc::rust_begin_unwind
  394. 17.95 s > 1: core::panicking::panic_fmt
  395. 17.95 s > 2: core::panicking::assert_failed_inner
  396. 17.95 s > 3: core::panicking::assert_failed::<alloc::string::String, alloc::string::String>
  397. 17.95 s > 4: idenso::color::test::form_reference::metric_contraction_respects_antisymmetric_normalization
  398. 17.95 s > 5: <idenso::color::test::form_reference::metric_contraction_respects_antisymmetric_normalization::{closure#0} as core::ops::function::FnOnce<()>>::call_once
  399. 17.95 s > note: Some details are omitted, run with `RUST_BACKTRACE=full` for a verbose backtrace.
  400. 17.95 s >
  401. 17.95 s > FAIL [ 0.034s] (218/224) idenso tensor::tests::parsing::infinite_execution
  402. 17.95 s > stdout ---
  403. 17.95 s >
  404. 17.95 s > running 1 test
  405. 17.95 s > ━━━━━━━━━━━━━━━━━━━━━━━━━━━━━━━ Snapshot Summary ━━━━━━━━━━━━━━━━━━━━━━━━━━━━━━━
  406. 17.95 s > Snapshot: infinite_execution
  407. 17.95 s > Source: crates/idenso/src/tensor/tests/parsing.rs:910
  408. 17.95 s > ────────────────────────────────────────────────────────────────────────────────
  409. 17.95 s > Expression: net_iter.snapshot_dot()
  410. 17.95 s > ────────────────────────────────────────────────────────────────────────────────
  411. 17.95 s > -old snapshot
  412. 17.95 s > +new results
  413. 17.95 s > ────────────┬───────────────────────────────────────────────────────────────────
  414. 17.95 s > 8 8 │ 0:0:s -> ext0 [id=0 color="red"];
  415. 17.95 s > 9 9 │ ext1 [style=invis];
  416. 17.95 s > 10 10 │ 0:5:s -> ext1 [id=1 dir=none color="red" label="mink4|l_0"];
  417. 17.95 s > 11 11 │ ext2 [style=invis];
  418. 17.95 s > 12 │- 0:4:s -> ext2 [id=2 dir=none color="red" label="bis4|l_2"];
  419. 17.95 s > 12 │+ 0:3:s -> ext2 [id=2 dir=none color="red" label="mink4|l_1"];
  420. 17.95 s > 13 13 │ ext3 [style=invis];
  421. 17.95 s > 14 │- 0:3:s -> ext3 [id=3 dir=none color="red" label="bis4|l_3"];
  422. 17.95 s > 14 │+ 0:1:s -> ext3 [id=3 dir=none color="red" label="bis4|l_2"];
  423. 17.95 s > 15 15 │ ext4 [style=invis];
  424. 17.95 s > 16 │- 0:1:s -> ext4 [id=4 dir=none color="red" label="mink4|l_1"];
  425. 17.95 s > 16 │+ 0:2:s -> ext4 [id=4 dir=none color="red" label="mink4|l_4"];
  426. 17.95 s > 17 17 │ ext5 [style=invis];
  427. 17.95 s > 18 │- 0:2:s -> ext5 [id=5 dir=none color="red" label="mink4|l_4"];
  428. 17.95 s > 18 │+ 0:4:s -> ext5 [id=5 dir=none color="red" label="bis4|l_3"];
  429. 17.95 s > 19 19 │ }
  430. 17.95 s > ────────────┴───────────────────────────────────────────────────────────────────
  431. 17.95 s > To update snapshots run `cargo insta review`
  432. 17.95 s > Stopped on the first failure. Run `cargo insta test` to run all snapshots.
  433. 17.95 s > test tensor::tests::parsing::infinite_execution ... FAILED
  434. 17.95 s >
  435. 17.95 s > failures:
  436. 17.95 s >
  437. 17.95 s > failures:
  438. 17.95 s > tensor::tests::parsing::infinite_execution
  439. 17.95 s >
  440. 17.95 s > test result: FAILED. 0 passed; 1 failed; 0 ignored; 0 measured; 240 filtered out; finished in 0.03s
  441. 17.95 s >
  442. 17.95 s > stderr ---
  443. 17.95 s >
  444. 17.95 s > thread 'tensor::tests::parsing::infinite_execution' (849) panicked at /nix/store/p13pfw1gvvk8m860apfhvzcgidxhbs7g-vendor-cargo-deps/c19b7c6f923b580ac259164a89f2577984ad5ab09ee9d583b888f934adbbe8d0/insta-1.47.2/src/runtime.rs:719:13:
  445. 17.95 s > snapshot assertion for 'infinite_execution' failed in line 910
  446. 17.95 s > stack backtrace:
  447. 17.95 s > 0: __rustc::rust_begin_unwind
  448. 17.95 s > 1: core::panicking::panic_fmt
  449. 17.95 s > 2: insta::runtime::assert_snapshot
  450. 17.95 s > 3: idenso::tensor::tests::parsing::infinite_execution
  451. 17.95 s > 4: <idenso::tensor::tests::parsing::infinite_execution::{closure#0} as core::ops::function::FnOnce<()>>::call_once
  452. 17.95 s > note: Some details are omitted, run with `RUST_BACKTRACE=full` for a verbose backtrace.
  453. 17.95 s >
  454. 17.95 s > ------------
  455. 17.95 s > Summary [ 1.510s] 224 tests run: 222 passed, 2 failed, 26 skipped
  456. 17.95 s > FAIL [ 0.009s] ( 44/224) idenso color::test::form_reference::metric_contraction_respects_antisymmetric_normalization
  457. 17.95 s > stdout ---
  458. 17.95 s >
  459. 17.95 s > running 1 test
  460. 17.95 s > test color::test::form_reference::metric_contraction_respects_antisymmetric_normalization ... FAILED
  461. 17.95 s >
  462. 17.95 s > failures:
  463. 17.95 s >
  464. 17.95 s > failures:
  465. 17.95 s > color::test::form_reference::metric_contraction_respects_antisymmetric_normalization
  466. 17.95 s >
  467. 17.95 s > test result: FAILED. 0 passed; 1 failed; 0 ignored; 0 measured; 240 filtered out; finished in 0.00s
  468. 17.95 s >
  469. 17.95 s > stderr ---
  470. 17.95 s >
  471. 17.95 s > thread 'color::test::form_reference::metric_contraction_respects_antisymmetric_normalization' (331) panicked at crates/idenso/src/color/test/form_reference.rs:171:5:
  472. 17.95 s > assertion `left == right` failed
  473. 17.95 s > left: "-1*f(coad(8,standalone_metric_j),coad(8,standalone_metric_s),coad(8,standalone_metric_u))"
  474. 17.95 s > right: "f(coad(8,standalone_metric_j),coad(8,standalone_metric_s),coad(8,standalone_metric_u))"
  475. 17.95 s > stack backtrace:
  476. 17.95 s > 0: __rustc::rust_begin_unwind
  477. 17.95 s > 1: core::panicking::panic_fmt
  478. 17.95 s > 2: core::panicking::assert_failed_inner
  479. 17.95 s > 3: core::panicking::assert_failed::<alloc::string::String, alloc::string::String>
  480. 17.95 s > 4: idenso::color::test::form_reference::metric_contraction_respects_antisymmetric_normalization
  481. 17.95 s > 5: <idenso::color::test::form_reference::metric_contraction_respects_antisymmetric_normalization::{closure#0} as core::ops::function::FnOnce<()>>::call_once
  482. 17.95 s > note: Some details are omitted, run with `RUST_BACKTRACE=full` for a verbose backtrace.
  483. 17.95 s >
  484. 17.95 s > FAIL [ 0.034s] (218/224) idenso tensor::tests::parsing::infinite_execution
  485. 17.95 s > stdout ---
  486. 17.95 s >
  487. 17.95 s > running 1 test
  488. 17.95 s > ━━━━━━━━━━━━━━━━━━━━━━━━━━━━━━━ Snapshot Summary ━━━━━━━━━━━━━━━━━━━━━━━━━━━━━━━
  489. 17.95 s > Snapshot: infinite_execution
  490. 17.95 s > Source: crates/idenso/src/tensor/tests/parsing.rs:910
  491. 17.95 s > ────────────────────────────────────────────────────────────────────────────────
  492. 17.95 s > Expression: net_iter.snapshot_dot()
  493. 17.95 s > ────────────────────────────────────────────────────────────────────────────────
  494. 17.95 s > -old snapshot
  495. 17.95 s > +new results
  496. 17.95 s > ────────────┬───────────────────────────────────────────────────────────────────
  497. 17.95 s > 8 8 │ 0:0:s -> ext0 [id=0 color="red"];
  498. 17.95 s > 9 9 │ ext1 [style=invis];
  499. 17.95 s > 10 10 │ 0:5:s -> ext1 [id=1 dir=none color="red" label="mink4|l_0"];
  500. 17.95 s > 11 11 │ ext2 [style=invis];
  501. 17.95 s > 12 │- 0:4:s -> ext2 [id=2 dir=none color="red" label="bis4|l_2"];
  502. 17.95 s > 12 │+ 0:3:s -> ext2 [id=2 dir=none color="red" label="mink4|l_1"];
  503. 17.95 s > 13 13 │ ext3 [style=invis];
  504. 17.95 s > 14 │- 0:3:s -> ext3 [id=3 dir=none color="red" label="bis4|l_3"];
  505. 17.95 s > 14 │+ 0:1:s -> ext3 [id=3 dir=none color="red" label="bis4|l_2"];
  506. 17.95 s > 15 15 │ ext4 [style=invis];
  507. 17.95 s > 16 │- 0:1:s -> ext4 [id=4 dir=none color="red" label="mink4|l_1"];
  508. 17.95 s > 16 │+ 0:2:s -> ext4 [id=4 dir=none color="red" label="mink4|l_4"];
  509. 17.95 s > 17 17 │ ext5 [style=invis];
  510. 17.95 s > 18 │- 0:2:s -> ext5 [id=5 dir=none color="red" label="mink4|l_4"];
  511. 17.95 s > 18 │+ 0:4:s -> ext5 [id=5 dir=none color="red" label="bis4|l_3"];
  512. 17.95 s > 19 19 │ }
  513. 17.95 s > ────────────┴───────────────────────────────────────────────────────────────────
  514. 17.95 s > To update snapshots run `cargo insta review`
  515. 17.95 s > Stopped on the first failure. Run `cargo insta test` to run all snapshots.
  516. 17.95 s > test tensor::tests::parsing::infinite_execution ... FAILED
  517. 17.95 s >
  518. 17.95 s > failures:
  519. 17.95 s >
  520. 17.95 s > failures:
  521. 17.95 s > tensor::tests::parsing::infinite_execution
  522. 17.95 s >
  523. 17.95 s > test result: FAILED. 0 passed; 1 failed; 0 ignored; 0 measured; 240 filtered out; finished in 0.03s
  524. 17.95 s >
  525. 17.95 s > stderr ---
  526. 17.95 s >
  527. 17.95 s > thread 'tensor::tests::parsing::infinite_execution' (849) panicked at /nix/store/p13pfw1gvvk8m860apfhvzcgidxhbs7g-vendor-cargo-deps/c19b7c6f923b580ac259164a89f2577984ad5ab09ee9d583b888f934adbbe8d0/insta-1.47.2/src/runtime.rs:719:13:
  528. 17.95 s > snapshot assertion for 'infinite_execution' failed in line 910
  529. 17.95 s > stack backtrace:
  530. 17.95 s > 0: __rustc::rust_begin_unwind
  531. 17.95 s > 1: core::panicking::panic_fmt
  532. 17.95 s > 2: insta::runtime::assert_snapshot
  533. 17.95 s > 3: idenso::tensor::tests::parsing::infinite_execution
  534. 17.95 s > 4: <idenso::tensor::tests::parsing::infinite_execution::{closure#0} as core::ops::function::FnOnce<()>>::call_once
  535. 17.95 s > note: Some details are omitted, run with `RUST_BACKTRACE=full` for a verbose backtrace.
  536. 17.95 s >
  537. 17.95 s > error: test run failed
  538. 17.95 s >
  539. 17.95 s > ========== nextest test summary ==========
  540. 17.95 s > report: target/nextest/ci_gammaloop/junit.xml
  541. 17.95 s > tests: 224, failures: 2, errors: 0
  542. 17.95 s >
  543. 17.95 s > 1. idenso::color::test::form_reference::metric_contraction_respects_antisymmetric_normalization
  544. 17.95 s > failure: test failure with exit code 101
  545. 17.95 s > thread 'color::test::form_reference::metric_contraction_respects_antisymmetric_normalization' (331) panicked at crates/idenso/src/color/test/form_reference.rs:171:5:
  546. 17.95 s > assertion `left == right` failed
  547. 17.95 s > left: "-1*f(coad(8,standalone_metric_j),coad(8,standalone_metric_s),coad(8,standalone_metric_u))"
  548. 17.95 s > right: "f(coad(8,standalone_metric_j),coad(8,standalone_metric_s),coad(8,standalone_metric_u))"
  549. 17.95 s > stack backtrace:
  550. 17.95 s > 0: __rustc::rust_begin_unwind
  551. 17.95 s > 1: core::panicking::panic_fmt
  552. 17.95 s > 2: core::panicking::assert_failed_inner
  553. 17.95 s > 3: core::panicking::assert_failed::<alloc::string::String, alloc::string::String>
  554. 17.95 s > 4: idenso::color::test::form_reference::metric_contraction_respects_antisymmetric_normalization
  555. 17.95 s > 5: <idenso::color::test::form_reference::metric_contraction_respects_antisymmetric_normalization::{closure#0} as core::ops::function::FnOnce<()>>::call_once
  556. 17.95 s > note: Some details are omitted, run with `RUST_BACKTRACE=full` for a verbose backtrace.
  557. 17.95 s > system-out
  558. 17.95 s > running 1 test
  559. 17.95 s > test color::test::form_reference::metric_contraction_respects_antisymmetric_normalization ... FAILED
  560. 17.95 s >
  561. 17.95 s > failures:
  562. 17.95 s >
  563. 17.95 s > failures:
  564. 17.95 s > color::test::form_reference::metric_contraction_respects_antisymmetric_normalization
  565. 17.95 s >
  566. 17.95 s > test result: FAILED. 0 passed; 1 failed; 0 ignored; 0 measured; 240 filtered out; finished in 0.00s
  567. 17.95 s > system-err
  568. 17.95 s > thread 'color::test::form_reference::metric_contraction_respects_antisymmetric_normalization' (331) panicked at crates/idenso/src/color/test/form_reference.rs:171:5:
  569. 17.95 s > assertion `left == right` failed
  570. 17.95 s > left: "-1*f(coad(8,standalone_metric_j),coad(8,standalone_metric_s),coad(8,standalone_metric_u))"
  571. 17.95 s > right: "f(coad(8,standalone_metric_j),coad(8,standalone_metric_s),coad(8,standalone_metric_u))"
  572. 17.95 s > stack backtrace:
  573. 17.95 s > 0: __rustc::rust_begin_unwind
  574. 17.95 s > 1: core::panicking::panic_fmt
  575. 17.95 s > 2: core::panicking::assert_failed_inner
  576. 17.95 s > 3: core::panicking::assert_failed::<alloc::string::String, alloc::string::String>
  577. 17.95 s > 4: idenso::color::test::form_reference::metric_contraction_respects_antisymmetric_normalization
  578. 17.95 s > 5: <idenso::color::test::form_reference::metric_contraction_respects_antisymmetric_normalization::{closure#0} as core::ops::function::FnOnce<()>>::call_once
  579. 17.95 s > note: Some details are omitted, run with `RUST_BACKTRACE=full` for a verbose backtrace.
  580. 17.95 s >
  581. 17.95 s > 2. idenso::tensor::tests::parsing::infinite_execution
  582. 17.95 s > failure: test failure with exit code 101
  583. 17.95 s > thread 'tensor::tests::parsing::infinite_execution' (849) panicked at /nix/store/p13pfw1gvvk8m860apfhvzcgidxhbs7g-vendor-cargo-deps/c19b7c6f923b580ac259164a89f2577984ad5ab09ee9d583b888f934adbbe8d0/insta-1.47.2/src/runtime.rs:719:13:
  584. 17.95 s > snapshot assertion for 'infinite_execution' failed in line 910
  585. 17.95 s > stack backtrace:
  586. 17.95 s > 0: __rustc::rust_begin_unwind
  587. 17.95 s > 1: core::panicking::panic_fmt
  588. 17.95 s > 2: insta::runtime::assert_snapshot
  589. 17.95 s > 3: idenso::tensor::tests::parsing::infinite_execution
  590. 17.95 s > 4: <idenso::tensor::tests::parsing::infinite_execution::{closure#0} as core::ops::function::FnOnce<()>>::call_once
  591. 17.95 s > note: Some details are omitted, run with `RUST_BACKTRACE=full` for a verbose backtrace.
  592. 17.95 s > system-out
  593. 17.95 s > running 1 test
  594. 17.95 s > ━━━━━━━━━━━━━━━━━━━━━━━━━━━━━━━ Snapshot Summary ━━━━━━━━━━━━━━━━━━━━━━━━━━━━━━━
  595. 17.95 s > Snapshot: infinite_execution
  596. 17.95 s > Source: crates/idenso/src/tensor/tests/parsing.rs:910
  597. 17.95 s > ────────────────────────────────────────────────────────────────────────────────
  598. 17.95 s > Expression: net_iter.snapshot_dot()
  599. 17.95 s > ────────────────────────────────────────────────────────────────────────────────
  600. 17.95 s > -old snapshot
  601. 17.95 s > +new results
  602. 17.95 s > ────────────┬───────────────────────────────────────────────────────────────────
  603. 17.95 s > 8 8 │ 0:0:s-> ext0 [id=0 color="red"];
  604. 17.95 s > 9 9 │ ext1 [style=invis];
  605. 17.95 s > 10 10 │ 0:5:s-> ext1 [id=1 dir=none color="red" label="mink4|l_0"];
  606. 17.95 s > 11 11 │ ext2 [style=invis];
  607. 17.95 s > 12 │- 0:4:s-> ext2 [id=2 dir=none color="red" label="bis4|l_2"];
  608. 17.95 s > 12 │+ 0:3:s-> ext2 [id=2 dir=none color="red" label="mink4|l_1"];
  609. 17.95 s > 13 13 │ ext3 [style=invis];
  610. 17.95 s > 14 │- 0:3:s-> ext3 [id=3 dir=none color="red" label="bis4|l_3"];
  611. 17.95 s > 14 │+ 0:1:s-> ext3 [id=3 dir=none color="red" label="bis4|l_2"];
  612. 17.95 s > 15 15 │ ext4 [style=invis];
  613. 17.95 s > 16 │- 0:1:s-> ext4 [id=4 dir=none color="red" label="mink4|l_1"];
  614. 17.95 s > 16 │+ 0:2:s-> ext4 [id=4 dir=none color="red" label="mink4|l_4"];
  615. 17.95 s > 17 17 │ ext5 [style=invis];
  616. 17.95 s > 18 │- 0:2:s-> ext5 [id=5 dir=none color="red" label="mink4|l_4"];
  617. 17.95 s > 18 │+ 0:4:s-> ext5 [id=5 dir=none color="red" label="bis4|l_3"];
  618. 17.95 s > 19 19 │ }
  619. 17.95 s > ────────────┴───────────────────────────────────────────────────────────────────
  620. 17.95 s > To update snapshots run `cargo insta review`
  621. 17.95 s > Stopped on the first failure. Run `cargo insta test` to run all snapshots.
  622. 17.95 s > test tensor::tests::parsing::infinite_execution ... FAILED
  623. 17.95 s >
  624. 17.95 s > failures:
  625. 17.95 s >
  626. 17.95 s > failures:
  627. 17.95 s > tensor::tests::parsing::infinite_execution
  628. 17.95 s >
  629. 17.95 s > test result: FAILED. 0 passed; 1 failed; 0 ignored; 0 measured; 240 filtered out; finished in 0.03s
  630. 17.95 s > system-err
  631. 17.95 s > thread 'tensor::tests::parsing::infinite_execution' (849) panicked at /nix/store/p13pfw1gvvk8m860apfhvzcgidxhbs7g-vendor-cargo-deps/c19b7c6f923b580ac259164a89f2577984ad5ab09ee9d583b888f934adbbe8d0/insta-1.47.2/src/runtime.rs:719:13:
  632. 17.95 s > snapshot assertion for 'infinite_execution' failed in line 910
  633. 17.95 s > stack backtrace:
  634. 17.95 s > 0: __rustc::rust_begin_unwind
  635. 17.95 s > 1: core::panicking::panic_fmt
  636. 17.95 s > 2: insta::runtime::assert_snapshot
  637. 17.95 s > 3: idenso::tensor::tests::parsing::infinite_execution
  638. 17.95 s > 4: <idenso::tensor::tests::parsing::infinite_execution::{closure#0} as core::ops::function::FnOnce<()>>::call_once
  639. 17.95 s > note: Some details are omitted, run with `RUST_BACKTRACE=full` for a verbose backtrace.
  640. 17.95 s > =========================================
  641. 17.95 s > Extracting 2 binaries and 1 linked path to /build/nextest-archive-xlsAXh
  642. 17.95 s > Extracted 8 files to /build/nextest-archive-xlsAXh in 0.07s
  643. 17.95 s > ------------
  644. 17.95 s > Nextest run ID 528bd5f1-0336-4d34-850c-671816e8fe32 with nextest profile: ci_gammaloop
  645. 17.95 s > Starting 135 tests across 2 binaries
  646. 17.95 s > ------------
  647. 17.95 s > Summary [ 0.070s] 135 tests run: 135 passed, 0 skipped
  648. 17.95 s >
  649. 17.95 s > ========== nextest test summary ==========
  650. 17.95 s > report: target/nextest/ci_gammaloop/junit.xml
  651. 17.95 s > tests: 135, failures: 0, errors: 0
  652. 17.95 s > No failing testcases found.
  653. 17.95 s > =========================================
  654. 17.95 s > Extracting 5 binaries and 2 linked paths to /build/nextest-archive-bg1bQ4
  655. 17.95 s > Extracted 19 files to /build/nextest-archive-bg1bQ4 in 0.18s
  656. 17.95 s > ------------
  657. 17.95 s > Nextest run ID f8cfeda4-4ec3-4a3b-9364-fb3e85ebfa04 with nextest profile: ci_gammaloop
  658. 17.95 s > Starting 25 tests across 5 binaries (1 test skipped via profile.ci_gammaloop.default-filter)
  659. 17.95 s > ------------
  660. 17.95 s > Summary [ 0.180s] 25 tests run: 25 passed, 1 skipped
  661. 17.95 s >
  662. 17.95 s > ========== nextest test summary ==========
  663. 17.95 s > report: target/nextest/ci_gammaloop/junit.xml
  664. 17.95 s > tests: 25, failures: 0, errors: 0
  665. 17.95 s > No failing testcases found.
  666. 17.95 s > =========================================
  667. 17.95 s > Extracting 2 binaries and 1 linked path to /build/nextest-archive-Ok3XKx
  668. 17.95 s > Extracted 8 files to /build/nextest-archive-Ok3XKx in 0.05s
  669. 17.95 s > ------------
  670. 17.95 s > Nextest run ID e273a417-bd96-414b-8de3-4dcf8a8dfec5 with nextest profile: ci_gammaloop
  671. 17.95 s > Starting 1 test across 2 binaries
  672. 17.95 s > ------------
  673. 17.95 s > Summary [ 0.005s] 1 test run: 1 passed, 0 skipped
  674. 17.95 s >
  675. 17.95 s > ========== nextest test summary ==========
  676. 17.95 s > report: target/nextest/ci_gammaloop/junit.xml
  677. 17.95 s > tests: 1, failures: 0, errors: 0
  678. 17.95 s > No failing testcases found.
  679. 17.95 s > =========================================
  680. 17.95 s > Extracting 1 binary and 1 linked path to /build/nextest-archive-e6suVl
  681. 17.95 s > Extracted 7 files to /build/nextest-archive-e6suVl in 0.05s
  682. 17.95 s > ------------
  683. 17.95 s > Nextest run ID bcf613c4-b6fe-43ef-ac61-09dd69c394aa with nextest profile: ci_gammaloop
  684. 17.95 s > Starting 0 tests across 1 binary
  685. 17.95 s > ------------
  686. 17.95 s > Summary [ 0.000s] 0 tests run: 0 passed, 0 skipped
  687. 17.95 s >
  688. 17.95 s > ========== nextest test summary ==========
  689. 17.95 s > report: target/nextest/ci_gammaloop/junit.xml
  690. 17.95 s > tests: 0, failures: 0, errors: 0
  691. 17.95 s > No failing testcases found.
  692. 17.95 s > =========================================
  693. 17.95 s For full logs, run:
  694. 17.95 s nix log /nix/store/8hj2j3n1562bs62vvl44s3db1hsxblr2-gammaloop-nextest-spenso.drv
  695. 18.04 s [0 built (1 failed), 0.0Run failed.