test packages.x86_64-linux.nix-ci-check-gammaloop-nextest-spenso

Reproduce this run
Original Run
  1. 0.65 s $ /nix/store/9ypz3flqsrl5xl495mm8h645gadjsxi1-coreutils-9.11/bin/timeout --kill-after=15s 7200s /nix/store/23zk8sgzamrbmj1fday15szf7f2279s8-nix-2.34.7/bin/nix --extra-experimental-features nix-command --extra-experimental-features flakes flake clone git+https://github.com/alphal00p/gammaloop --dest /tmp/nix-ci-worker/stable-pwd/repo/
  2. 0.67 s Cloning into '/tmp/nix-ci-worker/stable-pwd/repo'...
  3. 0.78 s remote: Enumerating objects: 65262, done.
  4. 1.01 s remote: Counting objects: 0% (1/7913) remote: Counting objects: 1% (80/7913) remote: Counting objects: 2% (159/7913) remote: Counting objects: 3% (238/7913) remote: Counting objects: 4% (317/7913) remote: Counting objects: 5% (396/7913) remote: Counting objects: 6% (475/7913) remote: Counting objects: 7% (554/7913) remote: Counting objects: 8% (634/7913) remote: Counting objects: 9% (713/7913) remote: Counting objects: 10% (792/7913) remote: Counting objects: 11% (871/7913) remote: Counting objects: 12% (950/7913) remote: Counting objects: 13% (1029/7913) remote: Counting objects: 14% (1108/7913) remote: Counting objects: 15% (1187/7913) remote: Counting objects: 16% (1267/7913) remote: Counting objects: 17% (1346/7913) remote: Counting objects: 18% (1425/7913) remote: Counting objects: 19% (1504/7913) remote: Counting objects: 20% (1583/7913) remote: Counting objects: 21% (1662/7913) remote: Counting objects: 22% (1741/7913) remote: Counting objects: 23% (1820/7913) remote: Counting objects: 24% (1900/7913) remote: Counting objects: 25% (1979/7913) remote: Counting objects: 26% (2058/7913) remote: Counting objects: 27% (2137/7913) remote: Counting objects: 28% (2216/7913) remote: Counting objects: 29% (2295/7913) remote: Counting objects: 30% (2374/7913) remote: Counting objects: 31% (2454/7913) remote: Counting objects: 32% (2533/7913) remote: Counting objects: 33% (2612/7913) remote: Counting objects: 34% (2691/7913) remote: Counting objects: 35% (2770/7913) remote: Counting objects: 36% (2849/7913) remote: Counting objects: 37% (2928/7913) remote: Counting objects: 38% (3007/7913) remote: Counting objects: 39% (3087/7913) remote: Counting objects: 40% (3166/7913) remote: Counting objects: 41% (3245/7913) remote: Counting objects: 42% (3324/7913) remote: Counting objects: 43% (3403/7913) remote: Counting objects: 44% (3482/7913) remote: Counting objects: 45% (3561/7913) remote: Counting objects: 46% (3640/7913) remote: Counting objects: 47% (3720/7913) remote: Counting objects: 48% (3799/7913) remote: Counting objects: 49% (3878/7913) remote: Counting objects: 50% (3957/7913) remote: Counting objects: 51% (4036/7913) remote: Counting objects: 52% (4115/7913) remote: Counting objects: 53% (4194/7913) remote: Counting objects: 54% (4274/7913) remote: Counting objects: 55% (4353/7913) remote: Counting objects: 56% (4432/7913) remote: Counting objects: 57% (4511/7913) remote: Counting objects: 58% (4590/7913) remote: Counting objects: 59% (4669/7913) remote: Counting objects: 60% (4748/7913) remote: Counting objects: 61% (4827/7913) remote: Counting objects: 62% (4907/7913) remote: Counting objects: 63% (4986/7913) remote: Counting objects: 64% (5065/7913) remote: Counting objects: 65% (5144/7913) remote: Counting objects: 66% (5223/7913) remote: Counting objects: 67% (5302/7913) remote: Counting objects: 68% (5381/7913) remote: Counting objects: 69% (5460/7913) remote: Counting objects: 70% (5540/7913) remote: Counting objects: 71% (5619/7913) remote: Counting objects: 72% (5698/7913) remote: Counting objects: 73% (5777/7913) remote: Counting objects: 74% (5856/7913) remote: Counting objects: 75% (5935/7913) remote: Counting objects: 76% (6014/7913) remote: Counting objects: 77% (6094/7913) remote: Counting objects: 78% (6173/7913) remote: Counting objects: 79% (6252/7913) remote: Counting objects: 80% (6331/7913) remote: Counting objects: 81% (6410/7913) remote: Counting objects: 82% (6489/7913) remote: Counting objects: 83% (6568/7913) remote: Counting objects: 84% (6647/7913) remote: Counting objects: 85% (6727/7913) remote: Counting objects: 86% (6806/7913) remote: Counting objects: 87% (6885/7913) remote: Counting objects: 88% (6964/7913) remote: Counting objects: 89% (7043/7913) remote: Counting objects: 90% (7122/7913) remote: Counting objects: 91% (7201/7913) remote: Counting objects: 92% (7280/7913) remote: Counting objects: 93% (7360/7913) remote: Counting objects: 94% (7439/7913) remote: Counting objects: 95% (7518/7913) remote: Counting objects: 96% (7597/7913) remote: Counting objects: 97% (7676/7913) remote: Counting objects: 98% (7755/7913) remote: Counting objects: 99% (7834/7913) remote: Counting objects: 100% (7913/7913) remote: Counting objects: 100% (7913/7913), done.
  5. 2.39 s remote: Compressing objects: 0% (1/1586) remote: Compressing objects: 1% (16/1586) remote: Compressing objects: 2% (32/1586) remote: Compressing objects: 3% (48/1586) remote: Compressing objects: 4% (64/1586) remote: Compressing objects: 5% (80/1586) remote: Compressing objects: 6% (96/1586) remote: Compressing objects: 7% (112/1586) remote: Compressing objects: 8% (127/1586) remote: Compressing objects: 9% (143/1586) remote: Compressing objects: 10% (159/1586) remote: Compressing objects: 11% (175/1586) remote: Compressing objects: 12% (191/1586) remote: Compressing objects: 13% (207/1586) remote: Compressing objects: 14% (223/1586) remote: Compressing objects: 15% (238/1586) remote: Compressing objects: 15% (253/1586) remote: Compressing objects: 16% (254/1586) remote: Compressing objects: 17% (270/1586) remote: Compressing objects: 18% (286/1586) remote: Compressing objects: 19% (302/1586) remote: Compressing objects: 20% (318/1586) remote: Compressing objects: 21% (334/1586) remote: Compressing objects: 22% (349/1586) remote: Compressing objects: 23% (365/1586) remote: Compressing objects: 24% (381/1586) remote: Compressing objects: 25% (397/1586) remote: Compressing objects: 26% (413/1586) remote: Compressing objects: 27% (429/1586) remote: Compressing objects: 28% (445/1586) remote: Compressing objects: 29% (460/1586) remote: Compressing objects: 30% (476/1586) remote: Compressing objects: 31% (492/1586) remote: Compressing objects: 32% (508/1586) remote: Compressing objects: 33% (524/1586) remote: Compressing objects: 34% (540/1586) remote: Compressing objects: 35% (556/1586) remote: Compressing objects: 36% (571/1586) remote: Compressing objects: 37% (587/1586) remote: Compressing objects: 38% (603/1586) remote: Compressing objects: 39% (619/1586) remote: Compressing objects: 40% (635/1586) remote: Compressing objects: 41% (651/1586) remote: Compressing objects: 42% (667/1586) remote: Compressing objects: 43% (682/1586) remote: Compressing objects: 44% (698/1586) remote: Compressing objects: 45% (714/1586) remote: Compressing objects: 46% (730/1586) remote: Compressing objects: 47% (746/1586) remote: Compressing objects: 48% (762/1586) remote: Compressing objects: 49% (778/1586) remote: Compressing objects: 50% (793/1586) remote: Compressing objects: 51% (809/1586) remote: Compressing objects: 52% (825/1586) remote: Compressing objects: 53% (841/1586) remote: Compressing objects: 54% (857/1586) remote: Compressing objects: 55% (873/1586) remote: Compressing objects: 56% (889/1586) remote: Compressing objects: 57% (905/1586) remote: Compressing objects: 58% (920/1586) remote: Compressing objects: 59% (936/1586) remote: Compressing objects: 60% (952/1586) remote: Compressing objects: 61% (968/1586) remote: Compressing objects: 62% (984/1586) remote: Compressing objects: 63% (1000/1586) remote: Compressing objects: 64% (1016/1586) remote: Compressing objects: 65% (1031/1586) remote: Compressing objects: 66% (1047/1586) remote: Compressing objects: 67% (1063/1586) remote: Compressing objects: 68% (1079/1586) remote: Compressing objects: 69% (1095/1586) remote: Compressing objects: 70% (1111/1586) remote: Compressing objects: 71% (1127/1586) remote: Compressing objects: 72% (1142/1586) remote: Compressing objects: 73% (1158/1586) remote: Compressing objects: 74% (1174/1586) remote: Compressing objects: 75% (1190/1586) remote: Compressing objects: 76% (1206/1586) remote: Compressing objects: 77% (1222/1586) remote: Compressing objects: 78% (1238/1586) remote: Compressing objects: 79% (1253/1586) remote: Compressing objects: 80% (1269/1586) remote: Compressing objects: 81% (1285/1586) remote: Compressing objects: 82% (1301/1586) remote: Compressing objects: 83% (1317/1586) remote: Compressing objects: 84% (1333/1586) remote: Compressing objects: 85% (1349/1586) remote: Compressing objects: 86% (1364/1586) remote: Compressing objects: 87% (1380/1586) remote: Compressing objects: 88% (1396/1586) remote: Compressing objects: 89% (1412/1586) remote: Compressing objects: 90% (1428/1586) remote: Compressing objects: 91% (1444/1586) remote: Compressing objects: 92% (1460/1586) remote: Compressing objects: 93% (1475/1586) remote: Compressing objects: 94% (1491/1586) remote: Compressing objects: 95% (1507/1586) remote: Compressing objects: 96% (1523/1586) remote: Compressing objects: 97% (1539/1586) remote: Compressing objects: 98% (1555/1586) remote: Compressing objects: 99% (1571/1586) remote: Compressing objects: 100% (1586/1586) remote: Compressing objects: 100% (1586/1586), done.
  6. 5.08 s Receiving objects: 0% (1/65262) Receiving objects: 1% (653/65262) Receiving objects: 2% (1306/65262) Receiving objects: 3% (1958/65262) Receiving objects: 4% (2611/65262) Receiving objects: 5% (3264/65262) Receiving objects: 6% (3916/65262) Receiving objects: 7% (4569/65262) Receiving objects: 8% (5221/65262) Receiving objects: 9% (5874/65262) Receiving objects: 10% (6527/65262) Receiving objects: 11% (7179/65262) Receiving objects: 12% (7832/65262), 15.61 MiB | 31.20 MiB/s Receiving objects: 13% (8485/65262), 15.61 MiB | 31.20 MiB/s Receiving objects: 14% (9137/65262), 15.61 MiB | 31.20 MiB/s Receiving objects: 15% (9790/65262), 15.61 MiB | 31.20 MiB/s Receiving objects: 16% (10442/65262), 15.61 MiB | 31.20 MiB/s Receiving objects: 17% (11095/65262), 15.61 MiB | 31.20 MiB/s Receiving objects: 18% (11748/65262), 15.61 MiB | 31.20 MiB/s Receiving objects: 19% (12400/65262), 15.61 MiB | 31.20 MiB/s Receiving objects: 20% (13053/65262), 15.61 MiB | 31.20 MiB/s Receiving objects: 21% (13706/65262), 15.61 MiB | 31.20 MiB/s Receiving objects: 22% (14358/65262), 15.61 MiB | 31.20 MiB/s Receiving objects: 23% (15011/65262), 15.61 MiB | 31.20 MiB/s Receiving objects: 24% (15663/65262), 15.61 MiB | 31.20 MiB/s Receiving objects: 25% (16316/65262), 15.61 MiB | 31.20 MiB/s Receiving objects: 26% (16969/65262), 15.61 MiB | 31.20 MiB/s Receiving objects: 27% (17621/65262), 15.61 MiB | 31.20 MiB/s Receiving objects: 28% (18274/65262), 15.61 MiB | 31.20 MiB/s Receiving objects: 29% (18926/65262), 15.61 MiB | 31.20 MiB/s Receiving objects: 30% (19579/65262), 15.61 MiB | 31.20 MiB/s Receiving objects: 31% (20232/65262), 15.61 MiB | 31.20 MiB/s Receiving objects: 32% (20884/65262), 15.61 MiB | 31.20 MiB/s Receiving objects: 33% (21537/65262), 15.61 MiB | 31.20 MiB/s Receiving objects: 34% (22190/65262), 15.61 MiB | 31.20 MiB/s Receiving objects: 35% (22842/65262), 15.61 MiB | 31.20 MiB/s Receiving objects: 36% (23495/65262), 15.61 MiB | 31.20 MiB/s Receiving objects: 37% (24147/65262), 15.61 MiB | 31.20 MiB/s Receiving objects: 38% (24800/65262), 15.61 MiB | 31.20 MiB/s Receiving objects: 39% (25453/65262), 15.61 MiB | 31.20 MiB/s Receiving objects: 40% (26105/65262), 15.61 MiB | 31.20 MiB/s Receiving objects: 41% (26758/65262), 15.61 MiB | 31.20 MiB/s Receiving objects: 42% (27411/65262), 15.61 MiB | 31.20 MiB/s Receiving objects: 43% (28063/65262), 15.61 MiB | 31.20 MiB/s Receiving objects: 44% (28716/65262), 15.61 MiB | 31.20 MiB/s Receiving objects: 45% (29368/65262), 15.61 MiB | 31.20 MiB/s Receiving objects: 46% (30021/65262), 15.61 MiB | 31.20 MiB/s Receiving objects: 47% (30674/65262), 15.61 MiB | 31.20 MiB/s Receiving objects: 48% (31326/65262), 15.61 MiB | 31.20 MiB/s Receiving objects: 49% (31979/65262), 15.61 MiB | 31.20 MiB/s Receiving objects: 50% (32631/65262), 15.61 MiB | 31.20 MiB/s Receiving objects: 51% (33284/65262), 15.61 MiB | 31.20 MiB/s Receiving objects: 52% (33937/65262), 15.61 MiB | 31.20 MiB/s Receiving objects: 52% (34070/65262), 32.44 MiB | 31.36 MiB/s Receiving objects: 53% (34589/65262), 32.44 MiB | 31.36 MiB/s Receiving objects: 54% (35242/65262), 32.44 MiB | 31.36 MiB/s Receiving objects: 55% (35895/65262), 32.44 MiB | 31.36 MiB/s Receiving objects: 56% (36547/65262), 32.44 MiB | 31.36 MiB/s Receiving objects: 57% (37200/65262), 32.44 MiB | 31.36 MiB/s Receiving objects: 58% (37852/65262), 32.44 MiB | 31.36 MiB/s Receiving objects: 59% (38505/65262), 32.44 MiB | 31.36 MiB/s Receiving objects: 60% (39158/65262), 32.44 MiB | 31.36 MiB/s Receiving objects: 61% (39810/65262), 32.44 MiB | 31.36 MiB/s Receiving objects: 62% (40463/65262), 32.44 MiB | 31.36 MiB/s Receiving objects: 63% (41116/65262), 32.44 MiB | 31.36 MiB/s Receiving objects: 64% (41768/65262), 32.44 MiB | 31.36 MiB/s Receiving objects: 65% (42421/65262), 32.44 MiB | 31.36 MiB/s Receiving objects: 66% (43073/65262), 50.80 MiB | 33.10 MiB/s Receiving objects: 67% (43726/65262), 50.80 MiB | 33.10 MiB/s Receiving objects: 68% (44379/65262), 50.80 MiB | 33.10 MiB/s Receiving objects: 69% (45031/65262), 50.80 MiB | 33.10 MiB/s Receiving objects: 70% (45684/65262), 50.80 MiB | 33.10 MiB/s Receiving objects: 71% (46337/65262), 50.80 MiB | 33.10 MiB/s Receiving objects: 72% (46989/65262), 50.80 MiB | 33.10 MiB/s Receiving objects: 73% (47642/65262), 50.80 MiB | 33.10 MiB/s Receiving objects: 74% (48294/65262), 50.80 MiB | 33.10 MiB/s Receiving objects: 74% (48917/65262), 50.80 MiB | 33.10 MiB/s Receiving objects: 75% (48947/65262), 66.52 MiB | 32.11 MiB/s Receiving objects: 76% (49600/65262), 66.52 MiB | 32.11 MiB/s Receiving objects: 77% (50252/65262), 66.52 MiB | 32.11 MiB/s Receiving objects: 78% (50905/65262), 66.52 MiB | 32.11 MiB/s Receiving objects: 79% (51557/65262), 66.52 MiB | 32.11 MiB/s Receiving objects: 80% (52210/65262), 66.52 MiB | 32.11 MiB/s Receiving objects: 81% (52863/65262), 66.52 MiB | 32.11 MiB/s Receiving objects: 82% (53515/65262), 66.52 MiB | 32.11 MiB/s Receiving objects: 83% (54168/65262), 66.52 MiB | 32.11 MiB/s Receiving objects: 84% (54821/65262), 66.52 MiB | 32.11 MiB/s Receiving objects: 85% (55473/65262), 66.52 MiB | 32.11 MiB/s Receiving objects: 86% (56126/65262), 66.52 MiB | 32.11 MiB/s Receiving objects: 87% (56778/65262), 66.52 MiB | 32.11 MiB/s Receiving objects: 88% (57431/65262), 66.52 MiB | 32.11 MiB/s Receiving objects: 89% (58084/65262), 66.52 MiB | 32.11 MiB/s Receiving objects: 90% (58736/65262), 66.52 MiB | 32.11 MiB/s Receiving objects: 91% (59389/65262), 66.52 MiB | 32.11 MiB/s Receiving objects: 92% (60042/65262), 66.52 MiB | 32.11 MiB/s Receiving objects: 93% (60694/65262), 66.52 MiB | 32.11 MiB/s Receiving objects: 94% (61347/65262), 84.15 MiB | 32.72 MiB/s Receiving objects: 95% (61999/65262), 84.15 MiB | 32.72 MiB/s Receiving objects: 96% (62652/65262), 84.15 MiB | 32.72 MiB/s Receiving objects: 97% (63305/65262), 84.15 MiB | 32.72 MiB/s Receiving objects: 98% (63957/65262), 84.15 MiB | 32.72 MiB/s Receiving objects: 99% (64610/65262), 84.15 MiB | 32.72 MiB/s remote: Total 65262 (delta 6862), reused 6407 (delta 6318), pack-reused 57349 (from 1)
  7. 5.08 s Receiving objects: 100% (65262/65262), 84.15 MiB | 32.72 MiB/s Receiving objects: 100% (65262/65262), 87.60 MiB | 32.61 MiB/s, done.
  8. 5.73 s Resolving deltas: 0% (0/45980) Resolving deltas: 1% (460/45980) Resolving deltas: 2% (920/45980) Resolving deltas: 3% (1380/45980) Resolving deltas: 4% (1840/45980) Resolving deltas: 5% (2299/45980) Resolving deltas: 6% (2759/45980) Resolving deltas: 7% (3219/45980) Resolving deltas: 8% (3680/45980) Resolving deltas: 9% (4139/45980) Resolving deltas: 10% (4599/45980) Resolving deltas: 11% (5058/45980) Resolving deltas: 12% (5518/45980) Resolving deltas: 13% (5978/45980) Resolving deltas: 14% (6438/45980) Resolving deltas: 15% (6897/45980) Resolving deltas: 16% (7360/45980) Resolving deltas: 17% (7817/45980) Resolving deltas: 18% (8277/45980) Resolving deltas: 19% (8742/45980) Resolving deltas: 20% (9196/45980) Resolving deltas: 21% (9657/45980) Resolving deltas: 22% (10116/45980) Resolving deltas: 23% (10576/45980) Resolving deltas: 24% (11036/45980) Resolving deltas: 25% (11495/45980) Resolving deltas: 26% (11955/45980) Resolving deltas: 27% (12415/45980) Resolving deltas: 28% (12875/45980) Resolving deltas: 29% (13335/45980) Resolving deltas: 30% (13794/45980) Resolving deltas: 31% (14254/45980) Resolving deltas: 32% (14714/45980) Resolving deltas: 33% (15174/45980) Resolving deltas: 34% (15634/45980) Resolving deltas: 35% (16093/45980) Resolving deltas: 36% (16553/45980) Resolving deltas: 37% (17013/45980) Resolving deltas: 38% (17473/45980) Resolving deltas: 39% (17933/45980) Resolving deltas: 40% (18393/45980) Resolving deltas: 41% (18852/45980) Resolving deltas: 42% (19312/45980) Resolving deltas: 43% (19772/45980) Resolving deltas: 44% (20232/45980) Resolving deltas: 45% (20691/45980) Resolving deltas: 46% (21151/45980) Resolving deltas: 47% (21611/45980) Resolving deltas: 48% (22071/45980) Resolving deltas: 49% (22531/45980) Resolving deltas: 50% (22991/45980) Resolving deltas: 51% (23450/45980) Resolving deltas: 52% (23910/45980) Resolving deltas: 53% (24370/45980) Resolving deltas: 54% (24830/45980) Resolving deltas: 55% (25289/45980) Resolving deltas: 56% (25749/45980) Resolving deltas: 57% (26209/45980) Resolving deltas: 58% (26669/45980) Resolving deltas: 59% (27129/45980) Resolving deltas: 60% (27588/45980) Resolving deltas: 61% (28048/45980) Resolving deltas: 62% (28509/45980) Resolving deltas: 63% (28968/45980) Resolving deltas: 64% (29428/45980) Resolving deltas: 65% (29887/45980) Resolving deltas: 66% (30348/45980) Resolving deltas: 67% (30807/45980) Resolving deltas: 68% (31267/45980) Resolving deltas: 69% (31727/45980) Resolving deltas: 70% (32187/45980) Resolving deltas: 71% (32646/45980) Resolving deltas: 72% (33108/45980) Resolving deltas: 73% (33566/45980) Resolving deltas: 74% (34028/45980) Resolving deltas: 75% (34485/45980) Resolving deltas: 76% (34945/45980) Resolving deltas: 77% (35405/45980) Resolving deltas: 78% (35865/45980) Resolving deltas: 79% (36325/45980) Resolving deltas: 80% (36784/45980) Resolving deltas: 81% (37244/45980) Resolving deltas: 82% (37704/45980) Resolving deltas: 83% (38164/45980) Resolving deltas: 84% (38624/45980) Resolving deltas: 85% (39083/45980) Resolving deltas: 86% (39543/45980) Resolving deltas: 87% (40003/45980) Resolving deltas: 88% (40463/45980) Resolving deltas: 89% (40923/45980) Resolving deltas: 90% (41382/45980) Resolving deltas: 91% (41842/45980) Resolving deltas: 92% (42302/45980) Resolving deltas: 93% (42762/45980) Resolving deltas: 94% (43222/45980) Resolving deltas: 95% (43681/45980) Resolving deltas: 96% (44141/45980) Resolving deltas: 97% (44601/45980) Resolving deltas: 98% (45061/45980) Resolving deltas: 99% (45521/45980) Resolving deltas: 100% (45980/45980) Resolving deltas: 100% (45980/45980), done.
  9. 6.03 s Fetching commit 7d96a79602498c8c52cad067e3ea600af9a26e05 for vakint_rustred ...
  10. 6.03 s $ /nix/store/bcnisk3ydfgv26v2gw3zlky24g00yww2-git-2.54.0/bin/git fetch origin 7d96a79602498c8c52cad067e3ea600af9a26e05
  11. 6.43 s From https://github.com/alphal00p/gammaloop
  12. 6.43 s * branch 7d96a79602498c8c52cad067e3ea600af9a26e05 -> FETCH_HEAD
  13. 6.45 s $ /nix/store/9ypz3flqsrl5xl495mm8h645gadjsxi1-coreutils-9.11/bin/timeout --kill-after=15s 7200s /nix/store/bcnisk3ydfgv26v2gw3zlky24g00yww2-git-2.54.0/bin/git -c advice.detachedHead=false checkout 7d96a79602498c8c52cad067e3ea600af9a26e05
  14. 6.60 s HEAD is now at 7d96a796 add rustred scalar reduction through two loops
  15. 6.61 s $ /nix/store/9ypz3flqsrl5xl495mm8h645gadjsxi1-coreutils-9.11/bin/timeout --kill-after=15s 7200s /nix/store/23zk8sgzamrbmj1fday15szf7f2279s8-nix-2.34.7/bin/nix --extra-experimental-features nix-command --extra-experimental-features flakes --log-format internal-json run .#packages.x86_64-linux.nix-ci-check-gammaloop-nextest-spenso --print-build-logs
  16. 10.46 s
  17. 15.02 s evaluating derivation 'g copying '/nix/store/wz14 evaluating derivation 'g copying '/nix/store/wz14 evaluating derivation 'g querying gammaloop-nexte [0/1 built, 0.0 KiB DL] [1/0/1 built, 0.0 KiB DLgammaloop-nextest-spenso> Extracting 5 binaries and 2 linked paths to /build/nextest-archive-gUNf78
  18. 15.18 s gammaloop-nextest-spenso> Extracted 19 files to /build/nextest-archive-gUNf78 in 0.16s
  19. 15.19 s gammaloop-nextest-spenso> ------------
  20. 15.19 s gammaloop-nextest-spenso> Nextest run ID 05d1b1e8-567e-4ca4-974d-eb5a0f1b8c28 with nextest profile: ci_gammaloop
  21. 15.19 s gammaloop-nextest-spenso> Starting 224 tests across 5 binaries (26 tests skipped, including 2 tests via profile.ci_gammaloop.default-filter)
  22. 15.27 s gammaloop-nextest-spenso> FAIL [ 0.014s] ( 46/224) idenso color::test::form_reference::metric_contraction_respects_antisymmetric_normalization
  23. 15.27 s gammaloop-nextest-spenso> stdout ---
  24. 15.27 s gammaloop-nextest-spenso>
  25. 15.27 s gammaloop-nextest-spenso> running 1 test
  26. 15.27 s gammaloop-nextest-spenso> test color::test::form_reference::metric_contraction_respects_antisymmetric_normalization ... FAILED
  27. 15.27 s gammaloop-nextest-spenso>
  28. 15.27 s gammaloop-nextest-spenso> failures:
  29. 15.27 s gammaloop-nextest-spenso>
  30. 15.27 s gammaloop-nextest-spenso> failures:
  31. 15.27 s gammaloop-nextest-spenso> color::test::form_reference::metric_contraction_respects_antisymmetric_normalization
  32. 15.27 s gammaloop-nextest-spenso>
  33. 15.27 s gammaloop-nextest-spenso> test result: FAILED. 0 passed; 1 failed; 0 ignored; 0 measured; 240 filtered out; finished in 0.00s
  34. 15.27 s gammaloop-nextest-spenso>
  35. 15.27 s gammaloop-nextest-spenso> stderr ---
  36. 15.27 s gammaloop-nextest-spenso>
  37. 15.27 s gammaloop-nextest-spenso> thread 'color::test::form_reference::metric_contraction_respects_antisymmetric_normalization' (338) panicked at crates/idenso/src/color/test/form_reference.rs:171:5:
  38. 15.27 s gammaloop-nextest-spenso> assertion `left == right` failed
  39. 15.27 s gammaloop-nextest-spenso> left: "-1*f(coad(8,standalone_metric_j),coad(8,standalone_metric_s),coad(8,standalone_metric_u))"
  40. 15.27 s gammaloop-nextest-spenso> right: "f(coad(8,standalone_metric_j),coad(8,standalone_metric_s),coad(8,standalone_metric_u))"
  41. 15.27 s gammaloop-nextest-spenso> stack backtrace:
  42. 15.27 s gammaloop-nextest-spenso> 0: __rustc::rust_begin_unwind
  43. 15.27 s gammaloop-nextest-spenso> 1: core::panicking::panic_fmt
  44. 15.27 s gammaloop-nextest-spenso> 2: core::panicking::assert_failed_inner
  45. 15.27 s gammaloop-nextest-spenso> 3: core::panicking::assert_failed::<alloc::string::String, alloc::string::String>
  46. 15.27 s gammaloop-nextest-spenso> 4: idenso::color::test::form_reference::metric_contraction_respects_antisymmetric_normalization
  47. 15.27 s gammaloop-nextest-spenso> 5: <idenso::color::test::form_reference::metric_contraction_respects_antisymmetric_normalization::{closure#0} as core::ops::function::FnOnce<()>>::call_once
  48. 15.27 s gammaloop-nextest-spenso> note: Some details are omitted, run with `RUST_BACKTRACE=full` for a verbose backtrace.
  49. 15.27 s gammaloop-nextest-spenso>
  50. 15.55 s gammaloop-nextest-spenso> FAIL [ 0.103s] (221/224) idenso tensor::tests::parsing::infinite_execution
  51. 15.55 s gammaloop-nextest-spenso> stdout ---
  52. 15.55 s gammaloop-nextest-spenso>
  53. 15.55 s gammaloop-nextest-spenso> running 1 test
  54. 15.55 s gammaloop-nextest-spenso> ━━━━━━━━━━━━━━━━━━━━━━━━━━━━━━━ Snapshot Summary ━━━━━━━━━━━━━━━━━━━━━━━━━━━━━━━
  55. 15.55 s gammaloop-nextest-spenso> Snapshot: infinite_execution
  56. 15.55 s gammaloop-nextest-spenso> Source: crates/idenso/src/tensor/tests/parsing.rs:910
  57. 15.55 s gammaloop-nextest-spenso> ────────────────────────────────────────────────────────────────────────────────
  58. 15.55 s gammaloop-nextest-spenso> Expression: net_iter.snapshot_dot()
  59. 15.55 s gammaloop-nextest-spenso> ────────────────────────────────────────────────────────────────────────────────
  60. 15.55 s gammaloop-nextest-spenso> -old snapshot
  61. 15.55 s gammaloop-nextest-spenso> +new results
  62. 15.55 s gammaloop-nextest-spenso> ────────────┬───────────────────────────────────────────────────────────────────
  63. 15.55 s gammaloop-nextest-spenso> 8 8 │ 0:0:s -> ext0 [id=0 color="red"];
  64. 15.55 s gammaloop-nextest-spenso> 9 9 │ ext1 [style=invis];
  65. 15.55 s gammaloop-nextest-spenso> 10 10 │ 0:5:s -> ext1 [id=1 dir=none color="red" label="mink4|l_0"];
  66. 15.55 s gammaloop-nextest-spenso> 11 11 │ ext2 [style=invis];
  67. 15.55 s gammaloop-nextest-spenso> 12 │- 0:4:s -> ext2 [id=2 dir=none color="red" label="bis4|l_2"];
  68. 15.55 s gammaloop-nextest-spenso> 12 │+ 0:3:s -> ext2 [id=2 dir=none color="red" label="mink4|l_1"];
  69. 15.55 s gammaloop-nextest-spenso> 13 13 │ ext3 [style=invis];
  70. 15.55 s gammaloop-nextest-spenso> 14 │- 0:3:s -> ext3 [id=3 dir=none color="red" label="bis4|l_3"];
  71. 15.55 s gammaloop-nextest-spenso> 14 │+ 0:1:s -> ext3 [id=3 dir=none color="red" label="bis4|l_2"];
  72. 15.55 s gammaloop-nextest-spenso> 15 15 │ ext4 [style=invis];
  73. 15.55 s gammaloop-nextest-spenso> 16 │- 0:1:s -> ext4 [id=4 dir=none color="red" label="mink4|l_1"];
  74. 15.55 s gammaloop-nextest-spenso> 16 │+ 0:2:s -> ext4 [id=4 dir=none color="red" label="mink4|l_4"];
  75. 15.55 s gammaloop-nextest-spenso> 17 17 │ ext5 [style=invis];
  76. 15.55 s gammaloop-nextest-spenso> 18 │- 0:2:s -> ext5 [id=5 dir=none color="red" label="mink4|l_4"];
  77. 15.55 s gammaloop-nextest-spenso> 18 │+ 0:4:s -> ext5 [id=5 dir=none color="red" label="bis4|l_3"];
  78. 15.55 s gammaloop-nextest-spenso> 19 19 │ }
  79. 15.55 s gammaloop-nextest-spenso> ────────────┴───────────────────────────────────────────────────────────────────
  80. 15.55 s gammaloop-nextest-spenso> To update snapshots run `cargo insta review`
  81. 15.55 s gammaloop-nextest-spenso> Stopped on the first failure. Run `cargo insta test` to run all snapshots.
  82. 15.55 s gammaloop-nextest-spenso> test tensor::tests::parsing::infinite_execution ... FAILED
  83. 15.55 s gammaloop-nextest-spenso>
  84. 15.55 s gammaloop-nextest-spenso> failures:
  85. 15.55 s gammaloop-nextest-spenso>
  86. 15.55 s gammaloop-nextest-spenso> failures:
  87. 15.55 s gammaloop-nextest-spenso> tensor::tests::parsing::infinite_execution
  88. 15.55 s gammaloop-nextest-spenso>
  89. 15.55 s gammaloop-nextest-spenso> test result: FAILED. 0 passed; 1 failed; 0 ignored; 0 measured; 240 filtered out; finished in 0.10s
  90. 15.55 s gammaloop-nextest-spenso>
  91. 15.55 s gammaloop-nextest-spenso> stderr ---
  92. 15.55 s gammaloop-nextest-spenso>
  93. 15.55 s gammaloop-nextest-spenso> thread 'tensor::tests::parsing::infinite_execution' (843) panicked at /nix/store/qfja7nrd2p2n5iyvhzfjypcarnhpb7g4-vendor-cargo-deps/c19b7c6f923b580ac259164a89f2577984ad5ab09ee9d583b888f934adbbe8d0/insta-1.47.2/src/runtime.rs:719:13:
  94. 15.55 s gammaloop-nextest-spenso> snapshot assertion for 'infinite_execution' failed in line 910
  95. 15.55 s gammaloop-nextest-spenso> stack backtrace:
  96. 15.55 s gammaloop-nextest-spenso> 0: __rustc::rust_begin_unwind
  97. 15.55 s gammaloop-nextest-spenso> 1: core::panicking::panic_fmt
  98. 15.55 s gammaloop-nextest-spenso> 2: insta::runtime::assert_snapshot
  99. 15.55 s gammaloop-nextest-spenso> 3: idenso::tensor::tests::parsing::infinite_execution
  100. 15.55 s gammaloop-nextest-spenso> 4: <idenso::tensor::tests::parsing::infinite_execution::{closure#0} as core::ops::function::FnOnce<()>>::call_once
  101. 15.55 s gammaloop-nextest-spenso> note: Some details are omitted, run with `RUST_BACKTRACE=full` for a verbose backtrace.
  102. 15.55 s gammaloop-nextest-spenso>
  103. 16.75 s gammaloop-nextest-spenso> ------------
  104. 16.75 s gammaloop-nextest-spenso> Summary [ 1.559s] 224 tests run: 222 passed, 2 failed, 26 skipped
  105. 16.75 s gammaloop-nextest-spenso> FAIL [ 0.014s] ( 46/224) idenso color::test::form_reference::metric_contraction_respects_antisymmetric_normalization
  106. 16.75 s gammaloop-nextest-spenso> stdout ---
  107. 16.75 s gammaloop-nextest-spenso>
  108. 16.75 s gammaloop-nextest-spenso> running 1 test
  109. 16.75 s gammaloop-nextest-spenso> test color::test::form_reference::metric_contraction_respects_antisymmetric_normalization ... FAILED
  110. 16.75 s gammaloop-nextest-spenso>
  111. 16.75 s gammaloop-nextest-spenso> failures:
  112. 16.75 s gammaloop-nextest-spenso>
  113. 16.75 s gammaloop-nextest-spenso> failures:
  114. 16.75 s gammaloop-nextest-spenso> color::test::form_reference::metric_contraction_respects_antisymmetric_normalization
  115. 16.75 s gammaloop-nextest-spenso>
  116. 16.75 s gammaloop-nextest-spenso> test result: FAILED. 0 passed; 1 failed; 0 ignored; 0 measured; 240 filtered out; finished in 0.00s
  117. 16.75 s gammaloop-nextest-spenso>
  118. 16.75 s gammaloop-nextest-spenso> stderr ---
  119. 16.75 s gammaloop-nextest-spenso>
  120. 16.75 s gammaloop-nextest-spenso> thread 'color::test::form_reference::metric_contraction_respects_antisymmetric_normalization' (338) panicked at crates/idenso/src/color/test/form_reference.rs:171:5:
  121. 16.75 s gammaloop-nextest-spenso> assertion `left == right` failed
  122. 16.75 s gammaloop-nextest-spenso> left: "-1*f(coad(8,standalone_metric_j),coad(8,standalone_metric_s),coad(8,standalone_metric_u))"
  123. 16.75 s gammaloop-nextest-spenso> right: "f(coad(8,standalone_metric_j),coad(8,standalone_metric_s),coad(8,standalone_metric_u))"
  124. 16.75 s gammaloop-nextest-spenso> stack backtrace:
  125. 16.75 s gammaloop-nextest-spenso> 0: __rustc::rust_begin_unwind
  126. 16.75 s gammaloop-nextest-spenso> 1: core::panicking::panic_fmt
  127. 16.75 s gammaloop-nextest-spenso> 2: core::panicking::assert_failed_inner
  128. 16.75 s gammaloop-nextest-spenso> 3: core::panicking::assert_failed::<alloc::string::String, alloc::string::String>
  129. 16.75 s gammaloop-nextest-spenso> 4: idenso::color::test::form_reference::metric_contraction_respects_antisymmetric_normalization
  130. 16.75 s gammaloop-nextest-spenso> 5: <idenso::color::test::form_reference::metric_contraction_respects_antisymmetric_normalization::{closure#0} as core::ops::function::FnOnce<()>>::call_once
  131. 16.75 s gammaloop-nextest-spenso> note: Some details are omitted, run with `RUST_BACKTRACE=full` for a verbose backtrace.
  132. 16.75 s gammaloop-nextest-spenso>
  133. 16.75 s gammaloop-nextest-spenso> FAIL [ 0.103s] (221/224) idenso tensor::tests::parsing::infinite_execution
  134. 16.75 s gammaloop-nextest-spenso> stdout ---
  135. 16.75 s gammaloop-nextest-spenso>
  136. 16.75 s gammaloop-nextest-spenso> running 1 test
  137. 16.75 s gammaloop-nextest-spenso> ━━━━━━━━━━━━━━━━━━━━━━━━━━━━━━━ Snapshot Summary ━━━━━━━━━━━━━━━━━━━━━━━━━━━━━━━
  138. 16.75 s gammaloop-nextest-spenso> Snapshot: infinite_execution
  139. 16.75 s gammaloop-nextest-spenso> Source: crates/idenso/src/tensor/tests/parsing.rs:910
  140. 16.75 s gammaloop-nextest-spenso> ────────────────────────────────────────────────────────────────────────────────
  141. 16.75 s gammaloop-nextest-spenso> Expression: net_iter.snapshot_dot()
  142. 16.75 s gammaloop-nextest-spenso> ────────────────────────────────────────────────────────────────────────────────
  143. 16.75 s gammaloop-nextest-spenso> -old snapshot
  144. 16.75 s gammaloop-nextest-spenso> +new results
  145. 16.75 s gammaloop-nextest-spenso> ────────────┬───────────────────────────────────────────────────────────────────
  146. 16.75 s gammaloop-nextest-spenso> 8 8 │ 0:0:s -> ext0 [id=0 color="red"];
  147. 16.75 s gammaloop-nextest-spenso> 9 9 │ ext1 [style=invis];
  148. 16.75 s gammaloop-nextest-spenso> 10 10 │ 0:5:s -> ext1 [id=1 dir=none color="red" label="mink4|l_0"];
  149. 16.75 s gammaloop-nextest-spenso> 11 11 │ ext2 [style=invis];
  150. 16.75 s gammaloop-nextest-spenso> 12 │- 0:4:s -> ext2 [id=2 dir=none color="red" label="bis4|l_2"];
  151. 16.75 s gammaloop-nextest-spenso> 12 │+ 0:3:s -> ext2 [id=2 dir=none color="red" label="mink4|l_1"];
  152. 16.75 s gammaloop-nextest-spenso> 13 13 │ ext3 [style=invis];
  153. 16.75 s gammaloop-nextest-spenso> 14 │- 0:3:s -> ext3 [id=3 dir=none color="red" label="bis4|l_3"];
  154. 16.75 s gammaloop-nextest-spenso> 14 │+ 0:1:s -> ext3 [id=3 dir=none color="red" label="bis4|l_2"];
  155. 16.75 s gammaloop-nextest-spenso> 15 15 │ ext4 [style=invis];
  156. 16.75 s gammaloop-nextest-spenso> 16 │- 0:1:s -> ext4 [id=4 dir=none color="red" label="mink4|l_1"];
  157. 16.75 s gammaloop-nextest-spenso> 16 │+ 0:2:s -> ext4 [id=4 dir=none color="red" label="mink4|l_4"];
  158. 16.75 s gammaloop-nextest-spenso> 17 17 │ ext5 [style=invis];
  159. 16.75 s gammaloop-nextest-spenso> 18 │- 0:2:s -> ext5 [id=5 dir=none color="red" label="mink4|l_4"];
  160. 16.75 s gammaloop-nextest-spenso> 18 │+ 0:4:s -> ext5 [id=5 dir=none color="red" label="bis4|l_3"];
  161. 16.75 s gammaloop-nextest-spenso> 19 19 │ }
  162. 16.75 s gammaloop-nextest-spenso> ────────────┴───────────────────────────────────────────────────────────────────
  163. 16.75 s gammaloop-nextest-spenso> To update snapshots run `cargo insta review`
  164. 16.75 s gammaloop-nextest-spenso> Stopped on the first failure. Run `cargo insta test` to run all snapshots.
  165. 16.75 s gammaloop-nextest-spenso> test tensor::tests::parsing::infinite_execution ... FAILED
  166. 16.75 s gammaloop-nextest-spenso>
  167. 16.75 s gammaloop-nextest-spenso> failures:
  168. 16.75 s gammaloop-nextest-spenso>
  169. 16.75 s gammaloop-nextest-spenso> failures:
  170. 16.75 s gammaloop-nextest-spenso> tensor::tests::parsing::infinite_execution
  171. 16.75 s gammaloop-nextest-spenso>
  172. 16.75 s gammaloop-nextest-spenso> test result: FAILED. 0 passed; 1 failed; 0 ignored; 0 measured; 240 filtered out; finished in 0.10s
  173. 16.75 s gammaloop-nextest-spenso>
  174. 16.75 s gammaloop-nextest-spenso> stderr ---
  175. 16.75 s gammaloop-nextest-spenso>
  176. 16.75 s gammaloop-nextest-spenso> thread 'tensor::tests::parsing::infinite_execution' (843) panicked at /nix/store/qfja7nrd2p2n5iyvhzfjypcarnhpb7g4-vendor-cargo-deps/c19b7c6f923b580ac259164a89f2577984ad5ab09ee9d583b888f934adbbe8d0/insta-1.47.2/src/runtime.rs:719:13:
  177. 16.75 s gammaloop-nextest-spenso> snapshot assertion for 'infinite_execution' failed in line 910
  178. 16.75 s gammaloop-nextest-spenso> stack backtrace:
  179. 16.75 s gammaloop-nextest-spenso> 0: __rustc::rust_begin_unwind
  180. 16.75 s gammaloop-nextest-spenso> 1: core::panicking::panic_fmt
  181. 16.75 s gammaloop-nextest-spenso> 2: insta::runtime::assert_snapshot
  182. 16.75 s gammaloop-nextest-spenso> 3: idenso::tensor::tests::parsing::infinite_execution
  183. 16.75 s gammaloop-nextest-spenso> 4: <idenso::tensor::tests::parsing::infinite_execution::{closure#0} as core::ops::function::FnOnce<()>>::call_once
  184. 16.75 s gammaloop-nextest-spenso> note: Some details are omitted, run with `RUST_BACKTRACE=full` for a verbose backtrace.
  185. 16.75 s gammaloop-nextest-spenso>
  186. 16.78 s gammaloop-nextest-spenso> error: test run failed
  187. 16.80 s gammaloop-nextest-spenso>
  188. 16.80 s gammaloop-nextest-spenso> ========== nextest test summary ==========
  189. 16.80 s gammaloop-nextest-spenso> report: target/nextest/ci_gammaloop/junit.xml
  190. 16.80 s gammaloop-nextest-spenso> tests: 224, failures: 2, errors: 0
  191. 16.80 s gammaloop-nextest-spenso>
  192. 16.80 s gammaloop-nextest-spenso> 1. idenso::color::test::form_reference::metric_contraction_respects_antisymmetric_normalization
  193. 16.80 s gammaloop-nextest-spenso> failure: test failure with exit code 101
  194. 16.80 s gammaloop-nextest-spenso> thread 'color::test::form_reference::metric_contraction_respects_antisymmetric_normalization' (338) panicked at crates/idenso/src/color/test/form_reference.rs:171:5:
  195. 16.80 s gammaloop-nextest-spenso> assertion `left == right` failed
  196. 16.80 s gammaloop-nextest-spenso> left: "-1*f(coad(8,standalone_metric_j),coad(8,standalone_metric_s),coad(8,standalone_metric_u))"
  197. 16.80 s gammaloop-nextest-spenso> right: "f(coad(8,standalone_metric_j),coad(8,standalone_metric_s),coad(8,standalone_metric_u))"
  198. 16.80 s gammaloop-nextest-spenso> stack backtrace:
  199. 16.80 s gammaloop-nextest-spenso> 0: __rustc::rust_begin_unwind
  200. 16.80 s gammaloop-nextest-spenso> 1: core::panicking::panic_fmt
  201. 16.80 s gammaloop-nextest-spenso> 2: core::panicking::assert_failed_inner
  202. 16.80 s gammaloop-nextest-spenso> 3: core::panicking::assert_failed::<alloc::string::String, alloc::string::String>
  203. 16.80 s gammaloop-nextest-spenso> 4: idenso::color::test::form_reference::metric_contraction_respects_antisymmetric_normalization
  204. 16.80 s gammaloop-nextest-spenso> 5: <idenso::color::test::form_reference::metric_contraction_respects_antisymmetric_normalization::{closure#0} as core::ops::function::FnOnce<()>>::call_once
  205. 16.80 s gammaloop-nextest-spenso> note: Some details are omitted, run with `RUST_BACKTRACE=full` for a verbose backtrace.
  206. 16.80 s gammaloop-nextest-spenso> system-out
  207. 16.80 s gammaloop-nextest-spenso> running 1 test
  208. 16.80 s gammaloop-nextest-spenso> test color::test::form_reference::metric_contraction_respects_antisymmetric_normalization ... FAILED
  209. 16.80 s gammaloop-nextest-spenso>
  210. 16.80 s gammaloop-nextest-spenso> failures:
  211. 16.80 s gammaloop-nextest-spenso>
  212. 16.80 s gammaloop-nextest-spenso> failures:
  213. 16.80 s gammaloop-nextest-spenso> color::test::form_reference::metric_contraction_respects_antisymmetric_normalization
  214. 16.80 s gammaloop-nextest-spenso>
  215. 16.80 s gammaloop-nextest-spenso> test result: FAILED. 0 passed; 1 failed; 0 ignored; 0 measured; 240 filtered out; finished in 0.00s
  216. 16.80 s gammaloop-nextest-spenso> system-err
  217. 16.80 s gammaloop-nextest-spenso> thread 'color::test::form_reference::metric_contraction_respects_antisymmetric_normalization' (338) panicked at crates/idenso/src/color/test/form_reference.rs:171:5:
  218. 16.80 s gammaloop-nextest-spenso> assertion `left == right` failed
  219. 16.80 s gammaloop-nextest-spenso> left: "-1*f(coad(8,standalone_metric_j),coad(8,standalone_metric_s),coad(8,standalone_metric_u))"
  220. 16.80 s gammaloop-nextest-spenso> right: "f(coad(8,standalone_metric_j),coad(8,standalone_metric_s),coad(8,standalone_metric_u))"
  221. 16.80 s gammaloop-nextest-spenso> stack backtrace:
  222. 16.80 s gammaloop-nextest-spenso> 0: __rustc::rust_begin_unwind
  223. 16.80 s gammaloop-nextest-spenso> 1: core::panicking::panic_fmt
  224. 16.80 s gammaloop-nextest-spenso> 2: core::panicking::assert_failed_inner
  225. 16.80 s gammaloop-nextest-spenso> 3: core::panicking::assert_failed::<alloc::string::String, alloc::string::String>
  226. 16.80 s gammaloop-nextest-spenso> 4: idenso::color::test::form_reference::metric_contraction_respects_antisymmetric_normalization
  227. 16.80 s gammaloop-nextest-spenso> 5: <idenso::color::test::form_reference::metric_contraction_respects_antisymmetric_normalization::{closure#0} as core::ops::function::FnOnce<()>>::call_once
  228. 16.80 s gammaloop-nextest-spenso> note: Some details are omitted, run with `RUST_BACKTRACE=full` for a verbose backtrace.
  229. 16.80 s gammaloop-nextest-spenso>
  230. 16.80 s gammaloop-nextest-spenso> 2. idenso::tensor::tests::parsing::infinite_execution
  231. 16.80 s gammaloop-nextest-spenso> failure: test failure with exit code 101
  232. 16.80 s gammaloop-nextest-spenso> thread 'tensor::tests::parsing::infinite_execution' (843) panicked at /nix/store/qfja7nrd2p2n5iyvhzfjypcarnhpb7g4-vendor-cargo-deps/c19b7c6f923b580ac259164a89f2577984ad5ab09ee9d583b888f934adbbe8d0/insta-1.47.2/src/runtime.rs:719:13:
  233. 16.80 s gammaloop-nextest-spenso> snapshot assertion for 'infinite_execution' failed in line 910
  234. 16.80 s gammaloop-nextest-spenso> stack backtrace:
  235. 16.80 s gammaloop-nextest-spenso> 0: __rustc::rust_begin_unwind
  236. 16.80 s gammaloop-nextest-spenso> 1: core::panicking::panic_fmt
  237. 16.80 s gammaloop-nextest-spenso> 2: insta::runtime::assert_snapshot
  238. 16.80 s gammaloop-nextest-spenso> 3: idenso::tensor::tests::parsing::infinite_execution
  239. 16.80 s gammaloop-nextest-spenso> 4: <idenso::tensor::tests::parsing::infinite_execution::{closure#0} as core::ops::function::FnOnce<()>>::call_once
  240. 16.80 s gammaloop-nextest-spenso> note: Some details are omitted, run with `RUST_BACKTRACE=full` for a verbose backtrace.
  241. 16.80 s gammaloop-nextest-spenso> system-out
  242. 16.80 s gammaloop-nextest-spenso> running 1 test
  243. 16.80 s gammaloop-nextest-spenso> ━━━━━━━━━━━━━━━━━━━━━━━━━━━━━━━ Snapshot Summary ━━━━━━━━━━━━━━━━━━━━━━━━━━━━━━━
  244. 16.80 s gammaloop-nextest-spenso> Snapshot: infinite_execution
  245. 16.80 s gammaloop-nextest-spenso> Source: crates/idenso/src/tensor/tests/parsing.rs:910
  246. 16.80 s gammaloop-nextest-spenso> ────────────────────────────────────────────────────────────────────────────────
  247. 16.80 s gammaloop-nextest-spenso> Expression: net_iter.snapshot_dot()
  248. 16.80 s gammaloop-nextest-spenso> ────────────────────────────────────────────────────────────────────────────────
  249. 16.80 s gammaloop-nextest-spenso> -old snapshot
  250. 16.80 s gammaloop-nextest-spenso> +new results
  251. 16.80 s gammaloop-nextest-spenso> ────────────┬───────────────────────────────────────────────────────────────────
  252. 16.80 s gammaloop-nextest-spenso> 8 8 │ 0:0:s-> ext0 [id=0 color="red"];
  253. 16.80 s gammaloop-nextest-spenso> 9 9 │ ext1 [style=invis];
  254. 16.80 s gammaloop-nextest-spenso> 10 10 │ 0:5:s-> ext1 [id=1 dir=none color="red" label="mink4|l_0"];
  255. 16.80 s gammaloop-nextest-spenso> 11 11 │ ext2 [style=invis];
  256. 16.80 s gammaloop-nextest-spenso> 12 │- 0:4:s-> ext2 [id=2 dir=none color="red" label="bis4|l_2"];
  257. 16.80 s gammaloop-nextest-spenso> 12 │+ 0:3:s-> ext2 [id=2 dir=none color="red" label="mink4|l_1"];
  258. 16.80 s gammaloop-nextest-spenso> 13 13 │ ext3 [style=invis];
  259. 16.80 s gammaloop-nextest-spenso> 14 │- 0:3:s-> ext3 [id=3 dir=none color="red" label="bis4|l_3"];
  260. 16.80 s gammaloop-nextest-spenso> 14 │+ 0:1:s-> ext3 [id=3 dir=none color="red" label="bis4|l_2"];
  261. 16.80 s gammaloop-nextest-spenso> 15 15 │ ext4 [style=invis];
  262. 16.80 s gammaloop-nextest-spenso> 16 │- 0:1:s-> ext4 [id=4 dir=none color="red" label="mink4|l_1"];
  263. 16.80 s gammaloop-nextest-spenso> 16 │+ 0:2:s-> ext4 [id=4 dir=none color="red" label="mink4|l_4"];
  264. 16.80 s gammaloop-nextest-spenso> 17 17 │ ext5 [style=invis];
  265. 16.80 s gammaloop-nextest-spenso> 18 │- 0:2:s-> ext5 [id=5 dir=none color="red" label="mink4|l_4"];
  266. 16.80 s gammaloop-nextest-spenso> 18 │+ 0:4:s-> ext5 [id=5 dir=none color="red" label="bis4|l_3"];
  267. 16.80 s gammaloop-nextest-spenso> 19 19 │ }
  268. 16.80 s gammaloop-nextest-spenso> ────────────┴───────────────────────────────────────────────────────────────────
  269. 16.80 s gammaloop-nextest-spenso> To update snapshots run `cargo insta review`
  270. 16.80 s gammaloop-nextest-spenso> Stopped on the first failure. Run `cargo insta test` to run all snapshots.
  271. 16.80 s gammaloop-nextest-spenso> test tensor::tests::parsing::infinite_execution ... FAILED
  272. 16.80 s gammaloop-nextest-spenso>
  273. 16.80 s gammaloop-nextest-spenso> failures:
  274. 16.80 s gammaloop-nextest-spenso>
  275. 16.80 s gammaloop-nextest-spenso> failures:
  276. 16.80 s gammaloop-nextest-spenso> tensor::tests::parsing::infinite_execution
  277. 16.80 s gammaloop-nextest-spenso>
  278. 16.80 s gammaloop-nextest-spenso> test result: FAILED. 0 passed; 1 failed; 0 ignored; 0 measured; 240 filtered out; finished in 0.10s
  279. 16.80 s gammaloop-nextest-spenso> system-err
  280. 16.80 s gammaloop-nextest-spenso> thread 'tensor::tests::parsing::infinite_execution' (843) panicked at /nix/store/qfja7nrd2p2n5iyvhzfjypcarnhpb7g4-vendor-cargo-deps/c19b7c6f923b580ac259164a89f2577984ad5ab09ee9d583b888f934adbbe8d0/insta-1.47.2/src/runtime.rs:719:13:
  281. 16.80 s gammaloop-nextest-spenso> snapshot assertion for 'infinite_execution' failed in line 910
  282. 16.80 s gammaloop-nextest-spenso> stack backtrace:
  283. 16.80 s gammaloop-nextest-spenso> 0: __rustc::rust_begin_unwind
  284. 16.80 s gammaloop-nextest-spenso> 1: core::panicking::panic_fmt
  285. 16.80 s gammaloop-nextest-spenso> 2: insta::runtime::assert_snapshot
  286. 16.80 s gammaloop-nextest-spenso> 3: idenso::tensor::tests::parsing::infinite_execution
  287. 16.80 s gammaloop-nextest-spenso> 4: <idenso::tensor::tests::parsing::infinite_execution::{closure#0} as core::ops::function::FnOnce<()>>::call_once
  288. 16.80 s gammaloop-nextest-spenso> note: Some details are omitted, run with `RUST_BACKTRACE=full` for a verbose backtrace.
  289. 16.80 s gammaloop-nextest-spenso> =========================================
  290. 16.82 s gammaloop-nextest-spenso> Extracting 2 binaries and 1 linked path to /build/nextest-archive-s06re5
  291. 16.88 s gammaloop-nextest-spenso> Extracted 8 files to /build/nextest-archive-s06re5 in 0.07s
  292. 16.89 s gammaloop-nextest-spenso> ------------
  293. 16.89 s gammaloop-nextest-spenso> Nextest run ID 753d5fab-d09b-4893-9d26-477fd007a6d8 with nextest profile: ci_gammaloop
  294. 16.89 s gammaloop-nextest-spenso> Starting 135 tests across 2 binaries
  295. 16.96 s gammaloop-nextest-spenso> ------------
  296. 16.96 s gammaloop-nextest-spenso> Summary [ 0.073s] 135 tests run: 135 passed, 0 skipped
  297. 17.00 s gammaloop-nextest-spenso>
  298. 17.00 s gammaloop-nextest-spenso> ========== nextest test summary ==========
  299. 17.00 s gammaloop-nextest-spenso> report: target/nextest/ci_gammaloop/junit.xml
  300. 17.00 s gammaloop-nextest-spenso> tests: 135, failures: 0, errors: 0
  301. 17.00 s gammaloop-nextest-spenso> No failing testcases found.
  302. 17.00 s gammaloop-nextest-spenso> =========================================
  303. 17.01 s gammaloop-nextest-spenso> Extracting 5 binaries and 2 linked paths to /build/nextest-archive-1HgFe8
  304. 17.19 s gammaloop-nextest-spenso> Extracted 19 files to /build/nextest-archive-1HgFe8 in 0.18s
  305. 17.21 s gammaloop-nextest-spenso> ------------
  306. 17.21 s gammaloop-nextest-spenso> Nextest run ID 05098fa3-aeae-4b15-a4f6-e1c6fdc3ed4e with nextest profile: ci_gammaloop
  307. 17.21 s gammaloop-nextest-spenso> Starting 25 tests across 5 binaries (1 test skipped via profile.ci_gammaloop.default-filter)
  308. 17.39 s gammaloop-nextest-spenso> ------------
  309. 17.39 s gammaloop-nextest-spenso> Summary [ 0.188s] 25 tests run: 25 passed, 1 skipped
  310. 17.44 s gammaloop-nextest-spenso>
  311. 17.44 s gammaloop-nextest-spenso> ========== nextest test summary ==========
  312. 17.44 s gammaloop-nextest-spenso> report: target/nextest/ci_gammaloop/junit.xml
  313. 17.44 s gammaloop-nextest-spenso> tests: 25, failures: 0, errors: 0
  314. 17.44 s gammaloop-nextest-spenso> No failing testcases found.
  315. 17.44 s gammaloop-nextest-spenso> =========================================
  316. 17.46 s gammaloop-nextest-spenso> Extracting 2 binaries and 1 linked path to /build/nextest-archive-MMaNQB
  317. 17.51 s gammaloop-nextest-spenso> Extracted 8 files to /build/nextest-archive-MMaNQB in 0.05s
  318. 17.51 s gammaloop-nextest-spenso> ------------
  319. 17.51 s gammaloop-nextest-spenso> Nextest run ID 9709566f-d5db-493b-bd9c-dcb237681ce5 with nextest profile: ci_gammaloop
  320. 17.51 s gammaloop-nextest-spenso> Starting 1 test across 2 binaries
  321. 17.52 s gammaloop-nextest-spenso> ------------
  322. 17.52 s gammaloop-nextest-spenso> Summary [ 0.005s] 1 test run: 1 passed, 0 skipped
  323. 17.55 s gammaloop-nextest-spenso>
  324. 17.55 s gammaloop-nextest-spenso> ========== nextest test summary ==========
  325. 17.55 s gammaloop-nextest-spenso> report: target/nextest/ci_gammaloop/junit.xml
  326. 17.55 s gammaloop-nextest-spenso> tests: 1, failures: 0, errors: 0
  327. 17.55 s gammaloop-nextest-spenso> No failing testcases found.
  328. 17.55 s gammaloop-nextest-spenso> =========================================
  329. 17.56 s gammaloop-nextest-spenso> Extracting 1 binary and 1 linked path to /build/nextest-archive-l9u5hc
  330. 17.61 s gammaloop-nextest-spenso> Extracted 7 files to /build/nextest-archive-l9u5hc in 0.05s
  331. 17.62 s gammaloop-nextest-spenso> ------------
  332. 17.62 s gammaloop-nextest-spenso> Nextest run ID 2fe9008b-7bcd-44c2-9df9-1fd7b31e416a with nextest profile: ci_gammaloop
  333. 17.62 s gammaloop-nextest-spenso> Starting 0 tests across 1 binary
  334. 17.62 s gammaloop-nextest-spenso> ------------
  335. 17.62 s gammaloop-nextest-spenso> Summary [ 0.000s] 0 tests run: 0 passed, 0 skipped
  336. 17.65 s gammaloop-nextest-spenso>
  337. 17.65 s gammaloop-nextest-spenso> ========== nextest test summary ==========
  338. 17.65 s gammaloop-nextest-spenso> report: target/nextest/ci_gammaloop/junit.xml
  339. 17.65 s gammaloop-nextest-spenso> tests: 0, failures: 0, errors: 0
  340. 17.65 s gammaloop-nextest-spenso> No failing testcases found.
  341. 17.65 s gammaloop-nextest-spenso> =========================================
  342. 17.67 s error: Cannot build '/nix/store/hk3irrympzq7agrqvi8g99r01gw6v0g3-gammaloop-nextest-spenso.drv'.
  343. 17.67 s Reason: builder failed with exit code 100.
  344. 17.67 s Output paths:
  345. 17.67 s /nix/store/wcjln4hqsq5j381kylbbk9axpkb95zxm-gammaloop-nextest-spenso
  346. 17.67 s Last 325 log lines:
  347. 17.67 s > Extracting 5 binaries and 2 linked paths to /build/nextest-archive-gUNf78
  348. 17.67 s > Extracted 19 files to /build/nextest-archive-gUNf78 in 0.16s
  349. 17.67 s > ------------
  350. 17.67 s > Nextest run ID 05d1b1e8-567e-4ca4-974d-eb5a0f1b8c28 with nextest profile: ci_gammaloop
  351. 17.67 s > Starting 224 tests across 5 binaries (26 tests skipped, including 2 tests via profile.ci_gammaloop.default-filter)
  352. 17.67 s > FAIL [ 0.014s] ( 46/224) idenso color::test::form_reference::metric_contraction_respects_antisymmetric_normalization
  353. 17.67 s > stdout ---
  354. 17.67 s >
  355. 17.67 s > running 1 test
  356. 17.67 s > test color::test::form_reference::metric_contraction_respects_antisymmetric_normalization ... FAILED
  357. 17.67 s >
  358. 17.67 s > failures:
  359. 17.67 s >
  360. 17.67 s > failures:
  361. 17.67 s > color::test::form_reference::metric_contraction_respects_antisymmetric_normalization
  362. 17.67 s >
  363. 17.67 s > test result: FAILED. 0 passed; 1 failed; 0 ignored; 0 measured; 240 filtered out; finished in 0.00s
  364. 17.67 s >
  365. 17.67 s > stderr ---
  366. 17.67 s >
  367. 17.67 s > thread 'color::test::form_reference::metric_contraction_respects_antisymmetric_normalization' (338) panicked at crates/idenso/src/color/test/form_reference.rs:171:5:
  368. 17.67 s > assertion `left == right` failed
  369. 17.67 s > left: "-1*f(coad(8,standalone_metric_j),coad(8,standalone_metric_s),coad(8,standalone_metric_u))"
  370. 17.67 s > right: "f(coad(8,standalone_metric_j),coad(8,standalone_metric_s),coad(8,standalone_metric_u))"
  371. 17.67 s > stack backtrace:
  372. 17.67 s > 0: __rustc::rust_begin_unwind
  373. 17.67 s > 1: core::panicking::panic_fmt
  374. 17.67 s > 2: core::panicking::assert_failed_inner
  375. 17.67 s > 3: core::panicking::assert_failed::<alloc::string::String, alloc::string::String>
  376. 17.67 s > 4: idenso::color::test::form_reference::metric_contraction_respects_antisymmetric_normalization
  377. 17.67 s > 5: <idenso::color::test::form_reference::metric_contraction_respects_antisymmetric_normalization::{closure#0} as core::ops::function::FnOnce<()>>::call_once
  378. 17.67 s > note: Some details are omitted, run with `RUST_BACKTRACE=full` for a verbose backtrace.
  379. 17.67 s >
  380. 17.67 s > FAIL [ 0.103s] (221/224) idenso tensor::tests::parsing::infinite_execution
  381. 17.67 s > stdout ---
  382. 17.67 s >
  383. 17.67 s > running 1 test
  384. 17.67 s > ━━━━━━━━━━━━━━━━━━━━━━━━━━━━━━━ Snapshot Summary ━━━━━━━━━━━━━━━━━━━━━━━━━━━━━━━
  385. 17.67 s > Snapshot: infinite_execution
  386. 17.67 s > Source: crates/idenso/src/tensor/tests/parsing.rs:910
  387. 17.67 s > ────────────────────────────────────────────────────────────────────────────────
  388. 17.67 s > Expression: net_iter.snapshot_dot()
  389. 17.67 s > ────────────────────────────────────────────────────────────────────────────────
  390. 17.67 s > -old snapshot
  391. 17.67 s > +new results
  392. 17.67 s > ────────────┬───────────────────────────────────────────────────────────────────
  393. 17.67 s > 8 8 │ 0:0:s -> ext0 [id=0 color="red"];
  394. 17.67 s > 9 9 │ ext1 [style=invis];
  395. 17.67 s > 10 10 │ 0:5:s -> ext1 [id=1 dir=none color="red" label="mink4|l_0"];
  396. 17.67 s > 11 11 │ ext2 [style=invis];
  397. 17.67 s > 12 │- 0:4:s -> ext2 [id=2 dir=none color="red" label="bis4|l_2"];
  398. 17.67 s > 12 │+ 0:3:s -> ext2 [id=2 dir=none color="red" label="mink4|l_1"];
  399. 17.67 s > 13 13 │ ext3 [style=invis];
  400. 17.67 s > 14 │- 0:3:s -> ext3 [id=3 dir=none color="red" label="bis4|l_3"];
  401. 17.67 s > 14 │+ 0:1:s -> ext3 [id=3 dir=none color="red" label="bis4|l_2"];
  402. 17.67 s > 15 15 │ ext4 [style=invis];
  403. 17.67 s > 16 │- 0:1:s -> ext4 [id=4 dir=none color="red" label="mink4|l_1"];
  404. 17.67 s > 16 │+ 0:2:s -> ext4 [id=4 dir=none color="red" label="mink4|l_4"];
  405. 17.67 s > 17 17 │ ext5 [style=invis];
  406. 17.67 s > 18 │- 0:2:s -> ext5 [id=5 dir=none color="red" label="mink4|l_4"];
  407. 17.67 s > 18 │+ 0:4:s -> ext5 [id=5 dir=none color="red" label="bis4|l_3"];
  408. 17.67 s > 19 19 │ }
  409. 17.67 s > ────────────┴───────────────────────────────────────────────────────────────────
  410. 17.67 s > To update snapshots run `cargo insta review`
  411. 17.67 s > Stopped on the first failure. Run `cargo insta test` to run all snapshots.
  412. 17.67 s > test tensor::tests::parsing::infinite_execution ... FAILED
  413. 17.67 s >
  414. 17.67 s > failures:
  415. 17.67 s >
  416. 17.67 s > failures:
  417. 17.67 s > tensor::tests::parsing::infinite_execution
  418. 17.67 s >
  419. 17.67 s > test result: FAILED. 0 passed; 1 failed; 0 ignored; 0 measured; 240 filtered out; finished in 0.10s
  420. 17.67 s >
  421. 17.67 s > stderr ---
  422. 17.67 s >
  423. 17.67 s > thread 'tensor::tests::parsing::infinite_execution' (843) panicked at /nix/store/qfja7nrd2p2n5iyvhzfjypcarnhpb7g4-vendor-cargo-deps/c19b7c6f923b580ac259164a89f2577984ad5ab09ee9d583b888f934adbbe8d0/insta-1.47.2/src/runtime.rs:719:13:
  424. 17.67 s > snapshot assertion for 'infinite_execution' failed in line 910
  425. 17.67 s > stack backtrace:
  426. 17.67 s > 0: __rustc::rust_begin_unwind
  427. 17.67 s > 1: core::panicking::panic_fmt
  428. 17.67 s > 2: insta::runtime::assert_snapshot
  429. 17.67 s > 3: idenso::tensor::tests::parsing::infinite_execution
  430. 17.67 s > 4: <idenso::tensor::tests::parsing::infinite_execution::{closure#0} as core::ops::function::FnOnce<()>>::call_once
  431. 17.67 s > note: Some details are omitted, run with `RUST_BACKTRACE=full` for a verbose backtrace.
  432. 17.67 s >
  433. 17.67 s > ------------
  434. 17.67 s > Summary [ 1.559s] 224 tests run: 222 passed, 2 failed, 26 skipped
  435. 17.67 s > FAIL [ 0.014s] ( 46/224) idenso color::test::form_reference::metric_contraction_respects_antisymmetric_normalization
  436. 17.67 s > stdout ---
  437. 17.67 s >
  438. 17.67 s > running 1 test
  439. 17.67 s > test color::test::form_reference::metric_contraction_respects_antisymmetric_normalization ... FAILED
  440. 17.67 s >
  441. 17.67 s > failures:
  442. 17.67 s >
  443. 17.67 s > failures:
  444. 17.67 s > color::test::form_reference::metric_contraction_respects_antisymmetric_normalization
  445. 17.67 s >
  446. 17.67 s > test result: FAILED. 0 passed; 1 failed; 0 ignored; 0 measured; 240 filtered out; finished in 0.00s
  447. 17.67 s >
  448. 17.67 s > stderr ---
  449. 17.67 s >
  450. 17.67 s > thread 'color::test::form_reference::metric_contraction_respects_antisymmetric_normalization' (338) panicked at crates/idenso/src/color/test/form_reference.rs:171:5:
  451. 17.67 s > assertion `left == right` failed
  452. 17.67 s > left: "-1*f(coad(8,standalone_metric_j),coad(8,standalone_metric_s),coad(8,standalone_metric_u))"
  453. 17.67 s > right: "f(coad(8,standalone_metric_j),coad(8,standalone_metric_s),coad(8,standalone_metric_u))"
  454. 17.67 s > stack backtrace:
  455. 17.67 s > 0: __rustc::rust_begin_unwind
  456. 17.67 s > 1: core::panicking::panic_fmt
  457. 17.67 s > 2: core::panicking::assert_failed_inner
  458. 17.67 s > 3: core::panicking::assert_failed::<alloc::string::String, alloc::string::String>
  459. 17.67 s > 4: idenso::color::test::form_reference::metric_contraction_respects_antisymmetric_normalization
  460. 17.67 s > 5: <idenso::color::test::form_reference::metric_contraction_respects_antisymmetric_normalization::{closure#0} as core::ops::function::FnOnce<()>>::call_once
  461. 17.67 s > note: Some details are omitted, run with `RUST_BACKTRACE=full` for a verbose backtrace.
  462. 17.67 s >
  463. 17.67 s > FAIL [ 0.103s] (221/224) idenso tensor::tests::parsing::infinite_execution
  464. 17.67 s > stdout ---
  465. 17.67 s >
  466. 17.67 s > running 1 test
  467. 17.67 s > ━━━━━━━━━━━━━━━━━━━━━━━━━━━━━━━ Snapshot Summary ━━━━━━━━━━━━━━━━━━━━━━━━━━━━━━━
  468. 17.67 s > Snapshot: infinite_execution
  469. 17.67 s > Source: crates/idenso/src/tensor/tests/parsing.rs:910
  470. 17.67 s > ────────────────────────────────────────────────────────────────────────────────
  471. 17.67 s > Expression: net_iter.snapshot_dot()
  472. 17.67 s > ────────────────────────────────────────────────────────────────────────────────
  473. 17.67 s > -old snapshot
  474. 17.67 s > +new results
  475. 17.67 s > ────────────┬───────────────────────────────────────────────────────────────────
  476. 17.67 s > 8 8 │ 0:0:s -> ext0 [id=0 color="red"];
  477. 17.67 s > 9 9 │ ext1 [style=invis];
  478. 17.67 s > 10 10 │ 0:5:s -> ext1 [id=1 dir=none color="red" label="mink4|l_0"];
  479. 17.67 s > 11 11 │ ext2 [style=invis];
  480. 17.67 s > 12 │- 0:4:s -> ext2 [id=2 dir=none color="red" label="bis4|l_2"];
  481. 17.67 s > 12 │+ 0:3:s -> ext2 [id=2 dir=none color="red" label="mink4|l_1"];
  482. 17.67 s > 13 13 │ ext3 [style=invis];
  483. 17.67 s > 14 │- 0:3:s -> ext3 [id=3 dir=none color="red" label="bis4|l_3"];
  484. 17.67 s > 14 │+ 0:1:s -> ext3 [id=3 dir=none color="red" label="bis4|l_2"];
  485. 17.67 s > 15 15 │ ext4 [style=invis];
  486. 17.67 s > 16 │- 0:1:s -> ext4 [id=4 dir=none color="red" label="mink4|l_1"];
  487. 17.67 s > 16 │+ 0:2:s -> ext4 [id=4 dir=none color="red" label="mink4|l_4"];
  488. 17.67 s > 17 17 │ ext5 [style=invis];
  489. 17.67 s > 18 │- 0:2:s -> ext5 [id=5 dir=none color="red" label="mink4|l_4"];
  490. 17.67 s > 18 │+ 0:4:s -> ext5 [id=5 dir=none color="red" label="bis4|l_3"];
  491. 17.67 s > 19 19 │ }
  492. 17.67 s > ────────────┴───────────────────────────────────────────────────────────────────
  493. 17.67 s > To update snapshots run `cargo insta review`
  494. 17.67 s > Stopped on the first failure. Run `cargo insta test` to run all snapshots.
  495. 17.67 s > test tensor::tests::parsing::infinite_execution ... FAILED
  496. 17.67 s >
  497. 17.67 s > failures:
  498. 17.67 s >
  499. 17.67 s > failures:
  500. 17.67 s > tensor::tests::parsing::infinite_execution
  501. 17.67 s >
  502. 17.67 s > test result: FAILED. 0 passed; 1 failed; 0 ignored; 0 measured; 240 filtered out; finished in 0.10s
  503. 17.67 s >
  504. 17.67 s > stderr ---
  505. 17.67 s >
  506. 17.67 s > thread 'tensor::tests::parsing::infinite_execution' (843) panicked at /nix/store/qfja7nrd2p2n5iyvhzfjypcarnhpb7g4-vendor-cargo-deps/c19b7c6f923b580ac259164a89f2577984ad5ab09ee9d583b888f934adbbe8d0/insta-1.47.2/src/runtime.rs:719:13:
  507. 17.67 s > snapshot assertion for 'infinite_execution' failed in line 910
  508. 17.67 s > stack backtrace:
  509. 17.67 s > 0: __rustc::rust_begin_unwind
  510. 17.67 s > 1: core::panicking::panic_fmt
  511. 17.67 s > 2: insta::runtime::assert_snapshot
  512. 17.67 s > 3: idenso::tensor::tests::parsing::infinite_execution
  513. 17.67 s > 4: <idenso::tensor::tests::parsing::infinite_execution::{closure#0} as core::ops::function::FnOnce<()>>::call_once
  514. 17.67 s > note: Some details are omitted, run with `RUST_BACKTRACE=full` for a verbose backtrace.
  515. 17.67 s >
  516. 17.67 s > error: test run failed
  517. 17.67 s >
  518. 17.67 s > ========== nextest test summary ==========
  519. 17.67 s > report: target/nextest/ci_gammaloop/junit.xml
  520. 17.67 s > tests: 224, failures: 2, errors: 0
  521. 17.67 s >
  522. 17.67 s > 1. idenso::color::test::form_reference::metric_contraction_respects_antisymmetric_normalization
  523. 17.67 s > failure: test failure with exit code 101
  524. 17.67 s > thread 'color::test::form_reference::metric_contraction_respects_antisymmetric_normalization' (338) panicked at crates/idenso/src/color/test/form_reference.rs:171:5:
  525. 17.67 s > assertion `left == right` failed
  526. 17.67 s > left: "-1*f(coad(8,standalone_metric_j),coad(8,standalone_metric_s),coad(8,standalone_metric_u))"
  527. 17.67 s > right: "f(coad(8,standalone_metric_j),coad(8,standalone_metric_s),coad(8,standalone_metric_u))"
  528. 17.67 s > stack backtrace:
  529. 17.67 s > 0: __rustc::rust_begin_unwind
  530. 17.67 s > 1: core::panicking::panic_fmt
  531. 17.67 s > 2: core::panicking::assert_failed_inner
  532. 17.67 s > 3: core::panicking::assert_failed::<alloc::string::String, alloc::string::String>
  533. 17.67 s > 4: idenso::color::test::form_reference::metric_contraction_respects_antisymmetric_normalization
  534. 17.67 s > 5: <idenso::color::test::form_reference::metric_contraction_respects_antisymmetric_normalization::{closure#0} as core::ops::function::FnOnce<()>>::call_once
  535. 17.67 s > note: Some details are omitted, run with `RUST_BACKTRACE=full` for a verbose backtrace.
  536. 17.67 s > system-out
  537. 17.67 s > running 1 test
  538. 17.67 s > test color::test::form_reference::metric_contraction_respects_antisymmetric_normalization ... FAILED
  539. 17.67 s >
  540. 17.67 s > failures:
  541. 17.67 s >
  542. 17.67 s > failures:
  543. 17.67 s > color::test::form_reference::metric_contraction_respects_antisymmetric_normalization
  544. 17.67 s >
  545. 17.67 s > test result: FAILED. 0 passed; 1 failed; 0 ignored; 0 measured; 240 filtered out; finished in 0.00s
  546. 17.67 s > system-err
  547. 17.67 s > thread 'color::test::form_reference::metric_contraction_respects_antisymmetric_normalization' (338) panicked at crates/idenso/src/color/test/form_reference.rs:171:5:
  548. 17.67 s > assertion `left == right` failed
  549. 17.67 s > left: "-1*f(coad(8,standalone_metric_j),coad(8,standalone_metric_s),coad(8,standalone_metric_u))"
  550. 17.67 s > right: "f(coad(8,standalone_metric_j),coad(8,standalone_metric_s),coad(8,standalone_metric_u))"
  551. 17.67 s > stack backtrace:
  552. 17.67 s > 0: __rustc::rust_begin_unwind
  553. 17.67 s > 1: core::panicking::panic_fmt
  554. 17.67 s > 2: core::panicking::assert_failed_inner
  555. 17.68 s > 3: core::panicking::assert_failed::<alloc::string::String, alloc::string::String>
  556. 17.68 s > 4: idenso::color::test::form_reference::metric_contraction_respects_antisymmetric_normalization
  557. 17.68 s > 5: <idenso::color::test::form_reference::metric_contraction_respects_antisymmetric_normalization::{closure#0} as core::ops::function::FnOnce<()>>::call_once
  558. 17.68 s > note: Some details are omitted, run with `RUST_BACKTRACE=full` for a verbose backtrace.
  559. 17.68 s >
  560. 17.68 s > 2. idenso::tensor::tests::parsing::infinite_execution
  561. 17.68 s > failure: test failure with exit code 101
  562. 17.68 s > thread 'tensor::tests::parsing::infinite_execution' (843) panicked at /nix/store/qfja7nrd2p2n5iyvhzfjypcarnhpb7g4-vendor-cargo-deps/c19b7c6f923b580ac259164a89f2577984ad5ab09ee9d583b888f934adbbe8d0/insta-1.47.2/src/runtime.rs:719:13:
  563. 17.68 s > snapshot assertion for 'infinite_execution' failed in line 910
  564. 17.68 s > stack backtrace:
  565. 17.68 s > 0: __rustc::rust_begin_unwind
  566. 17.68 s > 1: core::panicking::panic_fmt
  567. 17.68 s > 2: insta::runtime::assert_snapshot
  568. 17.68 s > 3: idenso::tensor::tests::parsing::infinite_execution
  569. 17.68 s > 4: <idenso::tensor::tests::parsing::infinite_execution::{closure#0} as core::ops::function::FnOnce<()>>::call_once
  570. 17.68 s > note: Some details are omitted, run with `RUST_BACKTRACE=full` for a verbose backtrace.
  571. 17.68 s > system-out
  572. 17.68 s > running 1 test
  573. 17.68 s > ━━━━━━━━━━━━━━━━━━━━━━━━━━━━━━━ Snapshot Summary ━━━━━━━━━━━━━━━━━━━━━━━━━━━━━━━
  574. 17.68 s > Snapshot: infinite_execution
  575. 17.68 s > Source: crates/idenso/src/tensor/tests/parsing.rs:910
  576. 17.68 s > ────────────────────────────────────────────────────────────────────────────────
  577. 17.68 s > Expression: net_iter.snapshot_dot()
  578. 17.68 s > ────────────────────────────────────────────────────────────────────────────────
  579. 17.68 s > -old snapshot
  580. 17.68 s > +new results
  581. 17.68 s > ────────────┬───────────────────────────────────────────────────────────────────
  582. 17.68 s > 8 8 │ 0:0:s-> ext0 [id=0 color="red"];
  583. 17.68 s > 9 9 │ ext1 [style=invis];
  584. 17.68 s > 10 10 │ 0:5:s-> ext1 [id=1 dir=none color="red" label="mink4|l_0"];
  585. 17.68 s > 11 11 │ ext2 [style=invis];
  586. 17.68 s > 12 │- 0:4:s-> ext2 [id=2 dir=none color="red" label="bis4|l_2"];
  587. 17.68 s > 12 │+ 0:3:s-> ext2 [id=2 dir=none color="red" label="mink4|l_1"];
  588. 17.68 s > 13 13 │ ext3 [style=invis];
  589. 17.68 s > 14 │- 0:3:s-> ext3 [id=3 dir=none color="red" label="bis4|l_3"];
  590. 17.68 s > 14 │+ 0:1:s-> ext3 [id=3 dir=none color="red" label="bis4|l_2"];
  591. 17.68 s > 15 15 │ ext4 [style=invis];
  592. 17.68 s > 16 │- 0:1:s-> ext4 [id=4 dir=none color="red" label="mink4|l_1"];
  593. 17.68 s > 16 │+ 0:2:s-> ext4 [id=4 dir=none color="red" label="mink4|l_4"];
  594. 17.68 s > 17 17 │ ext5 [style=invis];
  595. 17.68 s > 18 │- 0:2:s-> ext5 [id=5 dir=none color="red" label="mink4|l_4"];
  596. 17.68 s > 18 │+ 0:4:s-> ext5 [id=5 dir=none color="red" label="bis4|l_3"];
  597. 17.68 s > 19 19 │ }
  598. 17.68 s > ────────────┴───────────────────────────────────────────────────────────────────
  599. 17.68 s > To update snapshots run `cargo insta review`
  600. 17.68 s > Stopped on the first failure. Run `cargo insta test` to run all snapshots.
  601. 17.68 s > test tensor::tests::parsing::infinite_execution ... FAILED
  602. 17.68 s >
  603. 17.68 s > failures:
  604. 17.68 s >
  605. 17.68 s > failures:
  606. 17.68 s > tensor::tests::parsing::infinite_execution
  607. 17.68 s >
  608. 17.68 s > test result: FAILED. 0 passed; 1 failed; 0 ignored; 0 measured; 240 filtered out; finished in 0.10s
  609. 17.68 s > system-err
  610. 17.68 s > thread 'tensor::tests::parsing::infinite_execution' (843) panicked at /nix/store/qfja7nrd2p2n5iyvhzfjypcarnhpb7g4-vendor-cargo-deps/c19b7c6f923b580ac259164a89f2577984ad5ab09ee9d583b888f934adbbe8d0/insta-1.47.2/src/runtime.rs:719:13:
  611. 17.68 s > snapshot assertion for 'infinite_execution' failed in line 910
  612. 17.68 s > stack backtrace:
  613. 17.68 s > 0: __rustc::rust_begin_unwind
  614. 17.68 s > 1: core::panicking::panic_fmt
  615. 17.68 s > 2: insta::runtime::assert_snapshot
  616. 17.68 s > 3: idenso::tensor::tests::parsing::infinite_execution
  617. 17.68 s > 4: <idenso::tensor::tests::parsing::infinite_execution::{closure#0} as core::ops::function::FnOnce<()>>::call_once
  618. 17.68 s > note: Some details are omitted, run with `RUST_BACKTRACE=full` for a verbose backtrace.
  619. 17.68 s > =========================================
  620. 17.68 s > Extracting 2 binaries and 1 linked path to /build/nextest-archive-s06re5
  621. 17.68 s > Extracted 8 files to /build/nextest-archive-s06re5 in 0.07s
  622. 17.68 s > ------------
  623. 17.68 s > Nextest run ID 753d5fab-d09b-4893-9d26-477fd007a6d8 with nextest profile: ci_gammaloop
  624. 17.68 s > Starting 135 tests across 2 binaries
  625. 17.68 s > ------------
  626. 17.68 s > Summary [ 0.073s] 135 tests run: 135 passed, 0 skipped
  627. 17.68 s >
  628. 17.68 s > ========== nextest test summary ==========
  629. 17.68 s > report: target/nextest/ci_gammaloop/junit.xml
  630. 17.68 s > tests: 135, failures: 0, errors: 0
  631. 17.68 s > No failing testcases found.
  632. 17.68 s > =========================================
  633. 17.68 s > Extracting 5 binaries and 2 linked paths to /build/nextest-archive-1HgFe8
  634. 17.68 s > Extracted 19 files to /build/nextest-archive-1HgFe8 in 0.18s
  635. 17.68 s > ------------
  636. 17.68 s > Nextest run ID 05098fa3-aeae-4b15-a4f6-e1c6fdc3ed4e with nextest profile: ci_gammaloop
  637. 17.68 s > Starting 25 tests across 5 binaries (1 test skipped via profile.ci_gammaloop.default-filter)
  638. 17.68 s > ------------
  639. 17.68 s > Summary [ 0.188s] 25 tests run: 25 passed, 1 skipped
  640. 17.68 s >
  641. 17.68 s > ========== nextest test summary ==========
  642. 17.68 s > report: target/nextest/ci_gammaloop/junit.xml
  643. 17.68 s > tests: 25, failures: 0, errors: 0
  644. 17.68 s > No failing testcases found.
  645. 17.68 s > =========================================
  646. 17.68 s > Extracting 2 binaries and 1 linked path to /build/nextest-archive-MMaNQB
  647. 17.68 s > Extracted 8 files to /build/nextest-archive-MMaNQB in 0.05s
  648. 17.68 s > ------------
  649. 17.68 s > Nextest run ID 9709566f-d5db-493b-bd9c-dcb237681ce5 with nextest profile: ci_gammaloop
  650. 17.68 s > Starting 1 test across 2 binaries
  651. 17.68 s > ------------
  652. 17.68 s > Summary [ 0.005s] 1 test run: 1 passed, 0 skipped
  653. 17.68 s >
  654. 17.68 s > ========== nextest test summary ==========
  655. 17.68 s > report: target/nextest/ci_gammaloop/junit.xml
  656. 17.68 s > tests: 1, failures: 0, errors: 0
  657. 17.68 s > No failing testcases found.
  658. 17.68 s > =========================================
  659. 17.68 s > Extracting 1 binary and 1 linked path to /build/nextest-archive-l9u5hc
  660. 17.68 s > Extracted 7 files to /build/nextest-archive-l9u5hc in 0.05s
  661. 17.68 s > ------------
  662. 17.68 s > Nextest run ID 2fe9008b-7bcd-44c2-9df9-1fd7b31e416a with nextest profile: ci_gammaloop
  663. 17.68 s > Starting 0 tests across 1 binary
  664. 17.68 s > ------------
  665. 17.68 s > Summary [ 0.000s] 0 tests run: 0 passed, 0 skipped
  666. 17.68 s >
  667. 17.68 s > ========== nextest test summary ==========
  668. 17.68 s > report: target/nextest/ci_gammaloop/junit.xml
  669. 17.68 s > tests: 0, failures: 0, errors: 0
  670. 17.68 s > No failing testcases found.
  671. 17.68 s > =========================================
  672. 17.68 s For full logs, run:
  673. 17.68 s nix log /nix/store/hk3irrympzq7agrqvi8g99r01gw6v0g3-gammaloop-nextest-spenso.drv
  674. 17.76 s [0 built (1 failed), 0.0Run failed.