test packages.x86_64-linux.nix-ci-check-gammaloop-nextest-spenso
0.14 s
$ /nix/store/9ypz3flqsrl5xl495mm8h645gadjsxi1-coreutils-9.11/bin/timeout --kill-after=15s 7200s /nix/store/23zk8sgzamrbmj1fday15szf7f2279s8-nix-2.34.7/bin/nix --extra-experimental-features nix-command --extra-experimental-features flakes flake clone git+https://github.com/alphal00p/gammaloop --dest /tmp/nix-ci-worker/stable-pwd/repo/
0.17 s
Cloning into '/tmp/nix-ci-worker/stable-pwd/repo'...
1.29 s
remote: Enumerating objects: 65262, done.
1.51 s
remote: Counting objects: 0% (1/7913)
remote: Counting objects: 1% (80/7913)
remote: Counting objects: 2% (159/7913)
remote: Counting objects: 3% (238/7913)
remote: Counting objects: 4% (317/7913)
remote: Counting objects: 5% (396/7913)
remote: Counting objects: 6% (475/7913)
remote: Counting objects: 7% (554/7913)
remote: Counting objects: 8% (634/7913)
remote: Counting objects: 9% (713/7913)
remote: Counting objects: 10% (792/7913)
remote: Counting objects: 11% (871/7913)
remote: Counting objects: 12% (950/7913)
remote: Counting objects: 13% (1029/7913)
remote: Counting objects: 14% (1108/7913)
remote: Counting objects: 15% (1187/7913)
remote: Counting objects: 16% (1267/7913)
remote: Counting objects: 17% (1346/7913)
remote: Counting objects: 18% (1425/7913)
remote: Counting objects: 19% (1504/7913)
remote: Counting objects: 20% (1583/7913)
remote: Counting objects: 21% (1662/7913)
remote: Counting objects: 22% (1741/7913)
remote: Counting objects: 23% (1820/7913)
remote: Counting objects: 24% (1900/7913)
remote: Counting objects: 25% (1979/7913)
remote: Counting objects: 26% (2058/7913)
remote: Counting objects: 27% (2137/7913)
remote: Counting objects: 28% (2216/7913)
remote: Counting objects: 29% (2295/7913)
remote: Counting objects: 30% (2374/7913)
remote: Counting objects: 31% (2454/7913)
remote: Counting objects: 32% (2533/7913)
remote: Counting objects: 33% (2612/7913)
remote: Counting objects: 34% (2691/7913)
remote: Counting objects: 35% (2770/7913)
remote: Counting objects: 36% (2849/7913)
remote: Counting objects: 37% (2928/7913)
remote: Counting objects: 38% (3007/7913)
remote: Counting objects: 39% (3087/7913)
remote: Counting objects: 40% (3166/7913)
remote: Counting objects: 41% (3245/7913)
remote: Counting objects: 42% (3324/7913)
remote: Counting objects: 43% (3403/7913)
remote: Counting objects: 44% (3482/7913)
remote: Counting objects: 45% (3561/7913)
remote: Counting objects: 46% (3640/7913)
remote: Counting objects: 47% (3720/7913)
remote: Counting objects: 48% (3799/7913)
remote: Counting objects: 49% (3878/7913)
remote: Counting objects: 50% (3957/7913)
remote: Counting objects: 51% (4036/7913)
remote: Counting objects: 52% (4115/7913)
remote: Counting objects: 53% (4194/7913)
remote: Counting objects: 54% (4274/7913)
remote: Counting objects: 55% (4353/7913)
remote: Counting objects: 56% (4432/7913)
remote: Counting objects: 57% (4511/7913)
remote: Counting objects: 58% (4590/7913)
remote: Counting objects: 59% (4669/7913)
remote: Counting objects: 60% (4748/7913)
remote: Counting objects: 61% (4827/7913)
remote: Counting objects: 62% (4907/7913)
remote: Counting objects: 63% (4986/7913)
remote: Counting objects: 64% (5065/7913)
remote: Counting objects: 65% (5144/7913)
remote: Counting objects: 66% (5223/7913)
remote: Counting objects: 67% (5302/7913)
remote: Counting objects: 68% (5381/7913)
remote: Counting objects: 69% (5460/7913)
remote: Counting objects: 70% (5540/7913)
remote: Counting objects: 71% (5619/7913)
remote: Counting objects: 72% (5698/7913)
remote: Counting objects: 73% (5777/7913)
remote: Counting objects: 74% (5856/7913)
remote: Counting objects: 75% (5935/7913)
remote: Counting objects: 76% (6014/7913)
remote: Counting objects: 77% (6094/7913)
remote: Counting objects: 78% (6173/7913)
remote: Counting objects: 79% (6252/7913)
remote: Counting objects: 80% (6331/7913)
remote: Counting objects: 81% (6410/7913)
remote: Counting objects: 82% (6489/7913)
remote: Counting objects: 83% (6568/7913)
remote: Counting objects: 84% (6647/7913)
remote: Counting objects: 85% (6727/7913)
remote: Counting objects: 86% (6806/7913)
remote: Counting objects: 87% (6885/7913)
remote: Counting objects: 88% (6964/7913)
remote: Counting objects: 89% (7043/7913)
remote: Counting objects: 90% (7122/7913)
remote: Counting objects: 91% (7201/7913)
remote: Counting objects: 92% (7280/7913)
remote: Counting objects: 93% (7360/7913)
remote: Counting objects: 94% (7439/7913)
remote: Counting objects: 95% (7518/7913)
remote: Counting objects: 96% (7597/7913)
remote: Counting objects: 97% (7676/7913)
remote: Counting objects: 98% (7755/7913)
remote: Counting objects: 99% (7834/7913)
remote: Counting objects: 100% (7913/7913)
remote: Counting objects: 100% (7913/7913), done.
2.90 s
remote: Compressing objects: 0% (1/1586)
remote: Compressing objects: 1% (16/1586)
remote: Compressing objects: 2% (32/1586)
remote: Compressing objects: 3% (48/1586)
remote: Compressing objects: 4% (64/1586)
remote: Compressing objects: 5% (80/1586)
remote: Compressing objects: 6% (96/1586)
remote: Compressing objects: 7% (112/1586)
remote: Compressing objects: 8% (127/1586)
remote: Compressing objects: 9% (143/1586)
remote: Compressing objects: 10% (159/1586)
remote: Compressing objects: 11% (175/1586)
remote: Compressing objects: 12% (191/1586)
remote: Compressing objects: 13% (207/1586)
remote: Compressing objects: 14% (223/1586)
remote: Compressing objects: 15% (238/1586)
remote: Compressing objects: 15% (251/1586)
remote: Compressing objects: 16% (254/1586)
remote: Compressing objects: 17% (270/1586)
remote: Compressing objects: 18% (286/1586)
remote: Compressing objects: 19% (302/1586)
remote: Compressing objects: 20% (318/1586)
remote: Compressing objects: 21% (334/1586)
remote: Compressing objects: 22% (349/1586)
remote: Compressing objects: 23% (365/1586)
remote: Compressing objects: 24% (381/1586)
remote: Compressing objects: 25% (397/1586)
remote: Compressing objects: 26% (413/1586)
remote: Compressing objects: 27% (429/1586)
remote: Compressing objects: 28% (445/1586)
remote: Compressing objects: 29% (460/1586)
remote: Compressing objects: 30% (476/1586)
remote: Compressing objects: 31% (492/1586)
remote: Compressing objects: 32% (508/1586)
remote: Compressing objects: 33% (524/1586)
remote: Compressing objects: 34% (540/1586)
remote: Compressing objects: 35% (556/1586)
remote: Compressing objects: 36% (571/1586)
remote: Compressing objects: 37% (587/1586)
remote: Compressing objects: 38% (603/1586)
remote: Compressing objects: 39% (619/1586)
remote: Compressing objects: 40% (635/1586)
remote: Compressing objects: 41% (651/1586)
remote: Compressing objects: 42% (667/1586)
remote: Compressing objects: 43% (682/1586)
remote: Compressing objects: 44% (698/1586)
remote: Compressing objects: 45% (714/1586)
remote: Compressing objects: 46% (730/1586)
remote: Compressing objects: 47% (746/1586)
remote: Compressing objects: 48% (762/1586)
remote: Compressing objects: 49% (778/1586)
remote: Compressing objects: 50% (793/1586)
remote: Compressing objects: 51% (809/1586)
remote: Compressing objects: 52% (825/1586)
remote: Compressing objects: 53% (841/1586)
remote: Compressing objects: 54% (857/1586)
remote: Compressing objects: 55% (873/1586)
remote: Compressing objects: 56% (889/1586)
remote: Compressing objects: 57% (905/1586)
remote: Compressing objects: 58% (920/1586)
remote: Compressing objects: 59% (936/1586)
remote: Compressing objects: 60% (952/1586)
remote: Compressing objects: 61% (968/1586)
remote: Compressing objects: 62% (984/1586)
remote: Compressing objects: 63% (1000/1586)
remote: Compressing objects: 64% (1016/1586)
remote: Compressing objects: 65% (1031/1586)
remote: Compressing objects: 66% (1047/1586)
remote: Compressing objects: 67% (1063/1586)
remote: Compressing objects: 68% (1079/1586)
remote: Compressing objects: 69% (1095/1586)
remote: Compressing objects: 70% (1111/1586)
remote: Compressing objects: 71% (1127/1586)
remote: Compressing objects: 72% (1142/1586)
remote: Compressing objects: 73% (1158/1586)
remote: Compressing objects: 74% (1174/1586)
remote: Compressing objects: 75% (1190/1586)
remote: Compressing objects: 76% (1206/1586)
remote: Compressing objects: 77% (1222/1586)
remote: Compressing objects: 78% (1238/1586)
remote: Compressing objects: 79% (1253/1586)
remote: Compressing objects: 80% (1269/1586)
remote: Compressing objects: 81% (1285/1586)
remote: Compressing objects: 82% (1301/1586)
remote: Compressing objects: 83% (1317/1586)
remote: Compressing objects: 84% (1333/1586)
remote: Compressing objects: 85% (1349/1586)
remote: Compressing objects: 86% (1364/1586)
remote: Compressing objects: 87% (1380/1586)
remote: Compressing objects: 88% (1396/1586)
remote: Compressing objects: 89% (1412/1586)
remote: Compressing objects: 90% (1428/1586)
remote: Compressing objects: 91% (1444/1586)
remote: Compressing objects: 92% (1460/1586)
remote: Compressing objects: 93% (1475/1586)
remote: Compressing objects: 94% (1491/1586)
remote: Compressing objects: 95% (1507/1586)
remote: Compressing objects: 96% (1523/1586)
remote: Compressing objects: 97% (1539/1586)
remote: Compressing objects: 98% (1555/1586)
remote: Compressing objects: 99% (1571/1586)
remote: Compressing objects: 100% (1586/1586)
remote: Compressing objects: 100% (1586/1586), done.
5.67 s
Receiving objects: 0% (1/65262)
Receiving objects: 1% (653/65262)
Receiving objects: 2% (1306/65262)
Receiving objects: 3% (1958/65262)
Receiving objects: 4% (2611/65262)
Receiving objects: 5% (3264/65262)
Receiving objects: 6% (3916/65262)
Receiving objects: 7% (4569/65262)
Receiving objects: 8% (5221/65262)
Receiving objects: 9% (5874/65262)
Receiving objects: 10% (6527/65262)
Receiving objects: 11% (7179/65262)
Receiving objects: 12% (7832/65262), 12.56 MiB | 25.10 MiB/s
Receiving objects: 13% (8485/65262), 12.56 MiB | 25.10 MiB/s
Receiving objects: 14% (9137/65262), 12.56 MiB | 25.10 MiB/s
Receiving objects: 15% (9790/65262), 12.56 MiB | 25.10 MiB/s
Receiving objects: 16% (10442/65262), 12.56 MiB | 25.10 MiB/s
Receiving objects: 17% (11095/65262), 12.56 MiB | 25.10 MiB/s
Receiving objects: 18% (11748/65262), 12.56 MiB | 25.10 MiB/s
Receiving objects: 19% (12400/65262), 12.56 MiB | 25.10 MiB/s
Receiving objects: 20% (13053/65262), 12.56 MiB | 25.10 MiB/s
Receiving objects: 21% (13706/65262), 12.56 MiB | 25.10 MiB/s
Receiving objects: 22% (14358/65262), 12.56 MiB | 25.10 MiB/s
Receiving objects: 23% (15011/65262), 12.56 MiB | 25.10 MiB/s
Receiving objects: 24% (15663/65262), 12.56 MiB | 25.10 MiB/s
Receiving objects: 25% (16316/65262), 12.56 MiB | 25.10 MiB/s
Receiving objects: 26% (16969/65262), 12.56 MiB | 25.10 MiB/s
Receiving objects: 27% (17621/65262), 12.56 MiB | 25.10 MiB/s
Receiving objects: 28% (18274/65262), 12.56 MiB | 25.10 MiB/s
Receiving objects: 29% (18926/65262), 12.56 MiB | 25.10 MiB/s
Receiving objects: 30% (19579/65262), 12.56 MiB | 25.10 MiB/s
Receiving objects: 31% (20232/65262), 12.56 MiB | 25.10 MiB/s
Receiving objects: 32% (20884/65262), 12.56 MiB | 25.10 MiB/s
Receiving objects: 33% (21537/65262), 12.56 MiB | 25.10 MiB/s
Receiving objects: 34% (22190/65262), 12.56 MiB | 25.10 MiB/s
Receiving objects: 35% (22842/65262), 12.56 MiB | 25.10 MiB/s
Receiving objects: 36% (23495/65262), 12.56 MiB | 25.10 MiB/s
Receiving objects: 37% (24147/65262), 12.56 MiB | 25.10 MiB/s
Receiving objects: 38% (24800/65262), 12.56 MiB | 25.10 MiB/s
Receiving objects: 39% (25453/65262), 12.56 MiB | 25.10 MiB/s
Receiving objects: 40% (26105/65262), 12.56 MiB | 25.10 MiB/s
Receiving objects: 41% (26758/65262), 12.56 MiB | 25.10 MiB/s
Receiving objects: 42% (27411/65262), 12.56 MiB | 25.10 MiB/s
Receiving objects: 43% (28063/65262), 12.56 MiB | 25.10 MiB/s
Receiving objects: 44% (28716/65262), 12.56 MiB | 25.10 MiB/s
Receiving objects: 45% (29368/65262), 12.56 MiB | 25.10 MiB/s
Receiving objects: 46% (30021/65262), 12.56 MiB | 25.10 MiB/s
Receiving objects: 47% (30674/65262), 12.56 MiB | 25.10 MiB/s
Receiving objects: 48% (31326/65262), 12.56 MiB | 25.10 MiB/s
Receiving objects: 49% (31979/65262), 12.56 MiB | 25.10 MiB/s
Receiving objects: 49% (31994/65262), 29.71 MiB | 29.70 MiB/s
Receiving objects: 50% (32631/65262), 29.71 MiB | 29.70 MiB/s
Receiving objects: 51% (33284/65262), 29.71 MiB | 29.70 MiB/s
Receiving objects: 52% (33937/65262), 29.71 MiB | 29.70 MiB/s
Receiving objects: 53% (34589/65262), 29.71 MiB | 29.70 MiB/s
Receiving objects: 54% (35242/65262), 29.71 MiB | 29.70 MiB/s
Receiving objects: 55% (35895/65262), 29.71 MiB | 29.70 MiB/s
Receiving objects: 56% (36547/65262), 29.71 MiB | 29.70 MiB/s
Receiving objects: 57% (37200/65262), 29.71 MiB | 29.70 MiB/s
Receiving objects: 58% (37852/65262), 29.71 MiB | 29.70 MiB/s
Receiving objects: 59% (38505/65262), 29.71 MiB | 29.70 MiB/s
Receiving objects: 60% (39158/65262), 29.71 MiB | 29.70 MiB/s
Receiving objects: 61% (39810/65262), 45.59 MiB | 30.38 MiB/s
Receiving objects: 62% (40463/65262), 45.59 MiB | 30.38 MiB/s
Receiving objects: 63% (41116/65262), 45.59 MiB | 30.38 MiB/s
Receiving objects: 64% (41768/65262), 45.59 MiB | 30.38 MiB/s
Receiving objects: 65% (42421/65262), 45.59 MiB | 30.38 MiB/s
Receiving objects: 66% (43073/65262), 45.59 MiB | 30.38 MiB/s
Receiving objects: 67% (43726/65262), 45.59 MiB | 30.38 MiB/s
Receiving objects: 68% (44379/65262), 45.59 MiB | 30.38 MiB/s
Receiving objects: 69% (45031/65262), 45.59 MiB | 30.38 MiB/s
Receiving objects: 70% (45684/65262), 45.59 MiB | 30.38 MiB/s
Receiving objects: 71% (46337/65262), 45.59 MiB | 30.38 MiB/s
Receiving objects: 72% (46989/65262), 45.59 MiB | 30.38 MiB/s
Receiving objects: 73% (47642/65262), 45.59 MiB | 30.38 MiB/s
Receiving objects: 74% (48294/65262), 45.59 MiB | 30.38 MiB/s
Receiving objects: 74% (48916/65262), 62.47 MiB | 31.20 MiB/s
Receiving objects: 75% (48947/65262), 62.47 MiB | 31.20 MiB/s
Receiving objects: 76% (49600/65262), 62.47 MiB | 31.20 MiB/s
Receiving objects: 77% (50252/65262), 62.47 MiB | 31.20 MiB/s
Receiving objects: 78% (50905/65262), 62.47 MiB | 31.20 MiB/s
Receiving objects: 79% (51557/65262), 62.47 MiB | 31.20 MiB/s
Receiving objects: 80% (52210/65262), 62.47 MiB | 31.20 MiB/s
Receiving objects: 81% (52863/65262), 62.47 MiB | 31.20 MiB/s
Receiving objects: 82% (53515/65262), 62.47 MiB | 31.20 MiB/s
Receiving objects: 83% (54168/65262), 62.47 MiB | 31.20 MiB/s
Receiving objects: 84% (54821/65262), 79.14 MiB | 31.64 MiB/s
Receiving objects: 85% (55473/65262), 79.14 MiB | 31.64 MiB/s
Receiving objects: 86% (56126/65262), 79.14 MiB | 31.64 MiB/s
Receiving objects: 87% (56778/65262), 79.14 MiB | 31.64 MiB/s
Receiving objects: 88% (57431/65262), 79.14 MiB | 31.64 MiB/s
Receiving objects: 89% (58084/65262), 79.14 MiB | 31.64 MiB/s
Receiving objects: 90% (58736/65262), 79.14 MiB | 31.64 MiB/s
Receiving objects: 91% (59389/65262), 79.14 MiB | 31.64 MiB/s
Receiving objects: 92% (60042/65262), 79.14 MiB | 31.64 MiB/s
Receiving objects: 93% (60694/65262), 79.14 MiB | 31.64 MiB/s
Receiving objects: 94% (61347/65262), 79.14 MiB | 31.64 MiB/s
Receiving objects: 95% (61999/65262), 79.14 MiB | 31.64 MiB/s
Receiving objects: 96% (62652/65262), 79.14 MiB | 31.64 MiB/s
Receiving objects: 97% (63305/65262), 79.14 MiB | 31.64 MiB/s
Receiving objects: 98% (63957/65262), 79.14 MiB | 31.64 MiB/s
Receiving objects: 99% (64610/65262), 79.14 MiB | 31.64 MiB/s
remote: Total 65262 (delta 6862), reused 6407 (delta 6318), pack-reused 57349 (from 1)
5.73 s
Receiving objects: 100% (65262/65262), 79.14 MiB | 31.64 MiB/s
Receiving objects: 100% (65262/65262), 87.60 MiB | 31.88 MiB/s, done.
6.32 s
Resolving deltas: 0% (0/45980)
Resolving deltas: 1% (460/45980)
Resolving deltas: 2% (920/45980)
Resolving deltas: 3% (1383/45980)
Resolving deltas: 4% (1840/45980)
Resolving deltas: 5% (2299/45980)
Resolving deltas: 6% (2759/45980)
Resolving deltas: 7% (3219/45980)
Resolving deltas: 8% (3680/45980)
Resolving deltas: 9% (4139/45980)
Resolving deltas: 10% (4598/45980)
Resolving deltas: 11% (5058/45980)
Resolving deltas: 12% (5518/45980)
Resolving deltas: 13% (5978/45980)
Resolving deltas: 14% (6438/45980)
Resolving deltas: 15% (6897/45980)
Resolving deltas: 16% (7357/45980)
Resolving deltas: 17% (7817/45980)
Resolving deltas: 18% (8279/45980)
Resolving deltas: 19% (8737/45980)
Resolving deltas: 20% (9196/45980)
Resolving deltas: 21% (9656/45980)
Resolving deltas: 22% (10116/45980)
Resolving deltas: 23% (10578/45980)
Resolving deltas: 24% (11036/45980)
Resolving deltas: 25% (11498/45980)
Resolving deltas: 26% (11955/45980)
Resolving deltas: 27% (12417/45980)
Resolving deltas: 28% (12875/45980)
Resolving deltas: 29% (13335/45980)
Resolving deltas: 30% (13794/45980)
Resolving deltas: 31% (14254/45980)
Resolving deltas: 32% (14714/45980)
Resolving deltas: 33% (15174/45980)
Resolving deltas: 34% (15634/45980)
Resolving deltas: 35% (16093/45980)
Resolving deltas: 36% (16553/45980)
Resolving deltas: 37% (17013/45980)
Resolving deltas: 38% (17473/45980)
Resolving deltas: 39% (17933/45980)
Resolving deltas: 40% (18395/45980)
Resolving deltas: 41% (18852/45980)
Resolving deltas: 42% (19312/45980)
Resolving deltas: 43% (19772/45980)
Resolving deltas: 44% (20232/45980)
Resolving deltas: 45% (20691/45980)
Resolving deltas: 46% (21151/45980)
Resolving deltas: 47% (21611/45980)
Resolving deltas: 48% (22071/45980)
Resolving deltas: 49% (22531/45980)
Resolving deltas: 50% (22990/45980)
Resolving deltas: 51% (23451/45980)
Resolving deltas: 52% (23910/45980)
Resolving deltas: 53% (24370/45980)
Resolving deltas: 54% (24831/45980)
Resolving deltas: 55% (25291/45980)
Resolving deltas: 56% (25749/45980)
Resolving deltas: 57% (26209/45980)
Resolving deltas: 58% (26670/45980)
Resolving deltas: 59% (27130/45980)
Resolving deltas: 60% (27588/45980)
Resolving deltas: 61% (28049/45980)
Resolving deltas: 62% (28508/45980)
Resolving deltas: 63% (28968/45980)
Resolving deltas: 64% (29428/45980)
Resolving deltas: 65% (29887/45980)
Resolving deltas: 66% (30347/45980)
Resolving deltas: 67% (30807/45980)
Resolving deltas: 68% (31268/45980)
Resolving deltas: 69% (31727/45980)
Resolving deltas: 70% (32186/45980)
Resolving deltas: 71% (32646/45980)
Resolving deltas: 72% (33106/45980)
Resolving deltas: 73% (33566/45980)
Resolving deltas: 74% (34026/45980)
Resolving deltas: 75% (34486/45980)
Resolving deltas: 76% (34945/45980)
Resolving deltas: 77% (35405/45980)
Resolving deltas: 78% (35865/45980)
Resolving deltas: 79% (36325/45980)
Resolving deltas: 80% (36784/45980)
Resolving deltas: 81% (37245/45980)
Resolving deltas: 82% (37704/45980)
Resolving deltas: 83% (38164/45980)
Resolving deltas: 84% (38624/45980)
Resolving deltas: 85% (39083/45980)
Resolving deltas: 86% (39543/45980)
Resolving deltas: 87% (40003/45980)
Resolving deltas: 88% (40463/45980)
Resolving deltas: 89% (40924/45980)
Resolving deltas: 90% (41382/45980)
Resolving deltas: 91% (41842/45980)
Resolving deltas: 92% (42302/45980)
Resolving deltas: 93% (42762/45980)
Resolving deltas: 94% (43225/45980)
Resolving deltas: 95% (43681/45980)
Resolving deltas: 96% (44141/45980)
Resolving deltas: 97% (44601/45980)
Resolving deltas: 98% (45061/45980)
Resolving deltas: 99% (45521/45980)
Resolving deltas: 100% (45980/45980)
Resolving deltas: 100% (45980/45980), done.
6.58 s
Fetching commit 7d96a79602498c8c52cad067e3ea600af9a26e05 for vakint_rustred ...
6.58 s
$ /nix/store/bcnisk3ydfgv26v2gw3zlky24g00yww2-git-2.54.0/bin/git fetch origin 7d96a79602498c8c52cad067e3ea600af9a26e05
7.05 s
From https://github.com/alphal00p/gammaloop
7.05 s
* branch 7d96a79602498c8c52cad067e3ea600af9a26e05 -> FETCH_HEAD
7.06 s
$ /nix/store/9ypz3flqsrl5xl495mm8h645gadjsxi1-coreutils-9.11/bin/timeout --kill-after=15s 7200s /nix/store/bcnisk3ydfgv26v2gw3zlky24g00yww2-git-2.54.0/bin/git -c advice.detachedHead=false checkout 7d96a79602498c8c52cad067e3ea600af9a26e05
7.21 s
HEAD is now at 7d96a796 add rustred scalar reduction through two loops
7.21 s
$ /nix/store/9ypz3flqsrl5xl495mm8h645gadjsxi1-coreutils-9.11/bin/timeout --kill-after=15s 7200s /nix/store/23zk8sgzamrbmj1fday15szf7f2279s8-nix-2.34.7/bin/nix --extra-experimental-features nix-command --extra-experimental-features flakes --log-format internal-json run .#packages.x86_64-linux.nix-ci-check-gammaloop-nextest-spenso --print-build-logs
11.57 s
11.69 s
Downloading cached gammaloop-nextest-binaries-spenso-idenso from https://cache.nix-ci.com
11.74 s
Downloading cached gammaloop-nextest-binaries-spenso-spenso from https://cache.nix-ci.com
11.74 s
Downloading cached gammaloop-nextest-binaries-spenso-spenso-hep-lib from https://cache.nix-ci.com
11.74 s
Downloading cached gammaloop-nextest-binaries-spenso-spenso-macros from https://cache.nix-ci.com
11.74 s
Downloading cached gammaloop-nextest-binaries-spenso-symbolica-utils from https://cache.nix-ci.com
11.98 s
Downloaded cached gammaloop-nextest-binaries-spenso-spenso-macros (6.5 MiB) in 244ms
11.98 s
Progress: 0 of 1 built, 1 of 7 downloaded from cache (4 downloading)
12.09 s
Downloaded cached gammaloop-nextest-binaries-spenso-spenso (10.2 MiB) in 351ms
12.09 s
Progress: 0 of 1 built, 2 of 7 downloaded from cache (3 downloading)
12.39 s
Downloaded cached gammaloop-nextest-binaries-spenso-symbolica-utils (6.3 MiB) in 655ms
12.39 s
Progress: 0 of 1 built, 3 of 7 downloaded from cache (2 downloading)
12.66 s
Downloaded cached gammaloop-nextest-binaries-spenso-idenso (29.3 MiB) in 969ms
12.66 s
Progress: 0 of 1 built, 4 of 7 downloaded from cache (1 downloading)
12.72 s
Downloaded cached gammaloop-nextest-binaries-spenso-spenso-hep-lib (34 MiB) in 982ms
12.72 s
Progress: 0 of 1 built, 5 of 7 downloaded from cache
12.72 s
Downloading cached gammaloop-nextest-binaries-spenso from https://cache.nix-ci.com
12.75 s
Downloaded cached gammaloop-nextest-binaries-spenso (1920 B) in 28ms
12.75 s
Progress: 0 of 1 built, 6 of 7 downloaded from cache
12.75 s
Downloading cached nix-ci-check-gammaloop-nextest-spenso from https://cache.nix-ci.com
12.78 s
Downloaded cached nix-ci-check-gammaloop-nextest-spenso (1016 B) in 28ms
12.78 s
Progress: 0 of 1 built, 7 of 7 downloaded from cache
17.38 s
evaluating derivation 'g
copying '/nix/store/wz14
evaluating derivation 'g
copying '/nix/store/wz14
evaluating derivation 'g
copying '/nix/store/wz14
evaluating derivation 'g
querying gammaloop-nexte
[0 /1 built, 0.0 KiB DL]
[1 /0 /1 built, 0.0 KiB DLgammaloop-nextest-spenso> Extracting 5 binaries and 2 linked paths to /build/nextest-archive-sLARIL
17.54 s
gammaloop-nextest-spenso> Extracted 19 files to /build/nextest-archive-sLARIL in 0.16s
17.55 s
gammaloop-nextest-spenso> ------------
17.55 s
gammaloop-nextest-spenso> Nextest run ID 083148e9-d592-4409-aae5-f59c75ba90af with nextest profile: ci_gammaloop
17.55 s
gammaloop-nextest-spenso> Starting 224 tests across 5 binaries (26 tests skipped , including 2 tests via profile.ci_gammaloop.default-filter )
17.64 s
gammaloop-nextest-spenso> FAIL [ 0.011s] ( 44/224) idenso color::test::form_reference :: metric_contraction_respects_antisymmetric_normalization
17.64 s
gammaloop-nextest-spenso> stdout ---
17.64 s
gammaloop-nextest-spenso>
17.64 s
gammaloop-nextest-spenso> running 1 test
17.64 s
gammaloop-nextest-spenso> test color::test::form_reference::metric_contraction_respects_antisymmetric_normalization ... FAILED
17.64 s
gammaloop-nextest-spenso>
17.64 s
gammaloop-nextest-spenso> failures:
17.64 s
gammaloop-nextest-spenso>
17.64 s
gammaloop-nextest-spenso> failures:
17.64 s
gammaloop-nextest-spenso> color::test::form_reference::metric_contraction_respects_antisymmetric_normalization
17.64 s
gammaloop-nextest-spenso>
17.64 s
gammaloop-nextest-spenso> test result: FAILED. 0 passed; 1 failed; 0 ignored; 0 measured; 240 filtered out; finished in 0.00s
17.64 s
gammaloop-nextest-spenso>
17.64 s
gammaloop-nextest-spenso> stderr ---
17.64 s
gammaloop-nextest-spenso>
17.64 s
gammaloop-nextest-spenso> thread 'color::test::form_reference::metric_contraction_respects_antisymmetric_normalization' (328) panicked at crates/idenso/src/color/test/form_reference.rs:171:5:
17.64 s
gammaloop-nextest-spenso> assertion `left == right` failed
17.64 s
gammaloop-nextest-spenso> left: "-1*f(coad(8,standalone_metric_j),coad(8,standalone_metric_s),coad(8,standalone_metric_u))"
17.64 s
gammaloop-nextest-spenso> right: "f(coad(8,standalone_metric_j),coad(8,standalone_metric_s),coad(8,standalone_metric_u))"
17.64 s
gammaloop-nextest-spenso> stack backtrace:
17.64 s
gammaloop-nextest-spenso> 0: __rustc::rust_begin_unwind
17.64 s
gammaloop-nextest-spenso> 1: core::panicking::panic_fmt
17.64 s
gammaloop-nextest-spenso> 2: core::panicking::assert_failed_inner
17.64 s
gammaloop-nextest-spenso> 3: core::panicking::assert_failed::<alloc::string::String, alloc::string::String>
17.64 s
gammaloop-nextest-spenso> 4: idenso::color::test::form_reference::metric_contraction_respects_antisymmetric_normalization
17.64 s
gammaloop-nextest-spenso> 5: <idenso::color::test::form_reference::metric_contraction_respects_antisymmetric_normalization::{closure#0} as core::ops::function::FnOnce<()>>::call_once
17.64 s
gammaloop-nextest-spenso> note: Some details are omitted, run with `RUST_BACKTRACE=full` for a verbose backtrace.
17.64 s
gammaloop-nextest-spenso>
17.94 s
gammaloop-nextest-spenso> FAIL [ 0.113s] (221/224) idenso tensor::tests::parsing :: infinite_execution
17.94 s
gammaloop-nextest-spenso> stdout ---
17.94 s
gammaloop-nextest-spenso>
17.94 s
gammaloop-nextest-spenso> running 1 test
17.94 s
gammaloop-nextest-spenso> ━━━━━━━━━━━━━━━━━━━━━━━━━━━━━━━ Snapshot Summary ━━━━━━━━━━━━━━━━━━━━━━━━━━━━━━━
17.94 s
gammaloop-nextest-spenso> Snapshot: infinite_execution
17.94 s
gammaloop-nextest-spenso> Source: crates/idenso/src/tensor/tests/parsing.rs:910
17.94 s
gammaloop-nextest-spenso> ────────────────────────────────────────────────────────────────────────────────
17.94 s
gammaloop-nextest-spenso> Expression: net_iter.snapshot_dot()
17.94 s
gammaloop-nextest-spenso> ────────────────────────────────────────────────────────────────────────────────
17.94 s
gammaloop-nextest-spenso> -old snapshot
17.94 s
gammaloop-nextest-spenso> +new results
17.94 s
gammaloop-nextest-spenso> ────────────┬───────────────────────────────────────────────────────────────────
17.94 s
gammaloop-nextest-spenso> 8 8 │ 0:0:s -> ext0 [id=0 color="red"];
17.94 s
gammaloop-nextest-spenso> 9 9 │ ext1 [style=invis];
17.94 s
gammaloop-nextest-spenso> 10 10 │ 0:5:s -> ext1 [id=1 dir=none color="red" label="mink4|l_0"];
17.94 s
gammaloop-nextest-spenso> 11 11 │ ext2 [style=invis];
17.94 s
gammaloop-nextest-spenso> 12 │- 0:4:s -> ext2 [id=2 dir=none color="red" label="bis4|l_2"];
17.94 s
gammaloop-nextest-spenso> 12 │+ 0:3:s -> ext2 [id=2 dir=none color="red" label="mink4|l_1"];
17.94 s
gammaloop-nextest-spenso> 13 13 │ ext3 [style=invis];
17.94 s
gammaloop-nextest-spenso> 14 │- 0:3:s -> ext3 [id=3 dir=none color="red" label="bis4|l_3"];
17.94 s
gammaloop-nextest-spenso> 14 │+ 0:1:s -> ext3 [id=3 dir=none color="red" label="bis4|l_2"];
17.94 s
gammaloop-nextest-spenso> 15 15 │ ext4 [style=invis];
17.94 s
gammaloop-nextest-spenso> 16 │- 0:1:s -> ext4 [id=4 dir=none color="red" label="mink4|l_1"];
17.94 s
gammaloop-nextest-spenso> 16 │+ 0:2:s -> ext4 [id=4 dir=none color="red" label="mink4|l_4"];
17.94 s
gammaloop-nextest-spenso> 17 17 │ ext5 [style=invis];
17.94 s
gammaloop-nextest-spenso> 18 │- 0:2:s -> ext5 [id=5 dir=none color="red" label="mink4|l_4"];
17.94 s
gammaloop-nextest-spenso> 18 │+ 0:4:s -> ext5 [id=5 dir=none color="red" label="bis4|l_3"];
17.94 s
gammaloop-nextest-spenso> 19 19 │ }
17.94 s
gammaloop-nextest-spenso> ────────────┴───────────────────────────────────────────────────────────────────
17.94 s
gammaloop-nextest-spenso> To update snapshots run `cargo insta review`
17.94 s
gammaloop-nextest-spenso> Stopped on the first failure. Run `cargo insta test` to run all snapshots.
17.94 s
gammaloop-nextest-spenso> test tensor::tests::parsing::infinite_execution ... FAILED
17.94 s
gammaloop-nextest-spenso>
17.94 s
gammaloop-nextest-spenso> failures:
17.94 s
gammaloop-nextest-spenso>
17.94 s
gammaloop-nextest-spenso> failures:
17.94 s
gammaloop-nextest-spenso> tensor::tests::parsing::infinite_execution
17.94 s
gammaloop-nextest-spenso>
17.94 s
gammaloop-nextest-spenso> test result: FAILED. 0 passed; 1 failed; 0 ignored; 0 measured; 240 filtered out; finished in 0.11s
17.94 s
gammaloop-nextest-spenso>
17.94 s
gammaloop-nextest-spenso> stderr ---
17.94 s
gammaloop-nextest-spenso>
17.94 s
gammaloop-nextest-spenso> thread 'tensor::tests::parsing::infinite_execution' (849) panicked at /nix/store/qfja7nrd2p2n5iyvhzfjypcarnhpb7g4-vendor-cargo-deps/c19b7c6f923b580ac259164a89f2577984ad5ab09ee9d583b888f934adbbe8d0/insta-1.47.2/src/runtime.rs:719:13:
17.94 s
gammaloop-nextest-spenso> snapshot assertion for 'infinite_execution' failed in line 910
17.94 s
gammaloop-nextest-spenso> stack backtrace:
17.94 s
gammaloop-nextest-spenso> 0: __rustc::rust_begin_unwind
17.94 s
gammaloop-nextest-spenso> 1: core::panicking::panic_fmt
17.94 s
gammaloop-nextest-spenso> 2: insta::runtime::assert_snapshot
17.94 s
gammaloop-nextest-spenso> 3: idenso::tensor::tests::parsing::infinite_execution
17.94 s
gammaloop-nextest-spenso> 4: <idenso::tensor::tests::parsing::infinite_execution::{closure#0} as core::ops::function::FnOnce<()>>::call_once
17.94 s
gammaloop-nextest-spenso> note: Some details are omitted, run with `RUST_BACKTRACE=full` for a verbose backtrace.
17.94 s
gammaloop-nextest-spenso>
19.09 s
gammaloop-nextest-spenso> ------------
19.09 s
gammaloop-nextest-spenso> Summary [ 1.541s] 224 tests run: 222 passed , 2 failed , 26 skipped
19.09 s
gammaloop-nextest-spenso> FAIL [ 0.011s] ( 44/224) idenso color::test::form_reference :: metric_contraction_respects_antisymmetric_normalization
19.09 s
gammaloop-nextest-spenso> stdout ---
19.09 s
gammaloop-nextest-spenso>
19.09 s
gammaloop-nextest-spenso> running 1 test
19.09 s
gammaloop-nextest-spenso> test color::test::form_reference::metric_contraction_respects_antisymmetric_normalization ... FAILED
19.09 s
gammaloop-nextest-spenso>
19.09 s
gammaloop-nextest-spenso> failures:
19.09 s
gammaloop-nextest-spenso>
19.09 s
gammaloop-nextest-spenso> failures:
19.09 s
gammaloop-nextest-spenso> color::test::form_reference::metric_contraction_respects_antisymmetric_normalization
19.09 s
gammaloop-nextest-spenso>
19.09 s
gammaloop-nextest-spenso> test result: FAILED. 0 passed; 1 failed; 0 ignored; 0 measured; 240 filtered out; finished in 0.00s
19.09 s
gammaloop-nextest-spenso>
19.09 s
gammaloop-nextest-spenso> stderr ---
19.09 s
gammaloop-nextest-spenso>
19.09 s
gammaloop-nextest-spenso> thread 'color::test::form_reference::metric_contraction_respects_antisymmetric_normalization' (328) panicked at crates/idenso/src/color/test/form_reference.rs:171:5:
19.09 s
gammaloop-nextest-spenso> assertion `left == right` failed
19.09 s
gammaloop-nextest-spenso> left: "-1*f(coad(8,standalone_metric_j),coad(8,standalone_metric_s),coad(8,standalone_metric_u))"
19.09 s
gammaloop-nextest-spenso> right: "f(coad(8,standalone_metric_j),coad(8,standalone_metric_s),coad(8,standalone_metric_u))"
19.09 s
gammaloop-nextest-spenso> stack backtrace:
19.09 s
gammaloop-nextest-spenso> 0: __rustc::rust_begin_unwind
19.09 s
gammaloop-nextest-spenso> 1: core::panicking::panic_fmt
19.09 s
gammaloop-nextest-spenso> 2: core::panicking::assert_failed_inner
19.09 s
gammaloop-nextest-spenso> 3: core::panicking::assert_failed::<alloc::string::String, alloc::string::String>
19.09 s
gammaloop-nextest-spenso> 4: idenso::color::test::form_reference::metric_contraction_respects_antisymmetric_normalization
19.09 s
gammaloop-nextest-spenso> 5: <idenso::color::test::form_reference::metric_contraction_respects_antisymmetric_normalization::{closure#0} as core::ops::function::FnOnce<()>>::call_once
19.09 s
gammaloop-nextest-spenso> note: Some details are omitted, run with `RUST_BACKTRACE=full` for a verbose backtrace.
19.09 s
gammaloop-nextest-spenso>
19.09 s
gammaloop-nextest-spenso> FAIL [ 0.113s] (221/224) idenso tensor::tests::parsing :: infinite_execution
19.09 s
gammaloop-nextest-spenso> stdout ---
19.09 s
gammaloop-nextest-spenso>
19.09 s
gammaloop-nextest-spenso> running 1 test
19.09 s
gammaloop-nextest-spenso> ━━━━━━━━━━━━━━━━━━━━━━━━━━━━━━━ Snapshot Summary ━━━━━━━━━━━━━━━━━━━━━━━━━━━━━━━
19.09 s
gammaloop-nextest-spenso> Snapshot: infinite_execution
19.09 s
gammaloop-nextest-spenso> Source: crates/idenso/src/tensor/tests/parsing.rs:910
19.09 s
gammaloop-nextest-spenso> ────────────────────────────────────────────────────────────────────────────────
19.09 s
gammaloop-nextest-spenso> Expression: net_iter.snapshot_dot()
19.09 s
gammaloop-nextest-spenso> ────────────────────────────────────────────────────────────────────────────────
19.09 s
gammaloop-nextest-spenso> -old snapshot
19.09 s
gammaloop-nextest-spenso> +new results
19.09 s
gammaloop-nextest-spenso> ────────────┬───────────────────────────────────────────────────────────────────
19.09 s
gammaloop-nextest-spenso> 8 8 │ 0:0:s -> ext0 [id=0 color="red"];
19.09 s
gammaloop-nextest-spenso> 9 9 │ ext1 [style=invis];
19.09 s
gammaloop-nextest-spenso> 10 10 │ 0:5:s -> ext1 [id=1 dir=none color="red" label="mink4|l_0"];
19.09 s
gammaloop-nextest-spenso> 11 11 │ ext2 [style=invis];
19.09 s
gammaloop-nextest-spenso> 12 │- 0:4:s -> ext2 [id=2 dir=none color="red" label="bis4|l_2"];
19.09 s
gammaloop-nextest-spenso> 12 │+ 0:3:s -> ext2 [id=2 dir=none color="red" label="mink4|l_1"];
19.09 s
gammaloop-nextest-spenso> 13 13 │ ext3 [style=invis];
19.09 s
gammaloop-nextest-spenso> 14 │- 0:3:s -> ext3 [id=3 dir=none color="red" label="bis4|l_3"];
19.09 s
gammaloop-nextest-spenso> 14 │+ 0:1:s -> ext3 [id=3 dir=none color="red" label="bis4|l_2"];
19.09 s
gammaloop-nextest-spenso> 15 15 │ ext4 [style=invis];
19.09 s
gammaloop-nextest-spenso> 16 │- 0:1:s -> ext4 [id=4 dir=none color="red" label="mink4|l_1"];
19.09 s
gammaloop-nextest-spenso> 16 │+ 0:2:s -> ext4 [id=4 dir=none color="red" label="mink4|l_4"];
19.09 s
gammaloop-nextest-spenso> 17 17 │ ext5 [style=invis];
19.09 s
gammaloop-nextest-spenso> 18 │- 0:2:s -> ext5 [id=5 dir=none color="red" label="mink4|l_4"];
19.09 s
gammaloop-nextest-spenso> 18 │+ 0:4:s -> ext5 [id=5 dir=none color="red" label="bis4|l_3"];
19.09 s
gammaloop-nextest-spenso> 19 19 │ }
19.09 s
gammaloop-nextest-spenso> ────────────┴───────────────────────────────────────────────────────────────────
19.09 s
gammaloop-nextest-spenso> To update snapshots run `cargo insta review`
19.09 s
gammaloop-nextest-spenso> Stopped on the first failure. Run `cargo insta test` to run all snapshots.
19.09 s
gammaloop-nextest-spenso> test tensor::tests::parsing::infinite_execution ... FAILED
19.09 s
gammaloop-nextest-spenso>
19.09 s
gammaloop-nextest-spenso> failures:
19.09 s
gammaloop-nextest-spenso>
19.09 s
gammaloop-nextest-spenso> failures:
19.09 s
gammaloop-nextest-spenso> tensor::tests::parsing::infinite_execution
19.09 s
gammaloop-nextest-spenso>
19.09 s
gammaloop-nextest-spenso> test result: FAILED. 0 passed; 1 failed; 0 ignored; 0 measured; 240 filtered out; finished in 0.11s
19.09 s
gammaloop-nextest-spenso>
19.09 s
gammaloop-nextest-spenso> stderr ---
19.09 s
gammaloop-nextest-spenso>
19.09 s
gammaloop-nextest-spenso> thread 'tensor::tests::parsing::infinite_execution' (849) panicked at /nix/store/qfja7nrd2p2n5iyvhzfjypcarnhpb7g4-vendor-cargo-deps/c19b7c6f923b580ac259164a89f2577984ad5ab09ee9d583b888f934adbbe8d0/insta-1.47.2/src/runtime.rs:719:13:
19.09 s
gammaloop-nextest-spenso> snapshot assertion for 'infinite_execution' failed in line 910
19.09 s
gammaloop-nextest-spenso> stack backtrace:
19.09 s
gammaloop-nextest-spenso> 0: __rustc::rust_begin_unwind
19.09 s
gammaloop-nextest-spenso> 1: core::panicking::panic_fmt
19.09 s
gammaloop-nextest-spenso> 2: insta::runtime::assert_snapshot
19.09 s
gammaloop-nextest-spenso> 3: idenso::tensor::tests::parsing::infinite_execution
19.09 s
gammaloop-nextest-spenso> 4: <idenso::tensor::tests::parsing::infinite_execution::{closure#0} as core::ops::function::FnOnce<()>>::call_once
19.09 s
gammaloop-nextest-spenso> note: Some details are omitted, run with `RUST_BACKTRACE=full` for a verbose backtrace.
19.09 s
gammaloop-nextest-spenso>
19.12 s
gammaloop-nextest-spenso> error : test run failed
19.14 s
gammaloop-nextest-spenso>
19.14 s
gammaloop-nextest-spenso> ========== nextest test summary ==========
19.14 s
gammaloop-nextest-spenso> report: target/nextest/ci_gammaloop/junit.xml
19.14 s
gammaloop-nextest-spenso> tests: 224, failures: 2, errors: 0
19.14 s
gammaloop-nextest-spenso>
19.14 s
gammaloop-nextest-spenso> 1. idenso::color::test::form_reference::metric_contraction_respects_antisymmetric_normalization
19.14 s
gammaloop-nextest-spenso> failure: test failure with exit code 101
19.14 s
gammaloop-nextest-spenso> thread 'color::test::form_reference::metric_contraction_respects_antisymmetric_normalization' (328) panicked at crates/idenso/src/color/test/form_reference.rs:171:5:
19.14 s
gammaloop-nextest-spenso> assertion `left == right` failed
19.14 s
gammaloop-nextest-spenso> left: "-1*f(coad(8,standalone_metric_j),coad(8,standalone_metric_s),coad(8,standalone_metric_u))"
19.14 s
gammaloop-nextest-spenso> right: "f(coad(8,standalone_metric_j),coad(8,standalone_metric_s),coad(8,standalone_metric_u))"
19.14 s
gammaloop-nextest-spenso> stack backtrace:
19.14 s
gammaloop-nextest-spenso> 0: __rustc::rust_begin_unwind
19.14 s
gammaloop-nextest-spenso> 1: core::panicking::panic_fmt
19.14 s
gammaloop-nextest-spenso> 2: core::panicking::assert_failed_inner
19.14 s
gammaloop-nextest-spenso> 3: core::panicking::assert_failed::<alloc::string::String, alloc::string::String>
19.14 s
gammaloop-nextest-spenso> 4: idenso::color::test::form_reference::metric_contraction_respects_antisymmetric_normalization
19.14 s
gammaloop-nextest-spenso> 5: <idenso::color::test::form_reference::metric_contraction_respects_antisymmetric_normalization::{closure#0} as core::ops::function::FnOnce<()>>::call_once
19.14 s
gammaloop-nextest-spenso> note: Some details are omitted, run with `RUST_BACKTRACE=full` for a verbose backtrace.
19.14 s
gammaloop-nextest-spenso> system-out
19.14 s
gammaloop-nextest-spenso> running 1 test
19.14 s
gammaloop-nextest-spenso> test color::test::form_reference::metric_contraction_respects_antisymmetric_normalization ... FAILED
19.14 s
gammaloop-nextest-spenso>
19.14 s
gammaloop-nextest-spenso> failures:
19.14 s
gammaloop-nextest-spenso>
19.14 s
gammaloop-nextest-spenso> failures:
19.14 s
gammaloop-nextest-spenso> color::test::form_reference::metric_contraction_respects_antisymmetric_normalization
19.14 s
gammaloop-nextest-spenso>
19.14 s
gammaloop-nextest-spenso> test result: FAILED. 0 passed; 1 failed; 0 ignored; 0 measured; 240 filtered out; finished in 0.00s
19.14 s
gammaloop-nextest-spenso> system-err
19.14 s
gammaloop-nextest-spenso> thread 'color::test::form_reference::metric_contraction_respects_antisymmetric_normalization' (328) panicked at crates/idenso/src/color/test/form_reference.rs:171:5:
19.14 s
gammaloop-nextest-spenso> assertion `left == right` failed
19.14 s
gammaloop-nextest-spenso> left: "-1*f(coad(8,standalone_metric_j),coad(8,standalone_metric_s),coad(8,standalone_metric_u))"
19.14 s
gammaloop-nextest-spenso> right: "f(coad(8,standalone_metric_j),coad(8,standalone_metric_s),coad(8,standalone_metric_u))"
19.14 s
gammaloop-nextest-spenso> stack backtrace:
19.14 s
gammaloop-nextest-spenso> 0: __rustc::rust_begin_unwind
19.14 s
gammaloop-nextest-spenso> 1: core::panicking::panic_fmt
19.14 s
gammaloop-nextest-spenso> 2: core::panicking::assert_failed_inner
19.14 s
gammaloop-nextest-spenso> 3: core::panicking::assert_failed::<alloc::string::String, alloc::string::String>
19.14 s
gammaloop-nextest-spenso> 4: idenso::color::test::form_reference::metric_contraction_respects_antisymmetric_normalization
19.14 s
gammaloop-nextest-spenso> 5: <idenso::color::test::form_reference::metric_contraction_respects_antisymmetric_normalization::{closure#0} as core::ops::function::FnOnce<()>>::call_once
19.14 s
gammaloop-nextest-spenso> note: Some details are omitted, run with `RUST_BACKTRACE=full` for a verbose backtrace.
19.14 s
gammaloop-nextest-spenso>
19.14 s
gammaloop-nextest-spenso> 2. idenso::tensor::tests::parsing::infinite_execution
19.14 s
gammaloop-nextest-spenso> failure: test failure with exit code 101
19.14 s
gammaloop-nextest-spenso> thread 'tensor::tests::parsing::infinite_execution' (849) panicked at /nix/store/qfja7nrd2p2n5iyvhzfjypcarnhpb7g4-vendor-cargo-deps/c19b7c6f923b580ac259164a89f2577984ad5ab09ee9d583b888f934adbbe8d0/insta-1.47.2/src/runtime.rs:719:13:
19.14 s
gammaloop-nextest-spenso> snapshot assertion for 'infinite_execution' failed in line 910
19.14 s
gammaloop-nextest-spenso> stack backtrace:
19.14 s
gammaloop-nextest-spenso> 0: __rustc::rust_begin_unwind
19.14 s
gammaloop-nextest-spenso> 1: core::panicking::panic_fmt
19.14 s
gammaloop-nextest-spenso> 2: insta::runtime::assert_snapshot
19.14 s
gammaloop-nextest-spenso> 3: idenso::tensor::tests::parsing::infinite_execution
19.14 s
gammaloop-nextest-spenso> 4: <idenso::tensor::tests::parsing::infinite_execution::{closure#0} as core::ops::function::FnOnce<()>>::call_once
19.14 s
gammaloop-nextest-spenso> note: Some details are omitted, run with `RUST_BACKTRACE=full` for a verbose backtrace.
19.14 s
gammaloop-nextest-spenso> system-out
19.14 s
gammaloop-nextest-spenso> running 1 test
19.14 s
gammaloop-nextest-spenso> ━━━━━━━━━━━━━━━━━━━━━━━━━━━━━━━ Snapshot Summary ━━━━━━━━━━━━━━━━━━━━━━━━━━━━━━━
19.14 s
gammaloop-nextest-spenso> Snapshot: infinite_execution
19.14 s
gammaloop-nextest-spenso> Source: crates/idenso/src/tensor/tests/parsing.rs:910
19.14 s
gammaloop-nextest-spenso> ────────────────────────────────────────────────────────────────────────────────
19.14 s
gammaloop-nextest-spenso> Expression: net_iter.snapshot_dot()
19.14 s
gammaloop-nextest-spenso> ────────────────────────────────────────────────────────────────────────────────
19.14 s
gammaloop-nextest-spenso> -old snapshot
19.14 s
gammaloop-nextest-spenso> +new results
19.14 s
gammaloop-nextest-spenso> ────────────┬───────────────────────────────────────────────────────────────────
19.14 s
gammaloop-nextest-spenso> 8 8 │ 0:0:s-> ext0 [id=0 color="red"];
19.14 s
gammaloop-nextest-spenso> 9 9 │ ext1 [style=invis];
19.14 s
gammaloop-nextest-spenso> 10 10 │ 0:5:s-> ext1 [id=1 dir=none color="red" label="mink4|l_0"];
19.14 s
gammaloop-nextest-spenso> 11 11 │ ext2 [style=invis];
19.14 s
gammaloop-nextest-spenso> 12 │- 0:4:s-> ext2 [id=2 dir=none color="red" label="bis4|l_2"];
19.14 s
gammaloop-nextest-spenso> 12 │+ 0:3:s-> ext2 [id=2 dir=none color="red" label="mink4|l_1"];
19.14 s
gammaloop-nextest-spenso> 13 13 │ ext3 [style=invis];
19.14 s
gammaloop-nextest-spenso> 14 │- 0:3:s-> ext3 [id=3 dir=none color="red" label="bis4|l_3"];
19.14 s
gammaloop-nextest-spenso> 14 │+ 0:1:s-> ext3 [id=3 dir=none color="red" label="bis4|l_2"];
19.14 s
gammaloop-nextest-spenso> 15 15 │ ext4 [style=invis];
19.14 s
gammaloop-nextest-spenso> 16 │- 0:1:s-> ext4 [id=4 dir=none color="red" label="mink4|l_1"];
19.14 s
gammaloop-nextest-spenso> 16 │+ 0:2:s-> ext4 [id=4 dir=none color="red" label="mink4|l_4"];
19.14 s
gammaloop-nextest-spenso> 17 17 │ ext5 [style=invis];
19.14 s
gammaloop-nextest-spenso> 18 │- 0:2:s-> ext5 [id=5 dir=none color="red" label="mink4|l_4"];
19.14 s
gammaloop-nextest-spenso> 18 │+ 0:4:s-> ext5 [id=5 dir=none color="red" label="bis4|l_3"];
19.14 s
gammaloop-nextest-spenso> 19 19 │ }
19.14 s
gammaloop-nextest-spenso> ────────────┴───────────────────────────────────────────────────────────────────
19.14 s
gammaloop-nextest-spenso> To update snapshots run `cargo insta review`
19.14 s
gammaloop-nextest-spenso> Stopped on the first failure. Run `cargo insta test` to run all snapshots.
19.14 s
gammaloop-nextest-spenso> test tensor::tests::parsing::infinite_execution ... FAILED
19.14 s
gammaloop-nextest-spenso>
19.14 s
gammaloop-nextest-spenso> failures:
19.14 s
gammaloop-nextest-spenso>
19.14 s
gammaloop-nextest-spenso> failures:
19.14 s
gammaloop-nextest-spenso> tensor::tests::parsing::infinite_execution
19.14 s
gammaloop-nextest-spenso>
19.14 s
gammaloop-nextest-spenso> test result: FAILED. 0 passed; 1 failed; 0 ignored; 0 measured; 240 filtered out; finished in 0.11s
19.14 s
gammaloop-nextest-spenso> system-err
19.14 s
gammaloop-nextest-spenso> thread 'tensor::tests::parsing::infinite_execution' (849) panicked at /nix/store/qfja7nrd2p2n5iyvhzfjypcarnhpb7g4-vendor-cargo-deps/c19b7c6f923b580ac259164a89f2577984ad5ab09ee9d583b888f934adbbe8d0/insta-1.47.2/src/runtime.rs:719:13:
19.14 s
gammaloop-nextest-spenso> snapshot assertion for 'infinite_execution' failed in line 910
19.14 s
gammaloop-nextest-spenso> stack backtrace:
19.14 s
gammaloop-nextest-spenso> 0: __rustc::rust_begin_unwind
19.14 s
gammaloop-nextest-spenso> 1: core::panicking::panic_fmt
19.14 s
gammaloop-nextest-spenso> 2: insta::runtime::assert_snapshot
19.14 s
gammaloop-nextest-spenso> 3: idenso::tensor::tests::parsing::infinite_execution
19.14 s
gammaloop-nextest-spenso> 4: <idenso::tensor::tests::parsing::infinite_execution::{closure#0} as core::ops::function::FnOnce<()>>::call_once
19.14 s
gammaloop-nextest-spenso> note: Some details are omitted, run with `RUST_BACKTRACE=full` for a verbose backtrace.
19.14 s
gammaloop-nextest-spenso> =========================================
19.15 s
gammaloop-nextest-spenso> Extracting 2 binaries and 1 linked path to /build/nextest-archive-kUzMB1
19.22 s
gammaloop-nextest-spenso> Extracted 8 files to /build/nextest-archive-kUzMB1 in 0.07s
19.23 s
gammaloop-nextest-spenso> ------------
19.23 s
gammaloop-nextest-spenso> Nextest run ID 8382c2db-4fad-4509-b7e7-533ccb6283d6 with nextest profile: ci_gammaloop
19.23 s
gammaloop-nextest-spenso> Starting 135 tests across 2 binaries
19.31 s
gammaloop-nextest-spenso> ------------
19.31 s
gammaloop-nextest-spenso> Summary [ 0.078s] 135 tests run: 135 passed , 0 skipped
19.34 s
gammaloop-nextest-spenso>
19.34 s
gammaloop-nextest-spenso> ========== nextest test summary ==========
19.34 s
gammaloop-nextest-spenso> report: target/nextest/ci_gammaloop/junit.xml
19.34 s
gammaloop-nextest-spenso> tests: 135, failures: 0, errors: 0
19.34 s
gammaloop-nextest-spenso> No failing testcases found.
19.34 s
gammaloop-nextest-spenso> =========================================
19.36 s
gammaloop-nextest-spenso> Extracting 5 binaries and 2 linked paths to /build/nextest-archive-TAxXD7
19.53 s
gammaloop-nextest-spenso> Extracted 19 files to /build/nextest-archive-TAxXD7 in 0.18s
19.54 s
gammaloop-nextest-spenso> ------------
19.54 s
gammaloop-nextest-spenso> Nextest run ID 8bd9b412-cf5e-4ebc-b0af-6f15f7fdd999 with nextest profile: ci_gammaloop
19.54 s
gammaloop-nextest-spenso> Starting 25 tests across 5 binaries (1 test skipped via profile.ci_gammaloop.default-filter )
19.73 s
gammaloop-nextest-spenso> ------------
19.73 s
gammaloop-nextest-spenso> Summary [ 0.182s] 25 tests run: 25 passed , 1 skipped
19.78 s
gammaloop-nextest-spenso>
19.78 s
gammaloop-nextest-spenso> ========== nextest test summary ==========
19.78 s
gammaloop-nextest-spenso> report: target/nextest/ci_gammaloop/junit.xml
19.78 s
gammaloop-nextest-spenso> tests: 25, failures: 0, errors: 0
19.78 s
gammaloop-nextest-spenso> No failing testcases found.
19.78 s
gammaloop-nextest-spenso> =========================================
19.79 s
gammaloop-nextest-spenso> Extracting 2 binaries and 1 linked path to /build/nextest-archive-Q1rqvy
19.84 s
gammaloop-nextest-spenso> Extracted 8 files to /build/nextest-archive-Q1rqvy in 0.05s
19.85 s
gammaloop-nextest-spenso> ------------
19.85 s
gammaloop-nextest-spenso> Nextest run ID 5bd67d0b-016a-472e-94fe-b1fb5cd8d4fd with nextest profile: ci_gammaloop
19.85 s
gammaloop-nextest-spenso> Starting 1 test across 2 binaries
19.86 s
gammaloop-nextest-spenso> ------------
19.86 s
gammaloop-nextest-spenso> Summary [ 0.005s] 1 test run: 1 passed , 0 skipped
19.89 s
gammaloop-nextest-spenso>
19.89 s
gammaloop-nextest-spenso> ========== nextest test summary ==========
19.89 s
gammaloop-nextest-spenso> report: target/nextest/ci_gammaloop/junit.xml
19.89 s
gammaloop-nextest-spenso> tests: 1, failures: 0, errors: 0
19.89 s
gammaloop-nextest-spenso> No failing testcases found.
19.89 s
gammaloop-nextest-spenso> =========================================
19.90 s
gammaloop-nextest-spenso> Extracting 1 binary and 1 linked path to /build/nextest-archive-LQhSCq
19.95 s
gammaloop-nextest-spenso> Extracted 7 files to /build/nextest-archive-LQhSCq in 0.05s
19.96 s
gammaloop-nextest-spenso> ------------
19.96 s
gammaloop-nextest-spenso> Nextest run ID 27640993-8c43-4717-adc9-7337f2d984f5 with nextest profile: ci_gammaloop
19.96 s
gammaloop-nextest-spenso> Starting 0 tests across 1 binary
19.96 s
gammaloop-nextest-spenso> ------------
19.96 s
gammaloop-nextest-spenso> Summary [ 0.000s] 0 tests run: 0 passed , 0 skipped
19.99 s
gammaloop-nextest-spenso>
19.99 s
gammaloop-nextest-spenso> ========== nextest test summary ==========
19.99 s
gammaloop-nextest-spenso> report: target/nextest/ci_gammaloop/junit.xml
19.99 s
gammaloop-nextest-spenso> tests: 0, failures: 0, errors: 0
19.99 s
gammaloop-nextest-spenso> No failing testcases found.
19.99 s
gammaloop-nextest-spenso> =========================================
20.02 s
error: Cannot build '/nix/store/hk3irrympzq7agrqvi8g99r01gw6v0g3-gammaloop-nextest-spenso.drv '.
20.02 s
Reason: builder failed with exit code 100 .
20.02 s
Output paths:
20.02 s
/nix/store/wcjln4hqsq5j381kylbbk9axpkb95zxm-gammaloop-nextest-spenso
20.02 s
Last 325 log lines:
20.02 s
> Extracting 5 binaries and 2 linked paths to /build/nextest-archive-sLARIL
20.02 s
> Extracted 19 files to /build/nextest-archive-sLARIL in 0.16s
20.02 s
> ------------
20.02 s
> Nextest run ID 083148e9-d592-4409-aae5-f59c75ba90af with nextest profile: ci_gammaloop
20.02 s
> Starting 224 tests across 5 binaries (26 tests skipped , including 2 tests via profile.ci_gammaloop.default-filter )
20.02 s
> FAIL [ 0.011s] ( 44/224) idenso color::test::form_reference :: metric_contraction_respects_antisymmetric_normalization
20.02 s
> stdout ---
20.02 s
>
20.02 s
> running 1 test
20.02 s
> test color::test::form_reference::metric_contraction_respects_antisymmetric_normalization ... FAILED
20.02 s
>
20.02 s
> failures:
20.02 s
>
20.02 s
> failures:
20.02 s
> color::test::form_reference::metric_contraction_respects_antisymmetric_normalization
20.02 s
>
20.02 s
> test result: FAILED. 0 passed; 1 failed; 0 ignored; 0 measured; 240 filtered out; finished in 0.00s
20.02 s
>
20.02 s
> stderr ---
20.02 s
>
20.02 s
> thread 'color::test::form_reference::metric_contraction_respects_antisymmetric_normalization' (328) panicked at crates/idenso/src/color/test/form_reference.rs:171:5:
20.02 s
> assertion `left == right` failed
20.02 s
> left: "-1*f(coad(8,standalone_metric_j),coad(8,standalone_metric_s),coad(8,standalone_metric_u))"
20.02 s
> right: "f(coad(8,standalone_metric_j),coad(8,standalone_metric_s),coad(8,standalone_metric_u))"
20.02 s
> stack backtrace:
20.02 s
> 0: __rustc::rust_begin_unwind
20.02 s
> 1: core::panicking::panic_fmt
20.02 s
> 2: core::panicking::assert_failed_inner
20.02 s
> 3: core::panicking::assert_failed::<alloc::string::String, alloc::string::String>
20.02 s
> 4: idenso::color::test::form_reference::metric_contraction_respects_antisymmetric_normalization
20.02 s
> 5: <idenso::color::test::form_reference::metric_contraction_respects_antisymmetric_normalization::{closure#0} as core::ops::function::FnOnce<()>>::call_once
20.02 s
> note: Some details are omitted, run with `RUST_BACKTRACE=full` for a verbose backtrace.
20.02 s
>
20.02 s
> FAIL [ 0.113s] (221/224) idenso tensor::tests::parsing :: infinite_execution
20.02 s
> stdout ---
20.02 s
>
20.02 s
> running 1 test
20.02 s
> ━━━━━━━━━━━━━━━━━━━━━━━━━━━━━━━ Snapshot Summary ━━━━━━━━━━━━━━━━━━━━━━━━━━━━━━━
20.02 s
> Snapshot: infinite_execution
20.02 s
> Source: crates/idenso/src/tensor/tests/parsing.rs:910
20.02 s
> ────────────────────────────────────────────────────────────────────────────────
20.02 s
> Expression: net_iter.snapshot_dot()
20.02 s
> ────────────────────────────────────────────────────────────────────────────────
20.02 s
> -old snapshot
20.02 s
> +new results
20.02 s
> ────────────┬───────────────────────────────────────────────────────────────────
20.02 s
> 8 8 │ 0:0:s -> ext0 [id=0 color="red"];
20.02 s
> 9 9 │ ext1 [style=invis];
20.02 s
> 10 10 │ 0:5:s -> ext1 [id=1 dir=none color="red" label="mink4|l_0"];
20.02 s
> 11 11 │ ext2 [style=invis];
20.02 s
> 12 │- 0:4:s -> ext2 [id=2 dir=none color="red" label="bis4|l_2"];
20.02 s
> 12 │+ 0:3:s -> ext2 [id=2 dir=none color="red" label="mink4|l_1"];
20.02 s
> 13 13 │ ext3 [style=invis];
20.02 s
> 14 │- 0:3:s -> ext3 [id=3 dir=none color="red" label="bis4|l_3"];
20.02 s
> 14 │+ 0:1:s -> ext3 [id=3 dir=none color="red" label="bis4|l_2"];
20.02 s
> 15 15 │ ext4 [style=invis];
20.02 s
> 16 │- 0:1:s -> ext4 [id=4 dir=none color="red" label="mink4|l_1"];
20.02 s
> 16 │+ 0:2:s -> ext4 [id=4 dir=none color="red" label="mink4|l_4"];
20.02 s
> 17 17 │ ext5 [style=invis];
20.02 s
> 18 │- 0:2:s -> ext5 [id=5 dir=none color="red" label="mink4|l_4"];
20.02 s
> 18 │+ 0:4:s -> ext5 [id=5 dir=none color="red" label="bis4|l_3"];
20.02 s
> 19 19 │ }
20.02 s
> ────────────┴───────────────────────────────────────────────────────────────────
20.02 s
> To update snapshots run `cargo insta review`
20.02 s
> Stopped on the first failure. Run `cargo insta test` to run all snapshots.
20.02 s
> test tensor::tests::parsing::infinite_execution ... FAILED
20.02 s
>
20.02 s
> failures:
20.02 s
>
20.02 s
> failures:
20.02 s
> tensor::tests::parsing::infinite_execution
20.02 s
>
20.02 s
> test result: FAILED. 0 passed; 1 failed; 0 ignored; 0 measured; 240 filtered out; finished in 0.11s
20.02 s
>
20.02 s
> stderr ---
20.02 s
>
20.02 s
> thread 'tensor::tests::parsing::infinite_execution' (849) panicked at /nix/store/qfja7nrd2p2n5iyvhzfjypcarnhpb7g4-vendor-cargo-deps/c19b7c6f923b580ac259164a89f2577984ad5ab09ee9d583b888f934adbbe8d0/insta-1.47.2/src/runtime.rs:719:13:
20.02 s
> snapshot assertion for 'infinite_execution' failed in line 910
20.02 s
> stack backtrace:
20.02 s
> 0: __rustc::rust_begin_unwind
20.02 s
> 1: core::panicking::panic_fmt
20.02 s
> 2: insta::runtime::assert_snapshot
20.02 s
> 3: idenso::tensor::tests::parsing::infinite_execution
20.02 s
> 4: <idenso::tensor::tests::parsing::infinite_execution::{closure#0} as core::ops::function::FnOnce<()>>::call_once
20.02 s
> note: Some details are omitted, run with `RUST_BACKTRACE=full` for a verbose backtrace.
20.02 s
>
20.02 s
> ------------
20.02 s
> Summary [ 1.541s] 224 tests run: 222 passed , 2 failed , 26 skipped
20.02 s
> FAIL [ 0.011s] ( 44/224) idenso color::test::form_reference :: metric_contraction_respects_antisymmetric_normalization
20.02 s
> stdout ---
20.02 s
>
20.02 s
> running 1 test
20.02 s
> test color::test::form_reference::metric_contraction_respects_antisymmetric_normalization ... FAILED
20.02 s
>
20.02 s
> failures:
20.02 s
>
20.02 s
> failures:
20.02 s
> color::test::form_reference::metric_contraction_respects_antisymmetric_normalization
20.02 s
>
20.02 s
> test result: FAILED. 0 passed; 1 failed; 0 ignored; 0 measured; 240 filtered out; finished in 0.00s
20.02 s
>
20.02 s
> stderr ---
20.02 s
>
20.02 s
> thread 'color::test::form_reference::metric_contraction_respects_antisymmetric_normalization' (328) panicked at crates/idenso/src/color/test/form_reference.rs:171:5:
20.02 s
> assertion `left == right` failed
20.02 s
> left: "-1*f(coad(8,standalone_metric_j),coad(8,standalone_metric_s),coad(8,standalone_metric_u))"
20.02 s
> right: "f(coad(8,standalone_metric_j),coad(8,standalone_metric_s),coad(8,standalone_metric_u))"
20.02 s
> stack backtrace:
20.02 s
> 0: __rustc::rust_begin_unwind
20.02 s
> 1: core::panicking::panic_fmt
20.02 s
> 2: core::panicking::assert_failed_inner
20.02 s
> 3: core::panicking::assert_failed::<alloc::string::String, alloc::string::String>
20.02 s
> 4: idenso::color::test::form_reference::metric_contraction_respects_antisymmetric_normalization
20.02 s
> 5: <idenso::color::test::form_reference::metric_contraction_respects_antisymmetric_normalization::{closure#0} as core::ops::function::FnOnce<()>>::call_once
20.02 s
> note: Some details are omitted, run with `RUST_BACKTRACE=full` for a verbose backtrace.
20.02 s
>
20.02 s
> FAIL [ 0.113s] (221/224) idenso tensor::tests::parsing :: infinite_execution
20.02 s
> stdout ---
20.02 s
>
20.02 s
> running 1 test
20.02 s
> ━━━━━━━━━━━━━━━━━━━━━━━━━━━━━━━ Snapshot Summary ━━━━━━━━━━━━━━━━━━━━━━━━━━━━━━━
20.02 s
> Snapshot: infinite_execution
20.02 s
> Source: crates/idenso/src/tensor/tests/parsing.rs:910
20.02 s
> ────────────────────────────────────────────────────────────────────────────────
20.02 s
> Expression: net_iter.snapshot_dot()
20.02 s
> ────────────────────────────────────────────────────────────────────────────────
20.02 s
> -old snapshot
20.02 s
> +new results
20.02 s
> ────────────┬───────────────────────────────────────────────────────────────────
20.02 s
> 8 8 │ 0:0:s -> ext0 [id=0 color="red"];
20.02 s
> 9 9 │ ext1 [style=invis];
20.02 s
> 10 10 │ 0:5:s -> ext1 [id=1 dir=none color="red" label="mink4|l_0"];
20.02 s
> 11 11 │ ext2 [style=invis];
20.02 s
> 12 │- 0:4:s -> ext2 [id=2 dir=none color="red" label="bis4|l_2"];
20.02 s
> 12 │+ 0:3:s -> ext2 [id=2 dir=none color="red" label="mink4|l_1"];
20.02 s
> 13 13 │ ext3 [style=invis];
20.02 s
> 14 │- 0:3:s -> ext3 [id=3 dir=none color="red" label="bis4|l_3"];
20.02 s
> 14 │+ 0:1:s -> ext3 [id=3 dir=none color="red" label="bis4|l_2"];
20.02 s
> 15 15 │ ext4 [style=invis];
20.02 s
> 16 │- 0:1:s -> ext4 [id=4 dir=none color="red" label="mink4|l_1"];
20.02 s
> 16 │+ 0:2:s -> ext4 [id=4 dir=none color="red" label="mink4|l_4"];
20.02 s
> 17 17 │ ext5 [style=invis];
20.02 s
> 18 │- 0:2:s -> ext5 [id=5 dir=none color="red" label="mink4|l_4"];
20.02 s
> 18 │+ 0:4:s -> ext5 [id=5 dir=none color="red" label="bis4|l_3"];
20.02 s
> 19 19 │ }
20.02 s
> ────────────┴───────────────────────────────────────────────────────────────────
20.02 s
> To update snapshots run `cargo insta review`
20.02 s
> Stopped on the first failure. Run `cargo insta test` to run all snapshots.
20.02 s
> test tensor::tests::parsing::infinite_execution ... FAILED
20.02 s
>
20.02 s
> failures:
20.02 s
>
20.02 s
> failures:
20.02 s
> tensor::tests::parsing::infinite_execution
20.02 s
>
20.02 s
> test result: FAILED. 0 passed; 1 failed; 0 ignored; 0 measured; 240 filtered out; finished in 0.11s
20.02 s
>
20.02 s
> stderr ---
20.02 s
>
20.02 s
> thread 'tensor::tests::parsing::infinite_execution' (849) panicked at /nix/store/qfja7nrd2p2n5iyvhzfjypcarnhpb7g4-vendor-cargo-deps/c19b7c6f923b580ac259164a89f2577984ad5ab09ee9d583b888f934adbbe8d0/insta-1.47.2/src/runtime.rs:719:13:
20.02 s
> snapshot assertion for 'infinite_execution' failed in line 910
20.02 s
> stack backtrace:
20.02 s
> 0: __rustc::rust_begin_unwind
20.02 s
> 1: core::panicking::panic_fmt
20.02 s
> 2: insta::runtime::assert_snapshot
20.02 s
> 3: idenso::tensor::tests::parsing::infinite_execution
20.02 s
> 4: <idenso::tensor::tests::parsing::infinite_execution::{closure#0} as core::ops::function::FnOnce<()>>::call_once
20.02 s
> note: Some details are omitted, run with `RUST_BACKTRACE=full` for a verbose backtrace.
20.02 s
>
20.02 s
> error : test run failed
20.02 s
>
20.02 s
> ========== nextest test summary ==========
20.02 s
> report: target/nextest/ci_gammaloop/junit.xml
20.02 s
> tests: 224, failures: 2, errors: 0
20.02 s
>
20.02 s
> 1. idenso::color::test::form_reference::metric_contraction_respects_antisymmetric_normalization
20.02 s
> failure: test failure with exit code 101
20.02 s
> thread 'color::test::form_reference::metric_contraction_respects_antisymmetric_normalization' (328) panicked at crates/idenso/src/color/test/form_reference.rs:171:5:
20.02 s
> assertion `left == right` failed
20.02 s
> left: "-1*f(coad(8,standalone_metric_j),coad(8,standalone_metric_s),coad(8,standalone_metric_u))"
20.02 s
> right: "f(coad(8,standalone_metric_j),coad(8,standalone_metric_s),coad(8,standalone_metric_u))"
20.02 s
> stack backtrace:
20.02 s
> 0: __rustc::rust_begin_unwind
20.02 s
> 1: core::panicking::panic_fmt
20.02 s
> 2: core::panicking::assert_failed_inner
20.02 s
> 3: core::panicking::assert_failed::<alloc::string::String, alloc::string::String>
20.02 s
> 4: idenso::color::test::form_reference::metric_contraction_respects_antisymmetric_normalization
20.02 s
> 5: <idenso::color::test::form_reference::metric_contraction_respects_antisymmetric_normalization::{closure#0} as core::ops::function::FnOnce<()>>::call_once
20.02 s
> note: Some details are omitted, run with `RUST_BACKTRACE=full` for a verbose backtrace.
20.02 s
> system-out
20.02 s
> running 1 test
20.02 s
> test color::test::form_reference::metric_contraction_respects_antisymmetric_normalization ... FAILED
20.02 s
>
20.02 s
> failures:
20.02 s
>
20.02 s
> failures:
20.02 s
> color::test::form_reference::metric_contraction_respects_antisymmetric_normalization
20.02 s
>
20.02 s
> test result: FAILED. 0 passed; 1 failed; 0 ignored; 0 measured; 240 filtered out; finished in 0.00s
20.02 s
> system-err
20.02 s
> thread 'color::test::form_reference::metric_contraction_respects_antisymmetric_normalization' (328) panicked at crates/idenso/src/color/test/form_reference.rs:171:5:
20.02 s
> assertion `left == right` failed
20.02 s
> left: "-1*f(coad(8,standalone_metric_j),coad(8,standalone_metric_s),coad(8,standalone_metric_u))"
20.02 s
> right: "f(coad(8,standalone_metric_j),coad(8,standalone_metric_s),coad(8,standalone_metric_u))"
20.02 s
> stack backtrace:
20.02 s
> 0: __rustc::rust_begin_unwind
20.02 s
> 1: core::panicking::panic_fmt
20.02 s
> 2: core::panicking::assert_failed_inner
20.02 s
> 3: core::panicking::assert_failed::<alloc::string::String, alloc::string::String>
20.02 s
> 4: idenso::color::test::form_reference::metric_contraction_respects_antisymmetric_normalization
20.02 s
> 5: <idenso::color::test::form_reference::metric_contraction_respects_antisymmetric_normalization::{closure#0} as core::ops::function::FnOnce<()>>::call_once
20.02 s
> note: Some details are omitted, run with `RUST_BACKTRACE=full` for a verbose backtrace.
20.02 s
>
20.02 s
> 2. idenso::tensor::tests::parsing::infinite_execution
20.02 s
> failure: test failure with exit code 101
20.02 s
> thread 'tensor::tests::parsing::infinite_execution' (849) panicked at /nix/store/qfja7nrd2p2n5iyvhzfjypcarnhpb7g4-vendor-cargo-deps/c19b7c6f923b580ac259164a89f2577984ad5ab09ee9d583b888f934adbbe8d0/insta-1.47.2/src/runtime.rs:719:13:
20.02 s
> snapshot assertion for 'infinite_execution' failed in line 910
20.02 s
> stack backtrace:
20.02 s
> 0: __rustc::rust_begin_unwind
20.02 s
> 1: core::panicking::panic_fmt
20.02 s
> 2: insta::runtime::assert_snapshot
20.02 s
> 3: idenso::tensor::tests::parsing::infinite_execution
20.02 s
> 4: <idenso::tensor::tests::parsing::infinite_execution::{closure#0} as core::ops::function::FnOnce<()>>::call_once
20.02 s
> note: Some details are omitted, run with `RUST_BACKTRACE=full` for a verbose backtrace.
20.02 s
> system-out
20.02 s
> running 1 test
20.02 s
> ━━━━━━━━━━━━━━━━━━━━━━━━━━━━━━━ Snapshot Summary ━━━━━━━━━━━━━━━━━━━━━━━━━━━━━━━
20.02 s
> Snapshot: infinite_execution
20.02 s
> Source: crates/idenso/src/tensor/tests/parsing.rs:910
20.02 s
> ────────────────────────────────────────────────────────────────────────────────
20.02 s
> Expression: net_iter.snapshot_dot()
20.02 s
> ────────────────────────────────────────────────────────────────────────────────
20.02 s
> -old snapshot
20.02 s
> +new results
20.02 s
> ────────────┬───────────────────────────────────────────────────────────────────
20.02 s
> 8 8 │ 0:0:s-> ext0 [id=0 color="red"];
20.02 s
> 9 9 │ ext1 [style=invis];
20.02 s
> 10 10 │ 0:5:s-> ext1 [id=1 dir=none color="red" label="mink4|l_0"];
20.02 s
> 11 11 │ ext2 [style=invis];
20.02 s
> 12 │- 0:4:s-> ext2 [id=2 dir=none color="red" label="bis4|l_2"];
20.02 s
> 12 │+ 0:3:s-> ext2 [id=2 dir=none color="red" label="mink4|l_1"];
20.02 s
> 13 13 │ ext3 [style=invis];
20.02 s
> 14 │- 0:3:s-> ext3 [id=3 dir=none color="red" label="bis4|l_3"];
20.02 s
> 14 │+ 0:1:s-> ext3 [id=3 dir=none color="red" label="bis4|l_2"];
20.02 s
> 15 15 │ ext4 [style=invis];
20.02 s
> 16 │- 0:1:s-> ext4 [id=4 dir=none color="red" label="mink4|l_1"];
20.02 s
> 16 │+ 0:2:s-> ext4 [id=4 dir=none color="red" label="mink4|l_4"];
20.02 s
> 17 17 │ ext5 [style=invis];
20.02 s
> 18 │- 0:2:s-> ext5 [id=5 dir=none color="red" label="mink4|l_4"];
20.02 s
> 18 │+ 0:4:s-> ext5 [id=5 dir=none color="red" label="bis4|l_3"];
20.02 s
> 19 19 │ }
20.02 s
> ────────────┴───────────────────────────────────────────────────────────────────
20.02 s
> To update snapshots run `cargo insta review`
20.02 s
> Stopped on the first failure. Run `cargo insta test` to run all snapshots.
20.02 s
> test tensor::tests::parsing::infinite_execution ... FAILED
20.02 s
>
20.02 s
> failures:
20.02 s
>
20.02 s
> failures:
20.02 s
> tensor::tests::parsing::infinite_execution
20.02 s
>
20.02 s
> test result: FAILED. 0 passed; 1 failed; 0 ignored; 0 measured; 240 filtered out; finished in 0.11s
20.02 s
> system-err
20.02 s
> thread 'tensor::tests::parsing::infinite_execution' (849) panicked at /nix/store/qfja7nrd2p2n5iyvhzfjypcarnhpb7g4-vendor-cargo-deps/c19b7c6f923b580ac259164a89f2577984ad5ab09ee9d583b888f934adbbe8d0/insta-1.47.2/src/runtime.rs:719:13:
20.02 s
> snapshot assertion for 'infinite_execution' failed in line 910
20.02 s
> stack backtrace:
20.02 s
> 0: __rustc::rust_begin_unwind
20.02 s
> 1: core::panicking::panic_fmt
20.02 s
> 2: insta::runtime::assert_snapshot
20.02 s
> 3: idenso::tensor::tests::parsing::infinite_execution
20.02 s
> 4: <idenso::tensor::tests::parsing::infinite_execution::{closure#0} as core::ops::function::FnOnce<()>>::call_once
20.02 s
> note: Some details are omitted, run with `RUST_BACKTRACE=full` for a verbose backtrace.
20.02 s
> =========================================
20.02 s
> Extracting 2 binaries and 1 linked path to /build/nextest-archive-kUzMB1
20.02 s
> Extracted 8 files to /build/nextest-archive-kUzMB1 in 0.07s
20.02 s
> ------------
20.02 s
> Nextest run ID 8382c2db-4fad-4509-b7e7-533ccb6283d6 with nextest profile: ci_gammaloop
20.02 s
> Starting 135 tests across 2 binaries
20.02 s
> ------------
20.02 s
> Summary [ 0.078s] 135 tests run: 135 passed , 0 skipped
20.02 s
>
20.02 s
> ========== nextest test summary ==========
20.02 s
> report: target/nextest/ci_gammaloop/junit.xml
20.02 s
> tests: 135, failures: 0, errors: 0
20.02 s
> No failing testcases found.
20.02 s
> =========================================
20.02 s
> Extracting 5 binaries and 2 linked paths to /build/nextest-archive-TAxXD7
20.02 s
> Extracted 19 files to /build/nextest-archive-TAxXD7 in 0.18s
20.02 s
> ------------
20.02 s
> Nextest run ID 8bd9b412-cf5e-4ebc-b0af-6f15f7fdd999 with nextest profile: ci_gammaloop
20.02 s
> Starting 25 tests across 5 binaries (1 test skipped via profile.ci_gammaloop.default-filter )
20.02 s
> ------------
20.02 s
> Summary [ 0.182s] 25 tests run: 25 passed , 1 skipped
20.02 s
>
20.02 s
> ========== nextest test summary ==========
20.02 s
> report: target/nextest/ci_gammaloop/junit.xml
20.02 s
> tests: 25, failures: 0, errors: 0
20.02 s
> No failing testcases found.
20.02 s
> =========================================
20.02 s
> Extracting 2 binaries and 1 linked path to /build/nextest-archive-Q1rqvy
20.02 s
> Extracted 8 files to /build/nextest-archive-Q1rqvy in 0.05s
20.02 s
> ------------
20.02 s
> Nextest run ID 5bd67d0b-016a-472e-94fe-b1fb5cd8d4fd with nextest profile: ci_gammaloop
20.02 s
> Starting 1 test across 2 binaries
20.02 s
> ------------
20.02 s
> Summary [ 0.005s] 1 test run: 1 passed , 0 skipped
20.02 s
>
20.02 s
> ========== nextest test summary ==========
20.02 s
> report: target/nextest/ci_gammaloop/junit.xml
20.02 s
> tests: 1, failures: 0, errors: 0
20.02 s
> No failing testcases found.
20.02 s
> =========================================
20.02 s
> Extracting 1 binary and 1 linked path to /build/nextest-archive-LQhSCq
20.02 s
> Extracted 7 files to /build/nextest-archive-LQhSCq in 0.05s
20.02 s
> ------------
20.02 s
> Nextest run ID 27640993-8c43-4717-adc9-7337f2d984f5 with nextest profile: ci_gammaloop
20.02 s
> Starting 0 tests across 1 binary
20.02 s
> ------------
20.02 s
> Summary [ 0.000s] 0 tests run: 0 passed , 0 skipped
20.02 s
>
20.02 s
> ========== nextest test summary ==========
20.02 s
> report: target/nextest/ci_gammaloop/junit.xml
20.02 s
> tests: 0, failures: 0, errors: 0
20.02 s
> No failing testcases found.
20.02 s
> =========================================
20.02 s
For full logs, run:
20.02 s
nix log /nix/store/hk3irrympzq7agrqvi8g99r01gw6v0g3-gammaloop-nextest-spenso.drv
20.10 s
[0 built (1 failed ), 0.0 Run failed.