1. 0.14 s $ /nix/store/9ypz3flqsrl5xl495mm8h645gadjsxi1-coreutils-9.11/bin/timeout --kill-after=15s 7200s /nix/store/23zk8sgzamrbmj1fday15szf7f2279s8-nix-2.34.7/bin/nix --extra-experimental-features nix-command --extra-experimental-features flakes flake clone git+https://github.com/alphal00p/gammaloop --dest /tmp/nix-ci-worker/stable-pwd/repo/
  2. 0.17 s Cloning into '/tmp/nix-ci-worker/stable-pwd/repo'...
  3. 1.29 s remote: Enumerating objects: 65262, done.
  4. 1.51 s remote: Counting objects: 0% (1/7913) remote: Counting objects: 1% (80/7913) remote: Counting objects: 2% (159/7913) remote: Counting objects: 3% (238/7913) remote: Counting objects: 4% (317/7913) remote: Counting objects: 5% (396/7913) remote: Counting objects: 6% (475/7913) remote: Counting objects: 7% (554/7913) remote: Counting objects: 8% (634/7913) remote: Counting objects: 9% (713/7913) remote: Counting objects: 10% (792/7913) remote: Counting objects: 11% (871/7913) remote: Counting objects: 12% (950/7913) remote: Counting objects: 13% (1029/7913) remote: Counting objects: 14% (1108/7913) remote: Counting objects: 15% (1187/7913) remote: Counting objects: 16% (1267/7913) remote: Counting objects: 17% (1346/7913) remote: Counting objects: 18% (1425/7913) remote: Counting objects: 19% (1504/7913) remote: Counting objects: 20% (1583/7913) remote: Counting objects: 21% (1662/7913) remote: Counting objects: 22% (1741/7913) remote: Counting objects: 23% (1820/7913) remote: Counting objects: 24% (1900/7913) remote: Counting objects: 25% (1979/7913) remote: Counting objects: 26% (2058/7913) remote: Counting objects: 27% (2137/7913) remote: Counting objects: 28% (2216/7913) remote: Counting objects: 29% (2295/7913) remote: Counting objects: 30% (2374/7913) remote: Counting objects: 31% (2454/7913) remote: Counting objects: 32% (2533/7913) remote: Counting objects: 33% (2612/7913) remote: Counting objects: 34% (2691/7913) remote: Counting objects: 35% (2770/7913) remote: Counting objects: 36% (2849/7913) remote: Counting objects: 37% (2928/7913) remote: Counting objects: 38% (3007/7913) remote: Counting objects: 39% (3087/7913) remote: Counting objects: 40% (3166/7913) remote: Counting objects: 41% (3245/7913) remote: Counting objects: 42% (3324/7913) remote: Counting objects: 43% (3403/7913) remote: Counting objects: 44% (3482/7913) remote: Counting objects: 45% (3561/7913) remote: Counting objects: 46% (3640/7913) remote: Counting objects: 47% (3720/7913) remote: Counting objects: 48% (3799/7913) remote: Counting objects: 49% (3878/7913) remote: Counting objects: 50% (3957/7913) remote: Counting objects: 51% (4036/7913) remote: Counting objects: 52% (4115/7913) remote: Counting objects: 53% (4194/7913) remote: Counting objects: 54% (4274/7913) remote: Counting objects: 55% (4353/7913) remote: Counting objects: 56% (4432/7913) remote: Counting objects: 57% (4511/7913) remote: Counting objects: 58% (4590/7913) remote: Counting objects: 59% (4669/7913) remote: Counting objects: 60% (4748/7913) remote: Counting objects: 61% (4827/7913) remote: Counting objects: 62% (4907/7913) remote: Counting objects: 63% (4986/7913) remote: Counting objects: 64% (5065/7913) remote: Counting objects: 65% (5144/7913) remote: Counting objects: 66% (5223/7913) remote: Counting objects: 67% (5302/7913) remote: Counting objects: 68% (5381/7913) remote: Counting objects: 69% (5460/7913) remote: Counting objects: 70% (5540/7913) remote: Counting objects: 71% (5619/7913) remote: Counting objects: 72% (5698/7913) remote: Counting objects: 73% (5777/7913) remote: Counting objects: 74% (5856/7913) remote: Counting objects: 75% (5935/7913) remote: Counting objects: 76% (6014/7913) remote: Counting objects: 77% (6094/7913) remote: Counting objects: 78% (6173/7913) remote: Counting objects: 79% (6252/7913) remote: Counting objects: 80% (6331/7913) remote: Counting objects: 81% (6410/7913) remote: Counting objects: 82% (6489/7913) remote: Counting objects: 83% (6568/7913) remote: Counting objects: 84% (6647/7913) remote: Counting objects: 85% (6727/7913) remote: Counting objects: 86% (6806/7913) remote: Counting objects: 87% (6885/7913) remote: Counting objects: 88% (6964/7913) remote: Counting objects: 89% (7043/7913) remote: Counting objects: 90% (7122/7913) remote: Counting objects: 91% (7201/7913) remote: Counting objects: 92% (7280/7913) remote: Counting objects: 93% (7360/7913) remote: Counting objects: 94% (7439/7913) remote: Counting objects: 95% (7518/7913) remote: Counting objects: 96% (7597/7913) remote: Counting objects: 97% (7676/7913) remote: Counting objects: 98% (7755/7913) remote: Counting objects: 99% (7834/7913) remote: Counting objects: 100% (7913/7913) remote: Counting objects: 100% (7913/7913), done.
  5. 2.90 s remote: Compressing objects: 0% (1/1586) remote: Compressing objects: 1% (16/1586) remote: Compressing objects: 2% (32/1586) remote: Compressing objects: 3% (48/1586) remote: Compressing objects: 4% (64/1586) remote: Compressing objects: 5% (80/1586) remote: Compressing objects: 6% (96/1586) remote: Compressing objects: 7% (112/1586) remote: Compressing objects: 8% (127/1586) remote: Compressing objects: 9% (143/1586) remote: Compressing objects: 10% (159/1586) remote: Compressing objects: 11% (175/1586) remote: Compressing objects: 12% (191/1586) remote: Compressing objects: 13% (207/1586) remote: Compressing objects: 14% (223/1586) remote: Compressing objects: 15% (238/1586) remote: Compressing objects: 15% (251/1586) remote: Compressing objects: 16% (254/1586) remote: Compressing objects: 17% (270/1586) remote: Compressing objects: 18% (286/1586) remote: Compressing objects: 19% (302/1586) remote: Compressing objects: 20% (318/1586) remote: Compressing objects: 21% (334/1586) remote: Compressing objects: 22% (349/1586) remote: Compressing objects: 23% (365/1586) remote: Compressing objects: 24% (381/1586) remote: Compressing objects: 25% (397/1586) remote: Compressing objects: 26% (413/1586) remote: Compressing objects: 27% (429/1586) remote: Compressing objects: 28% (445/1586) remote: Compressing objects: 29% (460/1586) remote: Compressing objects: 30% (476/1586) remote: Compressing objects: 31% (492/1586) remote: Compressing objects: 32% (508/1586) remote: Compressing objects: 33% (524/1586) remote: Compressing objects: 34% (540/1586) remote: Compressing objects: 35% (556/1586) remote: Compressing objects: 36% (571/1586) remote: Compressing objects: 37% (587/1586) remote: Compressing objects: 38% (603/1586) remote: Compressing objects: 39% (619/1586) remote: Compressing objects: 40% (635/1586) remote: Compressing objects: 41% (651/1586) remote: Compressing objects: 42% (667/1586) remote: Compressing objects: 43% (682/1586) remote: Compressing objects: 44% (698/1586) remote: Compressing objects: 45% (714/1586) remote: Compressing objects: 46% (730/1586) remote: Compressing objects: 47% (746/1586) remote: Compressing objects: 48% (762/1586) remote: Compressing objects: 49% (778/1586) remote: Compressing objects: 50% (793/1586) remote: Compressing objects: 51% (809/1586) remote: Compressing objects: 52% (825/1586) remote: Compressing objects: 53% (841/1586) remote: Compressing objects: 54% (857/1586) remote: Compressing objects: 55% (873/1586) remote: Compressing objects: 56% (889/1586) remote: Compressing objects: 57% (905/1586) remote: Compressing objects: 58% (920/1586) remote: Compressing objects: 59% (936/1586) remote: Compressing objects: 60% (952/1586) remote: Compressing objects: 61% (968/1586) remote: Compressing objects: 62% (984/1586) remote: Compressing objects: 63% (1000/1586) remote: Compressing objects: 64% (1016/1586) remote: Compressing objects: 65% (1031/1586) remote: Compressing objects: 66% (1047/1586) remote: Compressing objects: 67% (1063/1586) remote: Compressing objects: 68% (1079/1586) remote: Compressing objects: 69% (1095/1586) remote: Compressing objects: 70% (1111/1586) remote: Compressing objects: 71% (1127/1586) remote: Compressing objects: 72% (1142/1586) remote: Compressing objects: 73% (1158/1586) remote: Compressing objects: 74% (1174/1586) remote: Compressing objects: 75% (1190/1586) remote: Compressing objects: 76% (1206/1586) remote: Compressing objects: 77% (1222/1586) remote: Compressing objects: 78% (1238/1586) remote: Compressing objects: 79% (1253/1586) remote: Compressing objects: 80% (1269/1586) remote: Compressing objects: 81% (1285/1586) remote: Compressing objects: 82% (1301/1586) remote: Compressing objects: 83% (1317/1586) remote: Compressing objects: 84% (1333/1586) remote: Compressing objects: 85% (1349/1586) remote: Compressing objects: 86% (1364/1586) remote: Compressing objects: 87% (1380/1586) remote: Compressing objects: 88% (1396/1586) remote: Compressing objects: 89% (1412/1586) remote: Compressing objects: 90% (1428/1586) remote: Compressing objects: 91% (1444/1586) remote: Compressing objects: 92% (1460/1586) remote: Compressing objects: 93% (1475/1586) remote: Compressing objects: 94% (1491/1586) remote: Compressing objects: 95% (1507/1586) remote: Compressing objects: 96% (1523/1586) remote: Compressing objects: 97% (1539/1586) remote: Compressing objects: 98% (1555/1586) remote: Compressing objects: 99% (1571/1586) remote: Compressing objects: 100% (1586/1586) remote: Compressing objects: 100% (1586/1586), done.
  6. 5.67 s Receiving objects: 0% (1/65262) Receiving objects: 1% (653/65262) Receiving objects: 2% (1306/65262) Receiving objects: 3% (1958/65262) Receiving objects: 4% (2611/65262) Receiving objects: 5% (3264/65262) Receiving objects: 6% (3916/65262) Receiving objects: 7% (4569/65262) Receiving objects: 8% (5221/65262) Receiving objects: 9% (5874/65262) Receiving objects: 10% (6527/65262) Receiving objects: 11% (7179/65262) Receiving objects: 12% (7832/65262), 12.56 MiB | 25.10 MiB/s Receiving objects: 13% (8485/65262), 12.56 MiB | 25.10 MiB/s Receiving objects: 14% (9137/65262), 12.56 MiB | 25.10 MiB/s Receiving objects: 15% (9790/65262), 12.56 MiB | 25.10 MiB/s Receiving objects: 16% (10442/65262), 12.56 MiB | 25.10 MiB/s Receiving objects: 17% (11095/65262), 12.56 MiB | 25.10 MiB/s Receiving objects: 18% (11748/65262), 12.56 MiB | 25.10 MiB/s Receiving objects: 19% (12400/65262), 12.56 MiB | 25.10 MiB/s Receiving objects: 20% (13053/65262), 12.56 MiB | 25.10 MiB/s Receiving objects: 21% (13706/65262), 12.56 MiB | 25.10 MiB/s Receiving objects: 22% (14358/65262), 12.56 MiB | 25.10 MiB/s Receiving objects: 23% (15011/65262), 12.56 MiB | 25.10 MiB/s Receiving objects: 24% (15663/65262), 12.56 MiB | 25.10 MiB/s Receiving objects: 25% (16316/65262), 12.56 MiB | 25.10 MiB/s Receiving objects: 26% (16969/65262), 12.56 MiB | 25.10 MiB/s Receiving objects: 27% (17621/65262), 12.56 MiB | 25.10 MiB/s Receiving objects: 28% (18274/65262), 12.56 MiB | 25.10 MiB/s Receiving objects: 29% (18926/65262), 12.56 MiB | 25.10 MiB/s Receiving objects: 30% (19579/65262), 12.56 MiB | 25.10 MiB/s Receiving objects: 31% (20232/65262), 12.56 MiB | 25.10 MiB/s Receiving objects: 32% (20884/65262), 12.56 MiB | 25.10 MiB/s Receiving objects: 33% (21537/65262), 12.56 MiB | 25.10 MiB/s Receiving objects: 34% (22190/65262), 12.56 MiB | 25.10 MiB/s Receiving objects: 35% (22842/65262), 12.56 MiB | 25.10 MiB/s Receiving objects: 36% (23495/65262), 12.56 MiB | 25.10 MiB/s Receiving objects: 37% (24147/65262), 12.56 MiB | 25.10 MiB/s Receiving objects: 38% (24800/65262), 12.56 MiB | 25.10 MiB/s Receiving objects: 39% (25453/65262), 12.56 MiB | 25.10 MiB/s Receiving objects: 40% (26105/65262), 12.56 MiB | 25.10 MiB/s Receiving objects: 41% (26758/65262), 12.56 MiB | 25.10 MiB/s Receiving objects: 42% (27411/65262), 12.56 MiB | 25.10 MiB/s Receiving objects: 43% (28063/65262), 12.56 MiB | 25.10 MiB/s Receiving objects: 44% (28716/65262), 12.56 MiB | 25.10 MiB/s Receiving objects: 45% (29368/65262), 12.56 MiB | 25.10 MiB/s Receiving objects: 46% (30021/65262), 12.56 MiB | 25.10 MiB/s Receiving objects: 47% (30674/65262), 12.56 MiB | 25.10 MiB/s Receiving objects: 48% (31326/65262), 12.56 MiB | 25.10 MiB/s Receiving objects: 49% (31979/65262), 12.56 MiB | 25.10 MiB/s Receiving objects: 49% (31994/65262), 29.71 MiB | 29.70 MiB/s Receiving objects: 50% (32631/65262), 29.71 MiB | 29.70 MiB/s Receiving objects: 51% (33284/65262), 29.71 MiB | 29.70 MiB/s Receiving objects: 52% (33937/65262), 29.71 MiB | 29.70 MiB/s Receiving objects: 53% (34589/65262), 29.71 MiB | 29.70 MiB/s Receiving objects: 54% (35242/65262), 29.71 MiB | 29.70 MiB/s Receiving objects: 55% (35895/65262), 29.71 MiB | 29.70 MiB/s Receiving objects: 56% (36547/65262), 29.71 MiB | 29.70 MiB/s Receiving objects: 57% (37200/65262), 29.71 MiB | 29.70 MiB/s Receiving objects: 58% (37852/65262), 29.71 MiB | 29.70 MiB/s Receiving objects: 59% (38505/65262), 29.71 MiB | 29.70 MiB/s Receiving objects: 60% (39158/65262), 29.71 MiB | 29.70 MiB/s Receiving objects: 61% (39810/65262), 45.59 MiB | 30.38 MiB/s Receiving objects: 62% (40463/65262), 45.59 MiB | 30.38 MiB/s Receiving objects: 63% (41116/65262), 45.59 MiB | 30.38 MiB/s Receiving objects: 64% (41768/65262), 45.59 MiB | 30.38 MiB/s Receiving objects: 65% (42421/65262), 45.59 MiB | 30.38 MiB/s Receiving objects: 66% (43073/65262), 45.59 MiB | 30.38 MiB/s Receiving objects: 67% (43726/65262), 45.59 MiB | 30.38 MiB/s Receiving objects: 68% (44379/65262), 45.59 MiB | 30.38 MiB/s Receiving objects: 69% (45031/65262), 45.59 MiB | 30.38 MiB/s Receiving objects: 70% (45684/65262), 45.59 MiB | 30.38 MiB/s Receiving objects: 71% (46337/65262), 45.59 MiB | 30.38 MiB/s Receiving objects: 72% (46989/65262), 45.59 MiB | 30.38 MiB/s Receiving objects: 73% (47642/65262), 45.59 MiB | 30.38 MiB/s Receiving objects: 74% (48294/65262), 45.59 MiB | 30.38 MiB/s Receiving objects: 74% (48916/65262), 62.47 MiB | 31.20 MiB/s Receiving objects: 75% (48947/65262), 62.47 MiB | 31.20 MiB/s Receiving objects: 76% (49600/65262), 62.47 MiB | 31.20 MiB/s Receiving objects: 77% (50252/65262), 62.47 MiB | 31.20 MiB/s Receiving objects: 78% (50905/65262), 62.47 MiB | 31.20 MiB/s Receiving objects: 79% (51557/65262), 62.47 MiB | 31.20 MiB/s Receiving objects: 80% (52210/65262), 62.47 MiB | 31.20 MiB/s Receiving objects: 81% (52863/65262), 62.47 MiB | 31.20 MiB/s Receiving objects: 82% (53515/65262), 62.47 MiB | 31.20 MiB/s Receiving objects: 83% (54168/65262), 62.47 MiB | 31.20 MiB/s Receiving objects: 84% (54821/65262), 79.14 MiB | 31.64 MiB/s Receiving objects: 85% (55473/65262), 79.14 MiB | 31.64 MiB/s Receiving objects: 86% (56126/65262), 79.14 MiB | 31.64 MiB/s Receiving objects: 87% (56778/65262), 79.14 MiB | 31.64 MiB/s Receiving objects: 88% (57431/65262), 79.14 MiB | 31.64 MiB/s Receiving objects: 89% (58084/65262), 79.14 MiB | 31.64 MiB/s Receiving objects: 90% (58736/65262), 79.14 MiB | 31.64 MiB/s Receiving objects: 91% (59389/65262), 79.14 MiB | 31.64 MiB/s Receiving objects: 92% (60042/65262), 79.14 MiB | 31.64 MiB/s Receiving objects: 93% (60694/65262), 79.14 MiB | 31.64 MiB/s Receiving objects: 94% (61347/65262), 79.14 MiB | 31.64 MiB/s Receiving objects: 95% (61999/65262), 79.14 MiB | 31.64 MiB/s Receiving objects: 96% (62652/65262), 79.14 MiB | 31.64 MiB/s Receiving objects: 97% (63305/65262), 79.14 MiB | 31.64 MiB/s Receiving objects: 98% (63957/65262), 79.14 MiB | 31.64 MiB/s Receiving objects: 99% (64610/65262), 79.14 MiB | 31.64 MiB/s remote: Total 65262 (delta 6862), reused 6407 (delta 6318), pack-reused 57349 (from 1)
  7. 5.73 s Receiving objects: 100% (65262/65262), 79.14 MiB | 31.64 MiB/s Receiving objects: 100% (65262/65262), 87.60 MiB | 31.88 MiB/s, done.
  8. 6.32 s Resolving deltas: 0% (0/45980) Resolving deltas: 1% (460/45980) Resolving deltas: 2% (920/45980) Resolving deltas: 3% (1383/45980) Resolving deltas: 4% (1840/45980) Resolving deltas: 5% (2299/45980) Resolving deltas: 6% (2759/45980) Resolving deltas: 7% (3219/45980) Resolving deltas: 8% (3680/45980) Resolving deltas: 9% (4139/45980) Resolving deltas: 10% (4598/45980) Resolving deltas: 11% (5058/45980) Resolving deltas: 12% (5518/45980) Resolving deltas: 13% (5978/45980) Resolving deltas: 14% (6438/45980) Resolving deltas: 15% (6897/45980) Resolving deltas: 16% (7357/45980) Resolving deltas: 17% (7817/45980) Resolving deltas: 18% (8279/45980) Resolving deltas: 19% (8737/45980) Resolving deltas: 20% (9196/45980) Resolving deltas: 21% (9656/45980) Resolving deltas: 22% (10116/45980) Resolving deltas: 23% (10578/45980) Resolving deltas: 24% (11036/45980) Resolving deltas: 25% (11498/45980) Resolving deltas: 26% (11955/45980) Resolving deltas: 27% (12417/45980) Resolving deltas: 28% (12875/45980) Resolving deltas: 29% (13335/45980) Resolving deltas: 30% (13794/45980) Resolving deltas: 31% (14254/45980) Resolving deltas: 32% (14714/45980) Resolving deltas: 33% (15174/45980) Resolving deltas: 34% (15634/45980) Resolving deltas: 35% (16093/45980) Resolving deltas: 36% (16553/45980) Resolving deltas: 37% (17013/45980) Resolving deltas: 38% (17473/45980) Resolving deltas: 39% (17933/45980) Resolving deltas: 40% (18395/45980) Resolving deltas: 41% (18852/45980) Resolving deltas: 42% (19312/45980) Resolving deltas: 43% (19772/45980) Resolving deltas: 44% (20232/45980) Resolving deltas: 45% (20691/45980) Resolving deltas: 46% (21151/45980) Resolving deltas: 47% (21611/45980) Resolving deltas: 48% (22071/45980) Resolving deltas: 49% (22531/45980) Resolving deltas: 50% (22990/45980) Resolving deltas: 51% (23451/45980) Resolving deltas: 52% (23910/45980) Resolving deltas: 53% (24370/45980) Resolving deltas: 54% (24831/45980) Resolving deltas: 55% (25291/45980) Resolving deltas: 56% (25749/45980) Resolving deltas: 57% (26209/45980) Resolving deltas: 58% (26670/45980) Resolving deltas: 59% (27130/45980) Resolving deltas: 60% (27588/45980) Resolving deltas: 61% (28049/45980) Resolving deltas: 62% (28508/45980) Resolving deltas: 63% (28968/45980) Resolving deltas: 64% (29428/45980) Resolving deltas: 65% (29887/45980) Resolving deltas: 66% (30347/45980) Resolving deltas: 67% (30807/45980) Resolving deltas: 68% (31268/45980) Resolving deltas: 69% (31727/45980) Resolving deltas: 70% (32186/45980) Resolving deltas: 71% (32646/45980) Resolving deltas: 72% (33106/45980) Resolving deltas: 73% (33566/45980) Resolving deltas: 74% (34026/45980) Resolving deltas: 75% (34486/45980) Resolving deltas: 76% (34945/45980) Resolving deltas: 77% (35405/45980) Resolving deltas: 78% (35865/45980) Resolving deltas: 79% (36325/45980) Resolving deltas: 80% (36784/45980) Resolving deltas: 81% (37245/45980) Resolving deltas: 82% (37704/45980) Resolving deltas: 83% (38164/45980) Resolving deltas: 84% (38624/45980) Resolving deltas: 85% (39083/45980) Resolving deltas: 86% (39543/45980) Resolving deltas: 87% (40003/45980) Resolving deltas: 88% (40463/45980) Resolving deltas: 89% (40924/45980) Resolving deltas: 90% (41382/45980) Resolving deltas: 91% (41842/45980) Resolving deltas: 92% (42302/45980) Resolving deltas: 93% (42762/45980) Resolving deltas: 94% (43225/45980) Resolving deltas: 95% (43681/45980) Resolving deltas: 96% (44141/45980) Resolving deltas: 97% (44601/45980) Resolving deltas: 98% (45061/45980) Resolving deltas: 99% (45521/45980) Resolving deltas: 100% (45980/45980) Resolving deltas: 100% (45980/45980), done.
  9. 6.58 s Fetching commit 7d96a79602498c8c52cad067e3ea600af9a26e05 for vakint_rustred ...
  10. 6.58 s $ /nix/store/bcnisk3ydfgv26v2gw3zlky24g00yww2-git-2.54.0/bin/git fetch origin 7d96a79602498c8c52cad067e3ea600af9a26e05
  11. 7.05 s From https://github.com/alphal00p/gammaloop
  12. 7.05 s * branch 7d96a79602498c8c52cad067e3ea600af9a26e05 -> FETCH_HEAD
  13. 7.06 s $ /nix/store/9ypz3flqsrl5xl495mm8h645gadjsxi1-coreutils-9.11/bin/timeout --kill-after=15s 7200s /nix/store/bcnisk3ydfgv26v2gw3zlky24g00yww2-git-2.54.0/bin/git -c advice.detachedHead=false checkout 7d96a79602498c8c52cad067e3ea600af9a26e05
  14. 7.21 s HEAD is now at 7d96a796 add rustred scalar reduction through two loops
  15. 7.21 s $ /nix/store/9ypz3flqsrl5xl495mm8h645gadjsxi1-coreutils-9.11/bin/timeout --kill-after=15s 7200s /nix/store/23zk8sgzamrbmj1fday15szf7f2279s8-nix-2.34.7/bin/nix --extra-experimental-features nix-command --extra-experimental-features flakes --log-format internal-json run .#packages.x86_64-linux.nix-ci-check-gammaloop-nextest-spenso --print-build-logs
  16. 11.57 s
  17. 11.69 s Downloading cached gammaloop-nextest-binaries-spenso-idenso from https://cache.nix-ci.com
  18. 11.74 s Downloading cached gammaloop-nextest-binaries-spenso-spenso from https://cache.nix-ci.com
  19. 11.74 s Downloading cached gammaloop-nextest-binaries-spenso-spenso-hep-lib from https://cache.nix-ci.com
  20. 11.74 s Downloading cached gammaloop-nextest-binaries-spenso-spenso-macros from https://cache.nix-ci.com
  21. 11.74 s Downloading cached gammaloop-nextest-binaries-spenso-symbolica-utils from https://cache.nix-ci.com
  22. 11.98 s Downloaded cached gammaloop-nextest-binaries-spenso-spenso-macros (6.5 MiB) in 244ms
  23. 11.98 s Progress: 0 of 1 built, 1 of 7 downloaded from cache (4 downloading)
  24. 12.09 s Downloaded cached gammaloop-nextest-binaries-spenso-spenso (10.2 MiB) in 351ms
  25. 12.09 s Progress: 0 of 1 built, 2 of 7 downloaded from cache (3 downloading)
  26. 12.39 s Downloaded cached gammaloop-nextest-binaries-spenso-symbolica-utils (6.3 MiB) in 655ms
  27. 12.39 s Progress: 0 of 1 built, 3 of 7 downloaded from cache (2 downloading)
  28. 12.66 s Downloaded cached gammaloop-nextest-binaries-spenso-idenso (29.3 MiB) in 969ms
  29. 12.66 s Progress: 0 of 1 built, 4 of 7 downloaded from cache (1 downloading)
  30. 12.72 s Downloaded cached gammaloop-nextest-binaries-spenso-spenso-hep-lib (34 MiB) in 982ms
  31. 12.72 s Progress: 0 of 1 built, 5 of 7 downloaded from cache
  32. 12.72 s Downloading cached gammaloop-nextest-binaries-spenso from https://cache.nix-ci.com
  33. 12.75 s Downloaded cached gammaloop-nextest-binaries-spenso (1920 B) in 28ms
  34. 12.75 s Progress: 0 of 1 built, 6 of 7 downloaded from cache
  35. 12.75 s Downloading cached nix-ci-check-gammaloop-nextest-spenso from https://cache.nix-ci.com
  36. 12.78 s Downloaded cached nix-ci-check-gammaloop-nextest-spenso (1016 B) in 28ms
  37. 12.78 s Progress: 0 of 1 built, 7 of 7 downloaded from cache
  38. 17.38 s evaluating derivation 'g copying '/nix/store/wz14 evaluating derivation 'g copying '/nix/store/wz14 evaluating derivation 'g copying '/nix/store/wz14 evaluating derivation 'g querying gammaloop-nexte [0/1 built, 0.0 KiB DL] [1/0/1 built, 0.0 KiB DLgammaloop-nextest-spenso> Extracting 5 binaries and 2 linked paths to /build/nextest-archive-sLARIL
  39. 17.54 s gammaloop-nextest-spenso> Extracted 19 files to /build/nextest-archive-sLARIL in 0.16s
  40. 17.55 s gammaloop-nextest-spenso> ------------
  41. 17.55 s gammaloop-nextest-spenso> Nextest run ID 083148e9-d592-4409-aae5-f59c75ba90af with nextest profile: ci_gammaloop
  42. 17.55 s gammaloop-nextest-spenso> Starting 224 tests across 5 binaries (26 tests skipped, including 2 tests via profile.ci_gammaloop.default-filter)
  43. 17.64 s gammaloop-nextest-spenso> FAIL [ 0.011s] ( 44/224) idenso color::test::form_reference::metric_contraction_respects_antisymmetric_normalization
  44. 17.64 s gammaloop-nextest-spenso> stdout ---
  45. 17.64 s gammaloop-nextest-spenso>
  46. 17.64 s gammaloop-nextest-spenso> running 1 test
  47. 17.64 s gammaloop-nextest-spenso> test color::test::form_reference::metric_contraction_respects_antisymmetric_normalization ... FAILED
  48. 17.64 s gammaloop-nextest-spenso>
  49. 17.64 s gammaloop-nextest-spenso> failures:
  50. 17.64 s gammaloop-nextest-spenso>
  51. 17.64 s gammaloop-nextest-spenso> failures:
  52. 17.64 s gammaloop-nextest-spenso> color::test::form_reference::metric_contraction_respects_antisymmetric_normalization
  53. 17.64 s gammaloop-nextest-spenso>
  54. 17.64 s gammaloop-nextest-spenso> test result: FAILED. 0 passed; 1 failed; 0 ignored; 0 measured; 240 filtered out; finished in 0.00s
  55. 17.64 s gammaloop-nextest-spenso>
  56. 17.64 s gammaloop-nextest-spenso> stderr ---
  57. 17.64 s gammaloop-nextest-spenso>
  58. 17.64 s gammaloop-nextest-spenso> thread 'color::test::form_reference::metric_contraction_respects_antisymmetric_normalization' (328) panicked at crates/idenso/src/color/test/form_reference.rs:171:5:
  59. 17.64 s gammaloop-nextest-spenso> assertion `left == right` failed
  60. 17.64 s gammaloop-nextest-spenso> left: "-1*f(coad(8,standalone_metric_j),coad(8,standalone_metric_s),coad(8,standalone_metric_u))"
  61. 17.64 s gammaloop-nextest-spenso> right: "f(coad(8,standalone_metric_j),coad(8,standalone_metric_s),coad(8,standalone_metric_u))"
  62. 17.64 s gammaloop-nextest-spenso> stack backtrace:
  63. 17.64 s gammaloop-nextest-spenso> 0: __rustc::rust_begin_unwind
  64. 17.64 s gammaloop-nextest-spenso> 1: core::panicking::panic_fmt
  65. 17.64 s gammaloop-nextest-spenso> 2: core::panicking::assert_failed_inner
  66. 17.64 s gammaloop-nextest-spenso> 3: core::panicking::assert_failed::<alloc::string::String, alloc::string::String>
  67. 17.64 s gammaloop-nextest-spenso> 4: idenso::color::test::form_reference::metric_contraction_respects_antisymmetric_normalization
  68. 17.64 s gammaloop-nextest-spenso> 5: <idenso::color::test::form_reference::metric_contraction_respects_antisymmetric_normalization::{closure#0} as core::ops::function::FnOnce<()>>::call_once
  69. 17.64 s gammaloop-nextest-spenso> note: Some details are omitted, run with `RUST_BACKTRACE=full` for a verbose backtrace.
  70. 17.64 s gammaloop-nextest-spenso>
  71. 17.94 s gammaloop-nextest-spenso> FAIL [ 0.113s] (221/224) idenso tensor::tests::parsing::infinite_execution
  72. 17.94 s gammaloop-nextest-spenso> stdout ---
  73. 17.94 s gammaloop-nextest-spenso>
  74. 17.94 s gammaloop-nextest-spenso> running 1 test
  75. 17.94 s gammaloop-nextest-spenso> ━━━━━━━━━━━━━━━━━━━━━━━━━━━━━━━ Snapshot Summary ━━━━━━━━━━━━━━━━━━━━━━━━━━━━━━━
  76. 17.94 s gammaloop-nextest-spenso> Snapshot: infinite_execution
  77. 17.94 s gammaloop-nextest-spenso> Source: crates/idenso/src/tensor/tests/parsing.rs:910
  78. 17.94 s gammaloop-nextest-spenso> ────────────────────────────────────────────────────────────────────────────────
  79. 17.94 s gammaloop-nextest-spenso> Expression: net_iter.snapshot_dot()
  80. 17.94 s gammaloop-nextest-spenso> ────────────────────────────────────────────────────────────────────────────────
  81. 17.94 s gammaloop-nextest-spenso> -old snapshot
  82. 17.94 s gammaloop-nextest-spenso> +new results
  83. 17.94 s gammaloop-nextest-spenso> ────────────┬───────────────────────────────────────────────────────────────────
  84. 17.94 s gammaloop-nextest-spenso> 8 8 │ 0:0:s -> ext0 [id=0 color="red"];
  85. 17.94 s gammaloop-nextest-spenso> 9 9 │ ext1 [style=invis];
  86. 17.94 s gammaloop-nextest-spenso> 10 10 │ 0:5:s -> ext1 [id=1 dir=none color="red" label="mink4|l_0"];
  87. 17.94 s gammaloop-nextest-spenso> 11 11 │ ext2 [style=invis];
  88. 17.94 s gammaloop-nextest-spenso> 12 │- 0:4:s -> ext2 [id=2 dir=none color="red" label="bis4|l_2"];
  89. 17.94 s gammaloop-nextest-spenso> 12 │+ 0:3:s -> ext2 [id=2 dir=none color="red" label="mink4|l_1"];
  90. 17.94 s gammaloop-nextest-spenso> 13 13 │ ext3 [style=invis];
  91. 17.94 s gammaloop-nextest-spenso> 14 │- 0:3:s -> ext3 [id=3 dir=none color="red" label="bis4|l_3"];
  92. 17.94 s gammaloop-nextest-spenso> 14 │+ 0:1:s -> ext3 [id=3 dir=none color="red" label="bis4|l_2"];
  93. 17.94 s gammaloop-nextest-spenso> 15 15 │ ext4 [style=invis];
  94. 17.94 s gammaloop-nextest-spenso> 16 │- 0:1:s -> ext4 [id=4 dir=none color="red" label="mink4|l_1"];
  95. 17.94 s gammaloop-nextest-spenso> 16 │+ 0:2:s -> ext4 [id=4 dir=none color="red" label="mink4|l_4"];
  96. 17.94 s gammaloop-nextest-spenso> 17 17 │ ext5 [style=invis];
  97. 17.94 s gammaloop-nextest-spenso> 18 │- 0:2:s -> ext5 [id=5 dir=none color="red" label="mink4|l_4"];
  98. 17.94 s gammaloop-nextest-spenso> 18 │+ 0:4:s -> ext5 [id=5 dir=none color="red" label="bis4|l_3"];
  99. 17.94 s gammaloop-nextest-spenso> 19 19 │ }
  100. 17.94 s gammaloop-nextest-spenso> ────────────┴───────────────────────────────────────────────────────────────────
  101. 17.94 s gammaloop-nextest-spenso> To update snapshots run `cargo insta review`
  102. 17.94 s gammaloop-nextest-spenso> Stopped on the first failure. Run `cargo insta test` to run all snapshots.
  103. 17.94 s gammaloop-nextest-spenso> test tensor::tests::parsing::infinite_execution ... FAILED
  104. 17.94 s gammaloop-nextest-spenso>
  105. 17.94 s gammaloop-nextest-spenso> failures:
  106. 17.94 s gammaloop-nextest-spenso>
  107. 17.94 s gammaloop-nextest-spenso> failures:
  108. 17.94 s gammaloop-nextest-spenso> tensor::tests::parsing::infinite_execution
  109. 17.94 s gammaloop-nextest-spenso>
  110. 17.94 s gammaloop-nextest-spenso> test result: FAILED. 0 passed; 1 failed; 0 ignored; 0 measured; 240 filtered out; finished in 0.11s
  111. 17.94 s gammaloop-nextest-spenso>
  112. 17.94 s gammaloop-nextest-spenso> stderr ---
  113. 17.94 s gammaloop-nextest-spenso>
  114. 17.94 s gammaloop-nextest-spenso> thread 'tensor::tests::parsing::infinite_execution' (849) panicked at /nix/store/qfja7nrd2p2n5iyvhzfjypcarnhpb7g4-vendor-cargo-deps/c19b7c6f923b580ac259164a89f2577984ad5ab09ee9d583b888f934adbbe8d0/insta-1.47.2/src/runtime.rs:719:13:
  115. 17.94 s gammaloop-nextest-spenso> snapshot assertion for 'infinite_execution' failed in line 910
  116. 17.94 s gammaloop-nextest-spenso> stack backtrace:
  117. 17.94 s gammaloop-nextest-spenso> 0: __rustc::rust_begin_unwind
  118. 17.94 s gammaloop-nextest-spenso> 1: core::panicking::panic_fmt
  119. 17.94 s gammaloop-nextest-spenso> 2: insta::runtime::assert_snapshot
  120. 17.94 s gammaloop-nextest-spenso> 3: idenso::tensor::tests::parsing::infinite_execution
  121. 17.94 s gammaloop-nextest-spenso> 4: <idenso::tensor::tests::parsing::infinite_execution::{closure#0} as core::ops::function::FnOnce<()>>::call_once
  122. 17.94 s gammaloop-nextest-spenso> note: Some details are omitted, run with `RUST_BACKTRACE=full` for a verbose backtrace.
  123. 17.94 s gammaloop-nextest-spenso>
  124. 19.09 s gammaloop-nextest-spenso> ------------
  125. 19.09 s gammaloop-nextest-spenso> Summary [ 1.541s] 224 tests run: 222 passed, 2 failed, 26 skipped
  126. 19.09 s gammaloop-nextest-spenso> FAIL [ 0.011s] ( 44/224) idenso color::test::form_reference::metric_contraction_respects_antisymmetric_normalization
  127. 19.09 s gammaloop-nextest-spenso> stdout ---
  128. 19.09 s gammaloop-nextest-spenso>
  129. 19.09 s gammaloop-nextest-spenso> running 1 test
  130. 19.09 s gammaloop-nextest-spenso> test color::test::form_reference::metric_contraction_respects_antisymmetric_normalization ... FAILED
  131. 19.09 s gammaloop-nextest-spenso>
  132. 19.09 s gammaloop-nextest-spenso> failures:
  133. 19.09 s gammaloop-nextest-spenso>
  134. 19.09 s gammaloop-nextest-spenso> failures:
  135. 19.09 s gammaloop-nextest-spenso> color::test::form_reference::metric_contraction_respects_antisymmetric_normalization
  136. 19.09 s gammaloop-nextest-spenso>
  137. 19.09 s gammaloop-nextest-spenso> test result: FAILED. 0 passed; 1 failed; 0 ignored; 0 measured; 240 filtered out; finished in 0.00s
  138. 19.09 s gammaloop-nextest-spenso>
  139. 19.09 s gammaloop-nextest-spenso> stderr ---
  140. 19.09 s gammaloop-nextest-spenso>
  141. 19.09 s gammaloop-nextest-spenso> thread 'color::test::form_reference::metric_contraction_respects_antisymmetric_normalization' (328) panicked at crates/idenso/src/color/test/form_reference.rs:171:5:
  142. 19.09 s gammaloop-nextest-spenso> assertion `left == right` failed
  143. 19.09 s gammaloop-nextest-spenso> left: "-1*f(coad(8,standalone_metric_j),coad(8,standalone_metric_s),coad(8,standalone_metric_u))"
  144. 19.09 s gammaloop-nextest-spenso> right: "f(coad(8,standalone_metric_j),coad(8,standalone_metric_s),coad(8,standalone_metric_u))"
  145. 19.09 s gammaloop-nextest-spenso> stack backtrace:
  146. 19.09 s gammaloop-nextest-spenso> 0: __rustc::rust_begin_unwind
  147. 19.09 s gammaloop-nextest-spenso> 1: core::panicking::panic_fmt
  148. 19.09 s gammaloop-nextest-spenso> 2: core::panicking::assert_failed_inner
  149. 19.09 s gammaloop-nextest-spenso> 3: core::panicking::assert_failed::<alloc::string::String, alloc::string::String>
  150. 19.09 s gammaloop-nextest-spenso> 4: idenso::color::test::form_reference::metric_contraction_respects_antisymmetric_normalization
  151. 19.09 s gammaloop-nextest-spenso> 5: <idenso::color::test::form_reference::metric_contraction_respects_antisymmetric_normalization::{closure#0} as core::ops::function::FnOnce<()>>::call_once
  152. 19.09 s gammaloop-nextest-spenso> note: Some details are omitted, run with `RUST_BACKTRACE=full` for a verbose backtrace.
  153. 19.09 s gammaloop-nextest-spenso>
  154. 19.09 s gammaloop-nextest-spenso> FAIL [ 0.113s] (221/224) idenso tensor::tests::parsing::infinite_execution
  155. 19.09 s gammaloop-nextest-spenso> stdout ---
  156. 19.09 s gammaloop-nextest-spenso>
  157. 19.09 s gammaloop-nextest-spenso> running 1 test
  158. 19.09 s gammaloop-nextest-spenso> ━━━━━━━━━━━━━━━━━━━━━━━━━━━━━━━ Snapshot Summary ━━━━━━━━━━━━━━━━━━━━━━━━━━━━━━━
  159. 19.09 s gammaloop-nextest-spenso> Snapshot: infinite_execution
  160. 19.09 s gammaloop-nextest-spenso> Source: crates/idenso/src/tensor/tests/parsing.rs:910
  161. 19.09 s gammaloop-nextest-spenso> ────────────────────────────────────────────────────────────────────────────────
  162. 19.09 s gammaloop-nextest-spenso> Expression: net_iter.snapshot_dot()
  163. 19.09 s gammaloop-nextest-spenso> ────────────────────────────────────────────────────────────────────────────────
  164. 19.09 s gammaloop-nextest-spenso> -old snapshot
  165. 19.09 s gammaloop-nextest-spenso> +new results
  166. 19.09 s gammaloop-nextest-spenso> ────────────┬───────────────────────────────────────────────────────────────────
  167. 19.09 s gammaloop-nextest-spenso> 8 8 │ 0:0:s -> ext0 [id=0 color="red"];
  168. 19.09 s gammaloop-nextest-spenso> 9 9 │ ext1 [style=invis];
  169. 19.09 s gammaloop-nextest-spenso> 10 10 │ 0:5:s -> ext1 [id=1 dir=none color="red" label="mink4|l_0"];
  170. 19.09 s gammaloop-nextest-spenso> 11 11 │ ext2 [style=invis];
  171. 19.09 s gammaloop-nextest-spenso> 12 │- 0:4:s -> ext2 [id=2 dir=none color="red" label="bis4|l_2"];
  172. 19.09 s gammaloop-nextest-spenso> 12 │+ 0:3:s -> ext2 [id=2 dir=none color="red" label="mink4|l_1"];
  173. 19.09 s gammaloop-nextest-spenso> 13 13 │ ext3 [style=invis];
  174. 19.09 s gammaloop-nextest-spenso> 14 │- 0:3:s -> ext3 [id=3 dir=none color="red" label="bis4|l_3"];
  175. 19.09 s gammaloop-nextest-spenso> 14 │+ 0:1:s -> ext3 [id=3 dir=none color="red" label="bis4|l_2"];
  176. 19.09 s gammaloop-nextest-spenso> 15 15 │ ext4 [style=invis];
  177. 19.09 s gammaloop-nextest-spenso> 16 │- 0:1:s -> ext4 [id=4 dir=none color="red" label="mink4|l_1"];
  178. 19.09 s gammaloop-nextest-spenso> 16 │+ 0:2:s -> ext4 [id=4 dir=none color="red" label="mink4|l_4"];
  179. 19.09 s gammaloop-nextest-spenso> 17 17 │ ext5 [style=invis];
  180. 19.09 s gammaloop-nextest-spenso> 18 │- 0:2:s -> ext5 [id=5 dir=none color="red" label="mink4|l_4"];
  181. 19.09 s gammaloop-nextest-spenso> 18 │+ 0:4:s -> ext5 [id=5 dir=none color="red" label="bis4|l_3"];
  182. 19.09 s gammaloop-nextest-spenso> 19 19 │ }
  183. 19.09 s gammaloop-nextest-spenso> ────────────┴───────────────────────────────────────────────────────────────────
  184. 19.09 s gammaloop-nextest-spenso> To update snapshots run `cargo insta review`
  185. 19.09 s gammaloop-nextest-spenso> Stopped on the first failure. Run `cargo insta test` to run all snapshots.
  186. 19.09 s gammaloop-nextest-spenso> test tensor::tests::parsing::infinite_execution ... FAILED
  187. 19.09 s gammaloop-nextest-spenso>
  188. 19.09 s gammaloop-nextest-spenso> failures:
  189. 19.09 s gammaloop-nextest-spenso>
  190. 19.09 s gammaloop-nextest-spenso> failures:
  191. 19.09 s gammaloop-nextest-spenso> tensor::tests::parsing::infinite_execution
  192. 19.09 s gammaloop-nextest-spenso>
  193. 19.09 s gammaloop-nextest-spenso> test result: FAILED. 0 passed; 1 failed; 0 ignored; 0 measured; 240 filtered out; finished in 0.11s
  194. 19.09 s gammaloop-nextest-spenso>
  195. 19.09 s gammaloop-nextest-spenso> stderr ---
  196. 19.09 s gammaloop-nextest-spenso>
  197. 19.09 s gammaloop-nextest-spenso> thread 'tensor::tests::parsing::infinite_execution' (849) panicked at /nix/store/qfja7nrd2p2n5iyvhzfjypcarnhpb7g4-vendor-cargo-deps/c19b7c6f923b580ac259164a89f2577984ad5ab09ee9d583b888f934adbbe8d0/insta-1.47.2/src/runtime.rs:719:13:
  198. 19.09 s gammaloop-nextest-spenso> snapshot assertion for 'infinite_execution' failed in line 910
  199. 19.09 s gammaloop-nextest-spenso> stack backtrace:
  200. 19.09 s gammaloop-nextest-spenso> 0: __rustc::rust_begin_unwind
  201. 19.09 s gammaloop-nextest-spenso> 1: core::panicking::panic_fmt
  202. 19.09 s gammaloop-nextest-spenso> 2: insta::runtime::assert_snapshot
  203. 19.09 s gammaloop-nextest-spenso> 3: idenso::tensor::tests::parsing::infinite_execution
  204. 19.09 s gammaloop-nextest-spenso> 4: <idenso::tensor::tests::parsing::infinite_execution::{closure#0} as core::ops::function::FnOnce<()>>::call_once
  205. 19.09 s gammaloop-nextest-spenso> note: Some details are omitted, run with `RUST_BACKTRACE=full` for a verbose backtrace.
  206. 19.09 s gammaloop-nextest-spenso>
  207. 19.12 s gammaloop-nextest-spenso> error: test run failed
  208. 19.14 s gammaloop-nextest-spenso>
  209. 19.14 s gammaloop-nextest-spenso> ========== nextest test summary ==========
  210. 19.14 s gammaloop-nextest-spenso> report: target/nextest/ci_gammaloop/junit.xml
  211. 19.14 s gammaloop-nextest-spenso> tests: 224, failures: 2, errors: 0
  212. 19.14 s gammaloop-nextest-spenso>
  213. 19.14 s gammaloop-nextest-spenso> 1. idenso::color::test::form_reference::metric_contraction_respects_antisymmetric_normalization
  214. 19.14 s gammaloop-nextest-spenso> failure: test failure with exit code 101
  215. 19.14 s gammaloop-nextest-spenso> thread 'color::test::form_reference::metric_contraction_respects_antisymmetric_normalization' (328) panicked at crates/idenso/src/color/test/form_reference.rs:171:5:
  216. 19.14 s gammaloop-nextest-spenso> assertion `left == right` failed
  217. 19.14 s gammaloop-nextest-spenso> left: "-1*f(coad(8,standalone_metric_j),coad(8,standalone_metric_s),coad(8,standalone_metric_u))"
  218. 19.14 s gammaloop-nextest-spenso> right: "f(coad(8,standalone_metric_j),coad(8,standalone_metric_s),coad(8,standalone_metric_u))"
  219. 19.14 s gammaloop-nextest-spenso> stack backtrace:
  220. 19.14 s gammaloop-nextest-spenso> 0: __rustc::rust_begin_unwind
  221. 19.14 s gammaloop-nextest-spenso> 1: core::panicking::panic_fmt
  222. 19.14 s gammaloop-nextest-spenso> 2: core::panicking::assert_failed_inner
  223. 19.14 s gammaloop-nextest-spenso> 3: core::panicking::assert_failed::<alloc::string::String, alloc::string::String>
  224. 19.14 s gammaloop-nextest-spenso> 4: idenso::color::test::form_reference::metric_contraction_respects_antisymmetric_normalization
  225. 19.14 s gammaloop-nextest-spenso> 5: <idenso::color::test::form_reference::metric_contraction_respects_antisymmetric_normalization::{closure#0} as core::ops::function::FnOnce<()>>::call_once
  226. 19.14 s gammaloop-nextest-spenso> note: Some details are omitted, run with `RUST_BACKTRACE=full` for a verbose backtrace.
  227. 19.14 s gammaloop-nextest-spenso> system-out
  228. 19.14 s gammaloop-nextest-spenso> running 1 test
  229. 19.14 s gammaloop-nextest-spenso> test color::test::form_reference::metric_contraction_respects_antisymmetric_normalization ... FAILED
  230. 19.14 s gammaloop-nextest-spenso>
  231. 19.14 s gammaloop-nextest-spenso> failures:
  232. 19.14 s gammaloop-nextest-spenso>
  233. 19.14 s gammaloop-nextest-spenso> failures:
  234. 19.14 s gammaloop-nextest-spenso> color::test::form_reference::metric_contraction_respects_antisymmetric_normalization
  235. 19.14 s gammaloop-nextest-spenso>
  236. 19.14 s gammaloop-nextest-spenso> test result: FAILED. 0 passed; 1 failed; 0 ignored; 0 measured; 240 filtered out; finished in 0.00s
  237. 19.14 s gammaloop-nextest-spenso> system-err
  238. 19.14 s gammaloop-nextest-spenso> thread 'color::test::form_reference::metric_contraction_respects_antisymmetric_normalization' (328) panicked at crates/idenso/src/color/test/form_reference.rs:171:5:
  239. 19.14 s gammaloop-nextest-spenso> assertion `left == right` failed
  240. 19.14 s gammaloop-nextest-spenso> left: "-1*f(coad(8,standalone_metric_j),coad(8,standalone_metric_s),coad(8,standalone_metric_u))"
  241. 19.14 s gammaloop-nextest-spenso> right: "f(coad(8,standalone_metric_j),coad(8,standalone_metric_s),coad(8,standalone_metric_u))"
  242. 19.14 s gammaloop-nextest-spenso> stack backtrace:
  243. 19.14 s gammaloop-nextest-spenso> 0: __rustc::rust_begin_unwind
  244. 19.14 s gammaloop-nextest-spenso> 1: core::panicking::panic_fmt
  245. 19.14 s gammaloop-nextest-spenso> 2: core::panicking::assert_failed_inner
  246. 19.14 s gammaloop-nextest-spenso> 3: core::panicking::assert_failed::<alloc::string::String, alloc::string::String>
  247. 19.14 s gammaloop-nextest-spenso> 4: idenso::color::test::form_reference::metric_contraction_respects_antisymmetric_normalization
  248. 19.14 s gammaloop-nextest-spenso> 5: <idenso::color::test::form_reference::metric_contraction_respects_antisymmetric_normalization::{closure#0} as core::ops::function::FnOnce<()>>::call_once
  249. 19.14 s gammaloop-nextest-spenso> note: Some details are omitted, run with `RUST_BACKTRACE=full` for a verbose backtrace.
  250. 19.14 s gammaloop-nextest-spenso>
  251. 19.14 s gammaloop-nextest-spenso> 2. idenso::tensor::tests::parsing::infinite_execution
  252. 19.14 s gammaloop-nextest-spenso> failure: test failure with exit code 101
  253. 19.14 s gammaloop-nextest-spenso> thread 'tensor::tests::parsing::infinite_execution' (849) panicked at /nix/store/qfja7nrd2p2n5iyvhzfjypcarnhpb7g4-vendor-cargo-deps/c19b7c6f923b580ac259164a89f2577984ad5ab09ee9d583b888f934adbbe8d0/insta-1.47.2/src/runtime.rs:719:13:
  254. 19.14 s gammaloop-nextest-spenso> snapshot assertion for 'infinite_execution' failed in line 910
  255. 19.14 s gammaloop-nextest-spenso> stack backtrace:
  256. 19.14 s gammaloop-nextest-spenso> 0: __rustc::rust_begin_unwind
  257. 19.14 s gammaloop-nextest-spenso> 1: core::panicking::panic_fmt
  258. 19.14 s gammaloop-nextest-spenso> 2: insta::runtime::assert_snapshot
  259. 19.14 s gammaloop-nextest-spenso> 3: idenso::tensor::tests::parsing::infinite_execution
  260. 19.14 s gammaloop-nextest-spenso> 4: <idenso::tensor::tests::parsing::infinite_execution::{closure#0} as core::ops::function::FnOnce<()>>::call_once
  261. 19.14 s gammaloop-nextest-spenso> note: Some details are omitted, run with `RUST_BACKTRACE=full` for a verbose backtrace.
  262. 19.14 s gammaloop-nextest-spenso> system-out
  263. 19.14 s gammaloop-nextest-spenso> running 1 test
  264. 19.14 s gammaloop-nextest-spenso> ━━━━━━━━━━━━━━━━━━━━━━━━━━━━━━━ Snapshot Summary ━━━━━━━━━━━━━━━━━━━━━━━━━━━━━━━
  265. 19.14 s gammaloop-nextest-spenso> Snapshot: infinite_execution
  266. 19.14 s gammaloop-nextest-spenso> Source: crates/idenso/src/tensor/tests/parsing.rs:910
  267. 19.14 s gammaloop-nextest-spenso> ────────────────────────────────────────────────────────────────────────────────
  268. 19.14 s gammaloop-nextest-spenso> Expression: net_iter.snapshot_dot()
  269. 19.14 s gammaloop-nextest-spenso> ────────────────────────────────────────────────────────────────────────────────
  270. 19.14 s gammaloop-nextest-spenso> -old snapshot
  271. 19.14 s gammaloop-nextest-spenso> +new results
  272. 19.14 s gammaloop-nextest-spenso> ────────────┬───────────────────────────────────────────────────────────────────
  273. 19.14 s gammaloop-nextest-spenso> 8 8 │ 0:0:s-> ext0 [id=0 color="red"];
  274. 19.14 s gammaloop-nextest-spenso> 9 9 │ ext1 [style=invis];
  275. 19.14 s gammaloop-nextest-spenso> 10 10 │ 0:5:s-> ext1 [id=1 dir=none color="red" label="mink4|l_0"];
  276. 19.14 s gammaloop-nextest-spenso> 11 11 │ ext2 [style=invis];
  277. 19.14 s gammaloop-nextest-spenso> 12 │- 0:4:s-> ext2 [id=2 dir=none color="red" label="bis4|l_2"];
  278. 19.14 s gammaloop-nextest-spenso> 12 │+ 0:3:s-> ext2 [id=2 dir=none color="red" label="mink4|l_1"];
  279. 19.14 s gammaloop-nextest-spenso> 13 13 │ ext3 [style=invis];
  280. 19.14 s gammaloop-nextest-spenso> 14 │- 0:3:s-> ext3 [id=3 dir=none color="red" label="bis4|l_3"];
  281. 19.14 s gammaloop-nextest-spenso> 14 │+ 0:1:s-> ext3 [id=3 dir=none color="red" label="bis4|l_2"];
  282. 19.14 s gammaloop-nextest-spenso> 15 15 │ ext4 [style=invis];
  283. 19.14 s gammaloop-nextest-spenso> 16 │- 0:1:s-> ext4 [id=4 dir=none color="red" label="mink4|l_1"];
  284. 19.14 s gammaloop-nextest-spenso> 16 │+ 0:2:s-> ext4 [id=4 dir=none color="red" label="mink4|l_4"];
  285. 19.14 s gammaloop-nextest-spenso> 17 17 │ ext5 [style=invis];
  286. 19.14 s gammaloop-nextest-spenso> 18 │- 0:2:s-> ext5 [id=5 dir=none color="red" label="mink4|l_4"];
  287. 19.14 s gammaloop-nextest-spenso> 18 │+ 0:4:s-> ext5 [id=5 dir=none color="red" label="bis4|l_3"];
  288. 19.14 s gammaloop-nextest-spenso> 19 19 │ }
  289. 19.14 s gammaloop-nextest-spenso> ────────────┴───────────────────────────────────────────────────────────────────
  290. 19.14 s gammaloop-nextest-spenso> To update snapshots run `cargo insta review`
  291. 19.14 s gammaloop-nextest-spenso> Stopped on the first failure. Run `cargo insta test` to run all snapshots.
  292. 19.14 s gammaloop-nextest-spenso> test tensor::tests::parsing::infinite_execution ... FAILED
  293. 19.14 s gammaloop-nextest-spenso>
  294. 19.14 s gammaloop-nextest-spenso> failures:
  295. 19.14 s gammaloop-nextest-spenso>
  296. 19.14 s gammaloop-nextest-spenso> failures:
  297. 19.14 s gammaloop-nextest-spenso> tensor::tests::parsing::infinite_execution
  298. 19.14 s gammaloop-nextest-spenso>
  299. 19.14 s gammaloop-nextest-spenso> test result: FAILED. 0 passed; 1 failed; 0 ignored; 0 measured; 240 filtered out; finished in 0.11s
  300. 19.14 s gammaloop-nextest-spenso> system-err
  301. 19.14 s gammaloop-nextest-spenso> thread 'tensor::tests::parsing::infinite_execution' (849) panicked at /nix/store/qfja7nrd2p2n5iyvhzfjypcarnhpb7g4-vendor-cargo-deps/c19b7c6f923b580ac259164a89f2577984ad5ab09ee9d583b888f934adbbe8d0/insta-1.47.2/src/runtime.rs:719:13:
  302. 19.14 s gammaloop-nextest-spenso> snapshot assertion for 'infinite_execution' failed in line 910
  303. 19.14 s gammaloop-nextest-spenso> stack backtrace:
  304. 19.14 s gammaloop-nextest-spenso> 0: __rustc::rust_begin_unwind
  305. 19.14 s gammaloop-nextest-spenso> 1: core::panicking::panic_fmt
  306. 19.14 s gammaloop-nextest-spenso> 2: insta::runtime::assert_snapshot
  307. 19.14 s gammaloop-nextest-spenso> 3: idenso::tensor::tests::parsing::infinite_execution
  308. 19.14 s gammaloop-nextest-spenso> 4: <idenso::tensor::tests::parsing::infinite_execution::{closure#0} as core::ops::function::FnOnce<()>>::call_once
  309. 19.14 s gammaloop-nextest-spenso> note: Some details are omitted, run with `RUST_BACKTRACE=full` for a verbose backtrace.
  310. 19.14 s gammaloop-nextest-spenso> =========================================
  311. 19.15 s gammaloop-nextest-spenso> Extracting 2 binaries and 1 linked path to /build/nextest-archive-kUzMB1
  312. 19.22 s gammaloop-nextest-spenso> Extracted 8 files to /build/nextest-archive-kUzMB1 in 0.07s
  313. 19.23 s gammaloop-nextest-spenso> ------------
  314. 19.23 s gammaloop-nextest-spenso> Nextest run ID 8382c2db-4fad-4509-b7e7-533ccb6283d6 with nextest profile: ci_gammaloop
  315. 19.23 s gammaloop-nextest-spenso> Starting 135 tests across 2 binaries
  316. 19.31 s gammaloop-nextest-spenso> ------------
  317. 19.31 s gammaloop-nextest-spenso> Summary [ 0.078s] 135 tests run: 135 passed, 0 skipped
  318. 19.34 s gammaloop-nextest-spenso>
  319. 19.34 s gammaloop-nextest-spenso> ========== nextest test summary ==========
  320. 19.34 s gammaloop-nextest-spenso> report: target/nextest/ci_gammaloop/junit.xml
  321. 19.34 s gammaloop-nextest-spenso> tests: 135, failures: 0, errors: 0
  322. 19.34 s gammaloop-nextest-spenso> No failing testcases found.
  323. 19.34 s gammaloop-nextest-spenso> =========================================
  324. 19.36 s gammaloop-nextest-spenso> Extracting 5 binaries and 2 linked paths to /build/nextest-archive-TAxXD7
  325. 19.53 s gammaloop-nextest-spenso> Extracted 19 files to /build/nextest-archive-TAxXD7 in 0.18s
  326. 19.54 s gammaloop-nextest-spenso> ------------
  327. 19.54 s gammaloop-nextest-spenso> Nextest run ID 8bd9b412-cf5e-4ebc-b0af-6f15f7fdd999 with nextest profile: ci_gammaloop
  328. 19.54 s gammaloop-nextest-spenso> Starting 25 tests across 5 binaries (1 test skipped via profile.ci_gammaloop.default-filter)
  329. 19.73 s gammaloop-nextest-spenso> ------------
  330. 19.73 s gammaloop-nextest-spenso> Summary [ 0.182s] 25 tests run: 25 passed, 1 skipped
  331. 19.78 s gammaloop-nextest-spenso>
  332. 19.78 s gammaloop-nextest-spenso> ========== nextest test summary ==========
  333. 19.78 s gammaloop-nextest-spenso> report: target/nextest/ci_gammaloop/junit.xml
  334. 19.78 s gammaloop-nextest-spenso> tests: 25, failures: 0, errors: 0
  335. 19.78 s gammaloop-nextest-spenso> No failing testcases found.
  336. 19.78 s gammaloop-nextest-spenso> =========================================
  337. 19.79 s gammaloop-nextest-spenso> Extracting 2 binaries and 1 linked path to /build/nextest-archive-Q1rqvy
  338. 19.84 s gammaloop-nextest-spenso> Extracted 8 files to /build/nextest-archive-Q1rqvy in 0.05s
  339. 19.85 s gammaloop-nextest-spenso> ------------
  340. 19.85 s gammaloop-nextest-spenso> Nextest run ID 5bd67d0b-016a-472e-94fe-b1fb5cd8d4fd with nextest profile: ci_gammaloop
  341. 19.85 s gammaloop-nextest-spenso> Starting 1 test across 2 binaries
  342. 19.86 s gammaloop-nextest-spenso> ------------
  343. 19.86 s gammaloop-nextest-spenso> Summary [ 0.005s] 1 test run: 1 passed, 0 skipped
  344. 19.89 s gammaloop-nextest-spenso>
  345. 19.89 s gammaloop-nextest-spenso> ========== nextest test summary ==========
  346. 19.89 s gammaloop-nextest-spenso> report: target/nextest/ci_gammaloop/junit.xml
  347. 19.89 s gammaloop-nextest-spenso> tests: 1, failures: 0, errors: 0
  348. 19.89 s gammaloop-nextest-spenso> No failing testcases found.
  349. 19.89 s gammaloop-nextest-spenso> =========================================
  350. 19.90 s gammaloop-nextest-spenso> Extracting 1 binary and 1 linked path to /build/nextest-archive-LQhSCq
  351. 19.95 s gammaloop-nextest-spenso> Extracted 7 files to /build/nextest-archive-LQhSCq in 0.05s
  352. 19.96 s gammaloop-nextest-spenso> ------------
  353. 19.96 s gammaloop-nextest-spenso> Nextest run ID 27640993-8c43-4717-adc9-7337f2d984f5 with nextest profile: ci_gammaloop
  354. 19.96 s gammaloop-nextest-spenso> Starting 0 tests across 1 binary
  355. 19.96 s gammaloop-nextest-spenso> ------------
  356. 19.96 s gammaloop-nextest-spenso> Summary [ 0.000s] 0 tests run: 0 passed, 0 skipped
  357. 19.99 s gammaloop-nextest-spenso>
  358. 19.99 s gammaloop-nextest-spenso> ========== nextest test summary ==========
  359. 19.99 s gammaloop-nextest-spenso> report: target/nextest/ci_gammaloop/junit.xml
  360. 19.99 s gammaloop-nextest-spenso> tests: 0, failures: 0, errors: 0
  361. 19.99 s gammaloop-nextest-spenso> No failing testcases found.
  362. 19.99 s gammaloop-nextest-spenso> =========================================
  363. 20.02 s error: Cannot build '/nix/store/hk3irrympzq7agrqvi8g99r01gw6v0g3-gammaloop-nextest-spenso.drv'.
  364. 20.02 s Reason: builder failed with exit code 100.
  365. 20.02 s Output paths:
  366. 20.02 s /nix/store/wcjln4hqsq5j381kylbbk9axpkb95zxm-gammaloop-nextest-spenso
  367. 20.02 s Last 325 log lines:
  368. 20.02 s > Extracting 5 binaries and 2 linked paths to /build/nextest-archive-sLARIL
  369. 20.02 s > Extracted 19 files to /build/nextest-archive-sLARIL in 0.16s
  370. 20.02 s > ------------
  371. 20.02 s > Nextest run ID 083148e9-d592-4409-aae5-f59c75ba90af with nextest profile: ci_gammaloop
  372. 20.02 s > Starting 224 tests across 5 binaries (26 tests skipped, including 2 tests via profile.ci_gammaloop.default-filter)
  373. 20.02 s > FAIL [ 0.011s] ( 44/224) idenso color::test::form_reference::metric_contraction_respects_antisymmetric_normalization
  374. 20.02 s > stdout ---
  375. 20.02 s >
  376. 20.02 s > running 1 test
  377. 20.02 s > test color::test::form_reference::metric_contraction_respects_antisymmetric_normalization ... FAILED
  378. 20.02 s >
  379. 20.02 s > failures:
  380. 20.02 s >
  381. 20.02 s > failures:
  382. 20.02 s > color::test::form_reference::metric_contraction_respects_antisymmetric_normalization
  383. 20.02 s >
  384. 20.02 s > test result: FAILED. 0 passed; 1 failed; 0 ignored; 0 measured; 240 filtered out; finished in 0.00s
  385. 20.02 s >
  386. 20.02 s > stderr ---
  387. 20.02 s >
  388. 20.02 s > thread 'color::test::form_reference::metric_contraction_respects_antisymmetric_normalization' (328) panicked at crates/idenso/src/color/test/form_reference.rs:171:5:
  389. 20.02 s > assertion `left == right` failed
  390. 20.02 s > left: "-1*f(coad(8,standalone_metric_j),coad(8,standalone_metric_s),coad(8,standalone_metric_u))"
  391. 20.02 s > right: "f(coad(8,standalone_metric_j),coad(8,standalone_metric_s),coad(8,standalone_metric_u))"
  392. 20.02 s > stack backtrace:
  393. 20.02 s > 0: __rustc::rust_begin_unwind
  394. 20.02 s > 1: core::panicking::panic_fmt
  395. 20.02 s > 2: core::panicking::assert_failed_inner
  396. 20.02 s > 3: core::panicking::assert_failed::<alloc::string::String, alloc::string::String>
  397. 20.02 s > 4: idenso::color::test::form_reference::metric_contraction_respects_antisymmetric_normalization
  398. 20.02 s > 5: <idenso::color::test::form_reference::metric_contraction_respects_antisymmetric_normalization::{closure#0} as core::ops::function::FnOnce<()>>::call_once
  399. 20.02 s > note: Some details are omitted, run with `RUST_BACKTRACE=full` for a verbose backtrace.
  400. 20.02 s >
  401. 20.02 s > FAIL [ 0.113s] (221/224) idenso tensor::tests::parsing::infinite_execution
  402. 20.02 s > stdout ---
  403. 20.02 s >
  404. 20.02 s > running 1 test
  405. 20.02 s > ━━━━━━━━━━━━━━━━━━━━━━━━━━━━━━━ Snapshot Summary ━━━━━━━━━━━━━━━━━━━━━━━━━━━━━━━
  406. 20.02 s > Snapshot: infinite_execution
  407. 20.02 s > Source: crates/idenso/src/tensor/tests/parsing.rs:910
  408. 20.02 s > ────────────────────────────────────────────────────────────────────────────────
  409. 20.02 s > Expression: net_iter.snapshot_dot()
  410. 20.02 s > ────────────────────────────────────────────────────────────────────────────────
  411. 20.02 s > -old snapshot
  412. 20.02 s > +new results
  413. 20.02 s > ────────────┬───────────────────────────────────────────────────────────────────
  414. 20.02 s > 8 8 │ 0:0:s -> ext0 [id=0 color="red"];
  415. 20.02 s > 9 9 │ ext1 [style=invis];
  416. 20.02 s > 10 10 │ 0:5:s -> ext1 [id=1 dir=none color="red" label="mink4|l_0"];
  417. 20.02 s > 11 11 │ ext2 [style=invis];
  418. 20.02 s > 12 │- 0:4:s -> ext2 [id=2 dir=none color="red" label="bis4|l_2"];
  419. 20.02 s > 12 │+ 0:3:s -> ext2 [id=2 dir=none color="red" label="mink4|l_1"];
  420. 20.02 s > 13 13 │ ext3 [style=invis];
  421. 20.02 s > 14 │- 0:3:s -> ext3 [id=3 dir=none color="red" label="bis4|l_3"];
  422. 20.02 s > 14 │+ 0:1:s -> ext3 [id=3 dir=none color="red" label="bis4|l_2"];
  423. 20.02 s > 15 15 │ ext4 [style=invis];
  424. 20.02 s > 16 │- 0:1:s -> ext4 [id=4 dir=none color="red" label="mink4|l_1"];
  425. 20.02 s > 16 │+ 0:2:s -> ext4 [id=4 dir=none color="red" label="mink4|l_4"];
  426. 20.02 s > 17 17 │ ext5 [style=invis];
  427. 20.02 s > 18 │- 0:2:s -> ext5 [id=5 dir=none color="red" label="mink4|l_4"];
  428. 20.02 s > 18 │+ 0:4:s -> ext5 [id=5 dir=none color="red" label="bis4|l_3"];
  429. 20.02 s > 19 19 │ }
  430. 20.02 s > ────────────┴───────────────────────────────────────────────────────────────────
  431. 20.02 s > To update snapshots run `cargo insta review`
  432. 20.02 s > Stopped on the first failure. Run `cargo insta test` to run all snapshots.
  433. 20.02 s > test tensor::tests::parsing::infinite_execution ... FAILED
  434. 20.02 s >
  435. 20.02 s > failures:
  436. 20.02 s >
  437. 20.02 s > failures:
  438. 20.02 s > tensor::tests::parsing::infinite_execution
  439. 20.02 s >
  440. 20.02 s > test result: FAILED. 0 passed; 1 failed; 0 ignored; 0 measured; 240 filtered out; finished in 0.11s
  441. 20.02 s >
  442. 20.02 s > stderr ---
  443. 20.02 s >
  444. 20.02 s > thread 'tensor::tests::parsing::infinite_execution' (849) panicked at /nix/store/qfja7nrd2p2n5iyvhzfjypcarnhpb7g4-vendor-cargo-deps/c19b7c6f923b580ac259164a89f2577984ad5ab09ee9d583b888f934adbbe8d0/insta-1.47.2/src/runtime.rs:719:13:
  445. 20.02 s > snapshot assertion for 'infinite_execution' failed in line 910
  446. 20.02 s > stack backtrace:
  447. 20.02 s > 0: __rustc::rust_begin_unwind
  448. 20.02 s > 1: core::panicking::panic_fmt
  449. 20.02 s > 2: insta::runtime::assert_snapshot
  450. 20.02 s > 3: idenso::tensor::tests::parsing::infinite_execution
  451. 20.02 s > 4: <idenso::tensor::tests::parsing::infinite_execution::{closure#0} as core::ops::function::FnOnce<()>>::call_once
  452. 20.02 s > note: Some details are omitted, run with `RUST_BACKTRACE=full` for a verbose backtrace.
  453. 20.02 s >
  454. 20.02 s > ------------
  455. 20.02 s > Summary [ 1.541s] 224 tests run: 222 passed, 2 failed, 26 skipped
  456. 20.02 s > FAIL [ 0.011s] ( 44/224) idenso color::test::form_reference::metric_contraction_respects_antisymmetric_normalization
  457. 20.02 s > stdout ---
  458. 20.02 s >
  459. 20.02 s > running 1 test
  460. 20.02 s > test color::test::form_reference::metric_contraction_respects_antisymmetric_normalization ... FAILED
  461. 20.02 s >
  462. 20.02 s > failures:
  463. 20.02 s >
  464. 20.02 s > failures:
  465. 20.02 s > color::test::form_reference::metric_contraction_respects_antisymmetric_normalization
  466. 20.02 s >
  467. 20.02 s > test result: FAILED. 0 passed; 1 failed; 0 ignored; 0 measured; 240 filtered out; finished in 0.00s
  468. 20.02 s >
  469. 20.02 s > stderr ---
  470. 20.02 s >
  471. 20.02 s > thread 'color::test::form_reference::metric_contraction_respects_antisymmetric_normalization' (328) panicked at crates/idenso/src/color/test/form_reference.rs:171:5:
  472. 20.02 s > assertion `left == right` failed
  473. 20.02 s > left: "-1*f(coad(8,standalone_metric_j),coad(8,standalone_metric_s),coad(8,standalone_metric_u))"
  474. 20.02 s > right: "f(coad(8,standalone_metric_j),coad(8,standalone_metric_s),coad(8,standalone_metric_u))"
  475. 20.02 s > stack backtrace:
  476. 20.02 s > 0: __rustc::rust_begin_unwind
  477. 20.02 s > 1: core::panicking::panic_fmt
  478. 20.02 s > 2: core::panicking::assert_failed_inner
  479. 20.02 s > 3: core::panicking::assert_failed::<alloc::string::String, alloc::string::String>
  480. 20.02 s > 4: idenso::color::test::form_reference::metric_contraction_respects_antisymmetric_normalization
  481. 20.02 s > 5: <idenso::color::test::form_reference::metric_contraction_respects_antisymmetric_normalization::{closure#0} as core::ops::function::FnOnce<()>>::call_once
  482. 20.02 s > note: Some details are omitted, run with `RUST_BACKTRACE=full` for a verbose backtrace.
  483. 20.02 s >
  484. 20.02 s > FAIL [ 0.113s] (221/224) idenso tensor::tests::parsing::infinite_execution
  485. 20.02 s > stdout ---
  486. 20.02 s >
  487. 20.02 s > running 1 test
  488. 20.02 s > ━━━━━━━━━━━━━━━━━━━━━━━━━━━━━━━ Snapshot Summary ━━━━━━━━━━━━━━━━━━━━━━━━━━━━━━━
  489. 20.02 s > Snapshot: infinite_execution
  490. 20.02 s > Source: crates/idenso/src/tensor/tests/parsing.rs:910
  491. 20.02 s > ────────────────────────────────────────────────────────────────────────────────
  492. 20.02 s > Expression: net_iter.snapshot_dot()
  493. 20.02 s > ────────────────────────────────────────────────────────────────────────────────
  494. 20.02 s > -old snapshot
  495. 20.02 s > +new results
  496. 20.02 s > ────────────┬───────────────────────────────────────────────────────────────────
  497. 20.02 s > 8 8 │ 0:0:s -> ext0 [id=0 color="red"];
  498. 20.02 s > 9 9 │ ext1 [style=invis];
  499. 20.02 s > 10 10 │ 0:5:s -> ext1 [id=1 dir=none color="red" label="mink4|l_0"];
  500. 20.02 s > 11 11 │ ext2 [style=invis];
  501. 20.02 s > 12 │- 0:4:s -> ext2 [id=2 dir=none color="red" label="bis4|l_2"];
  502. 20.02 s > 12 │+ 0:3:s -> ext2 [id=2 dir=none color="red" label="mink4|l_1"];
  503. 20.02 s > 13 13 │ ext3 [style=invis];
  504. 20.02 s > 14 │- 0:3:s -> ext3 [id=3 dir=none color="red" label="bis4|l_3"];
  505. 20.02 s > 14 │+ 0:1:s -> ext3 [id=3 dir=none color="red" label="bis4|l_2"];
  506. 20.02 s > 15 15 │ ext4 [style=invis];
  507. 20.02 s > 16 │- 0:1:s -> ext4 [id=4 dir=none color="red" label="mink4|l_1"];
  508. 20.02 s > 16 │+ 0:2:s -> ext4 [id=4 dir=none color="red" label="mink4|l_4"];
  509. 20.02 s > 17 17 │ ext5 [style=invis];
  510. 20.02 s > 18 │- 0:2:s -> ext5 [id=5 dir=none color="red" label="mink4|l_4"];
  511. 20.02 s > 18 │+ 0:4:s -> ext5 [id=5 dir=none color="red" label="bis4|l_3"];
  512. 20.02 s > 19 19 │ }
  513. 20.02 s > ────────────┴───────────────────────────────────────────────────────────────────
  514. 20.02 s > To update snapshots run `cargo insta review`
  515. 20.02 s > Stopped on the first failure. Run `cargo insta test` to run all snapshots.
  516. 20.02 s > test tensor::tests::parsing::infinite_execution ... FAILED
  517. 20.02 s >
  518. 20.02 s > failures:
  519. 20.02 s >
  520. 20.02 s > failures:
  521. 20.02 s > tensor::tests::parsing::infinite_execution
  522. 20.02 s >
  523. 20.02 s > test result: FAILED. 0 passed; 1 failed; 0 ignored; 0 measured; 240 filtered out; finished in 0.11s
  524. 20.02 s >
  525. 20.02 s > stderr ---
  526. 20.02 s >
  527. 20.02 s > thread 'tensor::tests::parsing::infinite_execution' (849) panicked at /nix/store/qfja7nrd2p2n5iyvhzfjypcarnhpb7g4-vendor-cargo-deps/c19b7c6f923b580ac259164a89f2577984ad5ab09ee9d583b888f934adbbe8d0/insta-1.47.2/src/runtime.rs:719:13:
  528. 20.02 s > snapshot assertion for 'infinite_execution' failed in line 910
  529. 20.02 s > stack backtrace:
  530. 20.02 s > 0: __rustc::rust_begin_unwind
  531. 20.02 s > 1: core::panicking::panic_fmt
  532. 20.02 s > 2: insta::runtime::assert_snapshot
  533. 20.02 s > 3: idenso::tensor::tests::parsing::infinite_execution
  534. 20.02 s > 4: <idenso::tensor::tests::parsing::infinite_execution::{closure#0} as core::ops::function::FnOnce<()>>::call_once
  535. 20.02 s > note: Some details are omitted, run with `RUST_BACKTRACE=full` for a verbose backtrace.
  536. 20.02 s >
  537. 20.02 s > error: test run failed
  538. 20.02 s >
  539. 20.02 s > ========== nextest test summary ==========
  540. 20.02 s > report: target/nextest/ci_gammaloop/junit.xml
  541. 20.02 s > tests: 224, failures: 2, errors: 0
  542. 20.02 s >
  543. 20.02 s > 1. idenso::color::test::form_reference::metric_contraction_respects_antisymmetric_normalization
  544. 20.02 s > failure: test failure with exit code 101
  545. 20.02 s > thread 'color::test::form_reference::metric_contraction_respects_antisymmetric_normalization' (328) panicked at crates/idenso/src/color/test/form_reference.rs:171:5:
  546. 20.02 s > assertion `left == right` failed
  547. 20.02 s > left: "-1*f(coad(8,standalone_metric_j),coad(8,standalone_metric_s),coad(8,standalone_metric_u))"
  548. 20.02 s > right: "f(coad(8,standalone_metric_j),coad(8,standalone_metric_s),coad(8,standalone_metric_u))"
  549. 20.02 s > stack backtrace:
  550. 20.02 s > 0: __rustc::rust_begin_unwind
  551. 20.02 s > 1: core::panicking::panic_fmt
  552. 20.02 s > 2: core::panicking::assert_failed_inner
  553. 20.02 s > 3: core::panicking::assert_failed::<alloc::string::String, alloc::string::String>
  554. 20.02 s > 4: idenso::color::test::form_reference::metric_contraction_respects_antisymmetric_normalization
  555. 20.02 s > 5: <idenso::color::test::form_reference::metric_contraction_respects_antisymmetric_normalization::{closure#0} as core::ops::function::FnOnce<()>>::call_once
  556. 20.02 s > note: Some details are omitted, run with `RUST_BACKTRACE=full` for a verbose backtrace.
  557. 20.02 s > system-out
  558. 20.02 s > running 1 test
  559. 20.02 s > test color::test::form_reference::metric_contraction_respects_antisymmetric_normalization ... FAILED
  560. 20.02 s >
  561. 20.02 s > failures:
  562. 20.02 s >
  563. 20.02 s > failures:
  564. 20.02 s > color::test::form_reference::metric_contraction_respects_antisymmetric_normalization
  565. 20.02 s >
  566. 20.02 s > test result: FAILED. 0 passed; 1 failed; 0 ignored; 0 measured; 240 filtered out; finished in 0.00s
  567. 20.02 s > system-err
  568. 20.02 s > thread 'color::test::form_reference::metric_contraction_respects_antisymmetric_normalization' (328) panicked at crates/idenso/src/color/test/form_reference.rs:171:5:
  569. 20.02 s > assertion `left == right` failed
  570. 20.02 s > left: "-1*f(coad(8,standalone_metric_j),coad(8,standalone_metric_s),coad(8,standalone_metric_u))"
  571. 20.02 s > right: "f(coad(8,standalone_metric_j),coad(8,standalone_metric_s),coad(8,standalone_metric_u))"
  572. 20.02 s > stack backtrace:
  573. 20.02 s > 0: __rustc::rust_begin_unwind
  574. 20.02 s > 1: core::panicking::panic_fmt
  575. 20.02 s > 2: core::panicking::assert_failed_inner
  576. 20.02 s > 3: core::panicking::assert_failed::<alloc::string::String, alloc::string::String>
  577. 20.02 s > 4: idenso::color::test::form_reference::metric_contraction_respects_antisymmetric_normalization
  578. 20.02 s > 5: <idenso::color::test::form_reference::metric_contraction_respects_antisymmetric_normalization::{closure#0} as core::ops::function::FnOnce<()>>::call_once
  579. 20.02 s > note: Some details are omitted, run with `RUST_BACKTRACE=full` for a verbose backtrace.
  580. 20.02 s >
  581. 20.02 s > 2. idenso::tensor::tests::parsing::infinite_execution
  582. 20.02 s > failure: test failure with exit code 101
  583. 20.02 s > thread 'tensor::tests::parsing::infinite_execution' (849) panicked at /nix/store/qfja7nrd2p2n5iyvhzfjypcarnhpb7g4-vendor-cargo-deps/c19b7c6f923b580ac259164a89f2577984ad5ab09ee9d583b888f934adbbe8d0/insta-1.47.2/src/runtime.rs:719:13:
  584. 20.02 s > snapshot assertion for 'infinite_execution' failed in line 910
  585. 20.02 s > stack backtrace:
  586. 20.02 s > 0: __rustc::rust_begin_unwind
  587. 20.02 s > 1: core::panicking::panic_fmt
  588. 20.02 s > 2: insta::runtime::assert_snapshot
  589. 20.02 s > 3: idenso::tensor::tests::parsing::infinite_execution
  590. 20.02 s > 4: <idenso::tensor::tests::parsing::infinite_execution::{closure#0} as core::ops::function::FnOnce<()>>::call_once
  591. 20.02 s > note: Some details are omitted, run with `RUST_BACKTRACE=full` for a verbose backtrace.
  592. 20.02 s > system-out
  593. 20.02 s > running 1 test
  594. 20.02 s > ━━━━━━━━━━━━━━━━━━━━━━━━━━━━━━━ Snapshot Summary ━━━━━━━━━━━━━━━━━━━━━━━━━━━━━━━
  595. 20.02 s > Snapshot: infinite_execution
  596. 20.02 s > Source: crates/idenso/src/tensor/tests/parsing.rs:910
  597. 20.02 s > ────────────────────────────────────────────────────────────────────────────────
  598. 20.02 s > Expression: net_iter.snapshot_dot()
  599. 20.02 s > ────────────────────────────────────────────────────────────────────────────────
  600. 20.02 s > -old snapshot
  601. 20.02 s > +new results
  602. 20.02 s > ────────────┬───────────────────────────────────────────────────────────────────
  603. 20.02 s > 8 8 │ 0:0:s-> ext0 [id=0 color="red"];
  604. 20.02 s > 9 9 │ ext1 [style=invis];
  605. 20.02 s > 10 10 │ 0:5:s-> ext1 [id=1 dir=none color="red" label="mink4|l_0"];
  606. 20.02 s > 11 11 │ ext2 [style=invis];
  607. 20.02 s > 12 │- 0:4:s-> ext2 [id=2 dir=none color="red" label="bis4|l_2"];
  608. 20.02 s > 12 │+ 0:3:s-> ext2 [id=2 dir=none color="red" label="mink4|l_1"];
  609. 20.02 s > 13 13 │ ext3 [style=invis];
  610. 20.02 s > 14 │- 0:3:s-> ext3 [id=3 dir=none color="red" label="bis4|l_3"];
  611. 20.02 s > 14 │+ 0:1:s-> ext3 [id=3 dir=none color="red" label="bis4|l_2"];
  612. 20.02 s > 15 15 │ ext4 [style=invis];
  613. 20.02 s > 16 │- 0:1:s-> ext4 [id=4 dir=none color="red" label="mink4|l_1"];
  614. 20.02 s > 16 │+ 0:2:s-> ext4 [id=4 dir=none color="red" label="mink4|l_4"];
  615. 20.02 s > 17 17 │ ext5 [style=invis];
  616. 20.02 s > 18 │- 0:2:s-> ext5 [id=5 dir=none color="red" label="mink4|l_4"];
  617. 20.02 s > 18 │+ 0:4:s-> ext5 [id=5 dir=none color="red" label="bis4|l_3"];
  618. 20.02 s > 19 19 │ }
  619. 20.02 s > ────────────┴───────────────────────────────────────────────────────────────────
  620. 20.02 s > To update snapshots run `cargo insta review`
  621. 20.02 s > Stopped on the first failure. Run `cargo insta test` to run all snapshots.
  622. 20.02 s > test tensor::tests::parsing::infinite_execution ... FAILED
  623. 20.02 s >
  624. 20.02 s > failures:
  625. 20.02 s >
  626. 20.02 s > failures:
  627. 20.02 s > tensor::tests::parsing::infinite_execution
  628. 20.02 s >
  629. 20.02 s > test result: FAILED. 0 passed; 1 failed; 0 ignored; 0 measured; 240 filtered out; finished in 0.11s
  630. 20.02 s > system-err
  631. 20.02 s > thread 'tensor::tests::parsing::infinite_execution' (849) panicked at /nix/store/qfja7nrd2p2n5iyvhzfjypcarnhpb7g4-vendor-cargo-deps/c19b7c6f923b580ac259164a89f2577984ad5ab09ee9d583b888f934adbbe8d0/insta-1.47.2/src/runtime.rs:719:13:
  632. 20.02 s > snapshot assertion for 'infinite_execution' failed in line 910
  633. 20.02 s > stack backtrace:
  634. 20.02 s > 0: __rustc::rust_begin_unwind
  635. 20.02 s > 1: core::panicking::panic_fmt
  636. 20.02 s > 2: insta::runtime::assert_snapshot
  637. 20.02 s > 3: idenso::tensor::tests::parsing::infinite_execution
  638. 20.02 s > 4: <idenso::tensor::tests::parsing::infinite_execution::{closure#0} as core::ops::function::FnOnce<()>>::call_once
  639. 20.02 s > note: Some details are omitted, run with `RUST_BACKTRACE=full` for a verbose backtrace.
  640. 20.02 s > =========================================
  641. 20.02 s > Extracting 2 binaries and 1 linked path to /build/nextest-archive-kUzMB1
  642. 20.02 s > Extracted 8 files to /build/nextest-archive-kUzMB1 in 0.07s
  643. 20.02 s > ------------
  644. 20.02 s > Nextest run ID 8382c2db-4fad-4509-b7e7-533ccb6283d6 with nextest profile: ci_gammaloop
  645. 20.02 s > Starting 135 tests across 2 binaries
  646. 20.02 s > ------------
  647. 20.02 s > Summary [ 0.078s] 135 tests run: 135 passed, 0 skipped
  648. 20.02 s >
  649. 20.02 s > ========== nextest test summary ==========
  650. 20.02 s > report: target/nextest/ci_gammaloop/junit.xml
  651. 20.02 s > tests: 135, failures: 0, errors: 0
  652. 20.02 s > No failing testcases found.
  653. 20.02 s > =========================================
  654. 20.02 s > Extracting 5 binaries and 2 linked paths to /build/nextest-archive-TAxXD7
  655. 20.02 s > Extracted 19 files to /build/nextest-archive-TAxXD7 in 0.18s
  656. 20.02 s > ------------
  657. 20.02 s > Nextest run ID 8bd9b412-cf5e-4ebc-b0af-6f15f7fdd999 with nextest profile: ci_gammaloop
  658. 20.02 s > Starting 25 tests across 5 binaries (1 test skipped via profile.ci_gammaloop.default-filter)
  659. 20.02 s > ------------
  660. 20.02 s > Summary [ 0.182s] 25 tests run: 25 passed, 1 skipped
  661. 20.02 s >
  662. 20.02 s > ========== nextest test summary ==========
  663. 20.02 s > report: target/nextest/ci_gammaloop/junit.xml
  664. 20.02 s > tests: 25, failures: 0, errors: 0
  665. 20.02 s > No failing testcases found.
  666. 20.02 s > =========================================
  667. 20.02 s > Extracting 2 binaries and 1 linked path to /build/nextest-archive-Q1rqvy
  668. 20.02 s > Extracted 8 files to /build/nextest-archive-Q1rqvy in 0.05s
  669. 20.02 s > ------------
  670. 20.02 s > Nextest run ID 5bd67d0b-016a-472e-94fe-b1fb5cd8d4fd with nextest profile: ci_gammaloop
  671. 20.02 s > Starting 1 test across 2 binaries
  672. 20.02 s > ------------
  673. 20.02 s > Summary [ 0.005s] 1 test run: 1 passed, 0 skipped
  674. 20.02 s >
  675. 20.02 s > ========== nextest test summary ==========
  676. 20.02 s > report: target/nextest/ci_gammaloop/junit.xml
  677. 20.02 s > tests: 1, failures: 0, errors: 0
  678. 20.02 s > No failing testcases found.
  679. 20.02 s > =========================================
  680. 20.02 s > Extracting 1 binary and 1 linked path to /build/nextest-archive-LQhSCq
  681. 20.02 s > Extracted 7 files to /build/nextest-archive-LQhSCq in 0.05s
  682. 20.02 s > ------------
  683. 20.02 s > Nextest run ID 27640993-8c43-4717-adc9-7337f2d984f5 with nextest profile: ci_gammaloop
  684. 20.02 s > Starting 0 tests across 1 binary
  685. 20.02 s > ------------
  686. 20.02 s > Summary [ 0.000s] 0 tests run: 0 passed, 0 skipped
  687. 20.02 s >
  688. 20.02 s > ========== nextest test summary ==========
  689. 20.02 s > report: target/nextest/ci_gammaloop/junit.xml
  690. 20.02 s > tests: 0, failures: 0, errors: 0
  691. 20.02 s > No failing testcases found.
  692. 20.02 s > =========================================
  693. 20.02 s For full logs, run:
  694. 20.02 s nix log /nix/store/hk3irrympzq7agrqvi8g99r01gw6v0g3-gammaloop-nextest-spenso.drv
  695. 20.10 s [0 built (1 failed), 0.0Run failed.