test packages.x86_64-linux.nix-ci-check-gammaloop-nextest-spenso

Reproduce this run
Retry Run
  1. 0.23 s $ /nix/store/9ypz3flqsrl5xl495mm8h645gadjsxi1-coreutils-9.11/bin/timeout --kill-after=15s 7200s /nix/store/23zk8sgzamrbmj1fday15szf7f2279s8-nix-2.34.7/bin/nix --extra-experimental-features nix-command --extra-experimental-features flakes flake clone git+https://github.com/alphal00p/gammaloop --dest /tmp/nix-ci-worker/stable-pwd/repo/
  2. 0.50 s Cloning into '/tmp/nix-ci-worker/stable-pwd/repo'...
  3. 1.56 s remote: Enumerating objects: 65321, done.
  4. 1.78 s remote: Counting objects: 0% (1/7972) remote: Counting objects: 1% (80/7972) remote: Counting objects: 2% (160/7972) remote: Counting objects: 3% (240/7972) remote: Counting objects: 4% (319/7972) remote: Counting objects: 5% (399/7972) remote: Counting objects: 6% (479/7972) remote: Counting objects: 7% (559/7972) remote: Counting objects: 8% (638/7972) remote: Counting objects: 9% (718/7972) remote: Counting objects: 10% (798/7972) remote: Counting objects: 11% (877/7972) remote: Counting objects: 12% (957/7972) remote: Counting objects: 13% (1037/7972) remote: Counting objects: 14% (1117/7972) remote: Counting objects: 15% (1196/7972) remote: Counting objects: 16% (1276/7972) remote: Counting objects: 17% (1356/7972) remote: Counting objects: 18% (1435/7972) remote: Counting objects: 19% (1515/7972) remote: Counting objects: 20% (1595/7972) remote: Counting objects: 21% (1675/7972) remote: Counting objects: 22% (1754/7972) remote: Counting objects: 23% (1834/7972) remote: Counting objects: 24% (1914/7972) remote: Counting objects: 25% (1993/7972) remote: Counting objects: 26% (2073/7972) remote: Counting objects: 27% (2153/7972) remote: Counting objects: 28% (2233/7972) remote: Counting objects: 29% (2312/7972) remote: Counting objects: 30% (2392/7972) remote: Counting objects: 31% (2472/7972) remote: Counting objects: 32% (2552/7972) remote: Counting objects: 33% (2631/7972) remote: Counting objects: 34% (2711/7972) remote: Counting objects: 35% (2791/7972) remote: Counting objects: 36% (2870/7972) remote: Counting objects: 37% (2950/7972) remote: Counting objects: 38% (3030/7972) remote: Counting objects: 39% (3110/7972) remote: Counting objects: 40% (3189/7972) remote: Counting objects: 41% (3269/7972) remote: Counting objects: 42% (3349/7972) remote: Counting objects: 43% (3428/7972) remote: Counting objects: 44% (3508/7972) remote: Counting objects: 45% (3588/7972) remote: Counting objects: 46% (3668/7972) remote: Counting objects: 47% (3747/7972) remote: Counting objects: 48% (3827/7972) remote: Counting objects: 49% (3907/7972) remote: Counting objects: 50% (3986/7972) remote: Counting objects: 51% (4066/7972) remote: Counting objects: 52% (4146/7972) remote: Counting objects: 53% (4226/7972) remote: Counting objects: 54% (4305/7972) remote: Counting objects: 55% (4385/7972) remote: Counting objects: 56% (4465/7972) remote: Counting objects: 57% (4545/7972) remote: Counting objects: 58% (4624/7972) remote: Counting objects: 59% (4704/7972) remote: Counting objects: 60% (4784/7972) remote: Counting objects: 61% (4863/7972) remote: Counting objects: 62% (4943/7972) remote: Counting objects: 63% (5023/7972) remote: Counting objects: 64% (5103/7972) remote: Counting objects: 65% (5182/7972) remote: Counting objects: 66% (5262/7972) remote: Counting objects: 67% (5342/7972) remote: Counting objects: 68% (5421/7972) remote: Counting objects: 69% (5501/7972) remote: Counting objects: 70% (5581/7972) remote: Counting objects: 71% (5661/7972) remote: Counting objects: 72% (5740/7972) remote: Counting objects: 73% (5820/7972) remote: Counting objects: 74% (5900/7972) remote: Counting objects: 75% (5979/7972) remote: Counting objects: 76% (6059/7972) remote: Counting objects: 77% (6139/7972) remote: Counting objects: 78% (6219/7972) remote: Counting objects: 79% (6298/7972) remote: Counting objects: 80% (6378/7972) remote: Counting objects: 81% (6458/7972) remote: Counting objects: 82% (6538/7972) remote: Counting objects: 83% (6617/7972) remote: Counting objects: 84% (6697/7972) remote: Counting objects: 85% (6777/7972) remote: Counting objects: 86% (6856/7972) remote: Counting objects: 87% (6936/7972) remote: Counting objects: 88% (7016/7972) remote: Counting objects: 89% (7096/7972) remote: Counting objects: 90% (7175/7972) remote: Counting objects: 91% (7255/7972) remote: Counting objects: 92% (7335/7972) remote: Counting objects: 93% (7414/7972) remote: Counting objects: 94% (7494/7972) remote: Counting objects: 95% (7574/7972) remote: Counting objects: 96% (7654/7972) remote: Counting objects: 97% (7733/7972) remote: Counting objects: 98% (7813/7972) remote: Counting objects: 99% (7893/7972) remote: Counting objects: 100% (7972/7972) remote: Counting objects: 100% (7972/7972), done.
  5. 3.22 s remote: Compressing objects: 0% (1/1623) remote: Compressing objects: 1% (17/1623) remote: Compressing objects: 2% (33/1623) remote: Compressing objects: 3% (49/1623) remote: Compressing objects: 4% (65/1623) remote: Compressing objects: 5% (82/1623) remote: Compressing objects: 6% (98/1623) remote: Compressing objects: 7% (114/1623) remote: Compressing objects: 8% (130/1623) remote: Compressing objects: 9% (147/1623) remote: Compressing objects: 10% (163/1623) remote: Compressing objects: 11% (179/1623) remote: Compressing objects: 12% (195/1623) remote: Compressing objects: 13% (211/1623) remote: Compressing objects: 14% (228/1623) remote: Compressing objects: 15% (244/1623) remote: Compressing objects: 15% (256/1623) remote: Compressing objects: 16% (260/1623) remote: Compressing objects: 17% (276/1623) remote: Compressing objects: 18% (293/1623) remote: Compressing objects: 19% (309/1623) remote: Compressing objects: 20% (325/1623) remote: Compressing objects: 21% (341/1623) remote: Compressing objects: 22% (358/1623) remote: Compressing objects: 23% (374/1623) remote: Compressing objects: 24% (390/1623) remote: Compressing objects: 25% (406/1623) remote: Compressing objects: 26% (422/1623) remote: Compressing objects: 27% (439/1623) remote: Compressing objects: 28% (455/1623) remote: Compressing objects: 29% (471/1623) remote: Compressing objects: 30% (487/1623) remote: Compressing objects: 31% (504/1623) remote: Compressing objects: 32% (520/1623) remote: Compressing objects: 33% (536/1623) remote: Compressing objects: 34% (552/1623) remote: Compressing objects: 35% (569/1623) remote: Compressing objects: 36% (585/1623) remote: Compressing objects: 37% (601/1623) remote: Compressing objects: 38% (617/1623) remote: Compressing objects: 39% (633/1623) remote: Compressing objects: 40% (650/1623) remote: Compressing objects: 41% (666/1623) remote: Compressing objects: 42% (682/1623) remote: Compressing objects: 43% (698/1623) remote: Compressing objects: 44% (715/1623) remote: Compressing objects: 45% (731/1623) remote: Compressing objects: 46% (747/1623) remote: Compressing objects: 47% (763/1623) remote: Compressing objects: 48% (780/1623) remote: Compressing objects: 49% (796/1623) remote: Compressing objects: 50% (812/1623) remote: Compressing objects: 51% (828/1623) remote: Compressing objects: 52% (844/1623) remote: Compressing objects: 53% (861/1623) remote: Compressing objects: 54% (877/1623) remote: Compressing objects: 55% (893/1623) remote: Compressing objects: 56% (909/1623) remote: Compressing objects: 57% (926/1623) remote: Compressing objects: 58% (942/1623) remote: Compressing objects: 59% (958/1623) remote: Compressing objects: 60% (974/1623) remote: Compressing objects: 61% (991/1623) remote: Compressing objects: 62% (1007/1623) remote: Compressing objects: 63% (1023/1623) remote: Compressing objects: 64% (1039/1623) remote: Compressing objects: 65% (1055/1623) remote: Compressing objects: 66% (1072/1623) remote: Compressing objects: 67% (1088/1623) remote: Compressing objects: 68% (1104/1623) remote: Compressing objects: 69% (1120/1623) remote: Compressing objects: 70% (1137/1623) remote: Compressing objects: 71% (1153/1623) remote: Compressing objects: 72% (1169/1623) remote: Compressing objects: 73% (1185/1623) remote: Compressing objects: 74% (1202/1623) remote: Compressing objects: 75% (1218/1623) remote: Compressing objects: 76% (1234/1623) remote: Compressing objects: 77% (1250/1623) remote: Compressing objects: 78% (1266/1623) remote: Compressing objects: 79% (1283/1623) remote: Compressing objects: 80% (1299/1623) remote: Compressing objects: 81% (1315/1623) remote: Compressing objects: 82% (1331/1623) remote: Compressing objects: 83% (1348/1623) remote: Compressing objects: 84% (1364/1623) remote: Compressing objects: 85% (1380/1623) remote: Compressing objects: 86% (1396/1623) remote: Compressing objects: 87% (1413/1623) remote: Compressing objects: 88% (1429/1623) remote: Compressing objects: 89% (1445/1623) remote: Compressing objects: 90% (1461/1623) remote: Compressing objects: 91% (1477/1623) remote: Compressing objects: 92% (1494/1623) remote: Compressing objects: 93% (1510/1623) remote: Compressing objects: 94% (1526/1623) remote: Compressing objects: 95% (1542/1623) remote: Compressing objects: 96% (1559/1623) remote: Compressing objects: 97% (1575/1623) remote: Compressing objects: 98% (1591/1623) remote: Compressing objects: 99% (1607/1623) remote: Compressing objects: 100% (1623/1623) remote: Compressing objects: 100% (1623/1623), done.
  6. 6.02 s Receiving objects: 0% (1/65321) Receiving objects: 1% (654/65321) Receiving objects: 2% (1307/65321) Receiving objects: 3% (1960/65321) Receiving objects: 4% (2613/65321) Receiving objects: 5% (3267/65321) Receiving objects: 6% (3920/65321) Receiving objects: 7% (4573/65321) Receiving objects: 8% (5226/65321), 9.05 MiB | 18.08 MiB/s Receiving objects: 9% (5879/65321), 9.05 MiB | 18.08 MiB/s Receiving objects: 10% (6533/65321), 9.05 MiB | 18.08 MiB/s Receiving objects: 11% (7186/65321), 9.05 MiB | 18.08 MiB/s Receiving objects: 12% (7839/65321), 9.05 MiB | 18.08 MiB/s Receiving objects: 13% (8492/65321), 9.05 MiB | 18.08 MiB/s Receiving objects: 14% (9145/65321), 9.05 MiB | 18.08 MiB/s Receiving objects: 15% (9799/65321), 9.05 MiB | 18.08 MiB/s Receiving objects: 16% (10452/65321), 9.05 MiB | 18.08 MiB/s Receiving objects: 17% (11105/65321), 9.05 MiB | 18.08 MiB/s Receiving objects: 18% (11758/65321), 9.05 MiB | 18.08 MiB/s Receiving objects: 18% (12295/65321), 9.05 MiB | 18.08 MiB/s Receiving objects: 19% (12411/65321), 19.53 MiB | 19.52 MiB/s Receiving objects: 20% (13065/65321), 19.53 MiB | 19.52 MiB/s Receiving objects: 21% (13718/65321), 19.53 MiB | 19.52 MiB/s Receiving objects: 22% (14371/65321), 19.53 MiB | 19.52 MiB/s Receiving objects: 23% (15024/65321), 19.53 MiB | 19.52 MiB/s Receiving objects: 24% (15678/65321), 19.53 MiB | 19.52 MiB/s Receiving objects: 25% (16331/65321), 19.53 MiB | 19.52 MiB/s Receiving objects: 26% (16984/65321), 19.53 MiB | 19.52 MiB/s Receiving objects: 27% (17637/65321), 19.53 MiB | 19.52 MiB/s Receiving objects: 28% (18290/65321), 19.53 MiB | 19.52 MiB/s Receiving objects: 29% (18944/65321), 19.53 MiB | 19.52 MiB/s Receiving objects: 30% (19597/65321), 19.53 MiB | 19.52 MiB/s Receiving objects: 31% (20250/65321), 19.53 MiB | 19.52 MiB/s Receiving objects: 32% (20903/65321), 19.53 MiB | 19.52 MiB/s Receiving objects: 33% (21556/65321), 19.53 MiB | 19.52 MiB/s Receiving objects: 34% (22210/65321), 19.53 MiB | 19.52 MiB/s Receiving objects: 35% (22863/65321), 19.53 MiB | 19.52 MiB/s Receiving objects: 36% (23516/65321), 19.53 MiB | 19.52 MiB/s Receiving objects: 37% (24169/65321), 19.53 MiB | 19.52 MiB/s Receiving objects: 38% (24822/65321), 19.53 MiB | 19.52 MiB/s Receiving objects: 39% (25476/65321), 19.53 MiB | 19.52 MiB/s Receiving objects: 40% (26129/65321), 19.53 MiB | 19.52 MiB/s Receiving objects: 41% (26782/65321), 19.53 MiB | 19.52 MiB/s Receiving objects: 42% (27435/65321), 19.53 MiB | 19.52 MiB/s Receiving objects: 43% (28089/65321), 19.53 MiB | 19.52 MiB/s Receiving objects: 44% (28742/65321), 19.53 MiB | 19.52 MiB/s Receiving objects: 45% (29395/65321), 19.53 MiB | 19.52 MiB/s Receiving objects: 46% (30048/65321), 19.53 MiB | 19.52 MiB/s Receiving objects: 47% (30701/65321), 19.53 MiB | 19.52 MiB/s Receiving objects: 48% (31355/65321), 19.53 MiB | 19.52 MiB/s Receiving objects: 49% (32008/65321), 19.53 MiB | 19.52 MiB/s Receiving objects: 50% (32661/65321), 19.53 MiB | 19.52 MiB/s Receiving objects: 51% (33314/65321), 19.53 MiB | 19.52 MiB/s Receiving objects: 52% (33967/65321), 19.53 MiB | 19.52 MiB/s Receiving objects: 53% (34621/65321), 19.53 MiB | 19.52 MiB/s Receiving objects: 54% (35274/65321), 19.53 MiB | 19.52 MiB/s Receiving objects: 55% (35927/65321), 19.53 MiB | 19.52 MiB/s Receiving objects: 56% (36580/65321), 19.53 MiB | 19.52 MiB/s Receiving objects: 57% (37233/65321), 19.53 MiB | 19.52 MiB/s Receiving objects: 58% (37887/65321), 41.05 MiB | 27.36 MiB/s Receiving objects: 59% (38540/65321), 41.05 MiB | 27.36 MiB/s Receiving objects: 60% (39193/65321), 41.05 MiB | 27.36 MiB/s Receiving objects: 61% (39846/65321), 41.05 MiB | 27.36 MiB/s Receiving objects: 62% (40500/65321), 41.05 MiB | 27.36 MiB/s Receiving objects: 63% (41153/65321), 41.05 MiB | 27.36 MiB/s Receiving objects: 64% (41806/65321), 41.05 MiB | 27.36 MiB/s Receiving objects: 65% (42459/65321), 41.05 MiB | 27.36 MiB/s Receiving objects: 66% (43112/65321), 41.05 MiB | 27.36 MiB/s Receiving objects: 67% (43766/65321), 41.05 MiB | 27.36 MiB/s Receiving objects: 68% (44419/65321), 41.05 MiB | 27.36 MiB/s Receiving objects: 69% (45072/65321), 41.05 MiB | 27.36 MiB/s Receiving objects: 70% (45725/65321), 41.05 MiB | 27.36 MiB/s Receiving objects: 71% (46378/65321), 41.05 MiB | 27.36 MiB/s Receiving objects: 72% (47032/65321), 41.05 MiB | 27.36 MiB/s Receiving objects: 73% (47685/65321), 41.05 MiB | 27.36 MiB/s Receiving objects: 74% (48338/65321), 41.05 MiB | 27.36 MiB/s Receiving objects: 74% (48916/65321), 62.13 MiB | 31.06 MiB/s Receiving objects: 75% (48991/65321), 62.13 MiB | 31.06 MiB/s Receiving objects: 76% (49644/65321), 62.13 MiB | 31.06 MiB/s Receiving objects: 77% (50298/65321), 62.13 MiB | 31.06 MiB/s Receiving objects: 78% (50951/65321), 62.13 MiB | 31.06 MiB/s Receiving objects: 79% (51604/65321), 62.13 MiB | 31.06 MiB/s Receiving objects: 80% (52257/65321), 62.13 MiB | 31.06 MiB/s Receiving objects: 81% (52911/65321), 62.13 MiB | 31.06 MiB/s Receiving objects: 82% (53564/65321), 62.13 MiB | 31.06 MiB/s Receiving objects: 83% (54217/65321), 78.79 MiB | 31.45 MiB/s Receiving objects: 84% (54870/65321), 78.79 MiB | 31.45 MiB/s Receiving objects: 85% (55523/65321), 78.79 MiB | 31.45 MiB/s Receiving objects: 86% (56177/65321), 78.79 MiB | 31.45 MiB/s Receiving objects: 87% (56830/65321), 78.79 MiB | 31.45 MiB/s Receiving objects: 88% (57483/65321), 78.79 MiB | 31.45 MiB/s Receiving objects: 89% (58136/65321), 78.79 MiB | 31.45 MiB/s Receiving objects: 90% (58789/65321), 78.79 MiB | 31.45 MiB/s Receiving objects: 91% (59443/65321), 78.79 MiB | 31.45 MiB/s Receiving objects: 92% (60096/65321), 78.79 MiB | 31.45 MiB/s Receiving objects: 93% (60749/65321), 78.79 MiB | 31.45 MiB/s Receiving objects: 94% (61402/65321), 78.79 MiB | 31.45 MiB/s Receiving objects: 95% (62055/65321), 78.79 MiB | 31.45 MiB/s Receiving objects: 96% (62709/65321), 78.79 MiB | 31.45 MiB/s Receiving objects: 97% (63362/65321), 78.79 MiB | 31.45 MiB/s Receiving objects: 98% (64015/65321), 78.79 MiB | 31.45 MiB/s Receiving objects: 99% (64668/65321), 78.79 MiB | 31.45 MiB/s remote: Total 65321 (delta 6903), reused 6445 (delta 6339), pack-reused 57349 (from 1)
  7. 6.08 s Receiving objects: 100% (65321/65321), 78.79 MiB | 31.45 MiB/s Receiving objects: 100% (65321/65321), 87.65 MiB | 31.44 MiB/s, done.
  8. 8.13 s Resolving deltas: 0% (0/46021) Resolving deltas: 1% (461/46021) Resolving deltas: 2% (921/46021) Resolving deltas: 3% (1381/46021) Resolving deltas: 4% (1841/46021) Resolving deltas: 5% (2302/46021) Resolving deltas: 6% (2763/46021) Resolving deltas: 7% (3222/46021) Resolving deltas: 8% (3682/46021) Resolving deltas: 9% (4142/46021) Resolving deltas: 10% (4603/46021) Resolving deltas: 11% (5063/46021) Resolving deltas: 12% (5523/46021) Resolving deltas: 13% (5983/46021) Resolving deltas: 14% (6443/46021) Resolving deltas: 15% (6905/46021) Resolving deltas: 16% (7364/46021) Resolving deltas: 17% (7825/46021) Resolving deltas: 18% (8284/46021) Resolving deltas: 19% (8744/46021) Resolving deltas: 20% (9205/46021) Resolving deltas: 21% (9665/46021) Resolving deltas: 22% (10125/46021) Resolving deltas: 23% (10585/46021) Resolving deltas: 24% (11046/46021) Resolving deltas: 25% (11506/46021) Resolving deltas: 26% (11966/46021) Resolving deltas: 27% (12426/46021) Resolving deltas: 28% (12886/46021) Resolving deltas: 29% (13347/46021) Resolving deltas: 30% (13807/46021) Resolving deltas: 31% (14267/46021) Resolving deltas: 32% (14727/46021) Resolving deltas: 33% (15187/46021) Resolving deltas: 34% (15648/46021) Resolving deltas: 35% (16108/46021) Resolving deltas: 36% (16568/46021) Resolving deltas: 37% (17028/46021) Resolving deltas: 38% (17488/46021) Resolving deltas: 39% (17949/46021) Resolving deltas: 40% (18409/46021) Resolving deltas: 41% (18869/46021) Resolving deltas: 42% (19329/46021) Resolving deltas: 43% (19790/46021) Resolving deltas: 44% (20250/46021) Resolving deltas: 45% (20712/46021) Resolving deltas: 46% (21170/46021) Resolving deltas: 47% (21630/46021) Resolving deltas: 48% (22091/46021) Resolving deltas: 49% (22551/46021) Resolving deltas: 50% (23011/46021) Resolving deltas: 51% (23471/46021) Resolving deltas: 52% (23931/46021) Resolving deltas: 53% (24392/46021) Resolving deltas: 54% (24852/46021) Resolving deltas: 55% (25312/46021) Resolving deltas: 56% (25772/46021) Resolving deltas: 57% (26232/46021) Resolving deltas: 58% (26693/46021) Resolving deltas: 59% (27153/46021) Resolving deltas: 60% (27613/46021) Resolving deltas: 61% (28073/46021) Resolving deltas: 62% (28534/46021) Resolving deltas: 63% (28994/46021) Resolving deltas: 64% (29454/46021) Resolving deltas: 64% (29912/46021) Resolving deltas: 65% (29914/46021) Resolving deltas: 66% (30374/46021) Resolving deltas: 67% (30835/46021) Resolving deltas: 68% (31295/46021) Resolving deltas: 69% (31755/46021) Resolving deltas: 70% (32215/46021) Resolving deltas: 71% (32675/46021) Resolving deltas: 72% (33136/46021) Resolving deltas: 73% (33596/46021) Resolving deltas: 74% (34056/46021) Resolving deltas: 75% (34516/46021) Resolving deltas: 76% (34976/46021) Resolving deltas: 77% (35437/46021) Resolving deltas: 78% (35898/46021) Resolving deltas: 79% (36358/46021) Resolving deltas: 80% (36817/46021) Resolving deltas: 81% (37278/46021) Resolving deltas: 82% (37738/46021) Resolving deltas: 83% (38198/46021) Resolving deltas: 84% (38658/46021) Resolving deltas: 85% (39118/46021) Resolving deltas: 86% (39579/46021) Resolving deltas: 87% (40039/46021) Resolving deltas: 88% (40499/46021) Resolving deltas: 89% (40959/46021) Resolving deltas: 90% (41419/46021) Resolving deltas: 91% (41880/46021) Resolving deltas: 92% (42340/46021) Resolving deltas: 93% (42800/46021) Resolving deltas: 94% (43260/46021) Resolving deltas: 95% (43720/46021) Resolving deltas: 95% (43954/46021) Resolving deltas: 96% (44181/46021) Resolving deltas: 97% (44641/46021) Resolving deltas: 98% (45101/46021) Resolving deltas: 99% (45561/46021) Resolving deltas: 100% (46021/46021) Resolving deltas: 100% (46021/46021), done.
  9. 8.91 s Fetching commit 7ed25ba0add6fdafcb84d7c8d5c514d7d735f5bf for vakint_rustred ...
  10. 8.92 s $ /nix/store/bcnisk3ydfgv26v2gw3zlky24g00yww2-git-2.54.0/bin/git fetch origin 7ed25ba0add6fdafcb84d7c8d5c514d7d735f5bf
  11. 9.66 s From https://github.com/alphal00p/gammaloop
  12. 9.66 s * branch 7ed25ba0add6fdafcb84d7c8d5c514d7d735f5bf -> FETCH_HEAD
  13. 9.75 s $ /nix/store/9ypz3flqsrl5xl495mm8h645gadjsxi1-coreutils-9.11/bin/timeout --kill-after=15s 7200s /nix/store/bcnisk3ydfgv26v2gw3zlky24g00yww2-git-2.54.0/bin/git -c advice.detachedHead=false checkout 7ed25ba0add6fdafcb84d7c8d5c514d7d735f5bf
  14. 10.08 s HEAD is now at 7ed25ba0 Make RustRed scalar parity coverage exhaustive
  15. 10.10 s $ /nix/store/9ypz3flqsrl5xl495mm8h645gadjsxi1-coreutils-9.11/bin/timeout --kill-after=15s 7200s /nix/store/23zk8sgzamrbmj1fday15szf7f2279s8-nix-2.34.7/bin/nix --extra-experimental-features nix-command --extra-experimental-features flakes --log-format internal-json run .#packages.x86_64-linux.nix-ci-check-gammaloop-nextest-spenso --print-build-logs
  16. 16.82 s
  17. 23.08 s evaluating derivation 'g copying '/nix/store/6x63 evaluating derivation 'g copying '/nix/store/6x63 evaluating derivation 'g copying '/nix/store/6x63 evaluating derivation 'g copying '/nix/store/6x63 evaluating derivation 'g copying '/nix/store/6x63 evaluating derivation 'g [0/1 built] [1/0/1 built] [1/0/1 built] building ggammaloop-nextest-spenso> Extracting 5 binaries and 2 linked paths to /build/nextest-archive-xNLtwS
  18. 23.42 s gammaloop-nextest-spenso> Extracted 19 files to /build/nextest-archive-xNLtwS in 0.34s
  19. 23.44 s gammaloop-nextest-spenso> ------------
  20. 23.44 s gammaloop-nextest-spenso> Nextest run ID f846d28a-4591-41e4-83e0-f3dcbd63bbbc with nextest profile: ci_gammaloop
  21. 23.44 s gammaloop-nextest-spenso> Starting 224 tests across 5 binaries (26 tests skipped, including 2 tests via profile.ci_gammaloop.default-filter)
  22. 23.57 s gammaloop-nextest-spenso> FAIL [ 0.021s] ( 45/224) idenso color::test::form_reference::metric_contraction_respects_antisymmetric_normalization
  23. 23.57 s gammaloop-nextest-spenso> stdout ---
  24. 23.57 s gammaloop-nextest-spenso>
  25. 23.57 s gammaloop-nextest-spenso> running 1 test
  26. 23.57 s gammaloop-nextest-spenso> test color::test::form_reference::metric_contraction_respects_antisymmetric_normalization ... FAILED
  27. 23.57 s gammaloop-nextest-spenso>
  28. 23.57 s gammaloop-nextest-spenso> failures:
  29. 23.57 s gammaloop-nextest-spenso>
  30. 23.57 s gammaloop-nextest-spenso> failures:
  31. 23.57 s gammaloop-nextest-spenso> color::test::form_reference::metric_contraction_respects_antisymmetric_normalization
  32. 23.57 s gammaloop-nextest-spenso>
  33. 23.57 s gammaloop-nextest-spenso> test result: FAILED. 0 passed; 1 failed; 0 ignored; 0 measured; 240 filtered out; finished in 0.01s
  34. 23.57 s gammaloop-nextest-spenso>
  35. 23.57 s gammaloop-nextest-spenso> stderr ---
  36. 23.57 s gammaloop-nextest-spenso>
  37. 23.57 s gammaloop-nextest-spenso> thread 'color::test::form_reference::metric_contraction_respects_antisymmetric_normalization' (340) panicked at crates/idenso/src/color/test/form_reference.rs:171:5:
  38. 23.57 s gammaloop-nextest-spenso> assertion `left == right` failed
  39. 23.57 s gammaloop-nextest-spenso> left: "-1*f(coad(8,standalone_metric_j),coad(8,standalone_metric_s),coad(8,standalone_metric_u))"
  40. 23.57 s gammaloop-nextest-spenso> right: "f(coad(8,standalone_metric_j),coad(8,standalone_metric_s),coad(8,standalone_metric_u))"
  41. 23.57 s gammaloop-nextest-spenso> stack backtrace:
  42. 23.57 s gammaloop-nextest-spenso> 0: __rustc::rust_begin_unwind
  43. 23.57 s gammaloop-nextest-spenso> 1: core::panicking::panic_fmt
  44. 23.57 s gammaloop-nextest-spenso> 2: core::panicking::assert_failed_inner
  45. 23.57 s gammaloop-nextest-spenso> 3: core::panicking::assert_failed::<alloc::string::String, alloc::string::String>
  46. 23.57 s gammaloop-nextest-spenso> 4: idenso::color::test::form_reference::metric_contraction_respects_antisymmetric_normalization
  47. 23.57 s gammaloop-nextest-spenso> 5: <idenso::color::test::form_reference::metric_contraction_respects_antisymmetric_normalization::{closure#0} as core::ops::function::FnOnce<()>>::call_once
  48. 23.57 s gammaloop-nextest-spenso> note: Some details are omitted, run with `RUST_BACKTRACE=full` for a verbose backtrace.
  49. 23.57 s gammaloop-nextest-spenso>
  50. 23.95 s gammaloop-nextest-spenso> FAIL [ 0.069s] (217/224) idenso tensor::tests::parsing::infinite_execution
  51. 23.95 s gammaloop-nextest-spenso> stdout ---
  52. 23.95 s gammaloop-nextest-spenso>
  53. 23.95 s gammaloop-nextest-spenso> running 1 test
  54. 23.95 s gammaloop-nextest-spenso> ━━━━━━━━━━━━━━━━━━━━━━━━━━━━━━━ Snapshot Summary ━━━━━━━━━━━━━━━━━━━━━━━━━━━━━━━
  55. 23.95 s gammaloop-nextest-spenso> Snapshot: infinite_execution
  56. 23.95 s gammaloop-nextest-spenso> Source: crates/idenso/src/tensor/tests/parsing.rs:910
  57. 23.95 s gammaloop-nextest-spenso> ────────────────────────────────────────────────────────────────────────────────
  58. 23.95 s gammaloop-nextest-spenso> Expression: net_iter.snapshot_dot()
  59. 23.95 s gammaloop-nextest-spenso> ────────────────────────────────────────────────────────────────────────────────
  60. 23.95 s gammaloop-nextest-spenso> -old snapshot
  61. 23.95 s gammaloop-nextest-spenso> +new results
  62. 23.95 s gammaloop-nextest-spenso> ────────────┬───────────────────────────────────────────────────────────────────
  63. 23.95 s gammaloop-nextest-spenso> 8 8 │ 0:0:s -> ext0 [id=0 color="red"];
  64. 23.95 s gammaloop-nextest-spenso> 9 9 │ ext1 [style=invis];
  65. 23.95 s gammaloop-nextest-spenso> 10 10 │ 0:5:s -> ext1 [id=1 dir=none color="red" label="mink4|l_0"];
  66. 23.95 s gammaloop-nextest-spenso> 11 11 │ ext2 [style=invis];
  67. 23.95 s gammaloop-nextest-spenso> 12 │- 0:4:s -> ext2 [id=2 dir=none color="red" label="bis4|l_2"];
  68. 23.95 s gammaloop-nextest-spenso> 12 │+ 0:3:s -> ext2 [id=2 dir=none color="red" label="mink4|l_1"];
  69. 23.95 s gammaloop-nextest-spenso> 13 13 │ ext3 [style=invis];
  70. 23.95 s gammaloop-nextest-spenso> 14 │- 0:3:s -> ext3 [id=3 dir=none color="red" label="bis4|l_3"];
  71. 23.95 s gammaloop-nextest-spenso> 14 │+ 0:1:s -> ext3 [id=3 dir=none color="red" label="bis4|l_2"];
  72. 23.95 s gammaloop-nextest-spenso> 15 15 │ ext4 [style=invis];
  73. 23.95 s gammaloop-nextest-spenso> 16 │- 0:1:s -> ext4 [id=4 dir=none color="red" label="mink4|l_1"];
  74. 23.95 s gammaloop-nextest-spenso> 16 │+ 0:2:s -> ext4 [id=4 dir=none color="red" label="mink4|l_4"];
  75. 23.95 s gammaloop-nextest-spenso> 17 17 │ ext5 [style=invis];
  76. 23.95 s gammaloop-nextest-spenso> 18 │- 0:2:s -> ext5 [id=5 dir=none color="red" label="mink4|l_4"];
  77. 23.95 s gammaloop-nextest-spenso> 18 │+ 0:4:s -> ext5 [id=5 dir=none color="red" label="bis4|l_3"];
  78. 23.95 s gammaloop-nextest-spenso> 19 19 │ }
  79. 23.95 s gammaloop-nextest-spenso> ────────────┴───────────────────────────────────────────────────────────────────
  80. 23.95 s gammaloop-nextest-spenso> To update snapshots run `cargo insta review`
  81. 23.95 s gammaloop-nextest-spenso> Stopped on the first failure. Run `cargo insta test` to run all snapshots.
  82. 23.95 s gammaloop-nextest-spenso> test tensor::tests::parsing::infinite_execution ... FAILED
  83. 23.95 s gammaloop-nextest-spenso>
  84. 23.95 s gammaloop-nextest-spenso> failures:
  85. 23.95 s gammaloop-nextest-spenso>
  86. 23.95 s gammaloop-nextest-spenso> failures:
  87. 23.95 s gammaloop-nextest-spenso> tensor::tests::parsing::infinite_execution
  88. 23.95 s gammaloop-nextest-spenso>
  89. 23.95 s gammaloop-nextest-spenso> test result: FAILED. 0 passed; 1 failed; 0 ignored; 0 measured; 240 filtered out; finished in 0.06s
  90. 23.95 s gammaloop-nextest-spenso>
  91. 23.95 s gammaloop-nextest-spenso> stderr ---
  92. 23.95 s gammaloop-nextest-spenso>
  93. 23.95 s gammaloop-nextest-spenso> thread 'tensor::tests::parsing::infinite_execution' (846) panicked at /nix/store/p13pfw1gvvk8m860apfhvzcgidxhbs7g-vendor-cargo-deps/c19b7c6f923b580ac259164a89f2577984ad5ab09ee9d583b888f934adbbe8d0/insta-1.47.2/src/runtime.rs:719:13:
  94. 23.95 s gammaloop-nextest-spenso> snapshot assertion for 'infinite_execution' failed in line 910
  95. 23.95 s gammaloop-nextest-spenso> stack backtrace:
  96. 23.95 s gammaloop-nextest-spenso> 0: __rustc::rust_begin_unwind
  97. 23.95 s gammaloop-nextest-spenso> 1: core::panicking::panic_fmt
  98. 23.95 s gammaloop-nextest-spenso> 2: insta::runtime::assert_snapshot
  99. 23.95 s gammaloop-nextest-spenso> 3: idenso::tensor::tests::parsing::infinite_execution
  100. 23.95 s gammaloop-nextest-spenso> 4: <idenso::tensor::tests::parsing::infinite_execution::{closure#0} as core::ops::function::FnOnce<()>>::call_once
  101. 23.95 s gammaloop-nextest-spenso> note: Some details are omitted, run with `RUST_BACKTRACE=full` for a verbose backtrace.
  102. 23.95 s gammaloop-nextest-spenso>
  103. 26.32 s gammaloop-nextest-spenso> ------------
  104. 26.32 s gammaloop-nextest-spenso> Summary [ 2.883s] 224 tests run: 222 passed, 2 failed, 26 skipped
  105. 26.32 s gammaloop-nextest-spenso> FAIL [ 0.021s] ( 45/224) idenso color::test::form_reference::metric_contraction_respects_antisymmetric_normalization
  106. 26.32 s gammaloop-nextest-spenso> stdout ---
  107. 26.32 s gammaloop-nextest-spenso>
  108. 26.32 s gammaloop-nextest-spenso> running 1 test
  109. 26.32 s gammaloop-nextest-spenso> test color::test::form_reference::metric_contraction_respects_antisymmetric_normalization ... FAILED
  110. 26.32 s gammaloop-nextest-spenso>
  111. 26.32 s gammaloop-nextest-spenso> failures:
  112. 26.32 s gammaloop-nextest-spenso>
  113. 26.32 s gammaloop-nextest-spenso> failures:
  114. 26.32 s gammaloop-nextest-spenso> color::test::form_reference::metric_contraction_respects_antisymmetric_normalization
  115. 26.32 s gammaloop-nextest-spenso>
  116. 26.32 s gammaloop-nextest-spenso> test result: FAILED. 0 passed; 1 failed; 0 ignored; 0 measured; 240 filtered out; finished in 0.01s
  117. 26.32 s gammaloop-nextest-spenso>
  118. 26.32 s gammaloop-nextest-spenso> stderr ---
  119. 26.32 s gammaloop-nextest-spenso>
  120. 26.32 s gammaloop-nextest-spenso> thread 'color::test::form_reference::metric_contraction_respects_antisymmetric_normalization' (340) panicked at crates/idenso/src/color/test/form_reference.rs:171:5:
  121. 26.32 s gammaloop-nextest-spenso> assertion `left == right` failed
  122. 26.32 s gammaloop-nextest-spenso> left: "-1*f(coad(8,standalone_metric_j),coad(8,standalone_metric_s),coad(8,standalone_metric_u))"
  123. 26.32 s gammaloop-nextest-spenso> right: "f(coad(8,standalone_metric_j),coad(8,standalone_metric_s),coad(8,standalone_metric_u))"
  124. 26.32 s gammaloop-nextest-spenso> stack backtrace:
  125. 26.32 s gammaloop-nextest-spenso> 0: __rustc::rust_begin_unwind
  126. 26.32 s gammaloop-nextest-spenso> 1: core::panicking::panic_fmt
  127. 26.32 s gammaloop-nextest-spenso> 2: core::panicking::assert_failed_inner
  128. 26.32 s gammaloop-nextest-spenso> 3: core::panicking::assert_failed::<alloc::string::String, alloc::string::String>
  129. 26.32 s gammaloop-nextest-spenso> 4: idenso::color::test::form_reference::metric_contraction_respects_antisymmetric_normalization
  130. 26.32 s gammaloop-nextest-spenso> 5: <idenso::color::test::form_reference::metric_contraction_respects_antisymmetric_normalization::{closure#0} as core::ops::function::FnOnce<()>>::call_once
  131. 26.32 s gammaloop-nextest-spenso> note: Some details are omitted, run with `RUST_BACKTRACE=full` for a verbose backtrace.
  132. 26.32 s gammaloop-nextest-spenso>
  133. 26.32 s gammaloop-nextest-spenso> FAIL [ 0.069s] (217/224) idenso tensor::tests::parsing::infinite_execution
  134. 26.32 s gammaloop-nextest-spenso> stdout ---
  135. 26.32 s gammaloop-nextest-spenso>
  136. 26.32 s gammaloop-nextest-spenso> running 1 test
  137. 26.32 s gammaloop-nextest-spenso> ━━━━━━━━━━━━━━━━━━━━━━━━━━━━━━━ Snapshot Summary ━━━━━━━━━━━━━━━━━━━━━━━━━━━━━━━
  138. 26.32 s gammaloop-nextest-spenso> Snapshot: infinite_execution
  139. 26.32 s gammaloop-nextest-spenso> Source: crates/idenso/src/tensor/tests/parsing.rs:910
  140. 26.32 s gammaloop-nextest-spenso> ────────────────────────────────────────────────────────────────────────────────
  141. 26.32 s gammaloop-nextest-spenso> Expression: net_iter.snapshot_dot()
  142. 26.32 s gammaloop-nextest-spenso> ────────────────────────────────────────────────────────────────────────────────
  143. 26.32 s gammaloop-nextest-spenso> -old snapshot
  144. 26.32 s gammaloop-nextest-spenso> +new results
  145. 26.32 s gammaloop-nextest-spenso> ────────────┬───────────────────────────────────────────────────────────────────
  146. 26.32 s gammaloop-nextest-spenso> 8 8 │ 0:0:s -> ext0 [id=0 color="red"];
  147. 26.32 s gammaloop-nextest-spenso> 9 9 │ ext1 [style=invis];
  148. 26.32 s gammaloop-nextest-spenso> 10 10 │ 0:5:s -> ext1 [id=1 dir=none color="red" label="mink4|l_0"];
  149. 26.32 s gammaloop-nextest-spenso> 11 11 │ ext2 [style=invis];
  150. 26.32 s gammaloop-nextest-spenso> 12 │- 0:4:s -> ext2 [id=2 dir=none color="red" label="bis4|l_2"];
  151. 26.32 s gammaloop-nextest-spenso> 12 │+ 0:3:s -> ext2 [id=2 dir=none color="red" label="mink4|l_1"];
  152. 26.32 s gammaloop-nextest-spenso> 13 13 │ ext3 [style=invis];
  153. 26.32 s gammaloop-nextest-spenso> 14 │- 0:3:s -> ext3 [id=3 dir=none color="red" label="bis4|l_3"];
  154. 26.32 s gammaloop-nextest-spenso> 14 │+ 0:1:s -> ext3 [id=3 dir=none color="red" label="bis4|l_2"];
  155. 26.32 s gammaloop-nextest-spenso> 15 15 │ ext4 [style=invis];
  156. 26.32 s gammaloop-nextest-spenso> 16 │- 0:1:s -> ext4 [id=4 dir=none color="red" label="mink4|l_1"];
  157. 26.32 s gammaloop-nextest-spenso> 16 │+ 0:2:s -> ext4 [id=4 dir=none color="red" label="mink4|l_4"];
  158. 26.32 s gammaloop-nextest-spenso> 17 17 │ ext5 [style=invis];
  159. 26.32 s gammaloop-nextest-spenso> 18 │- 0:2:s -> ext5 [id=5 dir=none color="red" label="mink4|l_4"];
  160. 26.32 s gammaloop-nextest-spenso> 18 │+ 0:4:s -> ext5 [id=5 dir=none color="red" label="bis4|l_3"];
  161. 26.32 s gammaloop-nextest-spenso> 19 19 │ }
  162. 26.32 s gammaloop-nextest-spenso> ────────────┴───────────────────────────────────────────────────────────────────
  163. 26.32 s gammaloop-nextest-spenso> To update snapshots run `cargo insta review`
  164. 26.32 s gammaloop-nextest-spenso> Stopped on the first failure. Run `cargo insta test` to run all snapshots.
  165. 26.32 s gammaloop-nextest-spenso> test tensor::tests::parsing::infinite_execution ... FAILED
  166. 26.32 s gammaloop-nextest-spenso>
  167. 26.32 s gammaloop-nextest-spenso> failures:
  168. 26.32 s gammaloop-nextest-spenso>
  169. 26.32 s gammaloop-nextest-spenso> failures:
  170. 26.32 s gammaloop-nextest-spenso> tensor::tests::parsing::infinite_execution
  171. 26.32 s gammaloop-nextest-spenso>
  172. 26.32 s gammaloop-nextest-spenso> test result: FAILED. 0 passed; 1 failed; 0 ignored; 0 measured; 240 filtered out; finished in 0.06s
  173. 26.32 s gammaloop-nextest-spenso>
  174. 26.32 s gammaloop-nextest-spenso> stderr ---
  175. 26.32 s gammaloop-nextest-spenso>
  176. 26.32 s gammaloop-nextest-spenso> thread 'tensor::tests::parsing::infinite_execution' (846) panicked at /nix/store/p13pfw1gvvk8m860apfhvzcgidxhbs7g-vendor-cargo-deps/c19b7c6f923b580ac259164a89f2577984ad5ab09ee9d583b888f934adbbe8d0/insta-1.47.2/src/runtime.rs:719:13:
  177. 26.32 s gammaloop-nextest-spenso> snapshot assertion for 'infinite_execution' failed in line 910
  178. 26.32 s gammaloop-nextest-spenso> stack backtrace:
  179. 26.32 s gammaloop-nextest-spenso> 0: __rustc::rust_begin_unwind
  180. 26.32 s gammaloop-nextest-spenso> 1: core::panicking::panic_fmt
  181. 26.32 s gammaloop-nextest-spenso> 2: insta::runtime::assert_snapshot
  182. 26.32 s gammaloop-nextest-spenso> 3: idenso::tensor::tests::parsing::infinite_execution
  183. 26.32 s gammaloop-nextest-spenso> 4: <idenso::tensor::tests::parsing::infinite_execution::{closure#0} as core::ops::function::FnOnce<()>>::call_once
  184. 26.32 s gammaloop-nextest-spenso> note: Some details are omitted, run with `RUST_BACKTRACE=full` for a verbose backtrace.
  185. 26.32 s gammaloop-nextest-spenso>
  186. 26.38 s gammaloop-nextest-spenso> error: test run failed
  187. 26.42 s gammaloop-nextest-spenso>
  188. 26.42 s gammaloop-nextest-spenso> ========== nextest test summary ==========
  189. 26.42 s gammaloop-nextest-spenso> report: target/nextest/ci_gammaloop/junit.xml
  190. 26.42 s gammaloop-nextest-spenso> tests: 224, failures: 2, errors: 0
  191. 26.42 s gammaloop-nextest-spenso>
  192. 26.42 s gammaloop-nextest-spenso> 1. idenso::color::test::form_reference::metric_contraction_respects_antisymmetric_normalization
  193. 26.42 s gammaloop-nextest-spenso> failure: test failure with exit code 101
  194. 26.42 s gammaloop-nextest-spenso> thread 'color::test::form_reference::metric_contraction_respects_antisymmetric_normalization' (340) panicked at crates/idenso/src/color/test/form_reference.rs:171:5:
  195. 26.42 s gammaloop-nextest-spenso> assertion `left == right` failed
  196. 26.42 s gammaloop-nextest-spenso> left: "-1*f(coad(8,standalone_metric_j),coad(8,standalone_metric_s),coad(8,standalone_metric_u))"
  197. 26.42 s gammaloop-nextest-spenso> right: "f(coad(8,standalone_metric_j),coad(8,standalone_metric_s),coad(8,standalone_metric_u))"
  198. 26.42 s gammaloop-nextest-spenso> stack backtrace:
  199. 26.42 s gammaloop-nextest-spenso> 0: __rustc::rust_begin_unwind
  200. 26.42 s gammaloop-nextest-spenso> 1: core::panicking::panic_fmt
  201. 26.42 s gammaloop-nextest-spenso> 2: core::panicking::assert_failed_inner
  202. 26.42 s gammaloop-nextest-spenso> 3: core::panicking::assert_failed::<alloc::string::String, alloc::string::String>
  203. 26.42 s gammaloop-nextest-spenso> 4: idenso::color::test::form_reference::metric_contraction_respects_antisymmetric_normalization
  204. 26.42 s gammaloop-nextest-spenso> 5: <idenso::color::test::form_reference::metric_contraction_respects_antisymmetric_normalization::{closure#0} as core::ops::function::FnOnce<()>>::call_once
  205. 26.42 s gammaloop-nextest-spenso> note: Some details are omitted, run with `RUST_BACKTRACE=full` for a verbose backtrace.
  206. 26.42 s gammaloop-nextest-spenso> system-out
  207. 26.42 s gammaloop-nextest-spenso> running 1 test
  208. 26.42 s gammaloop-nextest-spenso> test color::test::form_reference::metric_contraction_respects_antisymmetric_normalization ... FAILED
  209. 26.42 s gammaloop-nextest-spenso>
  210. 26.42 s gammaloop-nextest-spenso> failures:
  211. 26.42 s gammaloop-nextest-spenso>
  212. 26.42 s gammaloop-nextest-spenso> failures:
  213. 26.42 s gammaloop-nextest-spenso> color::test::form_reference::metric_contraction_respects_antisymmetric_normalization
  214. 26.42 s gammaloop-nextest-spenso>
  215. 26.42 s gammaloop-nextest-spenso> test result: FAILED. 0 passed; 1 failed; 0 ignored; 0 measured; 240 filtered out; finished in 0.01s
  216. 26.42 s gammaloop-nextest-spenso> system-err
  217. 26.42 s gammaloop-nextest-spenso> thread 'color::test::form_reference::metric_contraction_respects_antisymmetric_normalization' (340) panicked at crates/idenso/src/color/test/form_reference.rs:171:5:
  218. 26.42 s gammaloop-nextest-spenso> assertion `left == right` failed
  219. 26.42 s gammaloop-nextest-spenso> left: "-1*f(coad(8,standalone_metric_j),coad(8,standalone_metric_s),coad(8,standalone_metric_u))"
  220. 26.42 s gammaloop-nextest-spenso> right: "f(coad(8,standalone_metric_j),coad(8,standalone_metric_s),coad(8,standalone_metric_u))"
  221. 26.42 s gammaloop-nextest-spenso> stack backtrace:
  222. 26.42 s gammaloop-nextest-spenso> 0: __rustc::rust_begin_unwind
  223. 26.42 s gammaloop-nextest-spenso> 1: core::panicking::panic_fmt
  224. 26.42 s gammaloop-nextest-spenso> 2: core::panicking::assert_failed_inner
  225. 26.42 s gammaloop-nextest-spenso> 3: core::panicking::assert_failed::<alloc::string::String, alloc::string::String>
  226. 26.42 s gammaloop-nextest-spenso> 4: idenso::color::test::form_reference::metric_contraction_respects_antisymmetric_normalization
  227. 26.42 s gammaloop-nextest-spenso> 5: <idenso::color::test::form_reference::metric_contraction_respects_antisymmetric_normalization::{closure#0} as core::ops::function::FnOnce<()>>::call_once
  228. 26.42 s gammaloop-nextest-spenso> note: Some details are omitted, run with `RUST_BACKTRACE=full` for a verbose backtrace.
  229. 26.42 s gammaloop-nextest-spenso>
  230. 26.42 s gammaloop-nextest-spenso> 2. idenso::tensor::tests::parsing::infinite_execution
  231. 26.42 s gammaloop-nextest-spenso> failure: test failure with exit code 101
  232. 26.42 s gammaloop-nextest-spenso> thread 'tensor::tests::parsing::infinite_execution' (846) panicked at /nix/store/p13pfw1gvvk8m860apfhvzcgidxhbs7g-vendor-cargo-deps/c19b7c6f923b580ac259164a89f2577984ad5ab09ee9d583b888f934adbbe8d0/insta-1.47.2/src/runtime.rs:719:13:
  233. 26.42 s gammaloop-nextest-spenso> snapshot assertion for 'infinite_execution' failed in line 910
  234. 26.42 s gammaloop-nextest-spenso> stack backtrace:
  235. 26.42 s gammaloop-nextest-spenso> 0: __rustc::rust_begin_unwind
  236. 26.42 s gammaloop-nextest-spenso> 1: core::panicking::panic_fmt
  237. 26.42 s gammaloop-nextest-spenso> 2: insta::runtime::assert_snapshot
  238. 26.42 s gammaloop-nextest-spenso> 3: idenso::tensor::tests::parsing::infinite_execution
  239. 26.42 s gammaloop-nextest-spenso> 4: <idenso::tensor::tests::parsing::infinite_execution::{closure#0} as core::ops::function::FnOnce<()>>::call_once
  240. 26.42 s gammaloop-nextest-spenso> note: Some details are omitted, run with `RUST_BACKTRACE=full` for a verbose backtrace.
  241. 26.42 s gammaloop-nextest-spenso> system-out
  242. 26.42 s gammaloop-nextest-spenso> running 1 test
  243. 26.42 s gammaloop-nextest-spenso> ━━━━━━━━━━━━━━━━━━━━━━━━━━━━━━━ Snapshot Summary ━━━━━━━━━━━━━━━━━━━━━━━━━━━━━━━
  244. 26.42 s gammaloop-nextest-spenso> Snapshot: infinite_execution
  245. 26.42 s gammaloop-nextest-spenso> Source: crates/idenso/src/tensor/tests/parsing.rs:910
  246. 26.42 s gammaloop-nextest-spenso> ────────────────────────────────────────────────────────────────────────────────
  247. 26.42 s gammaloop-nextest-spenso> Expression: net_iter.snapshot_dot()
  248. 26.42 s gammaloop-nextest-spenso> ────────────────────────────────────────────────────────────────────────────────
  249. 26.42 s gammaloop-nextest-spenso> -old snapshot
  250. 26.42 s gammaloop-nextest-spenso> +new results
  251. 26.42 s gammaloop-nextest-spenso> ────────────┬───────────────────────────────────────────────────────────────────
  252. 26.42 s gammaloop-nextest-spenso> 8 8 │ 0:0:s-> ext0 [id=0 color="red"];
  253. 26.42 s gammaloop-nextest-spenso> 9 9 │ ext1 [style=invis];
  254. 26.42 s gammaloop-nextest-spenso> 10 10 │ 0:5:s-> ext1 [id=1 dir=none color="red" label="mink4|l_0"];
  255. 26.42 s gammaloop-nextest-spenso> 11 11 │ ext2 [style=invis];
  256. 26.42 s gammaloop-nextest-spenso> 12 │- 0:4:s-> ext2 [id=2 dir=none color="red" label="bis4|l_2"];
  257. 26.42 s gammaloop-nextest-spenso> 12 │+ 0:3:s-> ext2 [id=2 dir=none color="red" label="mink4|l_1"];
  258. 26.42 s gammaloop-nextest-spenso> 13 13 │ ext3 [style=invis];
  259. 26.42 s gammaloop-nextest-spenso> 14 │- 0:3:s-> ext3 [id=3 dir=none color="red" label="bis4|l_3"];
  260. 26.42 s gammaloop-nextest-spenso> 14 │+ 0:1:s-> ext3 [id=3 dir=none color="red" label="bis4|l_2"];
  261. 26.42 s gammaloop-nextest-spenso> 15 15 │ ext4 [style=invis];
  262. 26.42 s gammaloop-nextest-spenso> 16 │- 0:1:s-> ext4 [id=4 dir=none color="red" label="mink4|l_1"];
  263. 26.42 s gammaloop-nextest-spenso> 16 │+ 0:2:s-> ext4 [id=4 dir=none color="red" label="mink4|l_4"];
  264. 26.42 s gammaloop-nextest-spenso> 17 17 │ ext5 [style=invis];
  265. 26.42 s gammaloop-nextest-spenso> 18 │- 0:2:s-> ext5 [id=5 dir=none color="red" label="mink4|l_4"];
  266. 26.42 s gammaloop-nextest-spenso> 18 │+ 0:4:s-> ext5 [id=5 dir=none color="red" label="bis4|l_3"];
  267. 26.42 s gammaloop-nextest-spenso> 19 19 │ }
  268. 26.42 s gammaloop-nextest-spenso> ────────────┴───────────────────────────────────────────────────────────────────
  269. 26.42 s gammaloop-nextest-spenso> To update snapshots run `cargo insta review`
  270. 26.42 s gammaloop-nextest-spenso> Stopped on the first failure. Run `cargo insta test` to run all snapshots.
  271. 26.42 s gammaloop-nextest-spenso> test tensor::tests::parsing::infinite_execution ... FAILED
  272. 26.42 s gammaloop-nextest-spenso>
  273. 26.43 s gammaloop-nextest-spenso> failures:
  274. 26.43 s gammaloop-nextest-spenso>
  275. 26.43 s gammaloop-nextest-spenso> failures:
  276. 26.43 s gammaloop-nextest-spenso> tensor::tests::parsing::infinite_execution
  277. 26.43 s gammaloop-nextest-spenso>
  278. 26.43 s gammaloop-nextest-spenso> test result: FAILED. 0 passed; 1 failed; 0 ignored; 0 measured; 240 filtered out; finished in 0.06s
  279. 26.43 s gammaloop-nextest-spenso> system-err
  280. 26.43 s gammaloop-nextest-spenso> thread 'tensor::tests::parsing::infinite_execution' (846) panicked at /nix/store/p13pfw1gvvk8m860apfhvzcgidxhbs7g-vendor-cargo-deps/c19b7c6f923b580ac259164a89f2577984ad5ab09ee9d583b888f934adbbe8d0/insta-1.47.2/src/runtime.rs:719:13:
  281. 26.43 s gammaloop-nextest-spenso> snapshot assertion for 'infinite_execution' failed in line 910
  282. 26.43 s gammaloop-nextest-spenso> stack backtrace:
  283. 26.43 s gammaloop-nextest-spenso> 0: __rustc::rust_begin_unwind
  284. 26.43 s gammaloop-nextest-spenso> 1: core::panicking::panic_fmt
  285. 26.43 s gammaloop-nextest-spenso> 2: insta::runtime::assert_snapshot
  286. 26.43 s gammaloop-nextest-spenso> 3: idenso::tensor::tests::parsing::infinite_execution
  287. 26.43 s gammaloop-nextest-spenso> 4: <idenso::tensor::tests::parsing::infinite_execution::{closure#0} as core::ops::function::FnOnce<()>>::call_once
  288. 26.43 s gammaloop-nextest-spenso> note: Some details are omitted, run with `RUST_BACKTRACE=full` for a verbose backtrace.
  289. 26.43 s gammaloop-nextest-spenso> =========================================
  290. 26.45 s gammaloop-nextest-spenso> Extracting 2 binaries and 1 linked path to /build/nextest-archive-cHkIwS
  291. 26.59 s gammaloop-nextest-spenso> Extracted 8 files to /build/nextest-archive-cHkIwS in 0.14s
  292. 26.61 s gammaloop-nextest-spenso> ------------
  293. 26.61 s gammaloop-nextest-spenso> Nextest run ID 97373f76-3e8d-4df7-8e38-09f3708eb2d0 with nextest profile: ci_gammaloop
  294. 26.61 s gammaloop-nextest-spenso> Starting 135 tests across 2 binaries
  295. 26.74 s gammaloop-nextest-spenso> ------------
  296. 26.74 s gammaloop-nextest-spenso> Summary [ 0.130s] 135 tests run: 135 passed, 0 skipped
  297. 26.81 s gammaloop-nextest-spenso>
  298. 26.81 s gammaloop-nextest-spenso> ========== nextest test summary ==========
  299. 26.81 s gammaloop-nextest-spenso> report: target/nextest/ci_gammaloop/junit.xml
  300. 26.81 s gammaloop-nextest-spenso> tests: 135, failures: 0, errors: 0
  301. 26.81 s gammaloop-nextest-spenso> No failing testcases found.
  302. 26.81 s gammaloop-nextest-spenso> =========================================
  303. 26.83 s gammaloop-nextest-spenso> Extracting 5 binaries and 2 linked paths to /build/nextest-archive-j4wo1I
  304. 27.20 s gammaloop-nextest-spenso> Extracted 19 files to /build/nextest-archive-j4wo1I in 0.37s
  305. 27.22 s gammaloop-nextest-spenso> ------------
  306. 27.22 s gammaloop-nextest-spenso> Nextest run ID 70f2d12b-7da6-4e33-ba54-2c8cdb402f57 with nextest profile: ci_gammaloop
  307. 27.22 s gammaloop-nextest-spenso> Starting 25 tests across 5 binaries (1 test skipped via profile.ci_gammaloop.default-filter)
  308. 27.56 s gammaloop-nextest-spenso> ------------
  309. 27.56 s gammaloop-nextest-spenso> Summary [ 0.340s] 25 tests run: 25 passed, 1 skipped
  310. 27.66 s gammaloop-nextest-spenso>
  311. 27.66 s gammaloop-nextest-spenso> ========== nextest test summary ==========
  312. 27.66 s gammaloop-nextest-spenso> report: target/nextest/ci_gammaloop/junit.xml
  313. 27.66 s gammaloop-nextest-spenso> tests: 25, failures: 0, errors: 0
  314. 27.66 s gammaloop-nextest-spenso> No failing testcases found.
  315. 27.66 s gammaloop-nextest-spenso> =========================================
  316. 27.68 s gammaloop-nextest-spenso> Extracting 2 binaries and 1 linked path to /build/nextest-archive-E6feWW
  317. 27.78 s gammaloop-nextest-spenso> Extracted 8 files to /build/nextest-archive-E6feWW in 0.10s
  318. 27.80 s gammaloop-nextest-spenso> ------------
  319. 27.80 s gammaloop-nextest-spenso> Nextest run ID 3ec8a6a2-7f7e-47af-b0db-84bfca01ffae with nextest profile: ci_gammaloop
  320. 27.80 s gammaloop-nextest-spenso> Starting 1 test across 2 binaries
  321. 27.80 s gammaloop-nextest-spenso> ------------
  322. 27.80 s gammaloop-nextest-spenso> Summary [ 0.008s] 1 test run: 1 passed, 0 skipped
  323. 27.87 s gammaloop-nextest-spenso>
  324. 27.87 s gammaloop-nextest-spenso> ========== nextest test summary ==========
  325. 27.87 s gammaloop-nextest-spenso> report: target/nextest/ci_gammaloop/junit.xml
  326. 27.87 s gammaloop-nextest-spenso> tests: 1, failures: 0, errors: 0
  327. 27.87 s gammaloop-nextest-spenso> No failing testcases found.
  328. 27.87 s gammaloop-nextest-spenso> =========================================
  329. 27.89 s gammaloop-nextest-spenso> Extracting 1 binary and 1 linked path to /build/nextest-archive-HVCbdI
  330. 27.99 s gammaloop-nextest-spenso> Extracted 7 files to /build/nextest-archive-HVCbdI in 0.10s
  331. 28.00 s gammaloop-nextest-spenso> ------------
  332. 28.00 s gammaloop-nextest-spenso> Nextest run ID 28ddb45c-d539-4b1f-beaf-c3c774257f2c with nextest profile: ci_gammaloop
  333. 28.00 s gammaloop-nextest-spenso> Starting 0 tests across 1 binary
  334. 28.00 s gammaloop-nextest-spenso> ------------
  335. 28.00 s gammaloop-nextest-spenso> Summary [ 0.000s] 0 tests run: 0 passed, 0 skipped
  336. 28.07 s gammaloop-nextest-spenso>
  337. 28.07 s gammaloop-nextest-spenso> ========== nextest test summary ==========
  338. 28.07 s gammaloop-nextest-spenso> report: target/nextest/ci_gammaloop/junit.xml
  339. 28.07 s gammaloop-nextest-spenso> tests: 0, failures: 0, errors: 0
  340. 28.07 s gammaloop-nextest-spenso> No failing testcases found.
  341. 28.07 s gammaloop-nextest-spenso> =========================================
  342. 28.13 s error: Cannot build '/nix/store/8hj2j3n1562bs62vvl44s3db1hsxblr2-gammaloop-nextest-spenso.drv'.
  343. 28.27 s Reason: builder failed with exit code 100.
  344. 28.27 s Output paths:
  345. 28.27 s /nix/store/q6zi5vs0q3wnr64456imbjpsvsayaj2c-gammaloop-nextest-spenso
  346. 28.27 s Last 325 log lines:
  347. 28.27 s > Extracting 5 binaries and 2 linked paths to /build/nextest-archive-xNLtwS
  348. 28.27 s > Extracted 19 files to /build/nextest-archive-xNLtwS in 0.34s
  349. 28.27 s > ------------
  350. 28.27 s > Nextest run ID f846d28a-4591-41e4-83e0-f3dcbd63bbbc with nextest profile: ci_gammaloop
  351. 28.27 s > Starting 224 tests across 5 binaries (26 tests skipped, including 2 tests via profile.ci_gammaloop.default-filter)
  352. 28.27 s > FAIL [ 0.021s] ( 45/224) idenso color::test::form_reference::metric_contraction_respects_antisymmetric_normalization
  353. 28.27 s > stdout ---
  354. 28.27 s >
  355. 28.27 s > running 1 test
  356. 28.27 s > test color::test::form_reference::metric_contraction_respects_antisymmetric_normalization ... FAILED
  357. 28.27 s >
  358. 28.27 s > failures:
  359. 28.27 s >
  360. 28.27 s > failures:
  361. 28.27 s > color::test::form_reference::metric_contraction_respects_antisymmetric_normalization
  362. 28.27 s >
  363. 28.27 s > test result: FAILED. 0 passed; 1 failed; 0 ignored; 0 measured; 240 filtered out; finished in 0.01s
  364. 28.27 s >
  365. 28.27 s > stderr ---
  366. 28.27 s >
  367. 28.27 s > thread 'color::test::form_reference::metric_contraction_respects_antisymmetric_normalization' (340) panicked at crates/idenso/src/color/test/form_reference.rs:171:5:
  368. 28.27 s > assertion `left == right` failed
  369. 28.27 s > left: "-1*f(coad(8,standalone_metric_j),coad(8,standalone_metric_s),coad(8,standalone_metric_u))"
  370. 28.27 s > right: "f(coad(8,standalone_metric_j),coad(8,standalone_metric_s),coad(8,standalone_metric_u))"
  371. 28.27 s > stack backtrace:
  372. 28.27 s > 0: __rustc::rust_begin_unwind
  373. 28.27 s > 1: core::panicking::panic_fmt
  374. 28.27 s > 2: core::panicking::assert_failed_inner
  375. 28.27 s > 3: core::panicking::assert_failed::<alloc::string::String, alloc::string::String>
  376. 28.27 s > 4: idenso::color::test::form_reference::metric_contraction_respects_antisymmetric_normalization
  377. 28.27 s > 5: <idenso::color::test::form_reference::metric_contraction_respects_antisymmetric_normalization::{closure#0} as core::ops::function::FnOnce<()>>::call_once
  378. 28.27 s > note: Some details are omitted, run with `RUST_BACKTRACE=full` for a verbose backtrace.
  379. 28.27 s >
  380. 28.27 s > FAIL [ 0.069s] (217/224) idenso tensor::tests::parsing::infinite_execution
  381. 28.27 s > stdout ---
  382. 28.27 s >
  383. 28.27 s > running 1 test
  384. 28.27 s > ━━━━━━━━━━━━━━━━━━━━━━━━━━━━━━━ Snapshot Summary ━━━━━━━━━━━━━━━━━━━━━━━━━━━━━━━
  385. 28.27 s > Snapshot: infinite_execution
  386. 28.27 s > Source: crates/idenso/src/tensor/tests/parsing.rs:910
  387. 28.27 s > ────────────────────────────────────────────────────────────────────────────────
  388. 28.27 s > Expression: net_iter.snapshot_dot()
  389. 28.27 s > ────────────────────────────────────────────────────────────────────────────────
  390. 28.27 s > -old snapshot
  391. 28.27 s > +new results
  392. 28.27 s > ────────────┬───────────────────────────────────────────────────────────────────
  393. 28.27 s > 8 8 │ 0:0:s -> ext0 [id=0 color="red"];
  394. 28.27 s > 9 9 │ ext1 [style=invis];
  395. 28.27 s > 10 10 │ 0:5:s -> ext1 [id=1 dir=none color="red" label="mink4|l_0"];
  396. 28.27 s > 11 11 │ ext2 [style=invis];
  397. 28.27 s > 12 │- 0:4:s -> ext2 [id=2 dir=none color="red" label="bis4|l_2"];
  398. 28.27 s > 12 │+ 0:3:s -> ext2 [id=2 dir=none color="red" label="mink4|l_1"];
  399. 28.27 s > 13 13 │ ext3 [style=invis];
  400. 28.27 s > 14 │- 0:3:s -> ext3 [id=3 dir=none color="red" label="bis4|l_3"];
  401. 28.27 s > 14 │+ 0:1:s -> ext3 [id=3 dir=none color="red" label="bis4|l_2"];
  402. 28.27 s > 15 15 │ ext4 [style=invis];
  403. 28.27 s > 16 │- 0:1:s -> ext4 [id=4 dir=none color="red" label="mink4|l_1"];
  404. 28.27 s > 16 │+ 0:2:s -> ext4 [id=4 dir=none color="red" label="mink4|l_4"];
  405. 28.27 s > 17 17 │ ext5 [style=invis];
  406. 28.27 s > 18 │- 0:2:s -> ext5 [id=5 dir=none color="red" label="mink4|l_4"];
  407. 28.27 s > 18 │+ 0:4:s -> ext5 [id=5 dir=none color="red" label="bis4|l_3"];
  408. 28.27 s > 19 19 │ }
  409. 28.27 s > ────────────┴───────────────────────────────────────────────────────────────────
  410. 28.27 s > To update snapshots run `cargo insta review`
  411. 28.27 s > Stopped on the first failure. Run `cargo insta test` to run all snapshots.
  412. 28.27 s > test tensor::tests::parsing::infinite_execution ... FAILED
  413. 28.27 s >
  414. 28.27 s > failures:
  415. 28.27 s >
  416. 28.27 s > failures:
  417. 28.27 s > tensor::tests::parsing::infinite_execution
  418. 28.27 s >
  419. 28.27 s > test result: FAILED. 0 passed; 1 failed; 0 ignored; 0 measured; 240 filtered out; finished in 0.06s
  420. 28.27 s >
  421. 28.27 s > stderr ---
  422. 28.27 s >
  423. 28.27 s > thread 'tensor::tests::parsing::infinite_execution' (846) panicked at /nix/store/p13pfw1gvvk8m860apfhvzcgidxhbs7g-vendor-cargo-deps/c19b7c6f923b580ac259164a89f2577984ad5ab09ee9d583b888f934adbbe8d0/insta-1.47.2/src/runtime.rs:719:13:
  424. 28.27 s > snapshot assertion for 'infinite_execution' failed in line 910
  425. 28.27 s > stack backtrace:
  426. 28.27 s > 0: __rustc::rust_begin_unwind
  427. 28.27 s > 1: core::panicking::panic_fmt
  428. 28.27 s > 2: insta::runtime::assert_snapshot
  429. 28.27 s > 3: idenso::tensor::tests::parsing::infinite_execution
  430. 28.27 s > 4: <idenso::tensor::tests::parsing::infinite_execution::{closure#0} as core::ops::function::FnOnce<()>>::call_once
  431. 28.27 s > note: Some details are omitted, run with `RUST_BACKTRACE=full` for a verbose backtrace.
  432. 28.27 s >
  433. 28.27 s > ------------
  434. 28.27 s > Summary [ 2.883s] 224 tests run: 222 passed, 2 failed, 26 skipped
  435. 28.27 s > FAIL [ 0.021s] ( 45/224) idenso color::test::form_reference::metric_contraction_respects_antisymmetric_normalization
  436. 28.27 s > stdout ---
  437. 28.27 s >
  438. 28.27 s > running 1 test
  439. 28.27 s > test color::test::form_reference::metric_contraction_respects_antisymmetric_normalization ... FAILED
  440. 28.27 s >
  441. 28.27 s > failures:
  442. 28.27 s >
  443. 28.27 s > failures:
  444. 28.27 s > color::test::form_reference::metric_contraction_respects_antisymmetric_normalization
  445. 28.27 s >
  446. 28.27 s > test result: FAILED. 0 passed; 1 failed; 0 ignored; 0 measured; 240 filtered out; finished in 0.01s
  447. 28.27 s >
  448. 28.27 s > stderr ---
  449. 28.27 s >
  450. 28.27 s > thread 'color::test::form_reference::metric_contraction_respects_antisymmetric_normalization' (340) panicked at crates/idenso/src/color/test/form_reference.rs:171:5:
  451. 28.27 s > assertion `left == right` failed
  452. 28.27 s > left: "-1*f(coad(8,standalone_metric_j),coad(8,standalone_metric_s),coad(8,standalone_metric_u))"
  453. 28.27 s > right: "f(coad(8,standalone_metric_j),coad(8,standalone_metric_s),coad(8,standalone_metric_u))"
  454. 28.27 s > stack backtrace:
  455. 28.27 s > 0: __rustc::rust_begin_unwind
  456. 28.27 s > 1: core::panicking::panic_fmt
  457. 28.27 s > 2: core::panicking::assert_failed_inner
  458. 28.27 s > 3: core::panicking::assert_failed::<alloc::string::String, alloc::string::String>
  459. 28.27 s > 4: idenso::color::test::form_reference::metric_contraction_respects_antisymmetric_normalization
  460. 28.27 s > 5: <idenso::color::test::form_reference::metric_contraction_respects_antisymmetric_normalization::{closure#0} as core::ops::function::FnOnce<()>>::call_once
  461. 28.27 s > note: Some details are omitted, run with `RUST_BACKTRACE=full` for a verbose backtrace.
  462. 28.27 s >
  463. 28.27 s > FAIL [ 0.069s] (217/224) idenso tensor::tests::parsing::infinite_execution
  464. 28.27 s > stdout ---
  465. 28.27 s >
  466. 28.27 s > running 1 test
  467. 28.27 s > ━━━━━━━━━━━━━━━━━━━━━━━━━━━━━━━ Snapshot Summary ━━━━━━━━━━━━━━━━━━━━━━━━━━━━━━━
  468. 28.27 s > Snapshot: infinite_execution
  469. 28.27 s > Source: crates/idenso/src/tensor/tests/parsing.rs:910
  470. 28.27 s > ────────────────────────────────────────────────────────────────────────────────
  471. 28.27 s > Expression: net_iter.snapshot_dot()
  472. 28.27 s > ────────────────────────────────────────────────────────────────────────────────
  473. 28.27 s > -old snapshot
  474. 28.27 s > +new results
  475. 28.27 s > ────────────┬───────────────────────────────────────────────────────────────────
  476. 28.27 s > 8 8 │ 0:0:s -> ext0 [id=0 color="red"];
  477. 28.27 s > 9 9 │ ext1 [style=invis];
  478. 28.27 s > 10 10 │ 0:5:s -> ext1 [id=1 dir=none color="red" label="mink4|l_0"];
  479. 28.27 s > 11 11 │ ext2 [style=invis];
  480. 28.27 s > 12 │- 0:4:s -> ext2 [id=2 dir=none color="red" label="bis4|l_2"];
  481. 28.27 s > 12 │+ 0:3:s -> ext2 [id=2 dir=none color="red" label="mink4|l_1"];
  482. 28.27 s > 13 13 │ ext3 [style=invis];
  483. 28.27 s > 14 │- 0:3:s -> ext3 [id=3 dir=none color="red" label="bis4|l_3"];
  484. 28.27 s > 14 │+ 0:1:s -> ext3 [id=3 dir=none color="red" label="bis4|l_2"];
  485. 28.27 s > 15 15 │ ext4 [style=invis];
  486. 28.27 s > 16 │- 0:1:s -> ext4 [id=4 dir=none color="red" label="mink4|l_1"];
  487. 28.27 s > 16 │+ 0:2:s -> ext4 [id=4 dir=none color="red" label="mink4|l_4"];
  488. 28.27 s > 17 17 │ ext5 [style=invis];
  489. 28.27 s > 18 │- 0:2:s -> ext5 [id=5 dir=none color="red" label="mink4|l_4"];
  490. 28.27 s > 18 │+ 0:4:s -> ext5 [id=5 dir=none color="red" label="bis4|l_3"];
  491. 28.27 s > 19 19 │ }
  492. 28.27 s > ────────────┴───────────────────────────────────────────────────────────────────
  493. 28.27 s > To update snapshots run `cargo insta review`
  494. 28.27 s > Stopped on the first failure. Run `cargo insta test` to run all snapshots.
  495. 28.27 s > test tensor::tests::parsing::infinite_execution ... FAILED
  496. 28.27 s >
  497. 28.27 s > failures:
  498. 28.27 s >
  499. 28.27 s > failures:
  500. 28.27 s > tensor::tests::parsing::infinite_execution
  501. 28.27 s >
  502. 28.27 s > test result: FAILED. 0 passed; 1 failed; 0 ignored; 0 measured; 240 filtered out; finished in 0.06s
  503. 28.27 s >
  504. 28.27 s > stderr ---
  505. 28.27 s >
  506. 28.27 s > thread 'tensor::tests::parsing::infinite_execution' (846) panicked at /nix/store/p13pfw1gvvk8m860apfhvzcgidxhbs7g-vendor-cargo-deps/c19b7c6f923b580ac259164a89f2577984ad5ab09ee9d583b888f934adbbe8d0/insta-1.47.2/src/runtime.rs:719:13:
  507. 28.27 s > snapshot assertion for 'infinite_execution' failed in line 910
  508. 28.27 s > stack backtrace:
  509. 28.27 s > 0: __rustc::rust_begin_unwind
  510. 28.27 s > 1: core::panicking::panic_fmt
  511. 28.27 s > 2: insta::runtime::assert_snapshot
  512. 28.27 s > 3: idenso::tensor::tests::parsing::infinite_execution
  513. 28.27 s > 4: <idenso::tensor::tests::parsing::infinite_execution::{closure#0} as core::ops::function::FnOnce<()>>::call_once
  514. 28.27 s > note: Some details are omitted, run with `RUST_BACKTRACE=full` for a verbose backtrace.
  515. 28.27 s >
  516. 28.27 s > error: test run failed
  517. 28.27 s >
  518. 28.27 s > ========== nextest test summary ==========
  519. 28.27 s > report: target/nextest/ci_gammaloop/junit.xml
  520. 28.27 s > tests: 224, failures: 2, errors: 0
  521. 28.27 s >
  522. 28.27 s > 1. idenso::color::test::form_reference::metric_contraction_respects_antisymmetric_normalization
  523. 28.27 s > failure: test failure with exit code 101
  524. 28.27 s > thread 'color::test::form_reference::metric_contraction_respects_antisymmetric_normalization' (340) panicked at crates/idenso/src/color/test/form_reference.rs:171:5:
  525. 28.27 s > assertion `left == right` failed
  526. 28.27 s > left: "-1*f(coad(8,standalone_metric_j),coad(8,standalone_metric_s),coad(8,standalone_metric_u))"
  527. 28.27 s > right: "f(coad(8,standalone_metric_j),coad(8,standalone_metric_s),coad(8,standalone_metric_u))"
  528. 28.27 s > stack backtrace:
  529. 28.27 s > 0: __rustc::rust_begin_unwind
  530. 28.27 s > 1: core::panicking::panic_fmt
  531. 28.27 s > 2: core::panicking::assert_failed_inner
  532. 28.27 s > 3: core::panicking::assert_failed::<alloc::string::String, alloc::string::String>
  533. 28.27 s > 4: idenso::color::test::form_reference::metric_contraction_respects_antisymmetric_normalization
  534. 28.27 s > 5: <idenso::color::test::form_reference::metric_contraction_respects_antisymmetric_normalization::{closure#0} as core::ops::function::FnOnce<()>>::call_once
  535. 28.27 s > note: Some details are omitted, run with `RUST_BACKTRACE=full` for a verbose backtrace.
  536. 28.27 s > system-out
  537. 28.27 s > running 1 test
  538. 28.27 s > test color::test::form_reference::metric_contraction_respects_antisymmetric_normalization ... FAILED
  539. 28.27 s >
  540. 28.27 s > failures:
  541. 28.27 s >
  542. 28.27 s > failures:
  543. 28.27 s > color::test::form_reference::metric_contraction_respects_antisymmetric_normalization
  544. 28.27 s >
  545. 28.27 s > test result: FAILED. 0 passed; 1 failed; 0 ignored; 0 measured; 240 filtered out; finished in 0.01s
  546. 28.27 s > system-err
  547. 28.27 s > thread 'color::test::form_reference::metric_contraction_respects_antisymmetric_normalization' (340) panicked at crates/idenso/src/color/test/form_reference.rs:171:5:
  548. 28.27 s > assertion `left == right` failed
  549. 28.27 s > left: "-1*f(coad(8,standalone_metric_j),coad(8,standalone_metric_s),coad(8,standalone_metric_u))"
  550. 28.27 s > right: "f(coad(8,standalone_metric_j),coad(8,standalone_metric_s),coad(8,standalone_metric_u))"
  551. 28.27 s > stack backtrace:
  552. 28.27 s > 0: __rustc::rust_begin_unwind
  553. 28.27 s > 1: core::panicking::panic_fmt
  554. 28.27 s > 2: core::panicking::assert_failed_inner
  555. 28.27 s > 3: core::panicking::assert_failed::<alloc::string::String, alloc::string::String>
  556. 28.27 s > 4: idenso::color::test::form_reference::metric_contraction_respects_antisymmetric_normalization
  557. 28.27 s > 5: <idenso::color::test::form_reference::metric_contraction_respects_antisymmetric_normalization::{closure#0} as core::ops::function::FnOnce<()>>::call_once
  558. 28.27 s > note: Some details are omitted, run with `RUST_BACKTRACE=full` for a verbose backtrace.
  559. 28.27 s >
  560. 28.27 s > 2. idenso::tensor::tests::parsing::infinite_execution
  561. 28.27 s > failure: test failure with exit code 101
  562. 28.27 s > thread 'tensor::tests::parsing::infinite_execution' (846) panicked at /nix/store/p13pfw1gvvk8m860apfhvzcgidxhbs7g-vendor-cargo-deps/c19b7c6f923b580ac259164a89f2577984ad5ab09ee9d583b888f934adbbe8d0/insta-1.47.2/src/runtime.rs:719:13:
  563. 28.27 s > snapshot assertion for 'infinite_execution' failed in line 910
  564. 28.27 s > stack backtrace:
  565. 28.27 s > 0: __rustc::rust_begin_unwind
  566. 28.27 s > 1: core::panicking::panic_fmt
  567. 28.27 s > 2: insta::runtime::assert_snapshot
  568. 28.27 s > 3: idenso::tensor::tests::parsing::infinite_execution
  569. 28.27 s > 4: <idenso::tensor::tests::parsing::infinite_execution::{closure#0} as core::ops::function::FnOnce<()>>::call_once
  570. 28.27 s > note: Some details are omitted, run with `RUST_BACKTRACE=full` for a verbose backtrace.
  571. 28.27 s > system-out
  572. 28.27 s > running 1 test
  573. 28.27 s > ━━━━━━━━━━━━━━━━━━━━━━━━━━━━━━━ Snapshot Summary ━━━━━━━━━━━━━━━━━━━━━━━━━━━━━━━
  574. 28.27 s > Snapshot: infinite_execution
  575. 28.27 s > Source: crates/idenso/src/tensor/tests/parsing.rs:910
  576. 28.27 s > ────────────────────────────────────────────────────────────────────────────────
  577. 28.27 s > Expression: net_iter.snapshot_dot()
  578. 28.27 s > ────────────────────────────────────────────────────────────────────────────────
  579. 28.27 s > -old snapshot
  580. 28.27 s > +new results
  581. 28.27 s > ────────────┬───────────────────────────────────────────────────────────────────
  582. 28.27 s > 8 8 │ 0:0:s-> ext0 [id=0 color="red"];
  583. 28.27 s > 9 9 │ ext1 [style=invis];
  584. 28.27 s > 10 10 │ 0:5:s-> ext1 [id=1 dir=none color="red" label="mink4|l_0"];
  585. 28.27 s > 11 11 │ ext2 [style=invis];
  586. 28.27 s > 12 │- 0:4:s-> ext2 [id=2 dir=none color="red" label="bis4|l_2"];
  587. 28.27 s > 12 │+ 0:3:s-> ext2 [id=2 dir=none color="red" label="mink4|l_1"];
  588. 28.27 s > 13 13 │ ext3 [style=invis];
  589. 28.27 s > 14 │- 0:3:s-> ext3 [id=3 dir=none color="red" label="bis4|l_3"];
  590. 28.27 s > 14 │+ 0:1:s-> ext3 [id=3 dir=none color="red" label="bis4|l_2"];
  591. 28.27 s > 15 15 │ ext4 [style=invis];
  592. 28.27 s > 16 │- 0:1:s-> ext4 [id=4 dir=none color="red" label="mink4|l_1"];
  593. 28.27 s > 16 │+ 0:2:s-> ext4 [id=4 dir=none color="red" label="mink4|l_4"];
  594. 28.27 s > 17 17 │ ext5 [style=invis];
  595. 28.27 s > 18 │- 0:2:s-> ext5 [id=5 dir=none color="red" label="mink4|l_4"];
  596. 28.27 s > 18 │+ 0:4:s-> ext5 [id=5 dir=none color="red" label="bis4|l_3"];
  597. 28.27 s > 19 19 │ }
  598. 28.27 s > ────────────┴───────────────────────────────────────────────────────────────────
  599. 28.27 s > To update snapshots run `cargo insta review`
  600. 28.27 s > Stopped on the first failure. Run `cargo insta test` to run all snapshots.
  601. 28.27 s > test tensor::tests::parsing::infinite_execution ... FAILED
  602. 28.27 s >
  603. 28.27 s > failures:
  604. 28.27 s >
  605. 28.27 s > failures:
  606. 28.27 s > tensor::tests::parsing::infinite_execution
  607. 28.27 s >
  608. 28.27 s > test result: FAILED. 0 passed; 1 failed; 0 ignored; 0 measured; 240 filtered out; finished in 0.06s
  609. 28.27 s > system-err
  610. 28.27 s > thread 'tensor::tests::parsing::infinite_execution' (846) panicked at /nix/store/p13pfw1gvvk8m860apfhvzcgidxhbs7g-vendor-cargo-deps/c19b7c6f923b580ac259164a89f2577984ad5ab09ee9d583b888f934adbbe8d0/insta-1.47.2/src/runtime.rs:719:13:
  611. 28.27 s > snapshot assertion for 'infinite_execution' failed in line 910
  612. 28.27 s > stack backtrace:
  613. 28.27 s > 0: __rustc::rust_begin_unwind
  614. 28.27 s > 1: core::panicking::panic_fmt
  615. 28.27 s > 2: insta::runtime::assert_snapshot
  616. 28.27 s > 3: idenso::tensor::tests::parsing::infinite_execution
  617. 28.27 s > 4: <idenso::tensor::tests::parsing::infinite_execution::{closure#0} as core::ops::function::FnOnce<()>>::call_once
  618. 28.27 s > note: Some details are omitted, run with `RUST_BACKTRACE=full` for a verbose backtrace.
  619. 28.27 s > =========================================
  620. 28.27 s > Extracting 2 binaries and 1 linked path to /build/nextest-archive-cHkIwS
  621. 28.27 s > Extracted 8 files to /build/nextest-archive-cHkIwS in 0.14s
  622. 28.27 s > ------------
  623. 28.27 s > Nextest run ID 97373f76-3e8d-4df7-8e38-09f3708eb2d0 with nextest profile: ci_gammaloop
  624. 28.27 s > Starting 135 tests across 2 binaries
  625. 28.27 s > ------------
  626. 28.27 s > Summary [ 0.130s] 135 tests run: 135 passed, 0 skipped
  627. 28.27 s >
  628. 28.27 s > ========== nextest test summary ==========
  629. 28.27 s > report: target/nextest/ci_gammaloop/junit.xml
  630. 28.27 s > tests: 135, failures: 0, errors: 0
  631. 28.27 s > No failing testcases found.
  632. 28.27 s > =========================================
  633. 28.27 s > Extracting 5 binaries and 2 linked paths to /build/nextest-archive-j4wo1I
  634. 28.27 s > Extracted 19 files to /build/nextest-archive-j4wo1I in 0.37s
  635. 28.27 s > ------------
  636. 28.27 s > Nextest run ID 70f2d12b-7da6-4e33-ba54-2c8cdb402f57 with nextest profile: ci_gammaloop
  637. 28.27 s > Starting 25 tests across 5 binaries (1 test skipped via profile.ci_gammaloop.default-filter)
  638. 28.27 s > ------------
  639. 28.27 s > Summary [ 0.340s] 25 tests run: 25 passed, 1 skipped
  640. 28.27 s >
  641. 28.27 s > ========== nextest test summary ==========
  642. 28.27 s > report: target/nextest/ci_gammaloop/junit.xml
  643. 28.27 s > tests: 25, failures: 0, errors: 0
  644. 28.27 s > No failing testcases found.
  645. 28.27 s > =========================================
  646. 28.27 s > Extracting 2 binaries and 1 linked path to /build/nextest-archive-E6feWW
  647. 28.27 s > Extracted 8 files to /build/nextest-archive-E6feWW in 0.10s
  648. 28.27 s > ------------
  649. 28.27 s > Nextest run ID 3ec8a6a2-7f7e-47af-b0db-84bfca01ffae with nextest profile: ci_gammaloop
  650. 28.27 s > Starting 1 test across 2 binaries
  651. 28.27 s > ------------
  652. 28.27 s > Summary [ 0.008s] 1 test run: 1 passed, 0 skipped
  653. 28.27 s >
  654. 28.27 s > ========== nextest test summary ==========
  655. 28.27 s > report: target/nextest/ci_gammaloop/junit.xml
  656. 28.27 s > tests: 1, failures: 0, errors: 0
  657. 28.27 s > No failing testcases found.
  658. 28.27 s > =========================================
  659. 28.27 s > Extracting 1 binary and 1 linked path to /build/nextest-archive-HVCbdI
  660. 28.27 s > Extracted 7 files to /build/nextest-archive-HVCbdI in 0.10s
  661. 28.27 s > ------------
  662. 28.27 s > Nextest run ID 28ddb45c-d539-4b1f-beaf-c3c774257f2c with nextest profile: ci_gammaloop
  663. 28.27 s > Starting 0 tests across 1 binary
  664. 28.27 s > ------------
  665. 28.27 s > Summary [ 0.000s] 0 tests run: 0 passed, 0 skipped
  666. 28.27 s >
  667. 28.27 s > ========== nextest test summary ==========
  668. 28.27 s > report: target/nextest/ci_gammaloop/junit.xml
  669. 28.27 s > tests: 0, failures: 0, errors: 0
  670. 28.27 s > No failing testcases found.
  671. 28.27 s > =========================================
  672. 28.27 s For full logs, run:
  673. 28.27 s nix log /nix/store/8hj2j3n1562bs62vvl44s3db1hsxblr2-gammaloop-nextest-spenso.drv
  674. 28.31 s [0 built (1 failed)]Run failed.