test packages.x86_64-linux.nix-ci-check-gammaloop-nextest-spenso
0.62 s
$ /nix/store/9ypz3flqsrl5xl495mm8h645gadjsxi1-coreutils-9.11/bin/timeout --kill-after=15s 7200s /nix/store/23zk8sgzamrbmj1fday15szf7f2279s8-nix-2.34.7/bin/nix --extra-experimental-features nix-command --extra-experimental-features flakes flake clone git+https://github.com/alphal00p/gammaloop --dest /tmp/nix-ci-worker/stable-pwd/repo/
1.53 s
Cloning into '/tmp/nix-ci-worker/stable-pwd/repo'...
1.53 s
remote: Enumerating objects: 65321, done.
1.53 s
remote: Counting objects: 0% (1/7972)
remote: Counting objects: 1% (80/7972)
remote: Counting objects: 2% (160/7972)
remote: Counting objects: 3% (240/7972)
remote: Counting objects: 4% (319/7972)
remote: Counting objects: 5% (399/7972)
remote: Counting objects: 6% (479/7972)
remote: Counting objects: 7% (559/7972)
remote: Counting objects: 8% (638/7972)
remote: Counting objects: 9% (718/7972)
remote: Counting objects: 10% (798/7972)
remote: Counting objects: 11% (877/7972)
remote: Counting objects: 12% (957/7972)
remote: Counting objects: 13% (1037/7972)
remote: Counting objects: 14% (1117/7972)
remote: Counting objects: 15% (1196/7972)
remote: Counting objects: 16% (1276/7972)
remote: Counting objects: 17% (1356/7972)
remote: Counting objects: 18% (1435/7972)
remote: Counting objects: 19% (1515/7972)
remote: Counting objects: 20% (1595/7972)
remote: Counting objects: 21% (1675/7972)
remote: Counting objects: 22% (1754/7972)
remote: Counting objects: 23% (1834/7972)
remote: Counting objects: 24% (1914/7972)
remote: Counting objects: 25% (1993/7972)
remote: Counting objects: 26% (2073/7972)
remote: Counting objects: 27% (2153/7972)
remote: Counting objects: 28% (2233/7972)
remote: Counting objects: 29% (2312/7972)
remote: Counting objects: 30% (2392/7972)
remote: Counting objects: 31% (2472/7972)
remote: Counting objects: 32% (2552/7972)
remote: Counting objects: 33% (2631/7972)
remote: Counting objects: 34% (2711/7972)
remote: Counting objects: 35% (2791/7972)
remote: Counting objects: 36% (2870/7972)
remote: Counting objects: 37% (2950/7972)
remote: Counting objects: 38% (3030/7972)
remote: Counting objects: 39% (3110/7972)
remote: Counting objects: 40% (3189/7972)
remote: Counting objects: 41% (3269/7972)
remote: Counting objects: 42% (3349/7972)
remote: Counting objects: 43% (3428/7972)
remote: Counting objects: 44% (3508/7972)
remote: Counting objects: 45% (3588/7972)
remote: Counting objects: 46% (3668/7972)
remote: Counting objects: 47% (3747/7972)
remote: Counting objects: 48% (3827/7972)
remote: Counting objects: 49% (3907/7972)
remote: Counting objects: 50% (3986/7972)
remote: Counting objects: 51% (4066/7972)
remote: Counting objects: 52% (4146/7972)
remote: Counting objects: 53% (4226/7972)
remote: Counting objects: 54% (4305/7972)
remote: Counting objects: 55% (4385/7972)
remote: Counting objects: 56% (4465/7972)
remote: Counting objects: 57% (4545/7972)
remote: Counting objects: 58% (4624/7972)
remote: Counting objects: 59% (4704/7972)
remote: Counting objects: 60% (4784/7972)
remote: Counting objects: 61% (4863/7972)
remote: Counting objects: 62% (4943/7972)
remote: Counting objects: 63% (5023/7972)
remote: Counting objects: 64% (5103/7972)
remote: Counting objects: 65% (5182/7972)
remote: Counting objects: 66% (5262/7972)
remote: Counting objects: 67% (5342/7972)
remote: Counting objects: 68% (5421/7972)
remote: Counting objects: 69% (5501/7972)
remote: Counting objects: 70% (5581/7972)
remote: Counting objects: 71% (5661/7972)
remote: Counting objects: 72% (5740/7972)
remote: Counting objects: 73% (5820/7972)
remote: Counting objects: 74% (5900/7972)
remote: Counting objects: 75% (5979/7972)
remote: Counting objects: 76% (6059/7972)
remote: Counting objects: 77% (6139/7972)
remote: Counting objects: 78% (6219/7972)
remote: Counting objects: 79% (6298/7972)
remote: Counting objects: 80% (6378/7972)
remote: Counting objects: 81% (6458/7972)
remote: Counting objects: 82% (6538/7972)
remote: Counting objects: 83% (6617/7972)
remote: Counting objects: 84% (6697/7972)
remote: Counting objects: 85% (6777/7972)
remote: Counting objects: 86% (6856/7972)
remote: Counting objects: 87% (6936/7972)
remote: Counting objects: 88% (7016/7972)
remote: Counting objects: 89% (7096/7972)
remote: Counting objects: 90% (7175/7972)
remote: Counting objects: 91% (7255/7972)
remote: Counting objects: 92% (7335/7972)
remote: Counting objects: 93% (7414/7972)
remote: Counting objects: 94% (7494/7972)
remote: Counting objects: 95% (7574/7972)
remote: Counting objects: 96% (7654/7972)
remote: Counting objects: 97% (7733/7972)
remote: Counting objects: 98% (7813/7972)
remote: Counting objects: 99% (7893/7972)
remote: Counting objects: 100% (7972/7972)
remote: Counting objects: 100% (7972/7972), done.
2.41 s
remote: Compressing objects: 0% (1/1623)
remote: Compressing objects: 1% (17/1623)
remote: Compressing objects: 2% (33/1623)
remote: Compressing objects: 3% (49/1623)
remote: Compressing objects: 4% (65/1623)
remote: Compressing objects: 5% (82/1623)
remote: Compressing objects: 6% (98/1623)
remote: Compressing objects: 7% (114/1623)
remote: Compressing objects: 8% (130/1623)
remote: Compressing objects: 9% (147/1623)
remote: Compressing objects: 10% (163/1623)
remote: Compressing objects: 11% (179/1623)
remote: Compressing objects: 12% (195/1623)
remote: Compressing objects: 13% (211/1623)
remote: Compressing objects: 14% (228/1623)
remote: Compressing objects: 15% (244/1623)
remote: Compressing objects: 16% (260/1623)
remote: Compressing objects: 17% (276/1623)
remote: Compressing objects: 18% (293/1623)
remote: Compressing objects: 19% (309/1623)
remote: Compressing objects: 20% (325/1623)
remote: Compressing objects: 21% (341/1623)
remote: Compressing objects: 22% (358/1623)
remote: Compressing objects: 23% (374/1623)
remote: Compressing objects: 24% (390/1623)
remote: Compressing objects: 25% (406/1623)
remote: Compressing objects: 26% (422/1623)
remote: Compressing objects: 27% (439/1623)
remote: Compressing objects: 28% (455/1623)
remote: Compressing objects: 29% (471/1623)
remote: Compressing objects: 30% (487/1623)
remote: Compressing objects: 31% (504/1623)
remote: Compressing objects: 32% (520/1623)
remote: Compressing objects: 33% (536/1623)
remote: Compressing objects: 34% (552/1623)
remote: Compressing objects: 35% (569/1623)
remote: Compressing objects: 36% (585/1623)
remote: Compressing objects: 37% (601/1623)
remote: Compressing objects: 38% (617/1623)
remote: Compressing objects: 39% (633/1623)
remote: Compressing objects: 40% (650/1623)
remote: Compressing objects: 41% (666/1623)
remote: Compressing objects: 42% (682/1623)
remote: Compressing objects: 43% (698/1623)
remote: Compressing objects: 44% (715/1623)
remote: Compressing objects: 45% (731/1623)
remote: Compressing objects: 46% (747/1623)
remote: Compressing objects: 47% (763/1623)
remote: Compressing objects: 48% (780/1623)
remote: Compressing objects: 49% (796/1623)
remote: Compressing objects: 50% (812/1623)
remote: Compressing objects: 51% (828/1623)
remote: Compressing objects: 52% (844/1623)
remote: Compressing objects: 53% (861/1623)
remote: Compressing objects: 54% (877/1623)
remote: Compressing objects: 55% (893/1623)
remote: Compressing objects: 56% (909/1623)
remote: Compressing objects: 57% (926/1623)
remote: Compressing objects: 58% (942/1623)
remote: Compressing objects: 59% (958/1623)
remote: Compressing objects: 60% (974/1623)
remote: Compressing objects: 61% (991/1623)
remote: Compressing objects: 62% (1007/1623)
remote: Compressing objects: 63% (1023/1623)
remote: Compressing objects: 64% (1039/1623)
remote: Compressing objects: 65% (1055/1623)
remote: Compressing objects: 66% (1072/1623)
remote: Compressing objects: 67% (1088/1623)
remote: Compressing objects: 68% (1104/1623)
remote: Compressing objects: 69% (1120/1623)
remote: Compressing objects: 70% (1137/1623)
remote: Compressing objects: 71% (1153/1623)
remote: Compressing objects: 72% (1169/1623)
remote: Compressing objects: 73% (1185/1623)
remote: Compressing objects: 74% (1202/1623)
remote: Compressing objects: 75% (1218/1623)
remote: Compressing objects: 76% (1234/1623)
remote: Compressing objects: 77% (1250/1623)
remote: Compressing objects: 78% (1266/1623)
remote: Compressing objects: 79% (1283/1623)
remote: Compressing objects: 80% (1299/1623)
remote: Compressing objects: 81% (1315/1623)
remote: Compressing objects: 82% (1331/1623)
remote: Compressing objects: 83% (1348/1623)
remote: Compressing objects: 84% (1364/1623)
remote: Compressing objects: 85% (1380/1623)
remote: Compressing objects: 86% (1396/1623)
remote: Compressing objects: 87% (1413/1623)
remote: Compressing objects: 88% (1429/1623)
remote: Compressing objects: 89% (1445/1623)
remote: Compressing objects: 90% (1461/1623)
remote: Compressing objects: 91% (1477/1623)
remote: Compressing objects: 92% (1494/1623)
remote: Compressing objects: 93% (1510/1623)
remote: Compressing objects: 94% (1526/1623)
remote: Compressing objects: 95% (1542/1623)
remote: Compressing objects: 96% (1559/1623)
remote: Compressing objects: 97% (1575/1623)
remote: Compressing objects: 98% (1591/1623)
remote: Compressing objects: 99% (1607/1623)
remote: Compressing objects: 100% (1623/1623)
remote: Compressing objects: 100% (1623/1623), done.
5.07 s
Receiving objects: 0% (1/65321)
Receiving objects: 1% (654/65321)
Receiving objects: 2% (1307/65321)
Receiving objects: 3% (1960/65321)
Receiving objects: 4% (2613/65321)
Receiving objects: 5% (3267/65321)
Receiving objects: 6% (3920/65321)
Receiving objects: 7% (4573/65321)
Receiving objects: 8% (5226/65321)
Receiving objects: 9% (5879/65321)
Receiving objects: 10% (6533/65321)
Receiving objects: 11% (7186/65321)
Receiving objects: 12% (7839/65321), 11.27 MiB | 22.51 MiB/s
Receiving objects: 13% (8492/65321), 11.27 MiB | 22.51 MiB/s
Receiving objects: 14% (9145/65321), 11.27 MiB | 22.51 MiB/s
Receiving objects: 15% (9799/65321), 11.27 MiB | 22.51 MiB/s
Receiving objects: 16% (10452/65321), 11.27 MiB | 22.51 MiB/s
Receiving objects: 17% (11105/65321), 11.27 MiB | 22.51 MiB/s
Receiving objects: 18% (11758/65321), 11.27 MiB | 22.51 MiB/s
Receiving objects: 19% (12411/65321), 11.27 MiB | 22.51 MiB/s
Receiving objects: 20% (13065/65321), 11.27 MiB | 22.51 MiB/s
Receiving objects: 21% (13718/65321), 11.27 MiB | 22.51 MiB/s
Receiving objects: 22% (14371/65321), 11.27 MiB | 22.51 MiB/s
Receiving objects: 23% (15024/65321), 11.27 MiB | 22.51 MiB/s
Receiving objects: 24% (15678/65321), 11.27 MiB | 22.51 MiB/s
Receiving objects: 25% (16331/65321), 11.27 MiB | 22.51 MiB/s
Receiving objects: 26% (16984/65321), 11.27 MiB | 22.51 MiB/s
Receiving objects: 27% (17637/65321), 11.27 MiB | 22.51 MiB/s
Receiving objects: 28% (18290/65321), 11.27 MiB | 22.51 MiB/s
Receiving objects: 29% (18944/65321), 11.27 MiB | 22.51 MiB/s
Receiving objects: 30% (19597/65321), 11.27 MiB | 22.51 MiB/s
Receiving objects: 31% (20250/65321), 11.27 MiB | 22.51 MiB/s
Receiving objects: 32% (20903/65321), 11.27 MiB | 22.51 MiB/s
Receiving objects: 33% (21556/65321), 11.27 MiB | 22.51 MiB/s
Receiving objects: 34% (22210/65321), 11.27 MiB | 22.51 MiB/s
Receiving objects: 35% (22863/65321), 11.27 MiB | 22.51 MiB/s
Receiving objects: 36% (23516/65321), 11.27 MiB | 22.51 MiB/s
Receiving objects: 37% (24169/65321), 11.27 MiB | 22.51 MiB/s
Receiving objects: 38% (24822/65321), 11.27 MiB | 22.51 MiB/s
Receiving objects: 39% (25476/65321), 11.27 MiB | 22.51 MiB/s
Receiving objects: 40% (26129/65321), 11.27 MiB | 22.51 MiB/s
Receiving objects: 41% (26782/65321), 11.27 MiB | 22.51 MiB/s
Receiving objects: 42% (27435/65321), 11.27 MiB | 22.51 MiB/s
Receiving objects: 43% (28089/65321), 11.27 MiB | 22.51 MiB/s
Receiving objects: 44% (28742/65321), 11.27 MiB | 22.51 MiB/s
Receiving objects: 45% (29395/65321), 11.27 MiB | 22.51 MiB/s
Receiving objects: 46% (30048/65321), 11.27 MiB | 22.51 MiB/s
Receiving objects: 47% (30701/65321), 11.27 MiB | 22.51 MiB/s
Receiving objects: 48% (31355/65321), 11.27 MiB | 22.51 MiB/s
Receiving objects: 49% (32008/65321), 11.27 MiB | 22.51 MiB/s
Receiving objects: 50% (32661/65321), 11.27 MiB | 22.51 MiB/s
Receiving objects: 51% (33314/65321), 11.27 MiB | 22.51 MiB/s
Receiving objects: 51% (33694/65321), 31.57 MiB | 31.56 MiB/s
Receiving objects: 52% (33967/65321), 31.57 MiB | 31.56 MiB/s
Receiving objects: 53% (34621/65321), 31.57 MiB | 31.56 MiB/s
Receiving objects: 54% (35274/65321), 31.57 MiB | 31.56 MiB/s
Receiving objects: 55% (35927/65321), 31.57 MiB | 31.56 MiB/s
Receiving objects: 56% (36580/65321), 31.57 MiB | 31.56 MiB/s
Receiving objects: 57% (37233/65321), 31.57 MiB | 31.56 MiB/s
Receiving objects: 58% (37887/65321), 31.57 MiB | 31.56 MiB/s
Receiving objects: 59% (38540/65321), 31.57 MiB | 31.56 MiB/s
Receiving objects: 60% (39193/65321), 31.57 MiB | 31.56 MiB/s
Receiving objects: 61% (39846/65321), 31.57 MiB | 31.56 MiB/s
Receiving objects: 62% (40500/65321), 31.57 MiB | 31.56 MiB/s
Receiving objects: 63% (41153/65321), 48.78 MiB | 32.51 MiB/s
Receiving objects: 64% (41806/65321), 48.78 MiB | 32.51 MiB/s
Receiving objects: 65% (42459/65321), 48.78 MiB | 32.51 MiB/s
Receiving objects: 66% (43112/65321), 48.78 MiB | 32.51 MiB/s
Receiving objects: 67% (43766/65321), 48.78 MiB | 32.51 MiB/s
Receiving objects: 68% (44419/65321), 48.78 MiB | 32.51 MiB/s
Receiving objects: 69% (45072/65321), 48.78 MiB | 32.51 MiB/s
Receiving objects: 70% (45725/65321), 48.78 MiB | 32.51 MiB/s
Receiving objects: 71% (46378/65321), 48.78 MiB | 32.51 MiB/s
Receiving objects: 72% (47032/65321), 48.78 MiB | 32.51 MiB/s
Receiving objects: 73% (47685/65321), 48.78 MiB | 32.51 MiB/s
Receiving objects: 74% (48338/65321), 48.78 MiB | 32.51 MiB/s
Receiving objects: 74% (48916/65321), 65.33 MiB | 32.66 MiB/s
Receiving objects: 75% (48991/65321), 65.33 MiB | 32.66 MiB/s
Receiving objects: 76% (49644/65321), 65.33 MiB | 32.66 MiB/s
Receiving objects: 77% (50298/65321), 65.33 MiB | 32.66 MiB/s
Receiving objects: 78% (50951/65321), 65.33 MiB | 32.66 MiB/s
Receiving objects: 79% (51604/65321), 65.33 MiB | 32.66 MiB/s
Receiving objects: 80% (52257/65321), 65.33 MiB | 32.66 MiB/s
Receiving objects: 81% (52911/65321), 65.33 MiB | 32.66 MiB/s
Receiving objects: 82% (53564/65321), 65.33 MiB | 32.66 MiB/s
Receiving objects: 83% (54217/65321), 65.33 MiB | 32.66 MiB/s
Receiving objects: 84% (54870/65321), 65.33 MiB | 32.66 MiB/s
Receiving objects: 85% (55523/65321), 65.33 MiB | 32.66 MiB/s
Receiving objects: 86% (56177/65321), 65.33 MiB | 32.66 MiB/s
Receiving objects: 87% (56830/65321), 65.33 MiB | 32.66 MiB/s
Receiving objects: 88% (57483/65321), 81.84 MiB | 32.73 MiB/s
Receiving objects: 89% (58136/65321), 81.84 MiB | 32.73 MiB/s
Receiving objects: 90% (58789/65321), 81.84 MiB | 32.73 MiB/s
Receiving objects: 91% (59443/65321), 81.84 MiB | 32.73 MiB/s
Receiving objects: 92% (60096/65321), 81.84 MiB | 32.73 MiB/s
Receiving objects: 93% (60749/65321), 81.84 MiB | 32.73 MiB/s
Receiving objects: 94% (61402/65321), 81.84 MiB | 32.73 MiB/s
Receiving objects: 95% (62055/65321), 81.84 MiB | 32.73 MiB/s
Receiving objects: 96% (62709/65321), 81.84 MiB | 32.73 MiB/s
Receiving objects: 97% (63362/65321), 81.84 MiB | 32.73 MiB/s
Receiving objects: 98% (64015/65321), 81.84 MiB | 32.73 MiB/s
Receiving objects: 99% (64668/65321), 81.84 MiB | 32.73 MiB/s
remote: Total 65321 (delta 6903), reused 6445 (delta 6339), pack-reused 57349 (from 1)
5.07 s
Receiving objects: 100% (65321/65321), 81.84 MiB | 32.73 MiB/s
Receiving objects: 100% (65321/65321), 87.65 MiB | 32.90 MiB/s, done.
5.93 s
Resolving deltas: 0% (0/46021)
Resolving deltas: 1% (461/46021)
Resolving deltas: 2% (921/46021)
Resolving deltas: 3% (1381/46021)
Resolving deltas: 4% (1842/46021)
Resolving deltas: 5% (2302/46021)
Resolving deltas: 6% (2762/46021)
Resolving deltas: 7% (3222/46021)
Resolving deltas: 8% (3682/46021)
Resolving deltas: 9% (4142/46021)
Resolving deltas: 10% (4603/46021)
Resolving deltas: 11% (5063/46021)
Resolving deltas: 12% (5523/46021)
Resolving deltas: 13% (5983/46021)
Resolving deltas: 14% (6443/46021)
Resolving deltas: 15% (6908/46021)
Resolving deltas: 16% (7365/46021)
Resolving deltas: 17% (7824/46021)
Resolving deltas: 18% (8284/46021)
Resolving deltas: 19% (8747/46021)
Resolving deltas: 20% (9205/46021)
Resolving deltas: 21% (9665/46021)
Resolving deltas: 22% (10125/46021)
Resolving deltas: 23% (10585/46021)
Resolving deltas: 24% (11046/46021)
Resolving deltas: 25% (11506/46021)
Resolving deltas: 26% (11966/46021)
Resolving deltas: 27% (12428/46021)
Resolving deltas: 28% (12887/46021)
Resolving deltas: 29% (13348/46021)
Resolving deltas: 30% (13807/46021)
Resolving deltas: 31% (14267/46021)
Resolving deltas: 32% (14728/46021)
Resolving deltas: 33% (15189/46021)
Resolving deltas: 34% (15648/46021)
Resolving deltas: 35% (16108/46021)
Resolving deltas: 36% (16568/46021)
Resolving deltas: 37% (17028/46021)
Resolving deltas: 38% (17488/46021)
Resolving deltas: 39% (17949/46021)
Resolving deltas: 40% (18409/46021)
Resolving deltas: 41% (18869/46021)
Resolving deltas: 42% (19330/46021)
Resolving deltas: 43% (19790/46021)
Resolving deltas: 44% (20250/46021)
Resolving deltas: 45% (20710/46021)
Resolving deltas: 46% (21170/46021)
Resolving deltas: 47% (21631/46021)
Resolving deltas: 48% (22091/46021)
Resolving deltas: 49% (22552/46021)
Resolving deltas: 50% (23011/46021)
Resolving deltas: 51% (23473/46021)
Resolving deltas: 52% (23931/46021)
Resolving deltas: 53% (24392/46021)
Resolving deltas: 54% (24853/46021)
Resolving deltas: 55% (25312/46021)
Resolving deltas: 56% (25773/46021)
Resolving deltas: 57% (26232/46021)
Resolving deltas: 58% (26693/46021)
Resolving deltas: 59% (27153/46021)
Resolving deltas: 60% (27613/46021)
Resolving deltas: 61% (28073/46021)
Resolving deltas: 62% (28534/46021)
Resolving deltas: 63% (28994/46021)
Resolving deltas: 64% (29454/46021)
Resolving deltas: 65% (29914/46021)
Resolving deltas: 66% (30374/46021)
Resolving deltas: 67% (30835/46021)
Resolving deltas: 68% (31295/46021)
Resolving deltas: 69% (31755/46021)
Resolving deltas: 70% (32215/46021)
Resolving deltas: 71% (32675/46021)
Resolving deltas: 72% (33136/46021)
Resolving deltas: 73% (33596/46021)
Resolving deltas: 74% (34056/46021)
Resolving deltas: 75% (34516/46021)
Resolving deltas: 76% (34976/46021)
Resolving deltas: 77% (35437/46021)
Resolving deltas: 78% (35897/46021)
Resolving deltas: 79% (36358/46021)
Resolving deltas: 80% (36818/46021)
Resolving deltas: 81% (37278/46021)
Resolving deltas: 82% (37738/46021)
Resolving deltas: 83% (38198/46021)
Resolving deltas: 84% (38659/46021)
Resolving deltas: 85% (39118/46021)
Resolving deltas: 86% (39579/46021)
Resolving deltas: 87% (40040/46021)
Resolving deltas: 88% (40499/46021)
Resolving deltas: 89% (40959/46021)
Resolving deltas: 90% (41419/46021)
Resolving deltas: 91% (41880/46021)
Resolving deltas: 92% (42340/46021)
Resolving deltas: 93% (42800/46021)
Resolving deltas: 94% (43262/46021)
Resolving deltas: 95% (43720/46021)
Resolving deltas: 96% (44181/46021)
Resolving deltas: 97% (44641/46021)
Resolving deltas: 98% (45101/46021)
Resolving deltas: 99% (45561/46021)
Resolving deltas: 100% (46021/46021)
Resolving deltas: 100% (46021/46021), done.
6.23 s
Fetching commit 7ed25ba0add6fdafcb84d7c8d5c514d7d735f5bf for vakint_rustred ...
6.23 s
$ /nix/store/bcnisk3ydfgv26v2gw3zlky24g00yww2-git-2.54.0/bin/git fetch origin 7ed25ba0add6fdafcb84d7c8d5c514d7d735f5bf
6.63 s
From https://github.com/alphal00p/gammaloop
6.63 s
* branch 7ed25ba0add6fdafcb84d7c8d5c514d7d735f5bf -> FETCH_HEAD
6.65 s
$ /nix/store/9ypz3flqsrl5xl495mm8h645gadjsxi1-coreutils-9.11/bin/timeout --kill-after=15s 7200s /nix/store/bcnisk3ydfgv26v2gw3zlky24g00yww2-git-2.54.0/bin/git -c advice.detachedHead=false checkout 7ed25ba0add6fdafcb84d7c8d5c514d7d735f5bf
6.82 s
HEAD is now at 7ed25ba0 Make RustRed scalar parity coverage exhaustive
6.83 s
$ /nix/store/9ypz3flqsrl5xl495mm8h645gadjsxi1-coreutils-9.11/bin/timeout --kill-after=15s 7200s /nix/store/23zk8sgzamrbmj1fday15szf7f2279s8-nix-2.34.7/bin/nix --extra-experimental-features nix-command --extra-experimental-features flakes --log-format internal-json run .#packages.x86_64-linux.nix-ci-check-gammaloop-nextest-spenso --print-build-logs
10.56 s
14.35 s
evaluating derivation 'g
copying '/nix/store/6x63
evaluating derivation 'g
copying '/nix/store/6x63
evaluating derivation 'g
[0 /1 built]
[1 /0 /1 built] building g gammaloop-nextest-spenso> Extracting 5 binaries and 2 linked paths to /build/nextest-archive-sueIky
14.52 s
gammaloop-nextest-spenso> Extracted 19 files to /build/nextest-archive-sueIky in 0.17s
14.53 s
gammaloop-nextest-spenso> ------------
14.53 s
gammaloop-nextest-spenso> Nextest run ID 9933a873-23c6-4993-aea9-aad2c3bbf160 with nextest profile: ci_gammaloop
14.53 s
gammaloop-nextest-spenso> Starting 224 tests across 5 binaries (26 tests skipped , including 2 tests via profile.ci_gammaloop.default-filter )
14.61 s
gammaloop-nextest-spenso> FAIL [ 0.010s] ( 47/224) idenso color::test::form_reference :: metric_contraction_respects_antisymmetric_normalization
14.61 s
gammaloop-nextest-spenso> stdout ---
14.61 s
gammaloop-nextest-spenso>
14.61 s
gammaloop-nextest-spenso> running 1 test
14.61 s
gammaloop-nextest-spenso> test color::test::form_reference::metric_contraction_respects_antisymmetric_normalization ... FAILED
14.61 s
gammaloop-nextest-spenso>
14.61 s
gammaloop-nextest-spenso> failures:
14.61 s
gammaloop-nextest-spenso>
14.61 s
gammaloop-nextest-spenso> failures:
14.61 s
gammaloop-nextest-spenso> color::test::form_reference::metric_contraction_respects_antisymmetric_normalization
14.61 s
gammaloop-nextest-spenso>
14.61 s
gammaloop-nextest-spenso> test result: FAILED. 0 passed; 1 failed; 0 ignored; 0 measured; 240 filtered out; finished in 0.00s
14.61 s
gammaloop-nextest-spenso>
14.61 s
gammaloop-nextest-spenso> stderr ---
14.61 s
gammaloop-nextest-spenso>
14.61 s
gammaloop-nextest-spenso> thread 'color::test::form_reference::metric_contraction_respects_antisymmetric_normalization' (327) panicked at crates/idenso/src/color/test/form_reference.rs:171:5:
14.61 s
gammaloop-nextest-spenso> assertion `left == right` failed
14.61 s
gammaloop-nextest-spenso> left: "-1*f(coad(8,standalone_metric_j),coad(8,standalone_metric_s),coad(8,standalone_metric_u))"
14.61 s
gammaloop-nextest-spenso> right: "f(coad(8,standalone_metric_j),coad(8,standalone_metric_s),coad(8,standalone_metric_u))"
14.61 s
gammaloop-nextest-spenso> stack backtrace:
14.61 s
gammaloop-nextest-spenso> 0: __rustc::rust_begin_unwind
14.61 s
gammaloop-nextest-spenso> 1: core::panicking::panic_fmt
14.61 s
gammaloop-nextest-spenso> 2: core::panicking::assert_failed_inner
14.61 s
gammaloop-nextest-spenso> 3: core::panicking::assert_failed::<alloc::string::String, alloc::string::String>
14.61 s
gammaloop-nextest-spenso> 4: idenso::color::test::form_reference::metric_contraction_respects_antisymmetric_normalization
14.61 s
gammaloop-nextest-spenso> 5: <idenso::color::test::form_reference::metric_contraction_respects_antisymmetric_normalization::{closure#0} as core::ops::function::FnOnce<()>>::call_once
14.61 s
gammaloop-nextest-spenso> note: Some details are omitted, run with `RUST_BACKTRACE=full` for a verbose backtrace.
14.61 s
gammaloop-nextest-spenso>
14.90 s
gammaloop-nextest-spenso> FAIL [ 0.100s] (221/224) idenso tensor::tests::parsing :: infinite_execution
14.90 s
gammaloop-nextest-spenso> stdout ---
14.90 s
gammaloop-nextest-spenso>
14.90 s
gammaloop-nextest-spenso> running 1 test
14.90 s
gammaloop-nextest-spenso> ━━━━━━━━━━━━━━━━━━━━━━━━━━━━━━━ Snapshot Summary ━━━━━━━━━━━━━━━━━━━━━━━━━━━━━━━
14.90 s
gammaloop-nextest-spenso> Snapshot: infinite_execution
14.90 s
gammaloop-nextest-spenso> Source: crates/idenso/src/tensor/tests/parsing.rs:910
14.90 s
gammaloop-nextest-spenso> ────────────────────────────────────────────────────────────────────────────────
14.90 s
gammaloop-nextest-spenso> Expression: net_iter.snapshot_dot()
14.90 s
gammaloop-nextest-spenso> ────────────────────────────────────────────────────────────────────────────────
14.90 s
gammaloop-nextest-spenso> -old snapshot
14.90 s
gammaloop-nextest-spenso> +new results
14.90 s
gammaloop-nextest-spenso> ────────────┬───────────────────────────────────────────────────────────────────
14.90 s
gammaloop-nextest-spenso> 8 8 │ 0:0:s -> ext0 [id=0 color="red"];
14.90 s
gammaloop-nextest-spenso> 9 9 │ ext1 [style=invis];
14.90 s
gammaloop-nextest-spenso> 10 10 │ 0:5:s -> ext1 [id=1 dir=none color="red" label="mink4|l_0"];
14.90 s
gammaloop-nextest-spenso> 11 11 │ ext2 [style=invis];
14.90 s
gammaloop-nextest-spenso> 12 │- 0:4:s -> ext2 [id=2 dir=none color="red" label="bis4|l_2"];
14.90 s
gammaloop-nextest-spenso> 12 │+ 0:3:s -> ext2 [id=2 dir=none color="red" label="mink4|l_1"];
14.90 s
gammaloop-nextest-spenso> 13 13 │ ext3 [style=invis];
14.90 s
gammaloop-nextest-spenso> 14 │- 0:3:s -> ext3 [id=3 dir=none color="red" label="bis4|l_3"];
14.90 s
gammaloop-nextest-spenso> 14 │+ 0:1:s -> ext3 [id=3 dir=none color="red" label="bis4|l_2"];
14.90 s
gammaloop-nextest-spenso> 15 15 │ ext4 [style=invis];
14.90 s
gammaloop-nextest-spenso> 16 │- 0:1:s -> ext4 [id=4 dir=none color="red" label="mink4|l_1"];
14.90 s
gammaloop-nextest-spenso> 16 │+ 0:2:s -> ext4 [id=4 dir=none color="red" label="mink4|l_4"];
14.90 s
gammaloop-nextest-spenso> 17 17 │ ext5 [style=invis];
14.90 s
gammaloop-nextest-spenso> 18 │- 0:2:s -> ext5 [id=5 dir=none color="red" label="mink4|l_4"];
14.90 s
gammaloop-nextest-spenso> 18 │+ 0:4:s -> ext5 [id=5 dir=none color="red" label="bis4|l_3"];
14.90 s
gammaloop-nextest-spenso> 19 19 │ }
14.90 s
gammaloop-nextest-spenso> ────────────┴───────────────────────────────────────────────────────────────────
14.90 s
gammaloop-nextest-spenso> To update snapshots run `cargo insta review`
14.90 s
gammaloop-nextest-spenso> Stopped on the first failure. Run `cargo insta test` to run all snapshots.
14.90 s
gammaloop-nextest-spenso> test tensor::tests::parsing::infinite_execution ... FAILED
14.90 s
gammaloop-nextest-spenso>
14.90 s
gammaloop-nextest-spenso> failures:
14.90 s
gammaloop-nextest-spenso>
14.90 s
gammaloop-nextest-spenso> failures:
14.90 s
gammaloop-nextest-spenso> tensor::tests::parsing::infinite_execution
14.90 s
gammaloop-nextest-spenso>
14.90 s
gammaloop-nextest-spenso> test result: FAILED. 0 passed; 1 failed; 0 ignored; 0 measured; 240 filtered out; finished in 0.09s
14.90 s
gammaloop-nextest-spenso>
14.90 s
gammaloop-nextest-spenso> stderr ---
14.90 s
gammaloop-nextest-spenso>
14.90 s
gammaloop-nextest-spenso> thread 'tensor::tests::parsing::infinite_execution' (844) panicked at /nix/store/p13pfw1gvvk8m860apfhvzcgidxhbs7g-vendor-cargo-deps/c19b7c6f923b580ac259164a89f2577984ad5ab09ee9d583b888f934adbbe8d0/insta-1.47.2/src/runtime.rs:719:13:
14.90 s
gammaloop-nextest-spenso> snapshot assertion for 'infinite_execution' failed in line 910
14.90 s
gammaloop-nextest-spenso> stack backtrace:
14.90 s
gammaloop-nextest-spenso> 0: __rustc::rust_begin_unwind
14.90 s
gammaloop-nextest-spenso> 1: core::panicking::panic_fmt
14.90 s
gammaloop-nextest-spenso> 2: insta::runtime::assert_snapshot
14.90 s
gammaloop-nextest-spenso> 3: idenso::tensor::tests::parsing::infinite_execution
14.90 s
gammaloop-nextest-spenso> 4: <idenso::tensor::tests::parsing::infinite_execution::{closure#0} as core::ops::function::FnOnce<()>>::call_once
14.90 s
gammaloop-nextest-spenso> note: Some details are omitted, run with `RUST_BACKTRACE=full` for a verbose backtrace.
14.90 s
gammaloop-nextest-spenso>
16.25 s
gammaloop-nextest-spenso> ------------
16.25 s
gammaloop-nextest-spenso> Summary [ 1.713s] 224 tests run: 222 passed , 2 failed , 26 skipped
16.25 s
gammaloop-nextest-spenso> FAIL [ 0.010s] ( 47/224) idenso color::test::form_reference :: metric_contraction_respects_antisymmetric_normalization
16.25 s
gammaloop-nextest-spenso> stdout ---
16.25 s
gammaloop-nextest-spenso>
16.25 s
gammaloop-nextest-spenso> running 1 test
16.25 s
gammaloop-nextest-spenso> test color::test::form_reference::metric_contraction_respects_antisymmetric_normalization ... FAILED
16.25 s
gammaloop-nextest-spenso>
16.25 s
gammaloop-nextest-spenso> failures:
16.25 s
gammaloop-nextest-spenso>
16.25 s
gammaloop-nextest-spenso> failures:
16.25 s
gammaloop-nextest-spenso> color::test::form_reference::metric_contraction_respects_antisymmetric_normalization
16.25 s
gammaloop-nextest-spenso>
16.25 s
gammaloop-nextest-spenso> test result: FAILED. 0 passed; 1 failed; 0 ignored; 0 measured; 240 filtered out; finished in 0.00s
16.25 s
gammaloop-nextest-spenso>
16.25 s
gammaloop-nextest-spenso> stderr ---
16.25 s
gammaloop-nextest-spenso>
16.25 s
gammaloop-nextest-spenso> thread 'color::test::form_reference::metric_contraction_respects_antisymmetric_normalization' (327) panicked at crates/idenso/src/color/test/form_reference.rs:171:5:
16.25 s
gammaloop-nextest-spenso> assertion `left == right` failed
16.25 s
gammaloop-nextest-spenso> left: "-1*f(coad(8,standalone_metric_j),coad(8,standalone_metric_s),coad(8,standalone_metric_u))"
16.25 s
gammaloop-nextest-spenso> right: "f(coad(8,standalone_metric_j),coad(8,standalone_metric_s),coad(8,standalone_metric_u))"
16.25 s
gammaloop-nextest-spenso> stack backtrace:
16.25 s
gammaloop-nextest-spenso> 0: __rustc::rust_begin_unwind
16.25 s
gammaloop-nextest-spenso> 1: core::panicking::panic_fmt
16.25 s
gammaloop-nextest-spenso> 2: core::panicking::assert_failed_inner
16.25 s
gammaloop-nextest-spenso> 3: core::panicking::assert_failed::<alloc::string::String, alloc::string::String>
16.25 s
gammaloop-nextest-spenso> 4: idenso::color::test::form_reference::metric_contraction_respects_antisymmetric_normalization
16.25 s
gammaloop-nextest-spenso> 5: <idenso::color::test::form_reference::metric_contraction_respects_antisymmetric_normalization::{closure#0} as core::ops::function::FnOnce<()>>::call_once
16.25 s
gammaloop-nextest-spenso> note: Some details are omitted, run with `RUST_BACKTRACE=full` for a verbose backtrace.
16.25 s
gammaloop-nextest-spenso>
16.25 s
gammaloop-nextest-spenso> FAIL [ 0.100s] (221/224) idenso tensor::tests::parsing :: infinite_execution
16.25 s
gammaloop-nextest-spenso> stdout ---
16.25 s
gammaloop-nextest-spenso>
16.25 s
gammaloop-nextest-spenso> running 1 test
16.25 s
gammaloop-nextest-spenso> ━━━━━━━━━━━━━━━━━━━━━━━━━━━━━━━ Snapshot Summary ━━━━━━━━━━━━━━━━━━━━━━━━━━━━━━━
16.25 s
gammaloop-nextest-spenso> Snapshot: infinite_execution
16.25 s
gammaloop-nextest-spenso> Source: crates/idenso/src/tensor/tests/parsing.rs:910
16.25 s
gammaloop-nextest-spenso> ────────────────────────────────────────────────────────────────────────────────
16.25 s
gammaloop-nextest-spenso> Expression: net_iter.snapshot_dot()
16.25 s
gammaloop-nextest-spenso> ────────────────────────────────────────────────────────────────────────────────
16.25 s
gammaloop-nextest-spenso> -old snapshot
16.25 s
gammaloop-nextest-spenso> +new results
16.25 s
gammaloop-nextest-spenso> ────────────┬───────────────────────────────────────────────────────────────────
16.25 s
gammaloop-nextest-spenso> 8 8 │ 0:0:s -> ext0 [id=0 color="red"];
16.25 s
gammaloop-nextest-spenso> 9 9 │ ext1 [style=invis];
16.25 s
gammaloop-nextest-spenso> 10 10 │ 0:5:s -> ext1 [id=1 dir=none color="red" label="mink4|l_0"];
16.25 s
gammaloop-nextest-spenso> 11 11 │ ext2 [style=invis];
16.25 s
gammaloop-nextest-spenso> 12 │- 0:4:s -> ext2 [id=2 dir=none color="red" label="bis4|l_2"];
16.25 s
gammaloop-nextest-spenso> 12 │+ 0:3:s -> ext2 [id=2 dir=none color="red" label="mink4|l_1"];
16.25 s
gammaloop-nextest-spenso> 13 13 │ ext3 [style=invis];
16.25 s
gammaloop-nextest-spenso> 14 │- 0:3:s -> ext3 [id=3 dir=none color="red" label="bis4|l_3"];
16.25 s
gammaloop-nextest-spenso> 14 │+ 0:1:s -> ext3 [id=3 dir=none color="red" label="bis4|l_2"];
16.25 s
gammaloop-nextest-spenso> 15 15 │ ext4 [style=invis];
16.25 s
gammaloop-nextest-spenso> 16 │- 0:1:s -> ext4 [id=4 dir=none color="red" label="mink4|l_1"];
16.25 s
gammaloop-nextest-spenso> 16 │+ 0:2:s -> ext4 [id=4 dir=none color="red" label="mink4|l_4"];
16.25 s
gammaloop-nextest-spenso> 17 17 │ ext5 [style=invis];
16.25 s
gammaloop-nextest-spenso> 18 │- 0:2:s -> ext5 [id=5 dir=none color="red" label="mink4|l_4"];
16.25 s
gammaloop-nextest-spenso> 18 │+ 0:4:s -> ext5 [id=5 dir=none color="red" label="bis4|l_3"];
16.25 s
gammaloop-nextest-spenso> 19 19 │ }
16.25 s
gammaloop-nextest-spenso> ────────────┴───────────────────────────────────────────────────────────────────
16.25 s
gammaloop-nextest-spenso> To update snapshots run `cargo insta review`
16.25 s
gammaloop-nextest-spenso> Stopped on the first failure. Run `cargo insta test` to run all snapshots.
16.25 s
gammaloop-nextest-spenso> test tensor::tests::parsing::infinite_execution ... FAILED
16.25 s
gammaloop-nextest-spenso>
16.25 s
gammaloop-nextest-spenso> failures:
16.25 s
gammaloop-nextest-spenso>
16.25 s
gammaloop-nextest-spenso> failures:
16.25 s
gammaloop-nextest-spenso> tensor::tests::parsing::infinite_execution
16.25 s
gammaloop-nextest-spenso>
16.25 s
gammaloop-nextest-spenso> test result: FAILED. 0 passed; 1 failed; 0 ignored; 0 measured; 240 filtered out; finished in 0.09s
16.25 s
gammaloop-nextest-spenso>
16.25 s
gammaloop-nextest-spenso> stderr ---
16.25 s
gammaloop-nextest-spenso>
16.25 s
gammaloop-nextest-spenso> thread 'tensor::tests::parsing::infinite_execution' (844) panicked at /nix/store/p13pfw1gvvk8m860apfhvzcgidxhbs7g-vendor-cargo-deps/c19b7c6f923b580ac259164a89f2577984ad5ab09ee9d583b888f934adbbe8d0/insta-1.47.2/src/runtime.rs:719:13:
16.25 s
gammaloop-nextest-spenso> snapshot assertion for 'infinite_execution' failed in line 910
16.25 s
gammaloop-nextest-spenso> stack backtrace:
16.25 s
gammaloop-nextest-spenso> 0: __rustc::rust_begin_unwind
16.25 s
gammaloop-nextest-spenso> 1: core::panicking::panic_fmt
16.25 s
gammaloop-nextest-spenso> 2: insta::runtime::assert_snapshot
16.25 s
gammaloop-nextest-spenso> 3: idenso::tensor::tests::parsing::infinite_execution
16.25 s
gammaloop-nextest-spenso> 4: <idenso::tensor::tests::parsing::infinite_execution::{closure#0} as core::ops::function::FnOnce<()>>::call_once
16.25 s
gammaloop-nextest-spenso> note: Some details are omitted, run with `RUST_BACKTRACE=full` for a verbose backtrace.
16.25 s
gammaloop-nextest-spenso>
16.28 s
gammaloop-nextest-spenso> error : test run failed
16.31 s
gammaloop-nextest-spenso>
16.31 s
gammaloop-nextest-spenso> ========== nextest test summary ==========
16.31 s
gammaloop-nextest-spenso> report: target/nextest/ci_gammaloop/junit.xml
16.31 s
gammaloop-nextest-spenso> tests: 224, failures: 2, errors: 0
16.31 s
gammaloop-nextest-spenso>
16.31 s
gammaloop-nextest-spenso> 1. idenso::color::test::form_reference::metric_contraction_respects_antisymmetric_normalization
16.31 s
gammaloop-nextest-spenso> failure: test failure with exit code 101
16.31 s
gammaloop-nextest-spenso> thread 'color::test::form_reference::metric_contraction_respects_antisymmetric_normalization' (327) panicked at crates/idenso/src/color/test/form_reference.rs:171:5:
16.31 s
gammaloop-nextest-spenso> assertion `left == right` failed
16.31 s
gammaloop-nextest-spenso> left: "-1*f(coad(8,standalone_metric_j),coad(8,standalone_metric_s),coad(8,standalone_metric_u))"
16.31 s
gammaloop-nextest-spenso> right: "f(coad(8,standalone_metric_j),coad(8,standalone_metric_s),coad(8,standalone_metric_u))"
16.31 s
gammaloop-nextest-spenso> stack backtrace:
16.31 s
gammaloop-nextest-spenso> 0: __rustc::rust_begin_unwind
16.31 s
gammaloop-nextest-spenso> 1: core::panicking::panic_fmt
16.31 s
gammaloop-nextest-spenso> 2: core::panicking::assert_failed_inner
16.31 s
gammaloop-nextest-spenso> 3: core::panicking::assert_failed::<alloc::string::String, alloc::string::String>
16.31 s
gammaloop-nextest-spenso> 4: idenso::color::test::form_reference::metric_contraction_respects_antisymmetric_normalization
16.31 s
gammaloop-nextest-spenso> 5: <idenso::color::test::form_reference::metric_contraction_respects_antisymmetric_normalization::{closure#0} as core::ops::function::FnOnce<()>>::call_once
16.31 s
gammaloop-nextest-spenso> note: Some details are omitted, run with `RUST_BACKTRACE=full` for a verbose backtrace.
16.31 s
gammaloop-nextest-spenso> system-out
16.31 s
gammaloop-nextest-spenso> running 1 test
16.31 s
gammaloop-nextest-spenso> test color::test::form_reference::metric_contraction_respects_antisymmetric_normalization ... FAILED
16.31 s
gammaloop-nextest-spenso>
16.31 s
gammaloop-nextest-spenso> failures:
16.31 s
gammaloop-nextest-spenso>
16.31 s
gammaloop-nextest-spenso> failures:
16.31 s
gammaloop-nextest-spenso> color::test::form_reference::metric_contraction_respects_antisymmetric_normalization
16.31 s
gammaloop-nextest-spenso>
16.31 s
gammaloop-nextest-spenso> test result: FAILED. 0 passed; 1 failed; 0 ignored; 0 measured; 240 filtered out; finished in 0.00s
16.31 s
gammaloop-nextest-spenso> system-err
16.31 s
gammaloop-nextest-spenso> thread 'color::test::form_reference::metric_contraction_respects_antisymmetric_normalization' (327) panicked at crates/idenso/src/color/test/form_reference.rs:171:5:
16.31 s
gammaloop-nextest-spenso> assertion `left == right` failed
16.31 s
gammaloop-nextest-spenso> left: "-1*f(coad(8,standalone_metric_j),coad(8,standalone_metric_s),coad(8,standalone_metric_u))"
16.31 s
gammaloop-nextest-spenso> right: "f(coad(8,standalone_metric_j),coad(8,standalone_metric_s),coad(8,standalone_metric_u))"
16.31 s
gammaloop-nextest-spenso> stack backtrace:
16.31 s
gammaloop-nextest-spenso> 0: __rustc::rust_begin_unwind
16.31 s
gammaloop-nextest-spenso> 1: core::panicking::panic_fmt
16.31 s
gammaloop-nextest-spenso> 2: core::panicking::assert_failed_inner
16.31 s
gammaloop-nextest-spenso> 3: core::panicking::assert_failed::<alloc::string::String, alloc::string::String>
16.31 s
gammaloop-nextest-spenso> 4: idenso::color::test::form_reference::metric_contraction_respects_antisymmetric_normalization
16.31 s
gammaloop-nextest-spenso> 5: <idenso::color::test::form_reference::metric_contraction_respects_antisymmetric_normalization::{closure#0} as core::ops::function::FnOnce<()>>::call_once
16.31 s
gammaloop-nextest-spenso> note: Some details are omitted, run with `RUST_BACKTRACE=full` for a verbose backtrace.
16.31 s
gammaloop-nextest-spenso>
16.31 s
gammaloop-nextest-spenso> 2. idenso::tensor::tests::parsing::infinite_execution
16.31 s
gammaloop-nextest-spenso> failure: test failure with exit code 101
16.31 s
gammaloop-nextest-spenso> thread 'tensor::tests::parsing::infinite_execution' (844) panicked at /nix/store/p13pfw1gvvk8m860apfhvzcgidxhbs7g-vendor-cargo-deps/c19b7c6f923b580ac259164a89f2577984ad5ab09ee9d583b888f934adbbe8d0/insta-1.47.2/src/runtime.rs:719:13:
16.31 s
gammaloop-nextest-spenso> snapshot assertion for 'infinite_execution' failed in line 910
16.31 s
gammaloop-nextest-spenso> stack backtrace:
16.31 s
gammaloop-nextest-spenso> 0: __rustc::rust_begin_unwind
16.31 s
gammaloop-nextest-spenso> 1: core::panicking::panic_fmt
16.31 s
gammaloop-nextest-spenso> 2: insta::runtime::assert_snapshot
16.31 s
gammaloop-nextest-spenso> 3: idenso::tensor::tests::parsing::infinite_execution
16.31 s
gammaloop-nextest-spenso> 4: <idenso::tensor::tests::parsing::infinite_execution::{closure#0} as core::ops::function::FnOnce<()>>::call_once
16.31 s
gammaloop-nextest-spenso> note: Some details are omitted, run with `RUST_BACKTRACE=full` for a verbose backtrace.
16.31 s
gammaloop-nextest-spenso> system-out
16.31 s
gammaloop-nextest-spenso> running 1 test
16.31 s
gammaloop-nextest-spenso> ━━━━━━━━━━━━━━━━━━━━━━━━━━━━━━━ Snapshot Summary ━━━━━━━━━━━━━━━━━━━━━━━━━━━━━━━
16.31 s
gammaloop-nextest-spenso> Snapshot: infinite_execution
16.31 s
gammaloop-nextest-spenso> Source: crates/idenso/src/tensor/tests/parsing.rs:910
16.31 s
gammaloop-nextest-spenso> ────────────────────────────────────────────────────────────────────────────────
16.31 s
gammaloop-nextest-spenso> Expression: net_iter.snapshot_dot()
16.31 s
gammaloop-nextest-spenso> ────────────────────────────────────────────────────────────────────────────────
16.31 s
gammaloop-nextest-spenso> -old snapshot
16.31 s
gammaloop-nextest-spenso> +new results
16.31 s
gammaloop-nextest-spenso> ────────────┬───────────────────────────────────────────────────────────────────
16.31 s
gammaloop-nextest-spenso> 8 8 │ 0:0:s-> ext0 [id=0 color="red"];
16.31 s
gammaloop-nextest-spenso> 9 9 │ ext1 [style=invis];
16.31 s
gammaloop-nextest-spenso> 10 10 │ 0:5:s-> ext1 [id=1 dir=none color="red" label="mink4|l_0"];
16.31 s
gammaloop-nextest-spenso> 11 11 │ ext2 [style=invis];
16.31 s
gammaloop-nextest-spenso> 12 │- 0:4:s-> ext2 [id=2 dir=none color="red" label="bis4|l_2"];
16.31 s
gammaloop-nextest-spenso> 12 │+ 0:3:s-> ext2 [id=2 dir=none color="red" label="mink4|l_1"];
16.31 s
gammaloop-nextest-spenso> 13 13 │ ext3 [style=invis];
16.31 s
gammaloop-nextest-spenso> 14 │- 0:3:s-> ext3 [id=3 dir=none color="red" label="bis4|l_3"];
16.31 s
gammaloop-nextest-spenso> 14 │+ 0:1:s-> ext3 [id=3 dir=none color="red" label="bis4|l_2"];
16.31 s
gammaloop-nextest-spenso> 15 15 │ ext4 [style=invis];
16.31 s
gammaloop-nextest-spenso> 16 │- 0:1:s-> ext4 [id=4 dir=none color="red" label="mink4|l_1"];
16.31 s
gammaloop-nextest-spenso> 16 │+ 0:2:s-> ext4 [id=4 dir=none color="red" label="mink4|l_4"];
16.31 s
gammaloop-nextest-spenso> 17 17 │ ext5 [style=invis];
16.31 s
gammaloop-nextest-spenso> 18 │- 0:2:s-> ext5 [id=5 dir=none color="red" label="mink4|l_4"];
16.31 s
gammaloop-nextest-spenso> 18 │+ 0:4:s-> ext5 [id=5 dir=none color="red" label="bis4|l_3"];
16.31 s
gammaloop-nextest-spenso> 19 19 │ }
16.31 s
gammaloop-nextest-spenso> ────────────┴───────────────────────────────────────────────────────────────────
16.31 s
gammaloop-nextest-spenso> To update snapshots run `cargo insta review`
16.31 s
gammaloop-nextest-spenso> Stopped on the first failure. Run `cargo insta test` to run all snapshots.
16.31 s
gammaloop-nextest-spenso> test tensor::tests::parsing::infinite_execution ... FAILED
16.31 s
gammaloop-nextest-spenso>
16.31 s
gammaloop-nextest-spenso> failures:
16.31 s
gammaloop-nextest-spenso>
16.31 s
gammaloop-nextest-spenso> failures:
16.31 s
gammaloop-nextest-spenso> tensor::tests::parsing::infinite_execution
16.31 s
gammaloop-nextest-spenso>
16.31 s
gammaloop-nextest-spenso> test result: FAILED. 0 passed; 1 failed; 0 ignored; 0 measured; 240 filtered out; finished in 0.09s
16.31 s
gammaloop-nextest-spenso> system-err
16.31 s
gammaloop-nextest-spenso> thread 'tensor::tests::parsing::infinite_execution' (844) panicked at /nix/store/p13pfw1gvvk8m860apfhvzcgidxhbs7g-vendor-cargo-deps/c19b7c6f923b580ac259164a89f2577984ad5ab09ee9d583b888f934adbbe8d0/insta-1.47.2/src/runtime.rs:719:13:
16.31 s
gammaloop-nextest-spenso> snapshot assertion for 'infinite_execution' failed in line 910
16.31 s
gammaloop-nextest-spenso> stack backtrace:
16.31 s
gammaloop-nextest-spenso> 0: __rustc::rust_begin_unwind
16.31 s
gammaloop-nextest-spenso> 1: core::panicking::panic_fmt
16.31 s
gammaloop-nextest-spenso> 2: insta::runtime::assert_snapshot
16.31 s
gammaloop-nextest-spenso> 3: idenso::tensor::tests::parsing::infinite_execution
16.31 s
gammaloop-nextest-spenso> 4: <idenso::tensor::tests::parsing::infinite_execution::{closure#0} as core::ops::function::FnOnce<()>>::call_once
16.31 s
gammaloop-nextest-spenso> note: Some details are omitted, run with `RUST_BACKTRACE=full` for a verbose backtrace.
16.31 s
gammaloop-nextest-spenso> =========================================
16.32 s
gammaloop-nextest-spenso> Extracting 2 binaries and 1 linked path to /build/nextest-archive-tOVEK3
16.40 s
gammaloop-nextest-spenso> Extracted 8 files to /build/nextest-archive-tOVEK3 in 0.08s
16.41 s
gammaloop-nextest-spenso> ------------
16.41 s
gammaloop-nextest-spenso> Nextest run ID a1da1127-a6fb-4d8e-bfde-33db0799fae6 with nextest profile: ci_gammaloop
16.41 s
gammaloop-nextest-spenso> Starting 135 tests across 2 binaries
16.50 s
gammaloop-nextest-spenso> ------------
16.50 s
gammaloop-nextest-spenso> Summary [ 0.097s] 135 tests run: 135 passed , 0 skipped
16.55 s
gammaloop-nextest-spenso>
16.55 s
gammaloop-nextest-spenso> ========== nextest test summary ==========
16.55 s
gammaloop-nextest-spenso> report: target/nextest/ci_gammaloop/junit.xml
16.55 s
gammaloop-nextest-spenso> tests: 135, failures: 0, errors: 0
16.55 s
gammaloop-nextest-spenso> No failing testcases found.
16.55 s
gammaloop-nextest-spenso> =========================================
16.56 s
gammaloop-nextest-spenso> Extracting 5 binaries and 2 linked paths to /build/nextest-archive-V83gOB
16.76 s
gammaloop-nextest-spenso> Extracted 19 files to /build/nextest-archive-V83gOB in 0.20s
16.77 s
gammaloop-nextest-spenso> ------------
16.77 s
gammaloop-nextest-spenso> Nextest run ID 93a8b1cd-2d89-477a-b03d-4825e5ae1a03 with nextest profile: ci_gammaloop
16.77 s
gammaloop-nextest-spenso> Starting 25 tests across 5 binaries (1 test skipped via profile.ci_gammaloop.default-filter )
16.97 s
gammaloop-nextest-spenso> ------------
16.97 s
gammaloop-nextest-spenso> Summary [ 0.199s] 25 tests run: 25 passed , 1 skipped
17.03 s
gammaloop-nextest-spenso>
17.03 s
gammaloop-nextest-spenso> ========== nextest test summary ==========
17.03 s
gammaloop-nextest-spenso> report: target/nextest/ci_gammaloop/junit.xml
17.03 s
gammaloop-nextest-spenso> tests: 25, failures: 0, errors: 0
17.03 s
gammaloop-nextest-spenso> No failing testcases found.
17.03 s
gammaloop-nextest-spenso> =========================================
17.04 s
gammaloop-nextest-spenso> Extracting 2 binaries and 1 linked path to /build/nextest-archive-p6tDsB
17.10 s
gammaloop-nextest-spenso> Extracted 8 files to /build/nextest-archive-p6tDsB in 0.06s
17.10 s
gammaloop-nextest-spenso> ------------
17.10 s
gammaloop-nextest-spenso> Nextest run ID 8f169b1b-0260-4bc9-8207-f9e13fc497b4 with nextest profile: ci_gammaloop
17.10 s
gammaloop-nextest-spenso> Starting 1 test across 2 binaries
17.11 s
gammaloop-nextest-spenso> ------------
17.11 s
gammaloop-nextest-spenso> Summary [ 0.005s] 1 test run: 1 passed , 0 skipped
17.15 s
gammaloop-nextest-spenso>
17.15 s
gammaloop-nextest-spenso> ========== nextest test summary ==========
17.15 s
gammaloop-nextest-spenso> report: target/nextest/ci_gammaloop/junit.xml
17.15 s
gammaloop-nextest-spenso> tests: 1, failures: 0, errors: 0
17.15 s
gammaloop-nextest-spenso> No failing testcases found.
17.15 s
gammaloop-nextest-spenso> =========================================
17.16 s
gammaloop-nextest-spenso> Extracting 1 binary and 1 linked path to /build/nextest-archive-2PUSPQ
17.21 s
gammaloop-nextest-spenso> Extracted 7 files to /build/nextest-archive-2PUSPQ in 0.05s
17.22 s
gammaloop-nextest-spenso> ------------
17.22 s
gammaloop-nextest-spenso> Nextest run ID 876bd068-8c17-4b32-afc4-780c8e3d1ae9 with nextest profile: ci_gammaloop
17.22 s
gammaloop-nextest-spenso> Starting 0 tests across 1 binary
17.22 s
gammaloop-nextest-spenso> ------------
17.22 s
gammaloop-nextest-spenso> Summary [ 0.000s] 0 tests run: 0 passed , 0 skipped
17.25 s
gammaloop-nextest-spenso>
17.25 s
gammaloop-nextest-spenso> ========== nextest test summary ==========
17.25 s
gammaloop-nextest-spenso> report: target/nextest/ci_gammaloop/junit.xml
17.25 s
gammaloop-nextest-spenso> tests: 0, failures: 0, errors: 0
17.25 s
gammaloop-nextest-spenso> No failing testcases found.
17.25 s
gammaloop-nextest-spenso> =========================================
17.28 s
error: Cannot build '/nix/store/8hj2j3n1562bs62vvl44s3db1hsxblr2-gammaloop-nextest-spenso.drv '.
17.28 s
Reason: builder failed with exit code 100 .
17.28 s
Output paths:
17.28 s
/nix/store/q6zi5vs0q3wnr64456imbjpsvsayaj2c-gammaloop-nextest-spenso
17.28 s
Last 325 log lines:
17.28 s
> Extracting 5 binaries and 2 linked paths to /build/nextest-archive-sueIky
17.28 s
> Extracted 19 files to /build/nextest-archive-sueIky in 0.17s
17.28 s
> ------------
17.28 s
> Nextest run ID 9933a873-23c6-4993-aea9-aad2c3bbf160 with nextest profile: ci_gammaloop
17.28 s
> Starting 224 tests across 5 binaries (26 tests skipped , including 2 tests via profile.ci_gammaloop.default-filter )
17.28 s
> FAIL [ 0.010s] ( 47/224) idenso color::test::form_reference :: metric_contraction_respects_antisymmetric_normalization
17.28 s
> stdout ---
17.28 s
>
17.28 s
> running 1 test
17.28 s
> test color::test::form_reference::metric_contraction_respects_antisymmetric_normalization ... FAILED
17.28 s
>
17.28 s
> failures:
17.28 s
>
17.28 s
> failures:
17.28 s
> color::test::form_reference::metric_contraction_respects_antisymmetric_normalization
17.28 s
>
17.28 s
> test result: FAILED. 0 passed; 1 failed; 0 ignored; 0 measured; 240 filtered out; finished in 0.00s
17.28 s
>
17.28 s
> stderr ---
17.28 s
>
17.28 s
> thread 'color::test::form_reference::metric_contraction_respects_antisymmetric_normalization' (327) panicked at crates/idenso/src/color/test/form_reference.rs:171:5:
17.28 s
> assertion `left == right` failed
17.28 s
> left: "-1*f(coad(8,standalone_metric_j),coad(8,standalone_metric_s),coad(8,standalone_metric_u))"
17.28 s
> right: "f(coad(8,standalone_metric_j),coad(8,standalone_metric_s),coad(8,standalone_metric_u))"
17.28 s
> stack backtrace:
17.28 s
> 0: __rustc::rust_begin_unwind
17.28 s
> 1: core::panicking::panic_fmt
17.28 s
> 2: core::panicking::assert_failed_inner
17.28 s
> 3: core::panicking::assert_failed::<alloc::string::String, alloc::string::String>
17.28 s
> 4: idenso::color::test::form_reference::metric_contraction_respects_antisymmetric_normalization
17.28 s
> 5: <idenso::color::test::form_reference::metric_contraction_respects_antisymmetric_normalization::{closure#0} as core::ops::function::FnOnce<()>>::call_once
17.28 s
> note: Some details are omitted, run with `RUST_BACKTRACE=full` for a verbose backtrace.
17.28 s
>
17.28 s
> FAIL [ 0.100s] (221/224) idenso tensor::tests::parsing :: infinite_execution
17.28 s
> stdout ---
17.28 s
>
17.28 s
> running 1 test
17.28 s
> ━━━━━━━━━━━━━━━━━━━━━━━━━━━━━━━ Snapshot Summary ━━━━━━━━━━━━━━━━━━━━━━━━━━━━━━━
17.28 s
> Snapshot: infinite_execution
17.28 s
> Source: crates/idenso/src/tensor/tests/parsing.rs:910
17.28 s
> ────────────────────────────────────────────────────────────────────────────────
17.28 s
> Expression: net_iter.snapshot_dot()
17.28 s
> ────────────────────────────────────────────────────────────────────────────────
17.28 s
> -old snapshot
17.28 s
> +new results
17.28 s
> ────────────┬───────────────────────────────────────────────────────────────────
17.28 s
> 8 8 │ 0:0:s -> ext0 [id=0 color="red"];
17.28 s
> 9 9 │ ext1 [style=invis];
17.28 s
> 10 10 │ 0:5:s -> ext1 [id=1 dir=none color="red" label="mink4|l_0"];
17.28 s
> 11 11 │ ext2 [style=invis];
17.28 s
> 12 │- 0:4:s -> ext2 [id=2 dir=none color="red" label="bis4|l_2"];
17.28 s
> 12 │+ 0:3:s -> ext2 [id=2 dir=none color="red" label="mink4|l_1"];
17.28 s
> 13 13 │ ext3 [style=invis];
17.28 s
> 14 │- 0:3:s -> ext3 [id=3 dir=none color="red" label="bis4|l_3"];
17.28 s
> 14 │+ 0:1:s -> ext3 [id=3 dir=none color="red" label="bis4|l_2"];
17.28 s
> 15 15 │ ext4 [style=invis];
17.28 s
> 16 │- 0:1:s -> ext4 [id=4 dir=none color="red" label="mink4|l_1"];
17.28 s
> 16 │+ 0:2:s -> ext4 [id=4 dir=none color="red" label="mink4|l_4"];
17.28 s
> 17 17 │ ext5 [style=invis];
17.28 s
> 18 │- 0:2:s -> ext5 [id=5 dir=none color="red" label="mink4|l_4"];
17.28 s
> 18 │+ 0:4:s -> ext5 [id=5 dir=none color="red" label="bis4|l_3"];
17.28 s
> 19 19 │ }
17.28 s
> ────────────┴───────────────────────────────────────────────────────────────────
17.28 s
> To update snapshots run `cargo insta review`
17.28 s
> Stopped on the first failure. Run `cargo insta test` to run all snapshots.
17.28 s
> test tensor::tests::parsing::infinite_execution ... FAILED
17.28 s
>
17.28 s
> failures:
17.28 s
>
17.28 s
> failures:
17.28 s
> tensor::tests::parsing::infinite_execution
17.28 s
>
17.28 s
> test result: FAILED. 0 passed; 1 failed; 0 ignored; 0 measured; 240 filtered out; finished in 0.09s
17.28 s
>
17.28 s
> stderr ---
17.28 s
>
17.28 s
> thread 'tensor::tests::parsing::infinite_execution' (844) panicked at /nix/store/p13pfw1gvvk8m860apfhvzcgidxhbs7g-vendor-cargo-deps/c19b7c6f923b580ac259164a89f2577984ad5ab09ee9d583b888f934adbbe8d0/insta-1.47.2/src/runtime.rs:719:13:
17.28 s
> snapshot assertion for 'infinite_execution' failed in line 910
17.28 s
> stack backtrace:
17.28 s
> 0: __rustc::rust_begin_unwind
17.28 s
> 1: core::panicking::panic_fmt
17.28 s
> 2: insta::runtime::assert_snapshot
17.28 s
> 3: idenso::tensor::tests::parsing::infinite_execution
17.28 s
> 4: <idenso::tensor::tests::parsing::infinite_execution::{closure#0} as core::ops::function::FnOnce<()>>::call_once
17.28 s
> note: Some details are omitted, run with `RUST_BACKTRACE=full` for a verbose backtrace.
17.28 s
>
17.28 s
> ------------
17.28 s
> Summary [ 1.713s] 224 tests run: 222 passed , 2 failed , 26 skipped
17.28 s
> FAIL [ 0.010s] ( 47/224) idenso color::test::form_reference :: metric_contraction_respects_antisymmetric_normalization
17.28 s
> stdout ---
17.28 s
>
17.28 s
> running 1 test
17.28 s
> test color::test::form_reference::metric_contraction_respects_antisymmetric_normalization ... FAILED
17.28 s
>
17.28 s
> failures:
17.28 s
>
17.28 s
> failures:
17.28 s
> color::test::form_reference::metric_contraction_respects_antisymmetric_normalization
17.28 s
>
17.28 s
> test result: FAILED. 0 passed; 1 failed; 0 ignored; 0 measured; 240 filtered out; finished in 0.00s
17.28 s
>
17.28 s
> stderr ---
17.28 s
>
17.28 s
> thread 'color::test::form_reference::metric_contraction_respects_antisymmetric_normalization' (327) panicked at crates/idenso/src/color/test/form_reference.rs:171:5:
17.28 s
> assertion `left == right` failed
17.28 s
> left: "-1*f(coad(8,standalone_metric_j),coad(8,standalone_metric_s),coad(8,standalone_metric_u))"
17.28 s
> right: "f(coad(8,standalone_metric_j),coad(8,standalone_metric_s),coad(8,standalone_metric_u))"
17.28 s
> stack backtrace:
17.28 s
> 0: __rustc::rust_begin_unwind
17.28 s
> 1: core::panicking::panic_fmt
17.28 s
> 2: core::panicking::assert_failed_inner
17.28 s
> 3: core::panicking::assert_failed::<alloc::string::String, alloc::string::String>
17.28 s
> 4: idenso::color::test::form_reference::metric_contraction_respects_antisymmetric_normalization
17.28 s
> 5: <idenso::color::test::form_reference::metric_contraction_respects_antisymmetric_normalization::{closure#0} as core::ops::function::FnOnce<()>>::call_once
17.28 s
> note: Some details are omitted, run with `RUST_BACKTRACE=full` for a verbose backtrace.
17.28 s
>
17.28 s
> FAIL [ 0.100s] (221/224) idenso tensor::tests::parsing :: infinite_execution
17.28 s
> stdout ---
17.28 s
>
17.28 s
> running 1 test
17.28 s
> ━━━━━━━━━━━━━━━━━━━━━━━━━━━━━━━ Snapshot Summary ━━━━━━━━━━━━━━━━━━━━━━━━━━━━━━━
17.28 s
> Snapshot: infinite_execution
17.28 s
> Source: crates/idenso/src/tensor/tests/parsing.rs:910
17.28 s
> ────────────────────────────────────────────────────────────────────────────────
17.28 s
> Expression: net_iter.snapshot_dot()
17.28 s
> ────────────────────────────────────────────────────────────────────────────────
17.28 s
> -old snapshot
17.28 s
> +new results
17.28 s
> ────────────┬───────────────────────────────────────────────────────────────────
17.28 s
> 8 8 │ 0:0:s -> ext0 [id=0 color="red"];
17.28 s
> 9 9 │ ext1 [style=invis];
17.28 s
> 10 10 │ 0:5:s -> ext1 [id=1 dir=none color="red" label="mink4|l_0"];
17.28 s
> 11 11 │ ext2 [style=invis];
17.28 s
> 12 │- 0:4:s -> ext2 [id=2 dir=none color="red" label="bis4|l_2"];
17.28 s
> 12 │+ 0:3:s -> ext2 [id=2 dir=none color="red" label="mink4|l_1"];
17.28 s
> 13 13 │ ext3 [style=invis];
17.28 s
> 14 │- 0:3:s -> ext3 [id=3 dir=none color="red" label="bis4|l_3"];
17.28 s
> 14 │+ 0:1:s -> ext3 [id=3 dir=none color="red" label="bis4|l_2"];
17.28 s
> 15 15 │ ext4 [style=invis];
17.28 s
> 16 │- 0:1:s -> ext4 [id=4 dir=none color="red" label="mink4|l_1"];
17.28 s
> 16 │+ 0:2:s -> ext4 [id=4 dir=none color="red" label="mink4|l_4"];
17.28 s
> 17 17 │ ext5 [style=invis];
17.28 s
> 18 │- 0:2:s -> ext5 [id=5 dir=none color="red" label="mink4|l_4"];
17.28 s
> 18 │+ 0:4:s -> ext5 [id=5 dir=none color="red" label="bis4|l_3"];
17.28 s
> 19 19 │ }
17.28 s
> ────────────┴───────────────────────────────────────────────────────────────────
17.28 s
> To update snapshots run `cargo insta review`
17.28 s
> Stopped on the first failure. Run `cargo insta test` to run all snapshots.
17.28 s
> test tensor::tests::parsing::infinite_execution ... FAILED
17.28 s
>
17.28 s
> failures:
17.28 s
>
17.28 s
> failures:
17.28 s
> tensor::tests::parsing::infinite_execution
17.28 s
>
17.28 s
> test result: FAILED. 0 passed; 1 failed; 0 ignored; 0 measured; 240 filtered out; finished in 0.09s
17.28 s
>
17.28 s
> stderr ---
17.28 s
>
17.28 s
> thread 'tensor::tests::parsing::infinite_execution' (844) panicked at /nix/store/p13pfw1gvvk8m860apfhvzcgidxhbs7g-vendor-cargo-deps/c19b7c6f923b580ac259164a89f2577984ad5ab09ee9d583b888f934adbbe8d0/insta-1.47.2/src/runtime.rs:719:13:
17.28 s
> snapshot assertion for 'infinite_execution' failed in line 910
17.28 s
> stack backtrace:
17.28 s
> 0: __rustc::rust_begin_unwind
17.28 s
> 1: core::panicking::panic_fmt
17.28 s
> 2: insta::runtime::assert_snapshot
17.28 s
> 3: idenso::tensor::tests::parsing::infinite_execution
17.28 s
> 4: <idenso::tensor::tests::parsing::infinite_execution::{closure#0} as core::ops::function::FnOnce<()>>::call_once
17.28 s
> note: Some details are omitted, run with `RUST_BACKTRACE=full` for a verbose backtrace.
17.28 s
>
17.28 s
> error : test run failed
17.28 s
>
17.28 s
> ========== nextest test summary ==========
17.28 s
> report: target/nextest/ci_gammaloop/junit.xml
17.28 s
> tests: 224, failures: 2, errors: 0
17.28 s
>
17.28 s
> 1. idenso::color::test::form_reference::metric_contraction_respects_antisymmetric_normalization
17.28 s
> failure: test failure with exit code 101
17.28 s
> thread 'color::test::form_reference::metric_contraction_respects_antisymmetric_normalization' (327) panicked at crates/idenso/src/color/test/form_reference.rs:171:5:
17.28 s
> assertion `left == right` failed
17.28 s
> left: "-1*f(coad(8,standalone_metric_j),coad(8,standalone_metric_s),coad(8,standalone_metric_u))"
17.28 s
> right: "f(coad(8,standalone_metric_j),coad(8,standalone_metric_s),coad(8,standalone_metric_u))"
17.28 s
> stack backtrace:
17.28 s
> 0: __rustc::rust_begin_unwind
17.28 s
> 1: core::panicking::panic_fmt
17.28 s
> 2: core::panicking::assert_failed_inner
17.28 s
> 3: core::panicking::assert_failed::<alloc::string::String, alloc::string::String>
17.28 s
> 4: idenso::color::test::form_reference::metric_contraction_respects_antisymmetric_normalization
17.28 s
> 5: <idenso::color::test::form_reference::metric_contraction_respects_antisymmetric_normalization::{closure#0} as core::ops::function::FnOnce<()>>::call_once
17.28 s
> note: Some details are omitted, run with `RUST_BACKTRACE=full` for a verbose backtrace.
17.28 s
> system-out
17.28 s
> running 1 test
17.28 s
> test color::test::form_reference::metric_contraction_respects_antisymmetric_normalization ... FAILED
17.28 s
>
17.28 s
> failures:
17.28 s
>
17.28 s
> failures:
17.28 s
> color::test::form_reference::metric_contraction_respects_antisymmetric_normalization
17.28 s
>
17.28 s
> test result: FAILED. 0 passed; 1 failed; 0 ignored; 0 measured; 240 filtered out; finished in 0.00s
17.28 s
> system-err
17.28 s
> thread 'color::test::form_reference::metric_contraction_respects_antisymmetric_normalization' (327) panicked at crates/idenso/src/color/test/form_reference.rs:171:5:
17.28 s
> assertion `left == right` failed
17.28 s
> left: "-1*f(coad(8,standalone_metric_j),coad(8,standalone_metric_s),coad(8,standalone_metric_u))"
17.28 s
> right: "f(coad(8,standalone_metric_j),coad(8,standalone_metric_s),coad(8,standalone_metric_u))"
17.28 s
> stack backtrace:
17.28 s
> 0: __rustc::rust_begin_unwind
17.28 s
> 1: core::panicking::panic_fmt
17.28 s
> 2: core::panicking::assert_failed_inner
17.28 s
> 3: core::panicking::assert_failed::<alloc::string::String, alloc::string::String>
17.28 s
> 4: idenso::color::test::form_reference::metric_contraction_respects_antisymmetric_normalization
17.28 s
> 5: <idenso::color::test::form_reference::metric_contraction_respects_antisymmetric_normalization::{closure#0} as core::ops::function::FnOnce<()>>::call_once
17.28 s
> note: Some details are omitted, run with `RUST_BACKTRACE=full` for a verbose backtrace.
17.28 s
>
17.28 s
> 2. idenso::tensor::tests::parsing::infinite_execution
17.28 s
> failure: test failure with exit code 101
17.28 s
> thread 'tensor::tests::parsing::infinite_execution' (844) panicked at /nix/store/p13pfw1gvvk8m860apfhvzcgidxhbs7g-vendor-cargo-deps/c19b7c6f923b580ac259164a89f2577984ad5ab09ee9d583b888f934adbbe8d0/insta-1.47.2/src/runtime.rs:719:13:
17.28 s
> snapshot assertion for 'infinite_execution' failed in line 910
17.28 s
> stack backtrace:
17.28 s
> 0: __rustc::rust_begin_unwind
17.28 s
> 1: core::panicking::panic_fmt
17.28 s
> 2: insta::runtime::assert_snapshot
17.28 s
> 3: idenso::tensor::tests::parsing::infinite_execution
17.28 s
> 4: <idenso::tensor::tests::parsing::infinite_execution::{closure#0} as core::ops::function::FnOnce<()>>::call_once
17.28 s
> note: Some details are omitted, run with `RUST_BACKTRACE=full` for a verbose backtrace.
17.28 s
> system-out
17.28 s
> running 1 test
17.28 s
> ━━━━━━━━━━━━━━━━━━━━━━━━━━━━━━━ Snapshot Summary ━━━━━━━━━━━━━━━━━━━━━━━━━━━━━━━
17.28 s
> Snapshot: infinite_execution
17.28 s
> Source: crates/idenso/src/tensor/tests/parsing.rs:910
17.28 s
> ────────────────────────────────────────────────────────────────────────────────
17.28 s
> Expression: net_iter.snapshot_dot()
17.28 s
> ────────────────────────────────────────────────────────────────────────────────
17.28 s
> -old snapshot
17.28 s
> +new results
17.28 s
> ────────────┬───────────────────────────────────────────────────────────────────
17.28 s
> 8 8 │ 0:0:s-> ext0 [id=0 color="red"];
17.28 s
> 9 9 │ ext1 [style=invis];
17.28 s
> 10 10 │ 0:5:s-> ext1 [id=1 dir=none color="red" label="mink4|l_0"];
17.28 s
> 11 11 │ ext2 [style=invis];
17.28 s
> 12 │- 0:4:s-> ext2 [id=2 dir=none color="red" label="bis4|l_2"];
17.28 s
> 12 │+ 0:3:s-> ext2 [id=2 dir=none color="red" label="mink4|l_1"];
17.28 s
> 13 13 │ ext3 [style=invis];
17.28 s
> 14 │- 0:3:s-> ext3 [id=3 dir=none color="red" label="bis4|l_3"];
17.28 s
> 14 │+ 0:1:s-> ext3 [id=3 dir=none color="red" label="bis4|l_2"];
17.28 s
> 15 15 │ ext4 [style=invis];
17.28 s
> 16 │- 0:1:s-> ext4 [id=4 dir=none color="red" label="mink4|l_1"];
17.28 s
> 16 │+ 0:2:s-> ext4 [id=4 dir=none color="red" label="mink4|l_4"];
17.28 s
> 17 17 │ ext5 [style=invis];
17.28 s
> 18 │- 0:2:s-> ext5 [id=5 dir=none color="red" label="mink4|l_4"];
17.28 s
> 18 │+ 0:4:s-> ext5 [id=5 dir=none color="red" label="bis4|l_3"];
17.28 s
> 19 19 │ }
17.28 s
> ────────────┴───────────────────────────────────────────────────────────────────
17.28 s
> To update snapshots run `cargo insta review`
17.28 s
> Stopped on the first failure. Run `cargo insta test` to run all snapshots.
17.28 s
> test tensor::tests::parsing::infinite_execution ... FAILED
17.28 s
>
17.28 s
> failures:
17.28 s
>
17.28 s
> failures:
17.28 s
> tensor::tests::parsing::infinite_execution
17.28 s
>
17.28 s
> test result: FAILED. 0 passed; 1 failed; 0 ignored; 0 measured; 240 filtered out; finished in 0.09s
17.28 s
> system-err
17.28 s
> thread 'tensor::tests::parsing::infinite_execution' (844) panicked at /nix/store/p13pfw1gvvk8m860apfhvzcgidxhbs7g-vendor-cargo-deps/c19b7c6f923b580ac259164a89f2577984ad5ab09ee9d583b888f934adbbe8d0/insta-1.47.2/src/runtime.rs:719:13:
17.28 s
> snapshot assertion for 'infinite_execution' failed in line 910
17.28 s
> stack backtrace:
17.28 s
> 0: __rustc::rust_begin_unwind
17.28 s
> 1: core::panicking::panic_fmt
17.28 s
> 2: insta::runtime::assert_snapshot
17.28 s
> 3: idenso::tensor::tests::parsing::infinite_execution
17.28 s
> 4: <idenso::tensor::tests::parsing::infinite_execution::{closure#0} as core::ops::function::FnOnce<()>>::call_once
17.28 s
> note: Some details are omitted, run with `RUST_BACKTRACE=full` for a verbose backtrace.
17.28 s
> =========================================
17.28 s
> Extracting 2 binaries and 1 linked path to /build/nextest-archive-tOVEK3
17.28 s
> Extracted 8 files to /build/nextest-archive-tOVEK3 in 0.08s
17.28 s
> ------------
17.28 s
> Nextest run ID a1da1127-a6fb-4d8e-bfde-33db0799fae6 with nextest profile: ci_gammaloop
17.28 s
> Starting 135 tests across 2 binaries
17.28 s
> ------------
17.28 s
> Summary [ 0.097s] 135 tests run: 135 passed , 0 skipped
17.28 s
>
17.28 s
> ========== nextest test summary ==========
17.28 s
> report: target/nextest/ci_gammaloop/junit.xml
17.28 s
> tests: 135, failures: 0, errors: 0
17.28 s
> No failing testcases found.
17.28 s
> =========================================
17.28 s
> Extracting 5 binaries and 2 linked paths to /build/nextest-archive-V83gOB
17.28 s
> Extracted 19 files to /build/nextest-archive-V83gOB in 0.20s
17.28 s
> ------------
17.28 s
> Nextest run ID 93a8b1cd-2d89-477a-b03d-4825e5ae1a03 with nextest profile: ci_gammaloop
17.28 s
> Starting 25 tests across 5 binaries (1 test skipped via profile.ci_gammaloop.default-filter )
17.28 s
> ------------
17.28 s
> Summary [ 0.199s] 25 tests run: 25 passed , 1 skipped
17.28 s
>
17.28 s
> ========== nextest test summary ==========
17.28 s
> report: target/nextest/ci_gammaloop/junit.xml
17.28 s
> tests: 25, failures: 0, errors: 0
17.28 s
> No failing testcases found.
17.28 s
> =========================================
17.28 s
> Extracting 2 binaries and 1 linked path to /build/nextest-archive-p6tDsB
17.28 s
> Extracted 8 files to /build/nextest-archive-p6tDsB in 0.06s
17.28 s
> ------------
17.28 s
> Nextest run ID 8f169b1b-0260-4bc9-8207-f9e13fc497b4 with nextest profile: ci_gammaloop
17.28 s
> Starting 1 test across 2 binaries
17.28 s
> ------------
17.28 s
> Summary [ 0.005s] 1 test run: 1 passed , 0 skipped
17.28 s
>
17.28 s
> ========== nextest test summary ==========
17.28 s
> report: target/nextest/ci_gammaloop/junit.xml
17.28 s
> tests: 1, failures: 0, errors: 0
17.28 s
> No failing testcases found.
17.28 s
> =========================================
17.28 s
> Extracting 1 binary and 1 linked path to /build/nextest-archive-2PUSPQ
17.28 s
> Extracted 7 files to /build/nextest-archive-2PUSPQ in 0.05s
17.28 s
> ------------
17.28 s
> Nextest run ID 876bd068-8c17-4b32-afc4-780c8e3d1ae9 with nextest profile: ci_gammaloop
17.28 s
> Starting 0 tests across 1 binary
17.28 s
> ------------
17.28 s
> Summary [ 0.000s] 0 tests run: 0 passed , 0 skipped
17.28 s
>
17.28 s
> ========== nextest test summary ==========
17.28 s
> report: target/nextest/ci_gammaloop/junit.xml
17.28 s
> tests: 0, failures: 0, errors: 0
17.28 s
> No failing testcases found.
17.28 s
> =========================================
17.28 s
For full logs, run:
17.28 s
nix log /nix/store/8hj2j3n1562bs62vvl44s3db1hsxblr2-gammaloop-nextest-spenso.drv
17.38 s
[0 built (1 failed )]Run failed.