1. 0.62 s $ /nix/store/9ypz3flqsrl5xl495mm8h645gadjsxi1-coreutils-9.11/bin/timeout --kill-after=15s 7200s /nix/store/23zk8sgzamrbmj1fday15szf7f2279s8-nix-2.34.7/bin/nix --extra-experimental-features nix-command --extra-experimental-features flakes flake clone git+https://github.com/alphal00p/gammaloop --dest /tmp/nix-ci-worker/stable-pwd/repo/
  2. 1.53 s Cloning into '/tmp/nix-ci-worker/stable-pwd/repo'...
  3. 1.53 s remote: Enumerating objects: 65321, done.
  4. 1.53 s remote: Counting objects: 0% (1/7972) remote: Counting objects: 1% (80/7972) remote: Counting objects: 2% (160/7972) remote: Counting objects: 3% (240/7972) remote: Counting objects: 4% (319/7972) remote: Counting objects: 5% (399/7972) remote: Counting objects: 6% (479/7972) remote: Counting objects: 7% (559/7972) remote: Counting objects: 8% (638/7972) remote: Counting objects: 9% (718/7972) remote: Counting objects: 10% (798/7972) remote: Counting objects: 11% (877/7972) remote: Counting objects: 12% (957/7972) remote: Counting objects: 13% (1037/7972) remote: Counting objects: 14% (1117/7972) remote: Counting objects: 15% (1196/7972) remote: Counting objects: 16% (1276/7972) remote: Counting objects: 17% (1356/7972) remote: Counting objects: 18% (1435/7972) remote: Counting objects: 19% (1515/7972) remote: Counting objects: 20% (1595/7972) remote: Counting objects: 21% (1675/7972) remote: Counting objects: 22% (1754/7972) remote: Counting objects: 23% (1834/7972) remote: Counting objects: 24% (1914/7972) remote: Counting objects: 25% (1993/7972) remote: Counting objects: 26% (2073/7972) remote: Counting objects: 27% (2153/7972) remote: Counting objects: 28% (2233/7972) remote: Counting objects: 29% (2312/7972) remote: Counting objects: 30% (2392/7972) remote: Counting objects: 31% (2472/7972) remote: Counting objects: 32% (2552/7972) remote: Counting objects: 33% (2631/7972) remote: Counting objects: 34% (2711/7972) remote: Counting objects: 35% (2791/7972) remote: Counting objects: 36% (2870/7972) remote: Counting objects: 37% (2950/7972) remote: Counting objects: 38% (3030/7972) remote: Counting objects: 39% (3110/7972) remote: Counting objects: 40% (3189/7972) remote: Counting objects: 41% (3269/7972) remote: Counting objects: 42% (3349/7972) remote: Counting objects: 43% (3428/7972) remote: Counting objects: 44% (3508/7972) remote: Counting objects: 45% (3588/7972) remote: Counting objects: 46% (3668/7972) remote: Counting objects: 47% (3747/7972) remote: Counting objects: 48% (3827/7972) remote: Counting objects: 49% (3907/7972) remote: Counting objects: 50% (3986/7972) remote: Counting objects: 51% (4066/7972) remote: Counting objects: 52% (4146/7972) remote: Counting objects: 53% (4226/7972) remote: Counting objects: 54% (4305/7972) remote: Counting objects: 55% (4385/7972) remote: Counting objects: 56% (4465/7972) remote: Counting objects: 57% (4545/7972) remote: Counting objects: 58% (4624/7972) remote: Counting objects: 59% (4704/7972) remote: Counting objects: 60% (4784/7972) remote: Counting objects: 61% (4863/7972) remote: Counting objects: 62% (4943/7972) remote: Counting objects: 63% (5023/7972) remote: Counting objects: 64% (5103/7972) remote: Counting objects: 65% (5182/7972) remote: Counting objects: 66% (5262/7972) remote: Counting objects: 67% (5342/7972) remote: Counting objects: 68% (5421/7972) remote: Counting objects: 69% (5501/7972) remote: Counting objects: 70% (5581/7972) remote: Counting objects: 71% (5661/7972) remote: Counting objects: 72% (5740/7972) remote: Counting objects: 73% (5820/7972) remote: Counting objects: 74% (5900/7972) remote: Counting objects: 75% (5979/7972) remote: Counting objects: 76% (6059/7972) remote: Counting objects: 77% (6139/7972) remote: Counting objects: 78% (6219/7972) remote: Counting objects: 79% (6298/7972) remote: Counting objects: 80% (6378/7972) remote: Counting objects: 81% (6458/7972) remote: Counting objects: 82% (6538/7972) remote: Counting objects: 83% (6617/7972) remote: Counting objects: 84% (6697/7972) remote: Counting objects: 85% (6777/7972) remote: Counting objects: 86% (6856/7972) remote: Counting objects: 87% (6936/7972) remote: Counting objects: 88% (7016/7972) remote: Counting objects: 89% (7096/7972) remote: Counting objects: 90% (7175/7972) remote: Counting objects: 91% (7255/7972) remote: Counting objects: 92% (7335/7972) remote: Counting objects: 93% (7414/7972) remote: Counting objects: 94% (7494/7972) remote: Counting objects: 95% (7574/7972) remote: Counting objects: 96% (7654/7972) remote: Counting objects: 97% (7733/7972) remote: Counting objects: 98% (7813/7972) remote: Counting objects: 99% (7893/7972) remote: Counting objects: 100% (7972/7972) remote: Counting objects: 100% (7972/7972), done.
  5. 2.41 s remote: Compressing objects: 0% (1/1623) remote: Compressing objects: 1% (17/1623) remote: Compressing objects: 2% (33/1623) remote: Compressing objects: 3% (49/1623) remote: Compressing objects: 4% (65/1623) remote: Compressing objects: 5% (82/1623) remote: Compressing objects: 6% (98/1623) remote: Compressing objects: 7% (114/1623) remote: Compressing objects: 8% (130/1623) remote: Compressing objects: 9% (147/1623) remote: Compressing objects: 10% (163/1623) remote: Compressing objects: 11% (179/1623) remote: Compressing objects: 12% (195/1623) remote: Compressing objects: 13% (211/1623) remote: Compressing objects: 14% (228/1623) remote: Compressing objects: 15% (244/1623) remote: Compressing objects: 16% (260/1623) remote: Compressing objects: 17% (276/1623) remote: Compressing objects: 18% (293/1623) remote: Compressing objects: 19% (309/1623) remote: Compressing objects: 20% (325/1623) remote: Compressing objects: 21% (341/1623) remote: Compressing objects: 22% (358/1623) remote: Compressing objects: 23% (374/1623) remote: Compressing objects: 24% (390/1623) remote: Compressing objects: 25% (406/1623) remote: Compressing objects: 26% (422/1623) remote: Compressing objects: 27% (439/1623) remote: Compressing objects: 28% (455/1623) remote: Compressing objects: 29% (471/1623) remote: Compressing objects: 30% (487/1623) remote: Compressing objects: 31% (504/1623) remote: Compressing objects: 32% (520/1623) remote: Compressing objects: 33% (536/1623) remote: Compressing objects: 34% (552/1623) remote: Compressing objects: 35% (569/1623) remote: Compressing objects: 36% (585/1623) remote: Compressing objects: 37% (601/1623) remote: Compressing objects: 38% (617/1623) remote: Compressing objects: 39% (633/1623) remote: Compressing objects: 40% (650/1623) remote: Compressing objects: 41% (666/1623) remote: Compressing objects: 42% (682/1623) remote: Compressing objects: 43% (698/1623) remote: Compressing objects: 44% (715/1623) remote: Compressing objects: 45% (731/1623) remote: Compressing objects: 46% (747/1623) remote: Compressing objects: 47% (763/1623) remote: Compressing objects: 48% (780/1623) remote: Compressing objects: 49% (796/1623) remote: Compressing objects: 50% (812/1623) remote: Compressing objects: 51% (828/1623) remote: Compressing objects: 52% (844/1623) remote: Compressing objects: 53% (861/1623) remote: Compressing objects: 54% (877/1623) remote: Compressing objects: 55% (893/1623) remote: Compressing objects: 56% (909/1623) remote: Compressing objects: 57% (926/1623) remote: Compressing objects: 58% (942/1623) remote: Compressing objects: 59% (958/1623) remote: Compressing objects: 60% (974/1623) remote: Compressing objects: 61% (991/1623) remote: Compressing objects: 62% (1007/1623) remote: Compressing objects: 63% (1023/1623) remote: Compressing objects: 64% (1039/1623) remote: Compressing objects: 65% (1055/1623) remote: Compressing objects: 66% (1072/1623) remote: Compressing objects: 67% (1088/1623) remote: Compressing objects: 68% (1104/1623) remote: Compressing objects: 69% (1120/1623) remote: Compressing objects: 70% (1137/1623) remote: Compressing objects: 71% (1153/1623) remote: Compressing objects: 72% (1169/1623) remote: Compressing objects: 73% (1185/1623) remote: Compressing objects: 74% (1202/1623) remote: Compressing objects: 75% (1218/1623) remote: Compressing objects: 76% (1234/1623) remote: Compressing objects: 77% (1250/1623) remote: Compressing objects: 78% (1266/1623) remote: Compressing objects: 79% (1283/1623) remote: Compressing objects: 80% (1299/1623) remote: Compressing objects: 81% (1315/1623) remote: Compressing objects: 82% (1331/1623) remote: Compressing objects: 83% (1348/1623) remote: Compressing objects: 84% (1364/1623) remote: Compressing objects: 85% (1380/1623) remote: Compressing objects: 86% (1396/1623) remote: Compressing objects: 87% (1413/1623) remote: Compressing objects: 88% (1429/1623) remote: Compressing objects: 89% (1445/1623) remote: Compressing objects: 90% (1461/1623) remote: Compressing objects: 91% (1477/1623) remote: Compressing objects: 92% (1494/1623) remote: Compressing objects: 93% (1510/1623) remote: Compressing objects: 94% (1526/1623) remote: Compressing objects: 95% (1542/1623) remote: Compressing objects: 96% (1559/1623) remote: Compressing objects: 97% (1575/1623) remote: Compressing objects: 98% (1591/1623) remote: Compressing objects: 99% (1607/1623) remote: Compressing objects: 100% (1623/1623) remote: Compressing objects: 100% (1623/1623), done.
  6. 5.07 s Receiving objects: 0% (1/65321) Receiving objects: 1% (654/65321) Receiving objects: 2% (1307/65321) Receiving objects: 3% (1960/65321) Receiving objects: 4% (2613/65321) Receiving objects: 5% (3267/65321) Receiving objects: 6% (3920/65321) Receiving objects: 7% (4573/65321) Receiving objects: 8% (5226/65321) Receiving objects: 9% (5879/65321) Receiving objects: 10% (6533/65321) Receiving objects: 11% (7186/65321) Receiving objects: 12% (7839/65321), 11.27 MiB | 22.51 MiB/s Receiving objects: 13% (8492/65321), 11.27 MiB | 22.51 MiB/s Receiving objects: 14% (9145/65321), 11.27 MiB | 22.51 MiB/s Receiving objects: 15% (9799/65321), 11.27 MiB | 22.51 MiB/s Receiving objects: 16% (10452/65321), 11.27 MiB | 22.51 MiB/s Receiving objects: 17% (11105/65321), 11.27 MiB | 22.51 MiB/s Receiving objects: 18% (11758/65321), 11.27 MiB | 22.51 MiB/s Receiving objects: 19% (12411/65321), 11.27 MiB | 22.51 MiB/s Receiving objects: 20% (13065/65321), 11.27 MiB | 22.51 MiB/s Receiving objects: 21% (13718/65321), 11.27 MiB | 22.51 MiB/s Receiving objects: 22% (14371/65321), 11.27 MiB | 22.51 MiB/s Receiving objects: 23% (15024/65321), 11.27 MiB | 22.51 MiB/s Receiving objects: 24% (15678/65321), 11.27 MiB | 22.51 MiB/s Receiving objects: 25% (16331/65321), 11.27 MiB | 22.51 MiB/s Receiving objects: 26% (16984/65321), 11.27 MiB | 22.51 MiB/s Receiving objects: 27% (17637/65321), 11.27 MiB | 22.51 MiB/s Receiving objects: 28% (18290/65321), 11.27 MiB | 22.51 MiB/s Receiving objects: 29% (18944/65321), 11.27 MiB | 22.51 MiB/s Receiving objects: 30% (19597/65321), 11.27 MiB | 22.51 MiB/s Receiving objects: 31% (20250/65321), 11.27 MiB | 22.51 MiB/s Receiving objects: 32% (20903/65321), 11.27 MiB | 22.51 MiB/s Receiving objects: 33% (21556/65321), 11.27 MiB | 22.51 MiB/s Receiving objects: 34% (22210/65321), 11.27 MiB | 22.51 MiB/s Receiving objects: 35% (22863/65321), 11.27 MiB | 22.51 MiB/s Receiving objects: 36% (23516/65321), 11.27 MiB | 22.51 MiB/s Receiving objects: 37% (24169/65321), 11.27 MiB | 22.51 MiB/s Receiving objects: 38% (24822/65321), 11.27 MiB | 22.51 MiB/s Receiving objects: 39% (25476/65321), 11.27 MiB | 22.51 MiB/s Receiving objects: 40% (26129/65321), 11.27 MiB | 22.51 MiB/s Receiving objects: 41% (26782/65321), 11.27 MiB | 22.51 MiB/s Receiving objects: 42% (27435/65321), 11.27 MiB | 22.51 MiB/s Receiving objects: 43% (28089/65321), 11.27 MiB | 22.51 MiB/s Receiving objects: 44% (28742/65321), 11.27 MiB | 22.51 MiB/s Receiving objects: 45% (29395/65321), 11.27 MiB | 22.51 MiB/s Receiving objects: 46% (30048/65321), 11.27 MiB | 22.51 MiB/s Receiving objects: 47% (30701/65321), 11.27 MiB | 22.51 MiB/s Receiving objects: 48% (31355/65321), 11.27 MiB | 22.51 MiB/s Receiving objects: 49% (32008/65321), 11.27 MiB | 22.51 MiB/s Receiving objects: 50% (32661/65321), 11.27 MiB | 22.51 MiB/s Receiving objects: 51% (33314/65321), 11.27 MiB | 22.51 MiB/s Receiving objects: 51% (33694/65321), 31.57 MiB | 31.56 MiB/s Receiving objects: 52% (33967/65321), 31.57 MiB | 31.56 MiB/s Receiving objects: 53% (34621/65321), 31.57 MiB | 31.56 MiB/s Receiving objects: 54% (35274/65321), 31.57 MiB | 31.56 MiB/s Receiving objects: 55% (35927/65321), 31.57 MiB | 31.56 MiB/s Receiving objects: 56% (36580/65321), 31.57 MiB | 31.56 MiB/s Receiving objects: 57% (37233/65321), 31.57 MiB | 31.56 MiB/s Receiving objects: 58% (37887/65321), 31.57 MiB | 31.56 MiB/s Receiving objects: 59% (38540/65321), 31.57 MiB | 31.56 MiB/s Receiving objects: 60% (39193/65321), 31.57 MiB | 31.56 MiB/s Receiving objects: 61% (39846/65321), 31.57 MiB | 31.56 MiB/s Receiving objects: 62% (40500/65321), 31.57 MiB | 31.56 MiB/s Receiving objects: 63% (41153/65321), 48.78 MiB | 32.51 MiB/s Receiving objects: 64% (41806/65321), 48.78 MiB | 32.51 MiB/s Receiving objects: 65% (42459/65321), 48.78 MiB | 32.51 MiB/s Receiving objects: 66% (43112/65321), 48.78 MiB | 32.51 MiB/s Receiving objects: 67% (43766/65321), 48.78 MiB | 32.51 MiB/s Receiving objects: 68% (44419/65321), 48.78 MiB | 32.51 MiB/s Receiving objects: 69% (45072/65321), 48.78 MiB | 32.51 MiB/s Receiving objects: 70% (45725/65321), 48.78 MiB | 32.51 MiB/s Receiving objects: 71% (46378/65321), 48.78 MiB | 32.51 MiB/s Receiving objects: 72% (47032/65321), 48.78 MiB | 32.51 MiB/s Receiving objects: 73% (47685/65321), 48.78 MiB | 32.51 MiB/s Receiving objects: 74% (48338/65321), 48.78 MiB | 32.51 MiB/s Receiving objects: 74% (48916/65321), 65.33 MiB | 32.66 MiB/s Receiving objects: 75% (48991/65321), 65.33 MiB | 32.66 MiB/s Receiving objects: 76% (49644/65321), 65.33 MiB | 32.66 MiB/s Receiving objects: 77% (50298/65321), 65.33 MiB | 32.66 MiB/s Receiving objects: 78% (50951/65321), 65.33 MiB | 32.66 MiB/s Receiving objects: 79% (51604/65321), 65.33 MiB | 32.66 MiB/s Receiving objects: 80% (52257/65321), 65.33 MiB | 32.66 MiB/s Receiving objects: 81% (52911/65321), 65.33 MiB | 32.66 MiB/s Receiving objects: 82% (53564/65321), 65.33 MiB | 32.66 MiB/s Receiving objects: 83% (54217/65321), 65.33 MiB | 32.66 MiB/s Receiving objects: 84% (54870/65321), 65.33 MiB | 32.66 MiB/s Receiving objects: 85% (55523/65321), 65.33 MiB | 32.66 MiB/s Receiving objects: 86% (56177/65321), 65.33 MiB | 32.66 MiB/s Receiving objects: 87% (56830/65321), 65.33 MiB | 32.66 MiB/s Receiving objects: 88% (57483/65321), 81.84 MiB | 32.73 MiB/s Receiving objects: 89% (58136/65321), 81.84 MiB | 32.73 MiB/s Receiving objects: 90% (58789/65321), 81.84 MiB | 32.73 MiB/s Receiving objects: 91% (59443/65321), 81.84 MiB | 32.73 MiB/s Receiving objects: 92% (60096/65321), 81.84 MiB | 32.73 MiB/s Receiving objects: 93% (60749/65321), 81.84 MiB | 32.73 MiB/s Receiving objects: 94% (61402/65321), 81.84 MiB | 32.73 MiB/s Receiving objects: 95% (62055/65321), 81.84 MiB | 32.73 MiB/s Receiving objects: 96% (62709/65321), 81.84 MiB | 32.73 MiB/s Receiving objects: 97% (63362/65321), 81.84 MiB | 32.73 MiB/s Receiving objects: 98% (64015/65321), 81.84 MiB | 32.73 MiB/s Receiving objects: 99% (64668/65321), 81.84 MiB | 32.73 MiB/s remote: Total 65321 (delta 6903), reused 6445 (delta 6339), pack-reused 57349 (from 1)
  7. 5.07 s Receiving objects: 100% (65321/65321), 81.84 MiB | 32.73 MiB/s Receiving objects: 100% (65321/65321), 87.65 MiB | 32.90 MiB/s, done.
  8. 5.93 s Resolving deltas: 0% (0/46021) Resolving deltas: 1% (461/46021) Resolving deltas: 2% (921/46021) Resolving deltas: 3% (1381/46021) Resolving deltas: 4% (1842/46021) Resolving deltas: 5% (2302/46021) Resolving deltas: 6% (2762/46021) Resolving deltas: 7% (3222/46021) Resolving deltas: 8% (3682/46021) Resolving deltas: 9% (4142/46021) Resolving deltas: 10% (4603/46021) Resolving deltas: 11% (5063/46021) Resolving deltas: 12% (5523/46021) Resolving deltas: 13% (5983/46021) Resolving deltas: 14% (6443/46021) Resolving deltas: 15% (6908/46021) Resolving deltas: 16% (7365/46021) Resolving deltas: 17% (7824/46021) Resolving deltas: 18% (8284/46021) Resolving deltas: 19% (8747/46021) Resolving deltas: 20% (9205/46021) Resolving deltas: 21% (9665/46021) Resolving deltas: 22% (10125/46021) Resolving deltas: 23% (10585/46021) Resolving deltas: 24% (11046/46021) Resolving deltas: 25% (11506/46021) Resolving deltas: 26% (11966/46021) Resolving deltas: 27% (12428/46021) Resolving deltas: 28% (12887/46021) Resolving deltas: 29% (13348/46021) Resolving deltas: 30% (13807/46021) Resolving deltas: 31% (14267/46021) Resolving deltas: 32% (14728/46021) Resolving deltas: 33% (15189/46021) Resolving deltas: 34% (15648/46021) Resolving deltas: 35% (16108/46021) Resolving deltas: 36% (16568/46021) Resolving deltas: 37% (17028/46021) Resolving deltas: 38% (17488/46021) Resolving deltas: 39% (17949/46021) Resolving deltas: 40% (18409/46021) Resolving deltas: 41% (18869/46021) Resolving deltas: 42% (19330/46021) Resolving deltas: 43% (19790/46021) Resolving deltas: 44% (20250/46021) Resolving deltas: 45% (20710/46021) Resolving deltas: 46% (21170/46021) Resolving deltas: 47% (21631/46021) Resolving deltas: 48% (22091/46021) Resolving deltas: 49% (22552/46021) Resolving deltas: 50% (23011/46021) Resolving deltas: 51% (23473/46021) Resolving deltas: 52% (23931/46021) Resolving deltas: 53% (24392/46021) Resolving deltas: 54% (24853/46021) Resolving deltas: 55% (25312/46021) Resolving deltas: 56% (25773/46021) Resolving deltas: 57% (26232/46021) Resolving deltas: 58% (26693/46021) Resolving deltas: 59% (27153/46021) Resolving deltas: 60% (27613/46021) Resolving deltas: 61% (28073/46021) Resolving deltas: 62% (28534/46021) Resolving deltas: 63% (28994/46021) Resolving deltas: 64% (29454/46021) Resolving deltas: 65% (29914/46021) Resolving deltas: 66% (30374/46021) Resolving deltas: 67% (30835/46021) Resolving deltas: 68% (31295/46021) Resolving deltas: 69% (31755/46021) Resolving deltas: 70% (32215/46021) Resolving deltas: 71% (32675/46021) Resolving deltas: 72% (33136/46021) Resolving deltas: 73% (33596/46021) Resolving deltas: 74% (34056/46021) Resolving deltas: 75% (34516/46021) Resolving deltas: 76% (34976/46021) Resolving deltas: 77% (35437/46021) Resolving deltas: 78% (35897/46021) Resolving deltas: 79% (36358/46021) Resolving deltas: 80% (36818/46021) Resolving deltas: 81% (37278/46021) Resolving deltas: 82% (37738/46021) Resolving deltas: 83% (38198/46021) Resolving deltas: 84% (38659/46021) Resolving deltas: 85% (39118/46021) Resolving deltas: 86% (39579/46021) Resolving deltas: 87% (40040/46021) Resolving deltas: 88% (40499/46021) Resolving deltas: 89% (40959/46021) Resolving deltas: 90% (41419/46021) Resolving deltas: 91% (41880/46021) Resolving deltas: 92% (42340/46021) Resolving deltas: 93% (42800/46021) Resolving deltas: 94% (43262/46021) Resolving deltas: 95% (43720/46021) Resolving deltas: 96% (44181/46021) Resolving deltas: 97% (44641/46021) Resolving deltas: 98% (45101/46021) Resolving deltas: 99% (45561/46021) Resolving deltas: 100% (46021/46021) Resolving deltas: 100% (46021/46021), done.
  9. 6.23 s Fetching commit 7ed25ba0add6fdafcb84d7c8d5c514d7d735f5bf for vakint_rustred ...
  10. 6.23 s $ /nix/store/bcnisk3ydfgv26v2gw3zlky24g00yww2-git-2.54.0/bin/git fetch origin 7ed25ba0add6fdafcb84d7c8d5c514d7d735f5bf
  11. 6.63 s From https://github.com/alphal00p/gammaloop
  12. 6.63 s * branch 7ed25ba0add6fdafcb84d7c8d5c514d7d735f5bf -> FETCH_HEAD
  13. 6.65 s $ /nix/store/9ypz3flqsrl5xl495mm8h645gadjsxi1-coreutils-9.11/bin/timeout --kill-after=15s 7200s /nix/store/bcnisk3ydfgv26v2gw3zlky24g00yww2-git-2.54.0/bin/git -c advice.detachedHead=false checkout 7ed25ba0add6fdafcb84d7c8d5c514d7d735f5bf
  14. 6.82 s HEAD is now at 7ed25ba0 Make RustRed scalar parity coverage exhaustive
  15. 6.83 s $ /nix/store/9ypz3flqsrl5xl495mm8h645gadjsxi1-coreutils-9.11/bin/timeout --kill-after=15s 7200s /nix/store/23zk8sgzamrbmj1fday15szf7f2279s8-nix-2.34.7/bin/nix --extra-experimental-features nix-command --extra-experimental-features flakes --log-format internal-json run .#packages.x86_64-linux.nix-ci-check-gammaloop-nextest-spenso --print-build-logs
  16. 10.56 s
  17. 14.35 s evaluating derivation 'g copying '/nix/store/6x63 evaluating derivation 'g copying '/nix/store/6x63 evaluating derivation 'g [0/1 built] [1/0/1 built] building ggammaloop-nextest-spenso> Extracting 5 binaries and 2 linked paths to /build/nextest-archive-sueIky
  18. 14.52 s gammaloop-nextest-spenso> Extracted 19 files to /build/nextest-archive-sueIky in 0.17s
  19. 14.53 s gammaloop-nextest-spenso> ------------
  20. 14.53 s gammaloop-nextest-spenso> Nextest run ID 9933a873-23c6-4993-aea9-aad2c3bbf160 with nextest profile: ci_gammaloop
  21. 14.53 s gammaloop-nextest-spenso> Starting 224 tests across 5 binaries (26 tests skipped, including 2 tests via profile.ci_gammaloop.default-filter)
  22. 14.61 s gammaloop-nextest-spenso> FAIL [ 0.010s] ( 47/224) idenso color::test::form_reference::metric_contraction_respects_antisymmetric_normalization
  23. 14.61 s gammaloop-nextest-spenso> stdout ---
  24. 14.61 s gammaloop-nextest-spenso>
  25. 14.61 s gammaloop-nextest-spenso> running 1 test
  26. 14.61 s gammaloop-nextest-spenso> test color::test::form_reference::metric_contraction_respects_antisymmetric_normalization ... FAILED
  27. 14.61 s gammaloop-nextest-spenso>
  28. 14.61 s gammaloop-nextest-spenso> failures:
  29. 14.61 s gammaloop-nextest-spenso>
  30. 14.61 s gammaloop-nextest-spenso> failures:
  31. 14.61 s gammaloop-nextest-spenso> color::test::form_reference::metric_contraction_respects_antisymmetric_normalization
  32. 14.61 s gammaloop-nextest-spenso>
  33. 14.61 s gammaloop-nextest-spenso> test result: FAILED. 0 passed; 1 failed; 0 ignored; 0 measured; 240 filtered out; finished in 0.00s
  34. 14.61 s gammaloop-nextest-spenso>
  35. 14.61 s gammaloop-nextest-spenso> stderr ---
  36. 14.61 s gammaloop-nextest-spenso>
  37. 14.61 s gammaloop-nextest-spenso> thread 'color::test::form_reference::metric_contraction_respects_antisymmetric_normalization' (327) panicked at crates/idenso/src/color/test/form_reference.rs:171:5:
  38. 14.61 s gammaloop-nextest-spenso> assertion `left == right` failed
  39. 14.61 s gammaloop-nextest-spenso> left: "-1*f(coad(8,standalone_metric_j),coad(8,standalone_metric_s),coad(8,standalone_metric_u))"
  40. 14.61 s gammaloop-nextest-spenso> right: "f(coad(8,standalone_metric_j),coad(8,standalone_metric_s),coad(8,standalone_metric_u))"
  41. 14.61 s gammaloop-nextest-spenso> stack backtrace:
  42. 14.61 s gammaloop-nextest-spenso> 0: __rustc::rust_begin_unwind
  43. 14.61 s gammaloop-nextest-spenso> 1: core::panicking::panic_fmt
  44. 14.61 s gammaloop-nextest-spenso> 2: core::panicking::assert_failed_inner
  45. 14.61 s gammaloop-nextest-spenso> 3: core::panicking::assert_failed::<alloc::string::String, alloc::string::String>
  46. 14.61 s gammaloop-nextest-spenso> 4: idenso::color::test::form_reference::metric_contraction_respects_antisymmetric_normalization
  47. 14.61 s gammaloop-nextest-spenso> 5: <idenso::color::test::form_reference::metric_contraction_respects_antisymmetric_normalization::{closure#0} as core::ops::function::FnOnce<()>>::call_once
  48. 14.61 s gammaloop-nextest-spenso> note: Some details are omitted, run with `RUST_BACKTRACE=full` for a verbose backtrace.
  49. 14.61 s gammaloop-nextest-spenso>
  50. 14.90 s gammaloop-nextest-spenso> FAIL [ 0.100s] (221/224) idenso tensor::tests::parsing::infinite_execution
  51. 14.90 s gammaloop-nextest-spenso> stdout ---
  52. 14.90 s gammaloop-nextest-spenso>
  53. 14.90 s gammaloop-nextest-spenso> running 1 test
  54. 14.90 s gammaloop-nextest-spenso> ━━━━━━━━━━━━━━━━━━━━━━━━━━━━━━━ Snapshot Summary ━━━━━━━━━━━━━━━━━━━━━━━━━━━━━━━
  55. 14.90 s gammaloop-nextest-spenso> Snapshot: infinite_execution
  56. 14.90 s gammaloop-nextest-spenso> Source: crates/idenso/src/tensor/tests/parsing.rs:910
  57. 14.90 s gammaloop-nextest-spenso> ────────────────────────────────────────────────────────────────────────────────
  58. 14.90 s gammaloop-nextest-spenso> Expression: net_iter.snapshot_dot()
  59. 14.90 s gammaloop-nextest-spenso> ────────────────────────────────────────────────────────────────────────────────
  60. 14.90 s gammaloop-nextest-spenso> -old snapshot
  61. 14.90 s gammaloop-nextest-spenso> +new results
  62. 14.90 s gammaloop-nextest-spenso> ────────────┬───────────────────────────────────────────────────────────────────
  63. 14.90 s gammaloop-nextest-spenso> 8 8 │ 0:0:s -> ext0 [id=0 color="red"];
  64. 14.90 s gammaloop-nextest-spenso> 9 9 │ ext1 [style=invis];
  65. 14.90 s gammaloop-nextest-spenso> 10 10 │ 0:5:s -> ext1 [id=1 dir=none color="red" label="mink4|l_0"];
  66. 14.90 s gammaloop-nextest-spenso> 11 11 │ ext2 [style=invis];
  67. 14.90 s gammaloop-nextest-spenso> 12 │- 0:4:s -> ext2 [id=2 dir=none color="red" label="bis4|l_2"];
  68. 14.90 s gammaloop-nextest-spenso> 12 │+ 0:3:s -> ext2 [id=2 dir=none color="red" label="mink4|l_1"];
  69. 14.90 s gammaloop-nextest-spenso> 13 13 │ ext3 [style=invis];
  70. 14.90 s gammaloop-nextest-spenso> 14 │- 0:3:s -> ext3 [id=3 dir=none color="red" label="bis4|l_3"];
  71. 14.90 s gammaloop-nextest-spenso> 14 │+ 0:1:s -> ext3 [id=3 dir=none color="red" label="bis4|l_2"];
  72. 14.90 s gammaloop-nextest-spenso> 15 15 │ ext4 [style=invis];
  73. 14.90 s gammaloop-nextest-spenso> 16 │- 0:1:s -> ext4 [id=4 dir=none color="red" label="mink4|l_1"];
  74. 14.90 s gammaloop-nextest-spenso> 16 │+ 0:2:s -> ext4 [id=4 dir=none color="red" label="mink4|l_4"];
  75. 14.90 s gammaloop-nextest-spenso> 17 17 │ ext5 [style=invis];
  76. 14.90 s gammaloop-nextest-spenso> 18 │- 0:2:s -> ext5 [id=5 dir=none color="red" label="mink4|l_4"];
  77. 14.90 s gammaloop-nextest-spenso> 18 │+ 0:4:s -> ext5 [id=5 dir=none color="red" label="bis4|l_3"];
  78. 14.90 s gammaloop-nextest-spenso> 19 19 │ }
  79. 14.90 s gammaloop-nextest-spenso> ────────────┴───────────────────────────────────────────────────────────────────
  80. 14.90 s gammaloop-nextest-spenso> To update snapshots run `cargo insta review`
  81. 14.90 s gammaloop-nextest-spenso> Stopped on the first failure. Run `cargo insta test` to run all snapshots.
  82. 14.90 s gammaloop-nextest-spenso> test tensor::tests::parsing::infinite_execution ... FAILED
  83. 14.90 s gammaloop-nextest-spenso>
  84. 14.90 s gammaloop-nextest-spenso> failures:
  85. 14.90 s gammaloop-nextest-spenso>
  86. 14.90 s gammaloop-nextest-spenso> failures:
  87. 14.90 s gammaloop-nextest-spenso> tensor::tests::parsing::infinite_execution
  88. 14.90 s gammaloop-nextest-spenso>
  89. 14.90 s gammaloop-nextest-spenso> test result: FAILED. 0 passed; 1 failed; 0 ignored; 0 measured; 240 filtered out; finished in 0.09s
  90. 14.90 s gammaloop-nextest-spenso>
  91. 14.90 s gammaloop-nextest-spenso> stderr ---
  92. 14.90 s gammaloop-nextest-spenso>
  93. 14.90 s gammaloop-nextest-spenso> thread 'tensor::tests::parsing::infinite_execution' (844) panicked at /nix/store/p13pfw1gvvk8m860apfhvzcgidxhbs7g-vendor-cargo-deps/c19b7c6f923b580ac259164a89f2577984ad5ab09ee9d583b888f934adbbe8d0/insta-1.47.2/src/runtime.rs:719:13:
  94. 14.90 s gammaloop-nextest-spenso> snapshot assertion for 'infinite_execution' failed in line 910
  95. 14.90 s gammaloop-nextest-spenso> stack backtrace:
  96. 14.90 s gammaloop-nextest-spenso> 0: __rustc::rust_begin_unwind
  97. 14.90 s gammaloop-nextest-spenso> 1: core::panicking::panic_fmt
  98. 14.90 s gammaloop-nextest-spenso> 2: insta::runtime::assert_snapshot
  99. 14.90 s gammaloop-nextest-spenso> 3: idenso::tensor::tests::parsing::infinite_execution
  100. 14.90 s gammaloop-nextest-spenso> 4: <idenso::tensor::tests::parsing::infinite_execution::{closure#0} as core::ops::function::FnOnce<()>>::call_once
  101. 14.90 s gammaloop-nextest-spenso> note: Some details are omitted, run with `RUST_BACKTRACE=full` for a verbose backtrace.
  102. 14.90 s gammaloop-nextest-spenso>
  103. 16.25 s gammaloop-nextest-spenso> ------------
  104. 16.25 s gammaloop-nextest-spenso> Summary [ 1.713s] 224 tests run: 222 passed, 2 failed, 26 skipped
  105. 16.25 s gammaloop-nextest-spenso> FAIL [ 0.010s] ( 47/224) idenso color::test::form_reference::metric_contraction_respects_antisymmetric_normalization
  106. 16.25 s gammaloop-nextest-spenso> stdout ---
  107. 16.25 s gammaloop-nextest-spenso>
  108. 16.25 s gammaloop-nextest-spenso> running 1 test
  109. 16.25 s gammaloop-nextest-spenso> test color::test::form_reference::metric_contraction_respects_antisymmetric_normalization ... FAILED
  110. 16.25 s gammaloop-nextest-spenso>
  111. 16.25 s gammaloop-nextest-spenso> failures:
  112. 16.25 s gammaloop-nextest-spenso>
  113. 16.25 s gammaloop-nextest-spenso> failures:
  114. 16.25 s gammaloop-nextest-spenso> color::test::form_reference::metric_contraction_respects_antisymmetric_normalization
  115. 16.25 s gammaloop-nextest-spenso>
  116. 16.25 s gammaloop-nextest-spenso> test result: FAILED. 0 passed; 1 failed; 0 ignored; 0 measured; 240 filtered out; finished in 0.00s
  117. 16.25 s gammaloop-nextest-spenso>
  118. 16.25 s gammaloop-nextest-spenso> stderr ---
  119. 16.25 s gammaloop-nextest-spenso>
  120. 16.25 s gammaloop-nextest-spenso> thread 'color::test::form_reference::metric_contraction_respects_antisymmetric_normalization' (327) panicked at crates/idenso/src/color/test/form_reference.rs:171:5:
  121. 16.25 s gammaloop-nextest-spenso> assertion `left == right` failed
  122. 16.25 s gammaloop-nextest-spenso> left: "-1*f(coad(8,standalone_metric_j),coad(8,standalone_metric_s),coad(8,standalone_metric_u))"
  123. 16.25 s gammaloop-nextest-spenso> right: "f(coad(8,standalone_metric_j),coad(8,standalone_metric_s),coad(8,standalone_metric_u))"
  124. 16.25 s gammaloop-nextest-spenso> stack backtrace:
  125. 16.25 s gammaloop-nextest-spenso> 0: __rustc::rust_begin_unwind
  126. 16.25 s gammaloop-nextest-spenso> 1: core::panicking::panic_fmt
  127. 16.25 s gammaloop-nextest-spenso> 2: core::panicking::assert_failed_inner
  128. 16.25 s gammaloop-nextest-spenso> 3: core::panicking::assert_failed::<alloc::string::String, alloc::string::String>
  129. 16.25 s gammaloop-nextest-spenso> 4: idenso::color::test::form_reference::metric_contraction_respects_antisymmetric_normalization
  130. 16.25 s gammaloop-nextest-spenso> 5: <idenso::color::test::form_reference::metric_contraction_respects_antisymmetric_normalization::{closure#0} as core::ops::function::FnOnce<()>>::call_once
  131. 16.25 s gammaloop-nextest-spenso> note: Some details are omitted, run with `RUST_BACKTRACE=full` for a verbose backtrace.
  132. 16.25 s gammaloop-nextest-spenso>
  133. 16.25 s gammaloop-nextest-spenso> FAIL [ 0.100s] (221/224) idenso tensor::tests::parsing::infinite_execution
  134. 16.25 s gammaloop-nextest-spenso> stdout ---
  135. 16.25 s gammaloop-nextest-spenso>
  136. 16.25 s gammaloop-nextest-spenso> running 1 test
  137. 16.25 s gammaloop-nextest-spenso> ━━━━━━━━━━━━━━━━━━━━━━━━━━━━━━━ Snapshot Summary ━━━━━━━━━━━━━━━━━━━━━━━━━━━━━━━
  138. 16.25 s gammaloop-nextest-spenso> Snapshot: infinite_execution
  139. 16.25 s gammaloop-nextest-spenso> Source: crates/idenso/src/tensor/tests/parsing.rs:910
  140. 16.25 s gammaloop-nextest-spenso> ────────────────────────────────────────────────────────────────────────────────
  141. 16.25 s gammaloop-nextest-spenso> Expression: net_iter.snapshot_dot()
  142. 16.25 s gammaloop-nextest-spenso> ────────────────────────────────────────────────────────────────────────────────
  143. 16.25 s gammaloop-nextest-spenso> -old snapshot
  144. 16.25 s gammaloop-nextest-spenso> +new results
  145. 16.25 s gammaloop-nextest-spenso> ────────────┬───────────────────────────────────────────────────────────────────
  146. 16.25 s gammaloop-nextest-spenso> 8 8 │ 0:0:s -> ext0 [id=0 color="red"];
  147. 16.25 s gammaloop-nextest-spenso> 9 9 │ ext1 [style=invis];
  148. 16.25 s gammaloop-nextest-spenso> 10 10 │ 0:5:s -> ext1 [id=1 dir=none color="red" label="mink4|l_0"];
  149. 16.25 s gammaloop-nextest-spenso> 11 11 │ ext2 [style=invis];
  150. 16.25 s gammaloop-nextest-spenso> 12 │- 0:4:s -> ext2 [id=2 dir=none color="red" label="bis4|l_2"];
  151. 16.25 s gammaloop-nextest-spenso> 12 │+ 0:3:s -> ext2 [id=2 dir=none color="red" label="mink4|l_1"];
  152. 16.25 s gammaloop-nextest-spenso> 13 13 │ ext3 [style=invis];
  153. 16.25 s gammaloop-nextest-spenso> 14 │- 0:3:s -> ext3 [id=3 dir=none color="red" label="bis4|l_3"];
  154. 16.25 s gammaloop-nextest-spenso> 14 │+ 0:1:s -> ext3 [id=3 dir=none color="red" label="bis4|l_2"];
  155. 16.25 s gammaloop-nextest-spenso> 15 15 │ ext4 [style=invis];
  156. 16.25 s gammaloop-nextest-spenso> 16 │- 0:1:s -> ext4 [id=4 dir=none color="red" label="mink4|l_1"];
  157. 16.25 s gammaloop-nextest-spenso> 16 │+ 0:2:s -> ext4 [id=4 dir=none color="red" label="mink4|l_4"];
  158. 16.25 s gammaloop-nextest-spenso> 17 17 │ ext5 [style=invis];
  159. 16.25 s gammaloop-nextest-spenso> 18 │- 0:2:s -> ext5 [id=5 dir=none color="red" label="mink4|l_4"];
  160. 16.25 s gammaloop-nextest-spenso> 18 │+ 0:4:s -> ext5 [id=5 dir=none color="red" label="bis4|l_3"];
  161. 16.25 s gammaloop-nextest-spenso> 19 19 │ }
  162. 16.25 s gammaloop-nextest-spenso> ────────────┴───────────────────────────────────────────────────────────────────
  163. 16.25 s gammaloop-nextest-spenso> To update snapshots run `cargo insta review`
  164. 16.25 s gammaloop-nextest-spenso> Stopped on the first failure. Run `cargo insta test` to run all snapshots.
  165. 16.25 s gammaloop-nextest-spenso> test tensor::tests::parsing::infinite_execution ... FAILED
  166. 16.25 s gammaloop-nextest-spenso>
  167. 16.25 s gammaloop-nextest-spenso> failures:
  168. 16.25 s gammaloop-nextest-spenso>
  169. 16.25 s gammaloop-nextest-spenso> failures:
  170. 16.25 s gammaloop-nextest-spenso> tensor::tests::parsing::infinite_execution
  171. 16.25 s gammaloop-nextest-spenso>
  172. 16.25 s gammaloop-nextest-spenso> test result: FAILED. 0 passed; 1 failed; 0 ignored; 0 measured; 240 filtered out; finished in 0.09s
  173. 16.25 s gammaloop-nextest-spenso>
  174. 16.25 s gammaloop-nextest-spenso> stderr ---
  175. 16.25 s gammaloop-nextest-spenso>
  176. 16.25 s gammaloop-nextest-spenso> thread 'tensor::tests::parsing::infinite_execution' (844) panicked at /nix/store/p13pfw1gvvk8m860apfhvzcgidxhbs7g-vendor-cargo-deps/c19b7c6f923b580ac259164a89f2577984ad5ab09ee9d583b888f934adbbe8d0/insta-1.47.2/src/runtime.rs:719:13:
  177. 16.25 s gammaloop-nextest-spenso> snapshot assertion for 'infinite_execution' failed in line 910
  178. 16.25 s gammaloop-nextest-spenso> stack backtrace:
  179. 16.25 s gammaloop-nextest-spenso> 0: __rustc::rust_begin_unwind
  180. 16.25 s gammaloop-nextest-spenso> 1: core::panicking::panic_fmt
  181. 16.25 s gammaloop-nextest-spenso> 2: insta::runtime::assert_snapshot
  182. 16.25 s gammaloop-nextest-spenso> 3: idenso::tensor::tests::parsing::infinite_execution
  183. 16.25 s gammaloop-nextest-spenso> 4: <idenso::tensor::tests::parsing::infinite_execution::{closure#0} as core::ops::function::FnOnce<()>>::call_once
  184. 16.25 s gammaloop-nextest-spenso> note: Some details are omitted, run with `RUST_BACKTRACE=full` for a verbose backtrace.
  185. 16.25 s gammaloop-nextest-spenso>
  186. 16.28 s gammaloop-nextest-spenso> error: test run failed
  187. 16.31 s gammaloop-nextest-spenso>
  188. 16.31 s gammaloop-nextest-spenso> ========== nextest test summary ==========
  189. 16.31 s gammaloop-nextest-spenso> report: target/nextest/ci_gammaloop/junit.xml
  190. 16.31 s gammaloop-nextest-spenso> tests: 224, failures: 2, errors: 0
  191. 16.31 s gammaloop-nextest-spenso>
  192. 16.31 s gammaloop-nextest-spenso> 1. idenso::color::test::form_reference::metric_contraction_respects_antisymmetric_normalization
  193. 16.31 s gammaloop-nextest-spenso> failure: test failure with exit code 101
  194. 16.31 s gammaloop-nextest-spenso> thread 'color::test::form_reference::metric_contraction_respects_antisymmetric_normalization' (327) panicked at crates/idenso/src/color/test/form_reference.rs:171:5:
  195. 16.31 s gammaloop-nextest-spenso> assertion `left == right` failed
  196. 16.31 s gammaloop-nextest-spenso> left: "-1*f(coad(8,standalone_metric_j),coad(8,standalone_metric_s),coad(8,standalone_metric_u))"
  197. 16.31 s gammaloop-nextest-spenso> right: "f(coad(8,standalone_metric_j),coad(8,standalone_metric_s),coad(8,standalone_metric_u))"
  198. 16.31 s gammaloop-nextest-spenso> stack backtrace:
  199. 16.31 s gammaloop-nextest-spenso> 0: __rustc::rust_begin_unwind
  200. 16.31 s gammaloop-nextest-spenso> 1: core::panicking::panic_fmt
  201. 16.31 s gammaloop-nextest-spenso> 2: core::panicking::assert_failed_inner
  202. 16.31 s gammaloop-nextest-spenso> 3: core::panicking::assert_failed::<alloc::string::String, alloc::string::String>
  203. 16.31 s gammaloop-nextest-spenso> 4: idenso::color::test::form_reference::metric_contraction_respects_antisymmetric_normalization
  204. 16.31 s gammaloop-nextest-spenso> 5: <idenso::color::test::form_reference::metric_contraction_respects_antisymmetric_normalization::{closure#0} as core::ops::function::FnOnce<()>>::call_once
  205. 16.31 s gammaloop-nextest-spenso> note: Some details are omitted, run with `RUST_BACKTRACE=full` for a verbose backtrace.
  206. 16.31 s gammaloop-nextest-spenso> system-out
  207. 16.31 s gammaloop-nextest-spenso> running 1 test
  208. 16.31 s gammaloop-nextest-spenso> test color::test::form_reference::metric_contraction_respects_antisymmetric_normalization ... FAILED
  209. 16.31 s gammaloop-nextest-spenso>
  210. 16.31 s gammaloop-nextest-spenso> failures:
  211. 16.31 s gammaloop-nextest-spenso>
  212. 16.31 s gammaloop-nextest-spenso> failures:
  213. 16.31 s gammaloop-nextest-spenso> color::test::form_reference::metric_contraction_respects_antisymmetric_normalization
  214. 16.31 s gammaloop-nextest-spenso>
  215. 16.31 s gammaloop-nextest-spenso> test result: FAILED. 0 passed; 1 failed; 0 ignored; 0 measured; 240 filtered out; finished in 0.00s
  216. 16.31 s gammaloop-nextest-spenso> system-err
  217. 16.31 s gammaloop-nextest-spenso> thread 'color::test::form_reference::metric_contraction_respects_antisymmetric_normalization' (327) panicked at crates/idenso/src/color/test/form_reference.rs:171:5:
  218. 16.31 s gammaloop-nextest-spenso> assertion `left == right` failed
  219. 16.31 s gammaloop-nextest-spenso> left: "-1*f(coad(8,standalone_metric_j),coad(8,standalone_metric_s),coad(8,standalone_metric_u))"
  220. 16.31 s gammaloop-nextest-spenso> right: "f(coad(8,standalone_metric_j),coad(8,standalone_metric_s),coad(8,standalone_metric_u))"
  221. 16.31 s gammaloop-nextest-spenso> stack backtrace:
  222. 16.31 s gammaloop-nextest-spenso> 0: __rustc::rust_begin_unwind
  223. 16.31 s gammaloop-nextest-spenso> 1: core::panicking::panic_fmt
  224. 16.31 s gammaloop-nextest-spenso> 2: core::panicking::assert_failed_inner
  225. 16.31 s gammaloop-nextest-spenso> 3: core::panicking::assert_failed::<alloc::string::String, alloc::string::String>
  226. 16.31 s gammaloop-nextest-spenso> 4: idenso::color::test::form_reference::metric_contraction_respects_antisymmetric_normalization
  227. 16.31 s gammaloop-nextest-spenso> 5: <idenso::color::test::form_reference::metric_contraction_respects_antisymmetric_normalization::{closure#0} as core::ops::function::FnOnce<()>>::call_once
  228. 16.31 s gammaloop-nextest-spenso> note: Some details are omitted, run with `RUST_BACKTRACE=full` for a verbose backtrace.
  229. 16.31 s gammaloop-nextest-spenso>
  230. 16.31 s gammaloop-nextest-spenso> 2. idenso::tensor::tests::parsing::infinite_execution
  231. 16.31 s gammaloop-nextest-spenso> failure: test failure with exit code 101
  232. 16.31 s gammaloop-nextest-spenso> thread 'tensor::tests::parsing::infinite_execution' (844) panicked at /nix/store/p13pfw1gvvk8m860apfhvzcgidxhbs7g-vendor-cargo-deps/c19b7c6f923b580ac259164a89f2577984ad5ab09ee9d583b888f934adbbe8d0/insta-1.47.2/src/runtime.rs:719:13:
  233. 16.31 s gammaloop-nextest-spenso> snapshot assertion for 'infinite_execution' failed in line 910
  234. 16.31 s gammaloop-nextest-spenso> stack backtrace:
  235. 16.31 s gammaloop-nextest-spenso> 0: __rustc::rust_begin_unwind
  236. 16.31 s gammaloop-nextest-spenso> 1: core::panicking::panic_fmt
  237. 16.31 s gammaloop-nextest-spenso> 2: insta::runtime::assert_snapshot
  238. 16.31 s gammaloop-nextest-spenso> 3: idenso::tensor::tests::parsing::infinite_execution
  239. 16.31 s gammaloop-nextest-spenso> 4: <idenso::tensor::tests::parsing::infinite_execution::{closure#0} as core::ops::function::FnOnce<()>>::call_once
  240. 16.31 s gammaloop-nextest-spenso> note: Some details are omitted, run with `RUST_BACKTRACE=full` for a verbose backtrace.
  241. 16.31 s gammaloop-nextest-spenso> system-out
  242. 16.31 s gammaloop-nextest-spenso> running 1 test
  243. 16.31 s gammaloop-nextest-spenso> ━━━━━━━━━━━━━━━━━━━━━━━━━━━━━━━ Snapshot Summary ━━━━━━━━━━━━━━━━━━━━━━━━━━━━━━━
  244. 16.31 s gammaloop-nextest-spenso> Snapshot: infinite_execution
  245. 16.31 s gammaloop-nextest-spenso> Source: crates/idenso/src/tensor/tests/parsing.rs:910
  246. 16.31 s gammaloop-nextest-spenso> ────────────────────────────────────────────────────────────────────────────────
  247. 16.31 s gammaloop-nextest-spenso> Expression: net_iter.snapshot_dot()
  248. 16.31 s gammaloop-nextest-spenso> ────────────────────────────────────────────────────────────────────────────────
  249. 16.31 s gammaloop-nextest-spenso> -old snapshot
  250. 16.31 s gammaloop-nextest-spenso> +new results
  251. 16.31 s gammaloop-nextest-spenso> ────────────┬───────────────────────────────────────────────────────────────────
  252. 16.31 s gammaloop-nextest-spenso> 8 8 │ 0:0:s-> ext0 [id=0 color="red"];
  253. 16.31 s gammaloop-nextest-spenso> 9 9 │ ext1 [style=invis];
  254. 16.31 s gammaloop-nextest-spenso> 10 10 │ 0:5:s-> ext1 [id=1 dir=none color="red" label="mink4|l_0"];
  255. 16.31 s gammaloop-nextest-spenso> 11 11 │ ext2 [style=invis];
  256. 16.31 s gammaloop-nextest-spenso> 12 │- 0:4:s-> ext2 [id=2 dir=none color="red" label="bis4|l_2"];
  257. 16.31 s gammaloop-nextest-spenso> 12 │+ 0:3:s-> ext2 [id=2 dir=none color="red" label="mink4|l_1"];
  258. 16.31 s gammaloop-nextest-spenso> 13 13 │ ext3 [style=invis];
  259. 16.31 s gammaloop-nextest-spenso> 14 │- 0:3:s-> ext3 [id=3 dir=none color="red" label="bis4|l_3"];
  260. 16.31 s gammaloop-nextest-spenso> 14 │+ 0:1:s-> ext3 [id=3 dir=none color="red" label="bis4|l_2"];
  261. 16.31 s gammaloop-nextest-spenso> 15 15 │ ext4 [style=invis];
  262. 16.31 s gammaloop-nextest-spenso> 16 │- 0:1:s-> ext4 [id=4 dir=none color="red" label="mink4|l_1"];
  263. 16.31 s gammaloop-nextest-spenso> 16 │+ 0:2:s-> ext4 [id=4 dir=none color="red" label="mink4|l_4"];
  264. 16.31 s gammaloop-nextest-spenso> 17 17 │ ext5 [style=invis];
  265. 16.31 s gammaloop-nextest-spenso> 18 │- 0:2:s-> ext5 [id=5 dir=none color="red" label="mink4|l_4"];
  266. 16.31 s gammaloop-nextest-spenso> 18 │+ 0:4:s-> ext5 [id=5 dir=none color="red" label="bis4|l_3"];
  267. 16.31 s gammaloop-nextest-spenso> 19 19 │ }
  268. 16.31 s gammaloop-nextest-spenso> ────────────┴───────────────────────────────────────────────────────────────────
  269. 16.31 s gammaloop-nextest-spenso> To update snapshots run `cargo insta review`
  270. 16.31 s gammaloop-nextest-spenso> Stopped on the first failure. Run `cargo insta test` to run all snapshots.
  271. 16.31 s gammaloop-nextest-spenso> test tensor::tests::parsing::infinite_execution ... FAILED
  272. 16.31 s gammaloop-nextest-spenso>
  273. 16.31 s gammaloop-nextest-spenso> failures:
  274. 16.31 s gammaloop-nextest-spenso>
  275. 16.31 s gammaloop-nextest-spenso> failures:
  276. 16.31 s gammaloop-nextest-spenso> tensor::tests::parsing::infinite_execution
  277. 16.31 s gammaloop-nextest-spenso>
  278. 16.31 s gammaloop-nextest-spenso> test result: FAILED. 0 passed; 1 failed; 0 ignored; 0 measured; 240 filtered out; finished in 0.09s
  279. 16.31 s gammaloop-nextest-spenso> system-err
  280. 16.31 s gammaloop-nextest-spenso> thread 'tensor::tests::parsing::infinite_execution' (844) panicked at /nix/store/p13pfw1gvvk8m860apfhvzcgidxhbs7g-vendor-cargo-deps/c19b7c6f923b580ac259164a89f2577984ad5ab09ee9d583b888f934adbbe8d0/insta-1.47.2/src/runtime.rs:719:13:
  281. 16.31 s gammaloop-nextest-spenso> snapshot assertion for 'infinite_execution' failed in line 910
  282. 16.31 s gammaloop-nextest-spenso> stack backtrace:
  283. 16.31 s gammaloop-nextest-spenso> 0: __rustc::rust_begin_unwind
  284. 16.31 s gammaloop-nextest-spenso> 1: core::panicking::panic_fmt
  285. 16.31 s gammaloop-nextest-spenso> 2: insta::runtime::assert_snapshot
  286. 16.31 s gammaloop-nextest-spenso> 3: idenso::tensor::tests::parsing::infinite_execution
  287. 16.31 s gammaloop-nextest-spenso> 4: <idenso::tensor::tests::parsing::infinite_execution::{closure#0} as core::ops::function::FnOnce<()>>::call_once
  288. 16.31 s gammaloop-nextest-spenso> note: Some details are omitted, run with `RUST_BACKTRACE=full` for a verbose backtrace.
  289. 16.31 s gammaloop-nextest-spenso> =========================================
  290. 16.32 s gammaloop-nextest-spenso> Extracting 2 binaries and 1 linked path to /build/nextest-archive-tOVEK3
  291. 16.40 s gammaloop-nextest-spenso> Extracted 8 files to /build/nextest-archive-tOVEK3 in 0.08s
  292. 16.41 s gammaloop-nextest-spenso> ------------
  293. 16.41 s gammaloop-nextest-spenso> Nextest run ID a1da1127-a6fb-4d8e-bfde-33db0799fae6 with nextest profile: ci_gammaloop
  294. 16.41 s gammaloop-nextest-spenso> Starting 135 tests across 2 binaries
  295. 16.50 s gammaloop-nextest-spenso> ------------
  296. 16.50 s gammaloop-nextest-spenso> Summary [ 0.097s] 135 tests run: 135 passed, 0 skipped
  297. 16.55 s gammaloop-nextest-spenso>
  298. 16.55 s gammaloop-nextest-spenso> ========== nextest test summary ==========
  299. 16.55 s gammaloop-nextest-spenso> report: target/nextest/ci_gammaloop/junit.xml
  300. 16.55 s gammaloop-nextest-spenso> tests: 135, failures: 0, errors: 0
  301. 16.55 s gammaloop-nextest-spenso> No failing testcases found.
  302. 16.55 s gammaloop-nextest-spenso> =========================================
  303. 16.56 s gammaloop-nextest-spenso> Extracting 5 binaries and 2 linked paths to /build/nextest-archive-V83gOB
  304. 16.76 s gammaloop-nextest-spenso> Extracted 19 files to /build/nextest-archive-V83gOB in 0.20s
  305. 16.77 s gammaloop-nextest-spenso> ------------
  306. 16.77 s gammaloop-nextest-spenso> Nextest run ID 93a8b1cd-2d89-477a-b03d-4825e5ae1a03 with nextest profile: ci_gammaloop
  307. 16.77 s gammaloop-nextest-spenso> Starting 25 tests across 5 binaries (1 test skipped via profile.ci_gammaloop.default-filter)
  308. 16.97 s gammaloop-nextest-spenso> ------------
  309. 16.97 s gammaloop-nextest-spenso> Summary [ 0.199s] 25 tests run: 25 passed, 1 skipped
  310. 17.03 s gammaloop-nextest-spenso>
  311. 17.03 s gammaloop-nextest-spenso> ========== nextest test summary ==========
  312. 17.03 s gammaloop-nextest-spenso> report: target/nextest/ci_gammaloop/junit.xml
  313. 17.03 s gammaloop-nextest-spenso> tests: 25, failures: 0, errors: 0
  314. 17.03 s gammaloop-nextest-spenso> No failing testcases found.
  315. 17.03 s gammaloop-nextest-spenso> =========================================
  316. 17.04 s gammaloop-nextest-spenso> Extracting 2 binaries and 1 linked path to /build/nextest-archive-p6tDsB
  317. 17.10 s gammaloop-nextest-spenso> Extracted 8 files to /build/nextest-archive-p6tDsB in 0.06s
  318. 17.10 s gammaloop-nextest-spenso> ------------
  319. 17.10 s gammaloop-nextest-spenso> Nextest run ID 8f169b1b-0260-4bc9-8207-f9e13fc497b4 with nextest profile: ci_gammaloop
  320. 17.10 s gammaloop-nextest-spenso> Starting 1 test across 2 binaries
  321. 17.11 s gammaloop-nextest-spenso> ------------
  322. 17.11 s gammaloop-nextest-spenso> Summary [ 0.005s] 1 test run: 1 passed, 0 skipped
  323. 17.15 s gammaloop-nextest-spenso>
  324. 17.15 s gammaloop-nextest-spenso> ========== nextest test summary ==========
  325. 17.15 s gammaloop-nextest-spenso> report: target/nextest/ci_gammaloop/junit.xml
  326. 17.15 s gammaloop-nextest-spenso> tests: 1, failures: 0, errors: 0
  327. 17.15 s gammaloop-nextest-spenso> No failing testcases found.
  328. 17.15 s gammaloop-nextest-spenso> =========================================
  329. 17.16 s gammaloop-nextest-spenso> Extracting 1 binary and 1 linked path to /build/nextest-archive-2PUSPQ
  330. 17.21 s gammaloop-nextest-spenso> Extracted 7 files to /build/nextest-archive-2PUSPQ in 0.05s
  331. 17.22 s gammaloop-nextest-spenso> ------------
  332. 17.22 s gammaloop-nextest-spenso> Nextest run ID 876bd068-8c17-4b32-afc4-780c8e3d1ae9 with nextest profile: ci_gammaloop
  333. 17.22 s gammaloop-nextest-spenso> Starting 0 tests across 1 binary
  334. 17.22 s gammaloop-nextest-spenso> ------------
  335. 17.22 s gammaloop-nextest-spenso> Summary [ 0.000s] 0 tests run: 0 passed, 0 skipped
  336. 17.25 s gammaloop-nextest-spenso>
  337. 17.25 s gammaloop-nextest-spenso> ========== nextest test summary ==========
  338. 17.25 s gammaloop-nextest-spenso> report: target/nextest/ci_gammaloop/junit.xml
  339. 17.25 s gammaloop-nextest-spenso> tests: 0, failures: 0, errors: 0
  340. 17.25 s gammaloop-nextest-spenso> No failing testcases found.
  341. 17.25 s gammaloop-nextest-spenso> =========================================
  342. 17.28 s error: Cannot build '/nix/store/8hj2j3n1562bs62vvl44s3db1hsxblr2-gammaloop-nextest-spenso.drv'.
  343. 17.28 s Reason: builder failed with exit code 100.
  344. 17.28 s Output paths:
  345. 17.28 s /nix/store/q6zi5vs0q3wnr64456imbjpsvsayaj2c-gammaloop-nextest-spenso
  346. 17.28 s Last 325 log lines:
  347. 17.28 s > Extracting 5 binaries and 2 linked paths to /build/nextest-archive-sueIky
  348. 17.28 s > Extracted 19 files to /build/nextest-archive-sueIky in 0.17s
  349. 17.28 s > ------------
  350. 17.28 s > Nextest run ID 9933a873-23c6-4993-aea9-aad2c3bbf160 with nextest profile: ci_gammaloop
  351. 17.28 s > Starting 224 tests across 5 binaries (26 tests skipped, including 2 tests via profile.ci_gammaloop.default-filter)
  352. 17.28 s > FAIL [ 0.010s] ( 47/224) idenso color::test::form_reference::metric_contraction_respects_antisymmetric_normalization
  353. 17.28 s > stdout ---
  354. 17.28 s >
  355. 17.28 s > running 1 test
  356. 17.28 s > test color::test::form_reference::metric_contraction_respects_antisymmetric_normalization ... FAILED
  357. 17.28 s >
  358. 17.28 s > failures:
  359. 17.28 s >
  360. 17.28 s > failures:
  361. 17.28 s > color::test::form_reference::metric_contraction_respects_antisymmetric_normalization
  362. 17.28 s >
  363. 17.28 s > test result: FAILED. 0 passed; 1 failed; 0 ignored; 0 measured; 240 filtered out; finished in 0.00s
  364. 17.28 s >
  365. 17.28 s > stderr ---
  366. 17.28 s >
  367. 17.28 s > thread 'color::test::form_reference::metric_contraction_respects_antisymmetric_normalization' (327) panicked at crates/idenso/src/color/test/form_reference.rs:171:5:
  368. 17.28 s > assertion `left == right` failed
  369. 17.28 s > left: "-1*f(coad(8,standalone_metric_j),coad(8,standalone_metric_s),coad(8,standalone_metric_u))"
  370. 17.28 s > right: "f(coad(8,standalone_metric_j),coad(8,standalone_metric_s),coad(8,standalone_metric_u))"
  371. 17.28 s > stack backtrace:
  372. 17.28 s > 0: __rustc::rust_begin_unwind
  373. 17.28 s > 1: core::panicking::panic_fmt
  374. 17.28 s > 2: core::panicking::assert_failed_inner
  375. 17.28 s > 3: core::panicking::assert_failed::<alloc::string::String, alloc::string::String>
  376. 17.28 s > 4: idenso::color::test::form_reference::metric_contraction_respects_antisymmetric_normalization
  377. 17.28 s > 5: <idenso::color::test::form_reference::metric_contraction_respects_antisymmetric_normalization::{closure#0} as core::ops::function::FnOnce<()>>::call_once
  378. 17.28 s > note: Some details are omitted, run with `RUST_BACKTRACE=full` for a verbose backtrace.
  379. 17.28 s >
  380. 17.28 s > FAIL [ 0.100s] (221/224) idenso tensor::tests::parsing::infinite_execution
  381. 17.28 s > stdout ---
  382. 17.28 s >
  383. 17.28 s > running 1 test
  384. 17.28 s > ━━━━━━━━━━━━━━━━━━━━━━━━━━━━━━━ Snapshot Summary ━━━━━━━━━━━━━━━━━━━━━━━━━━━━━━━
  385. 17.28 s > Snapshot: infinite_execution
  386. 17.28 s > Source: crates/idenso/src/tensor/tests/parsing.rs:910
  387. 17.28 s > ────────────────────────────────────────────────────────────────────────────────
  388. 17.28 s > Expression: net_iter.snapshot_dot()
  389. 17.28 s > ────────────────────────────────────────────────────────────────────────────────
  390. 17.28 s > -old snapshot
  391. 17.28 s > +new results
  392. 17.28 s > ────────────┬───────────────────────────────────────────────────────────────────
  393. 17.28 s > 8 8 │ 0:0:s -> ext0 [id=0 color="red"];
  394. 17.28 s > 9 9 │ ext1 [style=invis];
  395. 17.28 s > 10 10 │ 0:5:s -> ext1 [id=1 dir=none color="red" label="mink4|l_0"];
  396. 17.28 s > 11 11 │ ext2 [style=invis];
  397. 17.28 s > 12 │- 0:4:s -> ext2 [id=2 dir=none color="red" label="bis4|l_2"];
  398. 17.28 s > 12 │+ 0:3:s -> ext2 [id=2 dir=none color="red" label="mink4|l_1"];
  399. 17.28 s > 13 13 │ ext3 [style=invis];
  400. 17.28 s > 14 │- 0:3:s -> ext3 [id=3 dir=none color="red" label="bis4|l_3"];
  401. 17.28 s > 14 │+ 0:1:s -> ext3 [id=3 dir=none color="red" label="bis4|l_2"];
  402. 17.28 s > 15 15 │ ext4 [style=invis];
  403. 17.28 s > 16 │- 0:1:s -> ext4 [id=4 dir=none color="red" label="mink4|l_1"];
  404. 17.28 s > 16 │+ 0:2:s -> ext4 [id=4 dir=none color="red" label="mink4|l_4"];
  405. 17.28 s > 17 17 │ ext5 [style=invis];
  406. 17.28 s > 18 │- 0:2:s -> ext5 [id=5 dir=none color="red" label="mink4|l_4"];
  407. 17.28 s > 18 │+ 0:4:s -> ext5 [id=5 dir=none color="red" label="bis4|l_3"];
  408. 17.28 s > 19 19 │ }
  409. 17.28 s > ────────────┴───────────────────────────────────────────────────────────────────
  410. 17.28 s > To update snapshots run `cargo insta review`
  411. 17.28 s > Stopped on the first failure. Run `cargo insta test` to run all snapshots.
  412. 17.28 s > test tensor::tests::parsing::infinite_execution ... FAILED
  413. 17.28 s >
  414. 17.28 s > failures:
  415. 17.28 s >
  416. 17.28 s > failures:
  417. 17.28 s > tensor::tests::parsing::infinite_execution
  418. 17.28 s >
  419. 17.28 s > test result: FAILED. 0 passed; 1 failed; 0 ignored; 0 measured; 240 filtered out; finished in 0.09s
  420. 17.28 s >
  421. 17.28 s > stderr ---
  422. 17.28 s >
  423. 17.28 s > thread 'tensor::tests::parsing::infinite_execution' (844) panicked at /nix/store/p13pfw1gvvk8m860apfhvzcgidxhbs7g-vendor-cargo-deps/c19b7c6f923b580ac259164a89f2577984ad5ab09ee9d583b888f934adbbe8d0/insta-1.47.2/src/runtime.rs:719:13:
  424. 17.28 s > snapshot assertion for 'infinite_execution' failed in line 910
  425. 17.28 s > stack backtrace:
  426. 17.28 s > 0: __rustc::rust_begin_unwind
  427. 17.28 s > 1: core::panicking::panic_fmt
  428. 17.28 s > 2: insta::runtime::assert_snapshot
  429. 17.28 s > 3: idenso::tensor::tests::parsing::infinite_execution
  430. 17.28 s > 4: <idenso::tensor::tests::parsing::infinite_execution::{closure#0} as core::ops::function::FnOnce<()>>::call_once
  431. 17.28 s > note: Some details are omitted, run with `RUST_BACKTRACE=full` for a verbose backtrace.
  432. 17.28 s >
  433. 17.28 s > ------------
  434. 17.28 s > Summary [ 1.713s] 224 tests run: 222 passed, 2 failed, 26 skipped
  435. 17.28 s > FAIL [ 0.010s] ( 47/224) idenso color::test::form_reference::metric_contraction_respects_antisymmetric_normalization
  436. 17.28 s > stdout ---
  437. 17.28 s >
  438. 17.28 s > running 1 test
  439. 17.28 s > test color::test::form_reference::metric_contraction_respects_antisymmetric_normalization ... FAILED
  440. 17.28 s >
  441. 17.28 s > failures:
  442. 17.28 s >
  443. 17.28 s > failures:
  444. 17.28 s > color::test::form_reference::metric_contraction_respects_antisymmetric_normalization
  445. 17.28 s >
  446. 17.28 s > test result: FAILED. 0 passed; 1 failed; 0 ignored; 0 measured; 240 filtered out; finished in 0.00s
  447. 17.28 s >
  448. 17.28 s > stderr ---
  449. 17.28 s >
  450. 17.28 s > thread 'color::test::form_reference::metric_contraction_respects_antisymmetric_normalization' (327) panicked at crates/idenso/src/color/test/form_reference.rs:171:5:
  451. 17.28 s > assertion `left == right` failed
  452. 17.28 s > left: "-1*f(coad(8,standalone_metric_j),coad(8,standalone_metric_s),coad(8,standalone_metric_u))"
  453. 17.28 s > right: "f(coad(8,standalone_metric_j),coad(8,standalone_metric_s),coad(8,standalone_metric_u))"
  454. 17.28 s > stack backtrace:
  455. 17.28 s > 0: __rustc::rust_begin_unwind
  456. 17.28 s > 1: core::panicking::panic_fmt
  457. 17.28 s > 2: core::panicking::assert_failed_inner
  458. 17.28 s > 3: core::panicking::assert_failed::<alloc::string::String, alloc::string::String>
  459. 17.28 s > 4: idenso::color::test::form_reference::metric_contraction_respects_antisymmetric_normalization
  460. 17.28 s > 5: <idenso::color::test::form_reference::metric_contraction_respects_antisymmetric_normalization::{closure#0} as core::ops::function::FnOnce<()>>::call_once
  461. 17.28 s > note: Some details are omitted, run with `RUST_BACKTRACE=full` for a verbose backtrace.
  462. 17.28 s >
  463. 17.28 s > FAIL [ 0.100s] (221/224) idenso tensor::tests::parsing::infinite_execution
  464. 17.28 s > stdout ---
  465. 17.28 s >
  466. 17.28 s > running 1 test
  467. 17.28 s > ━━━━━━━━━━━━━━━━━━━━━━━━━━━━━━━ Snapshot Summary ━━━━━━━━━━━━━━━━━━━━━━━━━━━━━━━
  468. 17.28 s > Snapshot: infinite_execution
  469. 17.28 s > Source: crates/idenso/src/tensor/tests/parsing.rs:910
  470. 17.28 s > ────────────────────────────────────────────────────────────────────────────────
  471. 17.28 s > Expression: net_iter.snapshot_dot()
  472. 17.28 s > ────────────────────────────────────────────────────────────────────────────────
  473. 17.28 s > -old snapshot
  474. 17.28 s > +new results
  475. 17.28 s > ────────────┬───────────────────────────────────────────────────────────────────
  476. 17.28 s > 8 8 │ 0:0:s -> ext0 [id=0 color="red"];
  477. 17.28 s > 9 9 │ ext1 [style=invis];
  478. 17.28 s > 10 10 │ 0:5:s -> ext1 [id=1 dir=none color="red" label="mink4|l_0"];
  479. 17.28 s > 11 11 │ ext2 [style=invis];
  480. 17.28 s > 12 │- 0:4:s -> ext2 [id=2 dir=none color="red" label="bis4|l_2"];
  481. 17.28 s > 12 │+ 0:3:s -> ext2 [id=2 dir=none color="red" label="mink4|l_1"];
  482. 17.28 s > 13 13 │ ext3 [style=invis];
  483. 17.28 s > 14 │- 0:3:s -> ext3 [id=3 dir=none color="red" label="bis4|l_3"];
  484. 17.28 s > 14 │+ 0:1:s -> ext3 [id=3 dir=none color="red" label="bis4|l_2"];
  485. 17.28 s > 15 15 │ ext4 [style=invis];
  486. 17.28 s > 16 │- 0:1:s -> ext4 [id=4 dir=none color="red" label="mink4|l_1"];
  487. 17.28 s > 16 │+ 0:2:s -> ext4 [id=4 dir=none color="red" label="mink4|l_4"];
  488. 17.28 s > 17 17 │ ext5 [style=invis];
  489. 17.28 s > 18 │- 0:2:s -> ext5 [id=5 dir=none color="red" label="mink4|l_4"];
  490. 17.28 s > 18 │+ 0:4:s -> ext5 [id=5 dir=none color="red" label="bis4|l_3"];
  491. 17.28 s > 19 19 │ }
  492. 17.28 s > ────────────┴───────────────────────────────────────────────────────────────────
  493. 17.28 s > To update snapshots run `cargo insta review`
  494. 17.28 s > Stopped on the first failure. Run `cargo insta test` to run all snapshots.
  495. 17.28 s > test tensor::tests::parsing::infinite_execution ... FAILED
  496. 17.28 s >
  497. 17.28 s > failures:
  498. 17.28 s >
  499. 17.28 s > failures:
  500. 17.28 s > tensor::tests::parsing::infinite_execution
  501. 17.28 s >
  502. 17.28 s > test result: FAILED. 0 passed; 1 failed; 0 ignored; 0 measured; 240 filtered out; finished in 0.09s
  503. 17.28 s >
  504. 17.28 s > stderr ---
  505. 17.28 s >
  506. 17.28 s > thread 'tensor::tests::parsing::infinite_execution' (844) panicked at /nix/store/p13pfw1gvvk8m860apfhvzcgidxhbs7g-vendor-cargo-deps/c19b7c6f923b580ac259164a89f2577984ad5ab09ee9d583b888f934adbbe8d0/insta-1.47.2/src/runtime.rs:719:13:
  507. 17.28 s > snapshot assertion for 'infinite_execution' failed in line 910
  508. 17.28 s > stack backtrace:
  509. 17.28 s > 0: __rustc::rust_begin_unwind
  510. 17.28 s > 1: core::panicking::panic_fmt
  511. 17.28 s > 2: insta::runtime::assert_snapshot
  512. 17.28 s > 3: idenso::tensor::tests::parsing::infinite_execution
  513. 17.28 s > 4: <idenso::tensor::tests::parsing::infinite_execution::{closure#0} as core::ops::function::FnOnce<()>>::call_once
  514. 17.28 s > note: Some details are omitted, run with `RUST_BACKTRACE=full` for a verbose backtrace.
  515. 17.28 s >
  516. 17.28 s > error: test run failed
  517. 17.28 s >
  518. 17.28 s > ========== nextest test summary ==========
  519. 17.28 s > report: target/nextest/ci_gammaloop/junit.xml
  520. 17.28 s > tests: 224, failures: 2, errors: 0
  521. 17.28 s >
  522. 17.28 s > 1. idenso::color::test::form_reference::metric_contraction_respects_antisymmetric_normalization
  523. 17.28 s > failure: test failure with exit code 101
  524. 17.28 s > thread 'color::test::form_reference::metric_contraction_respects_antisymmetric_normalization' (327) panicked at crates/idenso/src/color/test/form_reference.rs:171:5:
  525. 17.28 s > assertion `left == right` failed
  526. 17.28 s > left: "-1*f(coad(8,standalone_metric_j),coad(8,standalone_metric_s),coad(8,standalone_metric_u))"
  527. 17.28 s > right: "f(coad(8,standalone_metric_j),coad(8,standalone_metric_s),coad(8,standalone_metric_u))"
  528. 17.28 s > stack backtrace:
  529. 17.28 s > 0: __rustc::rust_begin_unwind
  530. 17.28 s > 1: core::panicking::panic_fmt
  531. 17.28 s > 2: core::panicking::assert_failed_inner
  532. 17.28 s > 3: core::panicking::assert_failed::<alloc::string::String, alloc::string::String>
  533. 17.28 s > 4: idenso::color::test::form_reference::metric_contraction_respects_antisymmetric_normalization
  534. 17.28 s > 5: <idenso::color::test::form_reference::metric_contraction_respects_antisymmetric_normalization::{closure#0} as core::ops::function::FnOnce<()>>::call_once
  535. 17.28 s > note: Some details are omitted, run with `RUST_BACKTRACE=full` for a verbose backtrace.
  536. 17.28 s > system-out
  537. 17.28 s > running 1 test
  538. 17.28 s > test color::test::form_reference::metric_contraction_respects_antisymmetric_normalization ... FAILED
  539. 17.28 s >
  540. 17.28 s > failures:
  541. 17.28 s >
  542. 17.28 s > failures:
  543. 17.28 s > color::test::form_reference::metric_contraction_respects_antisymmetric_normalization
  544. 17.28 s >
  545. 17.28 s > test result: FAILED. 0 passed; 1 failed; 0 ignored; 0 measured; 240 filtered out; finished in 0.00s
  546. 17.28 s > system-err
  547. 17.28 s > thread 'color::test::form_reference::metric_contraction_respects_antisymmetric_normalization' (327) panicked at crates/idenso/src/color/test/form_reference.rs:171:5:
  548. 17.28 s > assertion `left == right` failed
  549. 17.28 s > left: "-1*f(coad(8,standalone_metric_j),coad(8,standalone_metric_s),coad(8,standalone_metric_u))"
  550. 17.28 s > right: "f(coad(8,standalone_metric_j),coad(8,standalone_metric_s),coad(8,standalone_metric_u))"
  551. 17.28 s > stack backtrace:
  552. 17.28 s > 0: __rustc::rust_begin_unwind
  553. 17.28 s > 1: core::panicking::panic_fmt
  554. 17.28 s > 2: core::panicking::assert_failed_inner
  555. 17.28 s > 3: core::panicking::assert_failed::<alloc::string::String, alloc::string::String>
  556. 17.28 s > 4: idenso::color::test::form_reference::metric_contraction_respects_antisymmetric_normalization
  557. 17.28 s > 5: <idenso::color::test::form_reference::metric_contraction_respects_antisymmetric_normalization::{closure#0} as core::ops::function::FnOnce<()>>::call_once
  558. 17.28 s > note: Some details are omitted, run with `RUST_BACKTRACE=full` for a verbose backtrace.
  559. 17.28 s >
  560. 17.28 s > 2. idenso::tensor::tests::parsing::infinite_execution
  561. 17.28 s > failure: test failure with exit code 101
  562. 17.28 s > thread 'tensor::tests::parsing::infinite_execution' (844) panicked at /nix/store/p13pfw1gvvk8m860apfhvzcgidxhbs7g-vendor-cargo-deps/c19b7c6f923b580ac259164a89f2577984ad5ab09ee9d583b888f934adbbe8d0/insta-1.47.2/src/runtime.rs:719:13:
  563. 17.28 s > snapshot assertion for 'infinite_execution' failed in line 910
  564. 17.28 s > stack backtrace:
  565. 17.28 s > 0: __rustc::rust_begin_unwind
  566. 17.28 s > 1: core::panicking::panic_fmt
  567. 17.28 s > 2: insta::runtime::assert_snapshot
  568. 17.28 s > 3: idenso::tensor::tests::parsing::infinite_execution
  569. 17.28 s > 4: <idenso::tensor::tests::parsing::infinite_execution::{closure#0} as core::ops::function::FnOnce<()>>::call_once
  570. 17.28 s > note: Some details are omitted, run with `RUST_BACKTRACE=full` for a verbose backtrace.
  571. 17.28 s > system-out
  572. 17.28 s > running 1 test
  573. 17.28 s > ━━━━━━━━━━━━━━━━━━━━━━━━━━━━━━━ Snapshot Summary ━━━━━━━━━━━━━━━━━━━━━━━━━━━━━━━
  574. 17.28 s > Snapshot: infinite_execution
  575. 17.28 s > Source: crates/idenso/src/tensor/tests/parsing.rs:910
  576. 17.28 s > ────────────────────────────────────────────────────────────────────────────────
  577. 17.28 s > Expression: net_iter.snapshot_dot()
  578. 17.28 s > ────────────────────────────────────────────────────────────────────────────────
  579. 17.28 s > -old snapshot
  580. 17.28 s > +new results
  581. 17.28 s > ────────────┬───────────────────────────────────────────────────────────────────
  582. 17.28 s > 8 8 │ 0:0:s-> ext0 [id=0 color="red"];
  583. 17.28 s > 9 9 │ ext1 [style=invis];
  584. 17.28 s > 10 10 │ 0:5:s-> ext1 [id=1 dir=none color="red" label="mink4|l_0"];
  585. 17.28 s > 11 11 │ ext2 [style=invis];
  586. 17.28 s > 12 │- 0:4:s-> ext2 [id=2 dir=none color="red" label="bis4|l_2"];
  587. 17.28 s > 12 │+ 0:3:s-> ext2 [id=2 dir=none color="red" label="mink4|l_1"];
  588. 17.28 s > 13 13 │ ext3 [style=invis];
  589. 17.28 s > 14 │- 0:3:s-> ext3 [id=3 dir=none color="red" label="bis4|l_3"];
  590. 17.28 s > 14 │+ 0:1:s-> ext3 [id=3 dir=none color="red" label="bis4|l_2"];
  591. 17.28 s > 15 15 │ ext4 [style=invis];
  592. 17.28 s > 16 │- 0:1:s-> ext4 [id=4 dir=none color="red" label="mink4|l_1"];
  593. 17.28 s > 16 │+ 0:2:s-> ext4 [id=4 dir=none color="red" label="mink4|l_4"];
  594. 17.28 s > 17 17 │ ext5 [style=invis];
  595. 17.28 s > 18 │- 0:2:s-> ext5 [id=5 dir=none color="red" label="mink4|l_4"];
  596. 17.28 s > 18 │+ 0:4:s-> ext5 [id=5 dir=none color="red" label="bis4|l_3"];
  597. 17.28 s > 19 19 │ }
  598. 17.28 s > ────────────┴───────────────────────────────────────────────────────────────────
  599. 17.28 s > To update snapshots run `cargo insta review`
  600. 17.28 s > Stopped on the first failure. Run `cargo insta test` to run all snapshots.
  601. 17.28 s > test tensor::tests::parsing::infinite_execution ... FAILED
  602. 17.28 s >
  603. 17.28 s > failures:
  604. 17.28 s >
  605. 17.28 s > failures:
  606. 17.28 s > tensor::tests::parsing::infinite_execution
  607. 17.28 s >
  608. 17.28 s > test result: FAILED. 0 passed; 1 failed; 0 ignored; 0 measured; 240 filtered out; finished in 0.09s
  609. 17.28 s > system-err
  610. 17.28 s > thread 'tensor::tests::parsing::infinite_execution' (844) panicked at /nix/store/p13pfw1gvvk8m860apfhvzcgidxhbs7g-vendor-cargo-deps/c19b7c6f923b580ac259164a89f2577984ad5ab09ee9d583b888f934adbbe8d0/insta-1.47.2/src/runtime.rs:719:13:
  611. 17.28 s > snapshot assertion for 'infinite_execution' failed in line 910
  612. 17.28 s > stack backtrace:
  613. 17.28 s > 0: __rustc::rust_begin_unwind
  614. 17.28 s > 1: core::panicking::panic_fmt
  615. 17.28 s > 2: insta::runtime::assert_snapshot
  616. 17.28 s > 3: idenso::tensor::tests::parsing::infinite_execution
  617. 17.28 s > 4: <idenso::tensor::tests::parsing::infinite_execution::{closure#0} as core::ops::function::FnOnce<()>>::call_once
  618. 17.28 s > note: Some details are omitted, run with `RUST_BACKTRACE=full` for a verbose backtrace.
  619. 17.28 s > =========================================
  620. 17.28 s > Extracting 2 binaries and 1 linked path to /build/nextest-archive-tOVEK3
  621. 17.28 s > Extracted 8 files to /build/nextest-archive-tOVEK3 in 0.08s
  622. 17.28 s > ------------
  623. 17.28 s > Nextest run ID a1da1127-a6fb-4d8e-bfde-33db0799fae6 with nextest profile: ci_gammaloop
  624. 17.28 s > Starting 135 tests across 2 binaries
  625. 17.28 s > ------------
  626. 17.28 s > Summary [ 0.097s] 135 tests run: 135 passed, 0 skipped
  627. 17.28 s >
  628. 17.28 s > ========== nextest test summary ==========
  629. 17.28 s > report: target/nextest/ci_gammaloop/junit.xml
  630. 17.28 s > tests: 135, failures: 0, errors: 0
  631. 17.28 s > No failing testcases found.
  632. 17.28 s > =========================================
  633. 17.28 s > Extracting 5 binaries and 2 linked paths to /build/nextest-archive-V83gOB
  634. 17.28 s > Extracted 19 files to /build/nextest-archive-V83gOB in 0.20s
  635. 17.28 s > ------------
  636. 17.28 s > Nextest run ID 93a8b1cd-2d89-477a-b03d-4825e5ae1a03 with nextest profile: ci_gammaloop
  637. 17.28 s > Starting 25 tests across 5 binaries (1 test skipped via profile.ci_gammaloop.default-filter)
  638. 17.28 s > ------------
  639. 17.28 s > Summary [ 0.199s] 25 tests run: 25 passed, 1 skipped
  640. 17.28 s >
  641. 17.28 s > ========== nextest test summary ==========
  642. 17.28 s > report: target/nextest/ci_gammaloop/junit.xml
  643. 17.28 s > tests: 25, failures: 0, errors: 0
  644. 17.28 s > No failing testcases found.
  645. 17.28 s > =========================================
  646. 17.28 s > Extracting 2 binaries and 1 linked path to /build/nextest-archive-p6tDsB
  647. 17.28 s > Extracted 8 files to /build/nextest-archive-p6tDsB in 0.06s
  648. 17.28 s > ------------
  649. 17.28 s > Nextest run ID 8f169b1b-0260-4bc9-8207-f9e13fc497b4 with nextest profile: ci_gammaloop
  650. 17.28 s > Starting 1 test across 2 binaries
  651. 17.28 s > ------------
  652. 17.28 s > Summary [ 0.005s] 1 test run: 1 passed, 0 skipped
  653. 17.28 s >
  654. 17.28 s > ========== nextest test summary ==========
  655. 17.28 s > report: target/nextest/ci_gammaloop/junit.xml
  656. 17.28 s > tests: 1, failures: 0, errors: 0
  657. 17.28 s > No failing testcases found.
  658. 17.28 s > =========================================
  659. 17.28 s > Extracting 1 binary and 1 linked path to /build/nextest-archive-2PUSPQ
  660. 17.28 s > Extracted 7 files to /build/nextest-archive-2PUSPQ in 0.05s
  661. 17.28 s > ------------
  662. 17.28 s > Nextest run ID 876bd068-8c17-4b32-afc4-780c8e3d1ae9 with nextest profile: ci_gammaloop
  663. 17.28 s > Starting 0 tests across 1 binary
  664. 17.28 s > ------------
  665. 17.28 s > Summary [ 0.000s] 0 tests run: 0 passed, 0 skipped
  666. 17.28 s >
  667. 17.28 s > ========== nextest test summary ==========
  668. 17.28 s > report: target/nextest/ci_gammaloop/junit.xml
  669. 17.28 s > tests: 0, failures: 0, errors: 0
  670. 17.28 s > No failing testcases found.
  671. 17.28 s > =========================================
  672. 17.28 s For full logs, run:
  673. 17.28 s nix log /nix/store/8hj2j3n1562bs62vvl44s3db1hsxblr2-gammaloop-nextest-spenso.drv
  674. 17.38 s [0 built (1 failed)]Run failed.