test packages.x86_64-linux.nix-ci-check-gammaloop-nextest-core

Reproduce this run
Retry Run
  1. 0.14 s $ /nix/store/9ypz3flqsrl5xl495mm8h645gadjsxi1-coreutils-9.11/bin/timeout --kill-after=15s 7200s /nix/store/23zk8sgzamrbmj1fday15szf7f2279s8-nix-2.34.7/bin/nix --extra-experimental-features nix-command --extra-experimental-features flakes flake clone git+https://github.com/alphal00p/gammaloop --dest /tmp/nix-ci-worker/stable-pwd/repo/
  2. 0.18 s Cloning into '/tmp/nix-ci-worker/stable-pwd/repo'...
  3. 1.41 s remote: Enumerating objects: 65060, done.
  4. 1.53 s remote: Counting objects: 0% (1/7732) remote: Counting objects: 1% (78/7732) remote: Counting objects: 2% (155/7732) remote: Counting objects: 3% (232/7732) remote: Counting objects: 4% (310/7732) remote: Counting objects: 5% (387/7732) remote: Counting objects: 6% (464/7732) remote: Counting objects: 7% (542/7732) remote: Counting objects: 8% (619/7732) remote: Counting objects: 9% (696/7732) remote: Counting objects: 10% (774/7732) remote: Counting objects: 11% (851/7732) remote: Counting objects: 12% (928/7732) remote: Counting objects: 13% (1006/7732) remote: Counting objects: 14% (1083/7732) remote: Counting objects: 15% (1160/7732) remote: Counting objects: 16% (1238/7732) remote: Counting objects: 17% (1315/7732) remote: Counting objects: 18% (1392/7732) remote: Counting objects: 19% (1470/7732) remote: Counting objects: 20% (1547/7732) remote: Counting objects: 21% (1624/7732) remote: Counting objects: 22% (1702/7732) remote: Counting objects: 23% (1779/7732) remote: Counting objects: 24% (1856/7732) remote: Counting objects: 25% (1933/7732) remote: Counting objects: 26% (2011/7732) remote: Counting objects: 27% (2088/7732) remote: Counting objects: 28% (2165/7732) remote: Counting objects: 29% (2243/7732) remote: Counting objects: 30% (2320/7732) remote: Counting objects: 31% (2397/7732) remote: Counting objects: 32% (2475/7732) remote: Counting objects: 33% (2552/7732) remote: Counting objects: 34% (2629/7732) remote: Counting objects: 35% (2707/7732) remote: Counting objects: 36% (2784/7732) remote: Counting objects: 37% (2861/7732) remote: Counting objects: 38% (2939/7732) remote: Counting objects: 39% (3016/7732) remote: Counting objects: 40% (3093/7732) remote: Counting objects: 41% (3171/7732) remote: Counting objects: 42% (3248/7732) remote: Counting objects: 43% (3325/7732) remote: Counting objects: 44% (3403/7732) remote: Counting objects: 45% (3480/7732) remote: Counting objects: 46% (3557/7732) remote: Counting objects: 47% (3635/7732) remote: Counting objects: 48% (3712/7732) remote: Counting objects: 49% (3789/7732) remote: Counting objects: 50% (3866/7732) remote: Counting objects: 51% (3944/7732) remote: Counting objects: 52% (4021/7732) remote: Counting objects: 53% (4098/7732) remote: Counting objects: 54% (4176/7732) remote: Counting objects: 55% (4253/7732) remote: Counting objects: 56% (4330/7732) remote: Counting objects: 57% (4408/7732) remote: Counting objects: 58% (4485/7732) remote: Counting objects: 59% (4562/7732) remote: Counting objects: 60% (4640/7732) remote: Counting objects: 61% (4717/7732) remote: Counting objects: 62% (4794/7732) remote: Counting objects: 63% (4872/7732) remote: Counting objects: 64% (4949/7732) remote: Counting objects: 65% (5026/7732) remote: Counting objects: 66% (5104/7732) remote: Counting objects: 67% (5181/7732) remote: Counting objects: 68% (5258/7732) remote: Counting objects: 69% (5336/7732) remote: Counting objects: 70% (5413/7732) remote: Counting objects: 71% (5490/7732) remote: Counting objects: 72% (5568/7732) remote: Counting objects: 73% (5645/7732) remote: Counting objects: 74% (5722/7732) remote: Counting objects: 75% (5799/7732) remote: Counting objects: 76% (5877/7732) remote: Counting objects: 77% (5954/7732) remote: Counting objects: 78% (6031/7732) remote: Counting objects: 79% (6109/7732) remote: Counting objects: 80% (6186/7732) remote: Counting objects: 81% (6263/7732) remote: Counting objects: 82% (6341/7732) remote: Counting objects: 83% (6418/7732) remote: Counting objects: 84% (6495/7732) remote: Counting objects: 85% (6573/7732) remote: Counting objects: 86% (6650/7732) remote: Counting objects: 87% (6727/7732) remote: Counting objects: 88% (6805/7732) remote: Counting objects: 89% (6882/7732) remote: Counting objects: 90% (6959/7732) remote: Counting objects: 91% (7037/7732) remote: Counting objects: 92% (7114/7732) remote: Counting objects: 93% (7191/7732) remote: Counting objects: 94% (7269/7732) remote: Counting objects: 95% (7346/7732) remote: Counting objects: 96% (7423/7732) remote: Counting objects: 97% (7501/7732) remote: Counting objects: 98% (7578/7732) remote: Counting objects: 99% (7655/7732) remote: Counting objects: 100% (7732/7732) remote: Counting objects: 100% (7732/7732), done.
  5. 2.96 s remote: Compressing objects: 0% (1/1434) remote: Compressing objects: 1% (15/1434) remote: Compressing objects: 2% (29/1434) remote: Compressing objects: 3% (44/1434) remote: Compressing objects: 4% (58/1434) remote: Compressing objects: 5% (72/1434) remote: Compressing objects: 6% (87/1434) remote: Compressing objects: 7% (101/1434) remote: Compressing objects: 8% (115/1434) remote: Compressing objects: 9% (130/1434) remote: Compressing objects: 10% (144/1434) remote: Compressing objects: 11% (158/1434) remote: Compressing objects: 12% (173/1434) remote: Compressing objects: 12% (186/1434) remote: Compressing objects: 13% (187/1434) remote: Compressing objects: 14% (201/1434) remote: Compressing objects: 15% (216/1434) remote: Compressing objects: 16% (230/1434) remote: Compressing objects: 17% (244/1434) remote: Compressing objects: 18% (259/1434) remote: Compressing objects: 19% (273/1434) remote: Compressing objects: 20% (287/1434) remote: Compressing objects: 21% (302/1434) remote: Compressing objects: 22% (316/1434) remote: Compressing objects: 23% (330/1434) remote: Compressing objects: 24% (345/1434) remote: Compressing objects: 25% (359/1434) remote: Compressing objects: 26% (373/1434) remote: Compressing objects: 27% (388/1434) remote: Compressing objects: 28% (402/1434) remote: Compressing objects: 29% (416/1434) remote: Compressing objects: 30% (431/1434) remote: Compressing objects: 31% (445/1434) remote: Compressing objects: 32% (459/1434) remote: Compressing objects: 33% (474/1434) remote: Compressing objects: 34% (488/1434) remote: Compressing objects: 35% (502/1434) remote: Compressing objects: 36% (517/1434) remote: Compressing objects: 37% (531/1434) remote: Compressing objects: 38% (545/1434) remote: Compressing objects: 39% (560/1434) remote: Compressing objects: 40% (574/1434) remote: Compressing objects: 41% (588/1434) remote: Compressing objects: 42% (603/1434) remote: Compressing objects: 43% (617/1434) remote: Compressing objects: 44% (631/1434) remote: Compressing objects: 45% (646/1434) remote: Compressing objects: 46% (660/1434) remote: Compressing objects: 47% (674/1434) remote: Compressing objects: 48% (689/1434) remote: Compressing objects: 49% (703/1434) remote: Compressing objects: 50% (717/1434) remote: Compressing objects: 51% (732/1434) remote: Compressing objects: 52% (746/1434) remote: Compressing objects: 53% (761/1434) remote: Compressing objects: 54% (775/1434) remote: Compressing objects: 55% (789/1434) remote: Compressing objects: 56% (804/1434) remote: Compressing objects: 57% (818/1434) remote: Compressing objects: 58% (832/1434) remote: Compressing objects: 59% (847/1434) remote: Compressing objects: 60% (861/1434) remote: Compressing objects: 61% (875/1434) remote: Compressing objects: 62% (890/1434) remote: Compressing objects: 63% (904/1434) remote: Compressing objects: 64% (918/1434) remote: Compressing objects: 65% (933/1434) remote: Compressing objects: 66% (947/1434) remote: Compressing objects: 67% (961/1434) remote: Compressing objects: 68% (976/1434) remote: Compressing objects: 69% (990/1434) remote: Compressing objects: 70% (1004/1434) remote: Compressing objects: 71% (1019/1434) remote: Compressing objects: 72% (1033/1434) remote: Compressing objects: 73% (1047/1434) remote: Compressing objects: 74% (1062/1434) remote: Compressing objects: 75% (1076/1434) remote: Compressing objects: 76% (1090/1434) remote: Compressing objects: 77% (1105/1434) remote: Compressing objects: 78% (1119/1434) remote: Compressing objects: 79% (1133/1434) remote: Compressing objects: 80% (1148/1434) remote: Compressing objects: 81% (1162/1434) remote: Compressing objects: 82% (1176/1434) remote: Compressing objects: 83% (1191/1434) remote: Compressing objects: 84% (1205/1434) remote: Compressing objects: 85% (1219/1434) remote: Compressing objects: 86% (1234/1434) remote: Compressing objects: 87% (1248/1434) remote: Compressing objects: 88% (1262/1434) remote: Compressing objects: 89% (1277/1434) remote: Compressing objects: 90% (1291/1434) remote: Compressing objects: 91% (1305/1434) remote: Compressing objects: 92% (1320/1434) remote: Compressing objects: 93% (1334/1434) remote: Compressing objects: 94% (1348/1434) remote: Compressing objects: 95% (1363/1434) remote: Compressing objects: 96% (1377/1434) remote: Compressing objects: 97% (1391/1434) remote: Compressing objects: 98% (1406/1434) remote: Compressing objects: 99% (1420/1434) remote: Compressing objects: 100% (1434/1434) remote: Compressing objects: 100% (1434/1434), done.
  6. 5.95 s Receiving objects: 0% (1/65060) Receiving objects: 1% (651/65060) Receiving objects: 2% (1302/65060) Receiving objects: 3% (1952/65060) Receiving objects: 4% (2603/65060) Receiving objects: 5% (3253/65060) Receiving objects: 6% (3904/65060) Receiving objects: 7% (4555/65060) Receiving objects: 8% (5205/65060) Receiving objects: 9% (5856/65060) Receiving objects: 10% (6506/65060) Receiving objects: 11% (7157/65060), 10.26 MiB | 20.43 MiB/s Receiving objects: 12% (7808/65060), 10.26 MiB | 20.43 MiB/s Receiving objects: 13% (8458/65060), 10.26 MiB | 20.43 MiB/s Receiving objects: 14% (9109/65060), 10.26 MiB | 20.43 MiB/s Receiving objects: 15% (9759/65060), 10.26 MiB | 20.43 MiB/s Receiving objects: 16% (10410/65060), 10.26 MiB | 20.43 MiB/s Receiving objects: 17% (11061/65060), 10.26 MiB | 20.43 MiB/s Receiving objects: 18% (11711/65060), 10.26 MiB | 20.43 MiB/s Receiving objects: 19% (12362/65060), 10.26 MiB | 20.43 MiB/s Receiving objects: 20% (13012/65060), 10.26 MiB | 20.43 MiB/s Receiving objects: 21% (13663/65060), 10.26 MiB | 20.43 MiB/s Receiving objects: 22% (14314/65060), 10.26 MiB | 20.43 MiB/s Receiving objects: 23% (14964/65060), 10.26 MiB | 20.43 MiB/s Receiving objects: 24% (15615/65060), 10.26 MiB | 20.43 MiB/s Receiving objects: 25% (16265/65060), 10.26 MiB | 20.43 MiB/s Receiving objects: 26% (16916/65060), 10.26 MiB | 20.43 MiB/s Receiving objects: 27% (17567/65060), 10.26 MiB | 20.43 MiB/s Receiving objects: 28% (18217/65060), 10.26 MiB | 20.43 MiB/s Receiving objects: 29% (18868/65060), 10.26 MiB | 20.43 MiB/s Receiving objects: 30% (19518/65060), 10.26 MiB | 20.43 MiB/s Receiving objects: 31% (20169/65060), 10.26 MiB | 20.43 MiB/s Receiving objects: 32% (20820/65060), 10.26 MiB | 20.43 MiB/s Receiving objects: 33% (21470/65060), 10.26 MiB | 20.43 MiB/s Receiving objects: 34% (22121/65060), 10.26 MiB | 20.43 MiB/s Receiving objects: 35% (22771/65060), 10.26 MiB | 20.43 MiB/s Receiving objects: 36% (23422/65060), 10.26 MiB | 20.43 MiB/s Receiving objects: 37% (24073/65060), 10.26 MiB | 20.43 MiB/s Receiving objects: 38% (24723/65060), 10.26 MiB | 20.43 MiB/s Receiving objects: 39% (25374/65060), 10.26 MiB | 20.43 MiB/s Receiving objects: 39% (25717/65060), 10.26 MiB | 20.43 MiB/s Receiving objects: 40% (26024/65060), 10.26 MiB | 20.43 MiB/s Receiving objects: 41% (26675/65060), 10.26 MiB | 20.43 MiB/s Receiving objects: 42% (27326/65060), 26.68 MiB | 26.62 MiB/s Receiving objects: 43% (27976/65060), 26.68 MiB | 26.62 MiB/s Receiving objects: 44% (28627/65060), 26.68 MiB | 26.62 MiB/s Receiving objects: 45% (29277/65060), 26.68 MiB | 26.62 MiB/s Receiving objects: 46% (29928/65060), 26.68 MiB | 26.62 MiB/s Receiving objects: 47% (30579/65060), 26.68 MiB | 26.62 MiB/s Receiving objects: 48% (31229/65060), 26.68 MiB | 26.62 MiB/s Receiving objects: 49% (31880/65060), 26.68 MiB | 26.62 MiB/s Receiving objects: 50% (32530/65060), 26.68 MiB | 26.62 MiB/s Receiving objects: 51% (33181/65060), 26.68 MiB | 26.62 MiB/s Receiving objects: 52% (33832/65060), 26.68 MiB | 26.62 MiB/s Receiving objects: 53% (34482/65060), 26.68 MiB | 26.62 MiB/s Receiving objects: 54% (35133/65060), 26.68 MiB | 26.62 MiB/s Receiving objects: 55% (35783/65060), 26.68 MiB | 26.62 MiB/s Receiving objects: 56% (36434/65060), 26.68 MiB | 26.62 MiB/s Receiving objects: 57% (37085/65060), 26.68 MiB | 26.62 MiB/s Receiving objects: 58% (37735/65060), 41.74 MiB | 27.80 MiB/s Receiving objects: 59% (38386/65060), 41.74 MiB | 27.80 MiB/s Receiving objects: 60% (39036/65060), 41.74 MiB | 27.80 MiB/s Receiving objects: 61% (39687/65060), 41.74 MiB | 27.80 MiB/s Receiving objects: 62% (40338/65060), 41.74 MiB | 27.80 MiB/s Receiving objects: 63% (40988/65060), 41.74 MiB | 27.80 MiB/s Receiving objects: 64% (41639/65060), 41.74 MiB | 27.80 MiB/s Receiving objects: 65% (42289/65060), 41.74 MiB | 27.80 MiB/s Receiving objects: 66% (42940/65060), 41.74 MiB | 27.80 MiB/s Receiving objects: 67% (43591/65060), 41.74 MiB | 27.80 MiB/s Receiving objects: 68% (44241/65060), 41.74 MiB | 27.80 MiB/s Receiving objects: 69% (44892/65060), 41.74 MiB | 27.80 MiB/s Receiving objects: 70% (45542/65060), 41.74 MiB | 27.80 MiB/s Receiving objects: 71% (46193/65060), 41.74 MiB | 27.80 MiB/s Receiving objects: 71% (46481/65060), 56.14 MiB | 28.01 MiB/s Receiving objects: 72% (46844/65060), 56.14 MiB | 28.01 MiB/s Receiving objects: 73% (47494/65060), 56.14 MiB | 28.01 MiB/s Receiving objects: 74% (48145/65060), 56.14 MiB | 28.01 MiB/s Receiving objects: 75% (48795/65060), 56.14 MiB | 28.01 MiB/s Receiving objects: 76% (49446/65060), 56.14 MiB | 28.01 MiB/s Receiving objects: 77% (50097/65060), 56.14 MiB | 28.01 MiB/s Receiving objects: 78% (50747/65060), 56.14 MiB | 28.01 MiB/s Receiving objects: 79% (51398/65060), 71.82 MiB | 28.58 MiB/s Receiving objects: 80% (52048/65060), 71.82 MiB | 28.58 MiB/s Receiving objects: 81% (52699/65060), 71.82 MiB | 28.58 MiB/s Receiving objects: 82% (53350/65060), 71.82 MiB | 28.58 MiB/s Receiving objects: 83% (54000/65060), 71.82 MiB | 28.58 MiB/s Receiving objects: 84% (54651/65060), 71.82 MiB | 28.58 MiB/s Receiving objects: 85% (55301/65060), 71.82 MiB | 28.58 MiB/s Receiving objects: 86% (55952/65060), 71.82 MiB | 28.58 MiB/s Receiving objects: 87% (56603/65060), 71.82 MiB | 28.58 MiB/s Receiving objects: 88% (57253/65060), 71.82 MiB | 28.58 MiB/s Receiving objects: 89% (57904/65060), 71.82 MiB | 28.58 MiB/s Receiving objects: 90% (58554/65060), 71.82 MiB | 28.58 MiB/s Receiving objects: 91% (59205/65060), 71.82 MiB | 28.58 MiB/s Receiving objects: 92% (59856/65060), 71.82 MiB | 28.58 MiB/s Receiving objects: 93% (60506/65060), 71.82 MiB | 28.58 MiB/s Receiving objects: 94% (61157/65060), 71.82 MiB | 28.58 MiB/s Receiving objects: 95% (61807/65060), 71.82 MiB | 28.58 MiB/s Receiving objects: 96% (62458/65060), 71.82 MiB | 28.58 MiB/s Receiving objects: 97% (63109/65060), 71.82 MiB | 28.58 MiB/s Receiving objects: 98% (63759/65060), 71.82 MiB | 28.58 MiB/s Receiving objects: 99% (64410/65060), 71.82 MiB | 28.58 MiB/s remote: Total 65060 (delta 6825), reused 6316 (delta 6297), pack-reused 57328 (from 1)
  7. 6.02 s Receiving objects: 100% (65060/65060), 71.82 MiB | 28.58 MiB/s Receiving objects: 100% (65060/65060), 87.00 MiB | 29.08 MiB/s, done.
  8. 6.64 s Resolving deltas: 0% (0/45922) Resolving deltas: 1% (460/45922) Resolving deltas: 2% (919/45922) Resolving deltas: 3% (1378/45922) Resolving deltas: 4% (1837/45922) Resolving deltas: 5% (2297/45922) Resolving deltas: 6% (2756/45922) Resolving deltas: 7% (3215/45922) Resolving deltas: 8% (3674/45922) Resolving deltas: 9% (4133/45922) Resolving deltas: 10% (4593/45922) Resolving deltas: 11% (5052/45922) Resolving deltas: 12% (5511/45922) Resolving deltas: 13% (5970/45922) Resolving deltas: 14% (6430/45922) Resolving deltas: 15% (6889/45922) Resolving deltas: 16% (7348/45922) Resolving deltas: 17% (7807/45922) Resolving deltas: 18% (8266/45922) Resolving deltas: 19% (8726/45922) Resolving deltas: 20% (9185/45922) Resolving deltas: 21% (9644/45922) Resolving deltas: 22% (10104/45922) Resolving deltas: 23% (10563/45922) Resolving deltas: 24% (11022/45922) Resolving deltas: 25% (11481/45922) Resolving deltas: 26% (11940/45922) Resolving deltas: 27% (12399/45922) Resolving deltas: 28% (12859/45922) Resolving deltas: 29% (13318/45922) Resolving deltas: 30% (13778/45922) Resolving deltas: 31% (14236/45922) Resolving deltas: 32% (14696/45922) Resolving deltas: 33% (15155/45922) Resolving deltas: 34% (15614/45922) Resolving deltas: 35% (16073/45922) Resolving deltas: 36% (16532/45922) Resolving deltas: 37% (16993/45922) Resolving deltas: 38% (17451/45922) Resolving deltas: 39% (17910/45922) Resolving deltas: 40% (18369/45922) Resolving deltas: 41% (18829/45922) Resolving deltas: 42% (19288/45922) Resolving deltas: 43% (19747/45922) Resolving deltas: 44% (20206/45922) Resolving deltas: 45% (20666/45922) Resolving deltas: 46% (21126/45922) Resolving deltas: 47% (21585/45922) Resolving deltas: 48% (22043/45922) Resolving deltas: 49% (22502/45922) Resolving deltas: 50% (22961/45922) Resolving deltas: 51% (23421/45922) Resolving deltas: 52% (23881/45922) Resolving deltas: 53% (24339/45922) Resolving deltas: 54% (24798/45922) Resolving deltas: 55% (25258/45922) Resolving deltas: 56% (25717/45922) Resolving deltas: 57% (26176/45922) Resolving deltas: 58% (26635/45922) Resolving deltas: 59% (27094/45922) Resolving deltas: 60% (27555/45922) Resolving deltas: 61% (28016/45922) Resolving deltas: 62% (28472/45922) Resolving deltas: 63% (28933/45922) Resolving deltas: 64% (29391/45922) Resolving deltas: 65% (29850/45922) Resolving deltas: 66% (30311/45922) Resolving deltas: 67% (30768/45922) Resolving deltas: 68% (31227/45922) Resolving deltas: 69% (31687/45922) Resolving deltas: 70% (32146/45922) Resolving deltas: 71% (32605/45922) Resolving deltas: 72% (33064/45922) Resolving deltas: 73% (33524/45922) Resolving deltas: 74% (33983/45922) Resolving deltas: 75% (34442/45922) Resolving deltas: 76% (34901/45922) Resolving deltas: 77% (35360/45922) Resolving deltas: 78% (35820/45922) Resolving deltas: 79% (36280/45922) Resolving deltas: 80% (36738/45922) Resolving deltas: 81% (37197/45922) Resolving deltas: 82% (37657/45922) Resolving deltas: 83% (38116/45922) Resolving deltas: 84% (38575/45922) Resolving deltas: 85% (39034/45922) Resolving deltas: 86% (39493/45922) Resolving deltas: 87% (39953/45922) Resolving deltas: 88% (40412/45922) Resolving deltas: 89% (40871/45922) Resolving deltas: 90% (41330/45922) Resolving deltas: 91% (41790/45922) Resolving deltas: 92% (42249/45922) Resolving deltas: 93% (42708/45922) Resolving deltas: 94% (43167/45922) Resolving deltas: 95% (43626/45922) Resolving deltas: 96% (44086/45922) Resolving deltas: 97% (44546/45922) Resolving deltas: 98% (45004/45922) Resolving deltas: 99% (45463/45922) Resolving deltas: 100% (45922/45922) Resolving deltas: 100% (45922/45922), done.
  9. 7.11 s Fetching commit c1745ddd5ccecc94c54a846b90ea9a0e89de4682 for vakint_rustred ...
  10. 7.11 s $ /nix/store/bcnisk3ydfgv26v2gw3zlky24g00yww2-git-2.54.0/bin/git fetch origin c1745ddd5ccecc94c54a846b90ea9a0e89de4682
  11. 7.60 s From https://github.com/alphal00p/gammaloop
  12. 7.60 s * branch c1745ddd5ccecc94c54a846b90ea9a0e89de4682 -> FETCH_HEAD
  13. 7.61 s $ /nix/store/9ypz3flqsrl5xl495mm8h645gadjsxi1-coreutils-9.11/bin/timeout --kill-after=15s 7200s /nix/store/bcnisk3ydfgv26v2gw3zlky24g00yww2-git-2.54.0/bin/git -c advice.detachedHead=false checkout c1745ddd5ccecc94c54a846b90ea9a0e89de4682
  14. 7.80 s HEAD is now at c1745ddd Validate explicit RustRed tensor routings
  15. 7.80 s $ /nix/store/9ypz3flqsrl5xl495mm8h645gadjsxi1-coreutils-9.11/bin/timeout --kill-after=15s 7200s /nix/store/23zk8sgzamrbmj1fday15szf7f2279s8-nix-2.34.7/bin/nix --extra-experimental-features nix-command --extra-experimental-features flakes --log-format internal-json run .#packages.x86_64-linux.nix-ci-check-gammaloop-nextest-core --print-build-logs
  16. 14.82 s
  17. 14.96 s Downloading cached gammaloop-nextest-binaries-core-gammaloop-tracing-filter-macros from https://cache.nix-ci.com
  18. 15.00 s Downloading cached gammaloop-nextest-binaries-core-gammalooprs from https://cache.nix-ci.com
  19. 15.00 s Downloading cached gammaloop-nextest-binaries-core-gammaloop-api from https://cache.nix-ci.com
  20. 15.00 s Downloading cached gammaloop-nextest-binaries-core-gammaloop-tracing-filter from https://cache.nix-ci.com
  21. 15.20 s Downloaded cached gammaloop-nextest-binaries-core-gammaloop-tracing-filter-macros (1.7 MiB) in 239ms
  22. 15.20 s Progress: 0 of 1 built, 1 of 6 downloaded from cache (3 downloading)
  23. 15.40 s Downloaded cached gammaloop-nextest-binaries-core-gammaloop-tracing-filter (6.6 MiB) in 394ms
  24. 15.40 s Progress: 0 of 1 built, 2 of 6 downloaded from cache (2 downloading)
  25. 16.50 s Downloaded cached gammaloop-nextest-binaries-core-gammalooprs (76.8 MiB) in 1.4s
  26. 16.50 s Progress: 0 of 1 built, 3 of 6 downloaded from cache (1 downloading)
  27. 16.64 s Downloaded cached gammaloop-nextest-binaries-core-gammaloop-api (66.7 MiB) in 1.6s
  28. 16.64 s Progress: 0 of 1 built, 4 of 6 downloaded from cache
  29. 16.64 s Downloading cached gammaloop-nextest-binaries-core from https://cache.nix-ci.com
  30. 16.67 s Downloaded cached gammaloop-nextest-binaries-core (1640 B) in 30ms
  31. 16.67 s Progress: 0 of 1 built, 5 of 6 downloaded from cache
  32. 16.67 s Downloading cached nix-ci-check-gammaloop-nextest-core from https://cache.nix-ci.com
  33. 16.70 s Downloaded cached nix-ci-check-gammaloop-nextest-core (1016 B) in 29ms
  34. 16.70 s Progress: 0 of 1 built, 6 of 6 downloaded from cache
  35. 24.29 s evaluating derivation 'g copying '/nix/store/1zhf evaluating derivation 'g copying '/nix/store/1zhf evaluating derivation 'g copying '/nix/store/1zhf evaluating derivation 'g copying '/nix/store/1zhf evaluating derivation 'g copying '/nix/store/1zhf evaluating derivation 'g copying '/nix/store/1zhf evaluating derivation 'g copying '/nix/store/1zhf evaluating derivation 'g copying '/nix/store/1zhf evaluating derivation 'g copying '/nix/store/1zhf evaluating derivation 'g querying gammaloop-nexte [0/1 built, 0.0 KiB DL] [1/0/1 built, 0.0 KiB DLgammaloop-nextest-core> Extracting 3 binaries (including 1 non-test binary), 1 build script output directory, and 2 linked paths to /build/nextest-archive-rrQu5m
  36. 24.77 s gammaloop-nextest-core> Extracted 18 files to /build/nextest-archive-rrQu5m in 0.49s
  37. 24.81 s gammaloop-nextest-core> ------------
  38. 24.81 s gammaloop-nextest-core> Nextest run ID de47d34f-aef8-49f8-bd10-45c54fb310d4 with nextest profile: ci_gammaloop
  39. 24.81 s gammaloop-nextest-core> Starting 339 tests across 2 binaries
  40. 25.55 s gammaloop-nextest-core> ------------
  41. 25.55 s gammaloop-nextest-core> Summary [ 0.737s] 339 tests run: 339 passed, 0 skipped
  42. 25.68 s gammaloop-nextest-core>
  43. 25.68 s gammaloop-nextest-core> ========== nextest test summary ==========
  44. 25.68 s gammaloop-nextest-core> report: target/nextest/ci_gammaloop/junit.xml
  45. 25.68 s gammaloop-nextest-core> tests: 339, failures: 0, errors: 0
  46. 25.68 s gammaloop-nextest-core> No failing testcases found.
  47. 25.68 s gammaloop-nextest-core> =========================================
  48. 25.70 s gammaloop-nextest-core> Extracting 1 binary and 1 linked path to /build/nextest-archive-9jeTlM
  49. 25.77 s gammaloop-nextest-core> Extracted 7 files to /build/nextest-archive-9jeTlM in 0.07s
  50. 25.79 s gammaloop-nextest-core> ------------
  51. 25.79 s gammaloop-nextest-core> Nextest run ID d99e264e-ef4c-4aa5-850a-3308dba41ac1 with nextest profile: ci_gammaloop
  52. 25.79 s gammaloop-nextest-core> Starting 19 tests across 1 binary
  53. 25.85 s gammaloop-nextest-core> ------------
  54. 25.85 s gammaloop-nextest-core> Summary [ 0.055s] 19 tests run: 19 passed, 0 skipped
  55. 25.89 s gammaloop-nextest-core>
  56. 25.89 s gammaloop-nextest-core> ========== nextest test summary ==========
  57. 25.89 s gammaloop-nextest-core> report: target/nextest/ci_gammaloop/junit.xml
  58. 25.89 s gammaloop-nextest-core> tests: 19, failures: 0, errors: 0
  59. 25.89 s gammaloop-nextest-core> No failing testcases found.
  60. 25.89 s gammaloop-nextest-core> =========================================
  61. 25.92 s gammaloop-nextest-core> Extracting 1 binary to /build/nextest-archive-YMM6P1
  62. 25.95 s gammaloop-nextest-core> Extracted 4 files to /build/nextest-archive-YMM6P1 in 0.04s
  63. 25.98 s gammaloop-nextest-core> ------------
  64. 25.98 s gammaloop-nextest-core> Nextest run ID bd5cc846-fa9f-4cba-824c-1a830928a54e with nextest profile: ci_gammaloop
  65. 25.98 s gammaloop-nextest-core> Starting 0 tests across 1 binary
  66. 25.99 s gammaloop-nextest-core> ------------
  67. 25.99 s gammaloop-nextest-core> Summary [ 0.004s] 0 tests run: 0 passed, 0 skipped
  68. 26.04 s gammaloop-nextest-core>
  69. 26.04 s gammaloop-nextest-core> ========== nextest test summary ==========
  70. 26.04 s gammaloop-nextest-core> report: target/nextest/ci_gammaloop/junit.xml
  71. 26.04 s gammaloop-nextest-core> tests: 0, failures: 0, errors: 0
  72. 26.04 s gammaloop-nextest-core> No failing testcases found.
  73. 26.04 s gammaloop-nextest-core> =========================================
  74. 26.07 s gammaloop-nextest-core> Extracting 4 binaries, 1 build script output directory, and 2 linked paths to /build/nextest-archive-uwsXLs
  75. 26.62 s gammaloop-nextest-core> Extracted 18 files to /build/nextest-archive-uwsXLs in 0.55s
  76. 26.75 s gammaloop-nextest-core> ------------
  77. 26.75 s gammaloop-nextest-core> Nextest run ID 5b3bdee4-32a5-40a0-8622-db8bf808b00f with nextest profile: ci_gammaloop
  78. 26.75 s gammaloop-nextest-core> Starting 456 tests across 4 binaries (61 tests skipped, including 60 tests via profile.ci_gammaloop.default-filter)
  79. 28.70 s gammaloop-nextest-core> FAIL [ 0.349s] (443/456) gammalooprs::test_renormalization finit_part_ghlo
  80. 28.70 s gammaloop-nextest-core> stdout ---
  81. 28.70 s gammaloop-nextest-core>
  82. 28.70 s gammaloop-nextest-core> running 1 test
  83. 28.70 s gammaloop-nextest-core> ren part: 1/2*GC_10^2*dot(P(0,mink(dim)),P(0,mink(dim)))*cas(2,coad(8))/ε
  84. 28.70 s gammaloop-nextest-core> ━━━━━━━━━━━━━━━━━━━━━━━━━━━━━━━ Snapshot Summary ━━━━━━━━━━━━━━━━━━━━━━━━━━━━━━━
  85. 28.70 s gammaloop-nextest-core> Snapshot: finit_part_ghlo
  86. 28.70 s gammaloop-nextest-core> Source: crates/gammalooprs/tests/test_renormalization.rs:557
  87. 28.70 s gammaloop-nextest-core> ────────────────────────────────────────────────────────────────────────────────
  88. 28.70 s gammaloop-nextest-core> Expression: align_to_rqft(&a, &model).to_bare_ordered_string()
  89. 28.70 s gammaloop-nextest-core> ────────────────────────────────────────────────────────────────────────────────
  90. 28.70 s gammaloop-nextest-core> -old snapshot
  91. 28.70 s gammaloop-nextest-core> +new results
  92. 28.70 s gammaloop-nextest-core> ────────────┬───────────────────────────────────────────────────────────────────
  93. 28.70 s gammaloop-nextest-core> 1 │--1/2*cas(2,coad(8))*dot(P(0,mink(4)),P(0,mink(4)))*gs^2*ε^(-1)
  94. 28.70 s gammaloop-nextest-core> 1 │+1/2*cas(2,coad(8))*dot(P(0,mink(4)),P(0,mink(4)))*gs^2*ε^(-1)
  95. 28.70 s gammaloop-nextest-core> ────────────┴───────────────────────────────────────────────────────────────────
  96. 28.70 s gammaloop-nextest-core> To update snapshots run `cargo insta review`
  97. 28.70 s gammaloop-nextest-core> Stopped on the first failure. Run `cargo insta test` to run all snapshots.
  98. 28.70 s gammaloop-nextest-core> test finit_part_ghlo ... FAILED
  99. 28.70 s gammaloop-nextest-core>
  100. 28.70 s gammaloop-nextest-core> failures:
  101. 28.70 s gammaloop-nextest-core>
  102. 28.70 s gammaloop-nextest-core> failures:
  103. 28.70 s gammaloop-nextest-core> finit_part_ghlo
  104. 28.70 s gammaloop-nextest-core>
  105. 28.70 s gammaloop-nextest-core> test result: FAILED. 0 passed; 1 failed; 0 ignored; 0 measured; 5 filtered out; finished in 0.33s
  106. 28.70 s gammaloop-nextest-core>
  107. 28.70 s gammaloop-nextest-core> stderr ---
  108. 28.70 s gammaloop-nextest-core> The application panicked (crashed).
  109. 28.70 s gammaloop-nextest-core> Message: snapshot assertion for 'finit_part_ghlo' failed in line 557
  110. 28.70 s gammaloop-nextest-core> Location: /nix/store/30svmzr0z0zpcqjyynjn7w21wgx18y4b-vendor-cargo-deps/c19b7c6f923b580ac259164a89f2577984ad5ab09ee9d583b888f934adbbe8d0/insta-1.47.2/src/runtime.rs:719
  111. 28.70 s gammaloop-nextest-core>
  112. 28.70 s gammaloop-nextest-core> ━━━━━━━━━━━━━━━━━━━━━━━━━━━━━━━━━━ BACKTRACE ━━━━━━━━━━━━━━━━━━━━━━━━━━━━━━━━━━━
  113. 28.70 s gammaloop-nextest-core> 1: <color_eyre[51793ea62743adbd]::config::PanicHook>::panic_report<unknown>
  114. 28.70 s gammaloop-nextest-core> at <unknown source file>:<unknown line>
  115. 28.70 s gammaloop-nextest-core> 2: <color_eyre[51793ea62743adbd]::config::PanicHook>::into_panic_hook::{closure#0}<unknown>
  116. 28.70 s gammaloop-nextest-core> at <unknown source file>:<unknown line>
  117. 28.70 s gammaloop-nextest-core> 3: std[bcb96dfbba0ab899]::panicking::panic_with_hook<unknown>
  118. 28.70 s gammaloop-nextest-core> at <unknown source file>:<unknown line>
  119. 28.70 s gammaloop-nextest-core> 4: std[bcb96dfbba0ab899]::panicking::panic_handler::{closure#0}<unknown>
  120. 28.70 s gammaloop-nextest-core> at <unknown source file>:<unknown line>
  121. 28.70 s gammaloop-nextest-core> 5: std[bcb96dfbba0ab899]::sys::backtrace::__rust_end_short_backtrace::<std[bcb96dfbba0ab899]::panicking::panic_handler::{closure#0}, !><unknown>
  122. 28.70 s gammaloop-nextest-core> at <unknown source file>:<unknown line>
  123. 28.70 s gammaloop-nextest-core> 6: __rustc[6c289b9f9c454d21]::rust_begin_unwind<unknown>
  124. 28.70 s gammaloop-nextest-core> at <unknown source file>:<unknown line>
  125. 28.70 s gammaloop-nextest-core> 7: core[940e698046960fd5]::panicking::panic_fmt<unknown>
  126. 28.70 s gammaloop-nextest-core> at <unknown source file>:<unknown line>
  127. 28.70 s gammaloop-nextest-core> 8: insta[307a548ac79ef4d9]::runtime::assert_snapshot<unknown>
  128. 28.70 s gammaloop-nextest-core> at <unknown source file>:<unknown line>
  129. 28.70 s gammaloop-nextest-core> 9: <test_renormalization[9b33d9b78f5a79c8]::finit_part_ghlo::{closure#0} as core[940e698046960fd5]::ops::function::FnOnce<()>>::call_once<unknown>
  130. 28.70 s gammaloop-nextest-core> at <unknown source file>:<unknown line>
  131. 28.70 s gammaloop-nextest-core> 10: test[75d6903177b1d7e9]::__rust_begin_short_backtrace::<core[940e698046960fd5]::result::Result<(), alloc[2ea6bcb46fca0c42]::string::String>, fn() -> core[940e698046960fd5]::result::Result<(), alloc[2ea6bcb46fca0c42]::string::String>><unknown>
  132. 28.70 s gammaloop-nextest-core> at <unknown source file>:<unknown line>
  133. 28.70 s gammaloop-nextest-core> 11: test[75d6903177b1d7e9]::run_test::{closure#0}<unknown>
  134. 28.70 s gammaloop-nextest-core> at <unknown source file>:<unknown line>
  135. 28.70 s gammaloop-nextest-core> 12: std[bcb96dfbba0ab899]::sys::backtrace::__rust_begin_short_backtrace::<test[75d6903177b1d7e9]::run_test::{closure#1}, ()><unknown>
  136. 28.70 s gammaloop-nextest-core> at <unknown source file>:<unknown line>
  137. 28.70 s gammaloop-nextest-core> 13: <std[bcb96dfbba0ab899]::thread::lifecycle::spawn_unchecked<test[75d6903177b1d7e9]::run_test::{closure#1}, ()>::{closure#1} as core[940e698046960fd5]::ops::function::FnOnce<()>>::call_once::{shim:vtable#0}<unknown>
  138. 28.70 s gammaloop-nextest-core> at <unknown source file>:<unknown line>
  139. 28.70 s gammaloop-nextest-core> 14: <std[bcb96dfbba0ab899]::sys::thread::unix::Thread>::new::thread_start<unknown>
  140. 28.70 s gammaloop-nextest-core> at <unknown source file>:<unknown line>
  141. 28.70 s gammaloop-nextest-core> 15: start_thread<unknown>
  142. 28.70 s gammaloop-nextest-core> at <unknown source file>:<unknown line>
  143. 28.70 s gammaloop-nextest-core> 16: __clone3<unknown>
  144. 28.70 s gammaloop-nextest-core> at <unknown source file>:<unknown line>
  145. 28.70 s gammaloop-nextest-core>
  146. 28.70 s gammaloop-nextest-core> Run with COLORBT_SHOW_HIDDEN=1 environment variable to disable frame filtering.
  147. 28.70 s gammaloop-nextest-core> Run with RUST_BACKTRACE=full to include source snippets.
  148. 28.70 s gammaloop-nextest-core>
  149. 31.74 s gammaloop-nextest-core> FAIL [ 3.372s] (451/456) gammalooprs::test_renormalization finite_part_ghost_2loop
  150. 31.82 s gammaloop-nextest-core> stdout ---
  151. 31.82 s gammaloop-nextest-core>
  152. 31.82 s gammaloop-nextest-core> running 1 test
  153. 31.82 s gammaloop-nextest-core> ━━━━━━━━━━━━━━━━━━━━━━━━━━━━━━━ Snapshot Summary ━━━━━━━━━━━━━━━━━━━━━━━━━━━━━━━
  154. 31.82 s gammaloop-nextest-core> Snapshot: finite_part_ghost_2loop-3
  155. 31.82 s gammaloop-nextest-core> Source: crates/gammalooprs/tests/test_renormalization.rs:464
  156. 31.82 s gammaloop-nextest-core> ────────────────────────────────────────────────────────────────────────────────
  157. 31.82 s gammaloop-nextest-core> Expression: align_to_rqft(&a, &model).to_bare_ordered_string()
  158. 31.82 s gammaloop-nextest-core> ────────────────────────────────────────────────────────────────────────────────
  159. 31.82 s gammaloop-nextest-core> -old snapshot
  160. 31.82 s gammaloop-nextest-core> +new results
  161. 31.82 s gammaloop-nextest-core> ────────────┬───────────────────────────────────────────────────────────────────
  162. 31.82 s gammaloop-nextest-core> 1 │-(-1𝑖/32*ε+1𝑖/16)*(cas(2,coad(8)))^2*dot(P(0,mink(4)),P(0,mink(4)))*gs^4*ε^(-2)
  163. 31.82 s gammaloop-nextest-core> 1 │+(-1𝑖/16+1𝑖/32*ε)*(cas(2,coad(8)))^2*dot(P(0,mink(4)),P(0,mink(4)))*gs^4*ε^(-2)
  164. 31.82 s gammaloop-nextest-core> ────────────┴───────────────────────────────────────────────────────────────────
  165. 31.82 s gammaloop-nextest-core> To update snapshots run `cargo insta review`
  166. 31.82 s gammaloop-nextest-core> Stopped on the first failure. Run `cargo insta test` to run all snapshots.
  167. 31.82 s gammaloop-nextest-core> test finite_part_ghost_2loop ... FAILED
  168. 31.82 s gammaloop-nextest-core>
  169. 31.82 s gammaloop-nextest-core> failures:
  170. 31.82 s gammaloop-nextest-core>
  171. 31.82 s gammaloop-nextest-core> failures:
  172. 31.82 s gammaloop-nextest-core> finite_part_ghost_2loop
  173. 31.82 s gammaloop-nextest-core>
  174. 31.82 s gammaloop-nextest-core> test result: FAILED. 0 passed; 1 failed; 0 ignored; 0 measured; 5 filtered out; finished in 3.36s
  175. 31.82 s gammaloop-nextest-core>
  176. 31.82 s gammaloop-nextest-core> stderr ---
  177. 31.82 s gammaloop-nextest-core> The application panicked (crashed).
  178. 31.82 s gammaloop-nextest-core> Message: snapshot assertion for 'finite_part_ghost_2loop-3' failed in line 464
  179. 31.82 s gammaloop-nextest-core> Location: /nix/store/30svmzr0z0zpcqjyynjn7w21wgx18y4b-vendor-cargo-deps/c19b7c6f923b580ac259164a89f2577984ad5ab09ee9d583b888f934adbbe8d0/insta-1.47.2/src/runtime.rs:719
  180. 31.82 s gammaloop-nextest-core>
  181. 31.82 s gammaloop-nextest-core> ━━━━━━━━━━━━━━━━━━━━━━━━━━━━━━━━━━ BACKTRACE ━━━━━━━━━━━━━━━━━━━━━━━━━━━━━━━━━━━
  182. 31.82 s gammaloop-nextest-core> 1: <color_eyre[51793ea62743adbd]::config::PanicHook>::panic_report<unknown>
  183. 31.82 s gammaloop-nextest-core> at <unknown source file>:<unknown line>
  184. 31.82 s gammaloop-nextest-core> 2: <color_eyre[51793ea62743adbd]::config::PanicHook>::into_panic_hook::{closure#0}<unknown>
  185. 31.82 s gammaloop-nextest-core> at <unknown source file>:<unknown line>
  186. 31.82 s gammaloop-nextest-core> 3: std[bcb96dfbba0ab899]::panicking::panic_with_hook<unknown>
  187. 31.82 s gammaloop-nextest-core> at <unknown source file>:<unknown line>
  188. 31.82 s gammaloop-nextest-core> 4: std[bcb96dfbba0ab899]::panicking::panic_handler::{closure#0}<unknown>
  189. 31.82 s gammaloop-nextest-core> at <unknown source file>:<unknown line>
  190. 31.82 s gammaloop-nextest-core> 5: std[bcb96dfbba0ab899]::sys::backtrace::__rust_end_short_backtrace::<std[bcb96dfbba0ab899]::panicking::panic_handler::{closure#0}, !><unknown>
  191. 31.82 s gammaloop-nextest-core> at <unknown source file>:<unknown line>
  192. 31.82 s gammaloop-nextest-core> 6: __rustc[6c289b9f9c454d21]::rust_begin_unwind<unknown>
  193. 31.82 s gammaloop-nextest-core> at <unknown source file>:<unknown line>
  194. 31.82 s gammaloop-nextest-core> 7: core[940e698046960fd5]::panicking::panic_fmt<unknown>
  195. 31.82 s gammaloop-nextest-core> at <unknown source file>:<unknown line>
  196. 31.82 s gammaloop-nextest-core> 8: insta[307a548ac79ef4d9]::runtime::assert_snapshot<unknown>
  197. 31.82 s gammaloop-nextest-core> at <unknown source file>:<unknown line>
  198. 31.82 s gammaloop-nextest-core> 9: test_renormalization[9b33d9b78f5a79c8]::finite_part_ghost_2loop<unknown>
  199. 31.82 s gammaloop-nextest-core> at <unknown source file>:<unknown line>
  200. 31.82 s gammaloop-nextest-core> 10: <test_renormalization[9b33d9b78f5a79c8]::finite_part_ghost_2loop::{closure#0} as core[940e698046960fd5]::ops::function::FnOnce<()>>::call_once<unknown>
  201. 31.82 s gammaloop-nextest-core> at <unknown source file>:<unknown line>
  202. 31.82 s gammaloop-nextest-core> 11: test[75d6903177b1d7e9]::__rust_begin_short_backtrace::<core[940e698046960fd5]::result::Result<(), alloc[2ea6bcb46fca0c42]::string::String>, fn() -> core[940e698046960fd5]::result::Result<(), alloc[2ea6bcb46fca0c42]::string::String>><unknown>
  203. 31.82 s gammaloop-nextest-core> at <unknown source file>:<unknown line>
  204. 31.82 s gammaloop-nextest-core> 12: test[75d6903177b1d7e9]::run_test::{closure#0}<unknown>
  205. 31.82 s gammaloop-nextest-core> at <unknown source file>:<unknown line>
  206. 31.82 s gammaloop-nextest-core> 13: std[bcb96dfbba0ab899]::sys::backtrace::__rust_begin_short_backtrace::<test[75d6903177b1d7e9]::run_test::{closure#1}, ()><unknown>
  207. 31.82 s gammaloop-nextest-core> at <unknown source file>:<unknown line>
  208. 31.82 s gammaloop-nextest-core> 14: <std[bcb96dfbba0ab899]::thread::lifecycle::spawn_unchecked<test[75d6903177b1d7e9]::run_test::{closure#1}, ()>::{closure#1} as core[940e698046960fd5]::ops::function::FnOnce<()>>::call_once::{shim:vtable#0}<unknown>
  209. 31.82 s gammaloop-nextest-core> at <unknown source file>:<unknown line>
  210. 31.82 s gammaloop-nextest-core> 15: <std[bcb96dfbba0ab899]::sys::thread::unix::Thread>::new::thread_start<unknown>
  211. 31.82 s gammaloop-nextest-core> at <unknown source file>:<unknown line>
  212. 31.82 s gammaloop-nextest-core> 16: start_thread<unknown>
  213. 31.82 s gammaloop-nextest-core> at <unknown source file>:<unknown line>
  214. 31.82 s gammaloop-nextest-core> 17: __clone3<unknown>
  215. 31.82 s gammaloop-nextest-core> at <unknown source file>:<unknown line>
  216. 31.82 s gammaloop-nextest-core>
  217. 31.82 s gammaloop-nextest-core> Run with COLORBT_SHOW_HIDDEN=1 environment variable to disable frame filtering.
  218. 31.82 s gammaloop-nextest-core> Run with RUST_BACKTRACE=full to include source snippets.
  219. 31.82 s gammaloop-nextest-core>
  220. 38.26 s gammaloop-nextest-core> ------------
  221. 38.29 s gammaloop-nextest-core> Summary [ 11.506s] 456 tests run: 454 passed, 2 failed, 61 skipped
  222. 38.29 s gammaloop-nextest-core> FAIL [ 0.349s] (443/456) gammalooprs::test_renormalization finit_part_ghlo
  223. 38.29 s gammaloop-nextest-core> stdout ---
  224. 38.29 s gammaloop-nextest-core>
  225. 38.29 s gammaloop-nextest-core> running 1 test
  226. 38.29 s gammaloop-nextest-core> ren part: 1/2*GC_10^2*dot(P(0,mink(dim)),P(0,mink(dim)))*cas(2,coad(8))/ε
  227. 38.29 s gammaloop-nextest-core> ━━━━━━━━━━━━━━━━━━━━━━━━━━━━━━━ Snapshot Summary ━━━━━━━━━━━━━━━━━━━━━━━━━━━━━━━
  228. 38.29 s gammaloop-nextest-core> Snapshot: finit_part_ghlo
  229. 38.29 s gammaloop-nextest-core> Source: crates/gammalooprs/tests/test_renormalization.rs:557
  230. 38.29 s gammaloop-nextest-core> ────────────────────────────────────────────────────────────────────────────────
  231. 38.29 s gammaloop-nextest-core> Expression: align_to_rqft(&a, &model).to_bare_ordered_string()
  232. 38.29 s gammaloop-nextest-core> ────────────────────────────────────────────────────────────────────────────────
  233. 38.29 s gammaloop-nextest-core> -old snapshot
  234. 38.29 s gammaloop-nextest-core> +new results
  235. 38.29 s gammaloop-nextest-core> ────────────┬───────────────────────────────────────────────────────────────────
  236. 38.29 s gammaloop-nextest-core> 1 │--1/2*cas(2,coad(8))*dot(P(0,mink(4)),P(0,mink(4)))*gs^2*ε^(-1)
  237. 38.29 s gammaloop-nextest-core> 1 │+1/2*cas(2,coad(8))*dot(P(0,mink(4)),P(0,mink(4)))*gs^2*ε^(-1)
  238. 38.29 s gammaloop-nextest-core> ────────────┴───────────────────────────────────────────────────────────────────
  239. 38.29 s gammaloop-nextest-core> To update snapshots run `cargo insta review`
  240. 38.29 s gammaloop-nextest-core> Stopped on the first failure. Run `cargo insta test` to run all snapshots.
  241. 38.29 s gammaloop-nextest-core> test finit_part_ghlo ... FAILED
  242. 38.29 s gammaloop-nextest-core>
  243. 38.29 s gammaloop-nextest-core> failures:
  244. 38.29 s gammaloop-nextest-core>
  245. 38.29 s gammaloop-nextest-core> failures:
  246. 38.29 s gammaloop-nextest-core> finit_part_ghlo
  247. 38.29 s gammaloop-nextest-core>
  248. 38.29 s gammaloop-nextest-core> test result: FAILED. 0 passed; 1 failed; 0 ignored; 0 measured; 5 filtered out; finished in 0.33s
  249. 38.29 s gammaloop-nextest-core>
  250. 38.29 s gammaloop-nextest-core> stderr ---
  251. 38.29 s gammaloop-nextest-core> The application panicked (crashed).
  252. 38.29 s gammaloop-nextest-core> Message: snapshot assertion for 'finit_part_ghlo' failed in line 557
  253. 38.29 s gammaloop-nextest-core> Location: /nix/store/30svmzr0z0zpcqjyynjn7w21wgx18y4b-vendor-cargo-deps/c19b7c6f923b580ac259164a89f2577984ad5ab09ee9d583b888f934adbbe8d0/insta-1.47.2/src/runtime.rs:719
  254. 38.29 s gammaloop-nextest-core>
  255. 38.29 s gammaloop-nextest-core> ━━━━━━━━━━━━━━━━━━━━━━━━━━━━━━━━━━ BACKTRACE ━━━━━━━━━━━━━━━━━━━━━━━━━━━━━━━━━━━
  256. 38.29 s gammaloop-nextest-core> 1: <color_eyre[51793ea62743adbd]::config::PanicHook>::panic_report<unknown>
  257. 38.29 s gammaloop-nextest-core> at <unknown source file>:<unknown line>
  258. 38.29 s gammaloop-nextest-core> 2: <color_eyre[51793ea62743adbd]::config::PanicHook>::into_panic_hook::{closure#0}<unknown>
  259. 38.29 s gammaloop-nextest-core> at <unknown source file>:<unknown line>
  260. 38.29 s gammaloop-nextest-core> 3: std[bcb96dfbba0ab899]::panicking::panic_with_hook<unknown>
  261. 38.29 s gammaloop-nextest-core> at <unknown source file>:<unknown line>
  262. 38.29 s gammaloop-nextest-core> 4: std[bcb96dfbba0ab899]::panicking::panic_handler::{closure#0}<unknown>
  263. 38.29 s gammaloop-nextest-core> at <unknown source file>:<unknown line>
  264. 38.29 s gammaloop-nextest-core> 5: std[bcb96dfbba0ab899]::sys::backtrace::__rust_end_short_backtrace::<std[bcb96dfbba0ab899]::panicking::panic_handler::{closure#0}, !><unknown>
  265. 38.29 s gammaloop-nextest-core> at <unknown source file>:<unknown line>
  266. 38.29 s gammaloop-nextest-core> 6: __rustc[6c289b9f9c454d21]::rust_begin_unwind<unknown>
  267. 38.29 s gammaloop-nextest-core> at <unknown source file>:<unknown line>
  268. 38.29 s gammaloop-nextest-core> 7: core[940e698046960fd5]::panicking::panic_fmt<unknown>
  269. 38.29 s gammaloop-nextest-core> at <unknown source file>:<unknown line>
  270. 38.29 s gammaloop-nextest-core> 8: insta[307a548ac79ef4d9]::runtime::assert_snapshot<unknown>
  271. 38.29 s gammaloop-nextest-core> at <unknown source file>:<unknown line>
  272. 38.29 s gammaloop-nextest-core> 9: <test_renormalization[9b33d9b78f5a79c8]::finit_part_ghlo::{closure#0} as core[940e698046960fd5]::ops::function::FnOnce<()>>::call_once<unknown>
  273. 38.29 s gammaloop-nextest-core> at <unknown source file>:<unknown line>
  274. 38.29 s gammaloop-nextest-core> 10: test[75d6903177b1d7e9]::__rust_begin_short_backtrace::<core[940e698046960fd5]::result::Result<(), alloc[2ea6bcb46fca0c42]::string::String>, fn() -> core[940e698046960fd5]::result::Result<(), alloc[2ea6bcb46fca0c42]::string::String>><unknown>
  275. 38.29 s gammaloop-nextest-core> at <unknown source file>:<unknown line>
  276. 38.29 s gammaloop-nextest-core> 11: test[75d6903177b1d7e9]::run_test::{closure#0}<unknown>
  277. 38.29 s gammaloop-nextest-core> at <unknown source file>:<unknown line>
  278. 38.29 s gammaloop-nextest-core> 12: std[bcb96dfbba0ab899]::sys::backtrace::__rust_begin_short_backtrace::<test[75d6903177b1d7e9]::run_test::{closure#1}, ()><unknown>
  279. 38.29 s gammaloop-nextest-core> at <unknown source file>:<unknown line>
  280. 38.29 s gammaloop-nextest-core> 13: <std[bcb96dfbba0ab899]::thread::lifecycle::spawn_unchecked<test[75d6903177b1d7e9]::run_test::{closure#1}, ()>::{closure#1} as core[940e698046960fd5]::ops::function::FnOnce<()>>::call_once::{shim:vtable#0}<unknown>
  281. 38.29 s gammaloop-nextest-core> at <unknown source file>:<unknown line>
  282. 38.29 s gammaloop-nextest-core> 14: <std[bcb96dfbba0ab899]::sys::thread::unix::Thread>::new::thread_start<unknown>
  283. 38.29 s gammaloop-nextest-core> at <unknown source file>:<unknown line>
  284. 38.29 s gammaloop-nextest-core> 15: start_thread<unknown>
  285. 38.29 s gammaloop-nextest-core> at <unknown source file>:<unknown line>
  286. 38.29 s gammaloop-nextest-core> 16: __clone3<unknown>
  287. 38.29 s gammaloop-nextest-core> at <unknown source file>:<unknown line>
  288. 38.29 s gammaloop-nextest-core>
  289. 38.29 s gammaloop-nextest-core> Run with COLORBT_SHOW_HIDDEN=1 environment variable to disable frame filtering.
  290. 38.29 s gammaloop-nextest-core> Run with RUST_BACKTRACE=full to include source snippets.
  291. 38.29 s gammaloop-nextest-core>
  292. 38.29 s gammaloop-nextest-core> FAIL [ 3.372s] (451/456) gammalooprs::test_renormalization finite_part_ghost_2loop
  293. 38.29 s gammaloop-nextest-core> stdout ---
  294. 38.29 s gammaloop-nextest-core>
  295. 38.29 s gammaloop-nextest-core> running 1 test
  296. 38.29 s gammaloop-nextest-core> ━━━━━━━━━━━━━━━━━━━━━━━━━━━━━━━ Snapshot Summary ━━━━━━━━━━━━━━━━━━━━━━━━━━━━━━━
  297. 38.29 s gammaloop-nextest-core> Snapshot: finite_part_ghost_2loop-3
  298. 38.29 s gammaloop-nextest-core> Source: crates/gammalooprs/tests/test_renormalization.rs:464
  299. 38.29 s gammaloop-nextest-core> ────────────────────────────────────────────────────────────────────────────────
  300. 38.29 s gammaloop-nextest-core> Expression: align_to_rqft(&a, &model).to_bare_ordered_string()
  301. 38.29 s gammaloop-nextest-core> ────────────────────────────────────────────────────────────────────────────────
  302. 38.29 s gammaloop-nextest-core> -old snapshot
  303. 38.29 s gammaloop-nextest-core> +new results
  304. 38.29 s gammaloop-nextest-core> ────────────┬───────────────────────────────────────────────────────────────────
  305. 38.29 s gammaloop-nextest-core> 1 │-(-1𝑖/32*ε+1𝑖/16)*(cas(2,coad(8)))^2*dot(P(0,mink(4)),P(0,mink(4)))*gs^4*ε^(-2)
  306. 38.29 s gammaloop-nextest-core> 1 │+(-1𝑖/16+1𝑖/32*ε)*(cas(2,coad(8)))^2*dot(P(0,mink(4)),P(0,mink(4)))*gs^4*ε^(-2)
  307. 38.29 s gammaloop-nextest-core> ────────────┴───────────────────────────────────────────────────────────────────
  308. 38.29 s gammaloop-nextest-core> To update snapshots run `cargo insta review`
  309. 38.29 s gammaloop-nextest-core> Stopped on the first failure. Run `cargo insta test` to run all snapshots.
  310. 38.29 s gammaloop-nextest-core> test finite_part_ghost_2loop ... FAILED
  311. 38.29 s gammaloop-nextest-core>
  312. 38.29 s gammaloop-nextest-core> failures:
  313. 38.29 s gammaloop-nextest-core>
  314. 38.29 s gammaloop-nextest-core> failures:
  315. 38.29 s gammaloop-nextest-core> finite_part_ghost_2loop
  316. 38.29 s gammaloop-nextest-core>
  317. 38.29 s gammaloop-nextest-core> test result: FAILED. 0 passed; 1 failed; 0 ignored; 0 measured; 5 filtered out; finished in 3.36s
  318. 38.29 s gammaloop-nextest-core>
  319. 38.29 s gammaloop-nextest-core> stderr ---
  320. 38.29 s gammaloop-nextest-core> The application panicked (crashed).
  321. 38.29 s gammaloop-nextest-core> Message: snapshot assertion for 'finite_part_ghost_2loop-3' failed in line 464
  322. 38.29 s gammaloop-nextest-core> Location: /nix/store/30svmzr0z0zpcqjyynjn7w21wgx18y4b-vendor-cargo-deps/c19b7c6f923b580ac259164a89f2577984ad5ab09ee9d583b888f934adbbe8d0/insta-1.47.2/src/runtime.rs:719
  323. 38.29 s gammaloop-nextest-core>
  324. 38.29 s gammaloop-nextest-core> ━━━━━━━━━━━━━━━━━━━━━━━━━━━━━━━━━━ BACKTRACE ━━━━━━━━━━━━━━━━━━━━━━━━━━━━━━━━━━━
  325. 38.29 s gammaloop-nextest-core> 1: <color_eyre[51793ea62743adbd]::config::PanicHook>::panic_report<unknown>
  326. 38.29 s gammaloop-nextest-core> at <unknown source file>:<unknown line>
  327. 38.29 s gammaloop-nextest-core> 2: <color_eyre[51793ea62743adbd]::config::PanicHook>::into_panic_hook::{closure#0}<unknown>
  328. 38.29 s gammaloop-nextest-core> at <unknown source file>:<unknown line>
  329. 38.29 s gammaloop-nextest-core> 3: std[bcb96dfbba0ab899]::panicking::panic_with_hook<unknown>
  330. 38.29 s gammaloop-nextest-core> at <unknown source file>:<unknown line>
  331. 38.29 s gammaloop-nextest-core> 4: std[bcb96dfbba0ab899]::panicking::panic_handler::{closure#0}<unknown>
  332. 38.29 s gammaloop-nextest-core> at <unknown source file>:<unknown line>
  333. 38.29 s gammaloop-nextest-core> 5: std[bcb96dfbba0ab899]::sys::backtrace::__rust_end_short_backtrace::<std[bcb96dfbba0ab899]::panicking::panic_handler::{closure#0}, !><unknown>
  334. 38.29 s gammaloop-nextest-core> at <unknown source file>:<unknown line>
  335. 38.29 s gammaloop-nextest-core> 6: __rustc[6c289b9f9c454d21]::rust_begin_unwind<unknown>
  336. 38.29 s gammaloop-nextest-core> at <unknown source file>:<unknown line>
  337. 38.29 s gammaloop-nextest-core> 7: core[940e698046960fd5]::panicking::panic_fmt<unknown>
  338. 38.29 s gammaloop-nextest-core> at <unknown source file>:<unknown line>
  339. 38.29 s gammaloop-nextest-core> 8: insta[307a548ac79ef4d9]::runtime::assert_snapshot<unknown>
  340. 38.29 s gammaloop-nextest-core> at <unknown source file>:<unknown line>
  341. 38.29 s gammaloop-nextest-core> 9: test_renormalization[9b33d9b78f5a79c8]::finite_part_ghost_2loop<unknown>
  342. 38.29 s gammaloop-nextest-core> at <unknown source file>:<unknown line>
  343. 38.29 s gammaloop-nextest-core> 10: <test_renormalization[9b33d9b78f5a79c8]::finite_part_ghost_2loop::{closure#0} as core[940e698046960fd5]::ops::function::FnOnce<()>>::call_once<unknown>
  344. 38.29 s gammaloop-nextest-core> at <unknown source file>:<unknown line>
  345. 38.29 s gammaloop-nextest-core> 11: test[75d6903177b1d7e9]::__rust_begin_short_backtrace::<core[940e698046960fd5]::result::Result<(), alloc[2ea6bcb46fca0c42]::string::String>, fn() -> core[940e698046960fd5]::result::Result<(), alloc[2ea6bcb46fca0c42]::string::String>><unknown>
  346. 38.29 s gammaloop-nextest-core> at <unknown source file>:<unknown line>
  347. 38.29 s gammaloop-nextest-core> 12: test[75d6903177b1d7e9]::run_test::{closure#0}<unknown>
  348. 38.29 s gammaloop-nextest-core> at <unknown source file>:<unknown line>
  349. 38.29 s gammaloop-nextest-core> 13: std[bcb96dfbba0ab899]::sys::backtrace::__rust_begin_short_backtrace::<test[75d6903177b1d7e9]::run_test::{closure#1}, ()><unknown>
  350. 38.29 s gammaloop-nextest-core> at <unknown source file>:<unknown line>
  351. 38.29 s gammaloop-nextest-core> 14: <std[bcb96dfbba0ab899]::thread::lifecycle::spawn_unchecked<test[75d6903177b1d7e9]::run_test::{closure#1}, ()>::{closure#1} as core[940e698046960fd5]::ops::function::FnOnce<()>>::call_once::{shim:vtable#0}<unknown>
  352. 38.29 s gammaloop-nextest-core> at <unknown source file>:<unknown line>
  353. 38.29 s gammaloop-nextest-core> 15: <std[bcb96dfbba0ab899]::sys::thread::unix::Thread>::new::thread_start<unknown>
  354. 38.29 s gammaloop-nextest-core> at <unknown source file>:<unknown line>
  355. 38.29 s gammaloop-nextest-core> 16: start_thread<unknown>
  356. 38.29 s gammaloop-nextest-core> at <unknown source file>:<unknown line>
  357. 38.29 s gammaloop-nextest-core> 17: __clone3<unknown>
  358. 38.29 s gammaloop-nextest-core> at <unknown source file>:<unknown line>
  359. 38.29 s gammaloop-nextest-core>
  360. 38.29 s gammaloop-nextest-core> Run with COLORBT_SHOW_HIDDEN=1 environment variable to disable frame filtering.
  361. 38.29 s gammaloop-nextest-core> Run with RUST_BACKTRACE=full to include source snippets.
  362. 38.29 s gammaloop-nextest-core>
  363. 38.32 s gammaloop-nextest-core> error: test run failed
  364. 38.35 s gammaloop-nextest-core>
  365. 38.35 s gammaloop-nextest-core> ========== nextest test summary ==========
  366. 38.35 s gammaloop-nextest-core> report: target/nextest/ci_gammaloop/junit.xml
  367. 38.35 s gammaloop-nextest-core> tests: 456, failures: 2, errors: 0
  368. 38.35 s gammaloop-nextest-core>
  369. 38.35 s gammaloop-nextest-core> 1. gammalooprs::test_renormalization::finit_part_ghlo
  370. 38.35 s gammaloop-nextest-core> failure: test failure with exit code 101
  371. 38.35 s gammaloop-nextest-core> system-out
  372. 38.35 s gammaloop-nextest-core> running 1 test
  373. 38.35 s gammaloop-nextest-core> ren part: 1/2*GC_10^2*dot(P(0,mink(dim)),P(0,mink(dim)))*cas(2,coad(8))/ε
  374. 38.35 s gammaloop-nextest-core> ━━━━━━━━━━━━━━━━━━━━━━━━━━━━━━━ Snapshot Summary ━━━━━━━━━━━━━━━━━━━━━━━━━━━━━━━
  375. 38.35 s gammaloop-nextest-core> Snapshot: finit_part_ghlo
  376. 38.35 s gammaloop-nextest-core> Source: crates/gammalooprs/tests/test_renormalization.rs:557
  377. 38.35 s gammaloop-nextest-core> ────────────────────────────────────────────────────────────────────────────────
  378. 38.35 s gammaloop-nextest-core> Expression: align_to_rqft(&a, &model).to_bare_ordered_string()
  379. 38.35 s gammaloop-nextest-core> ────────────────────────────────────────────────────────────────────────────────
  380. 38.35 s gammaloop-nextest-core> -old snapshot
  381. 38.35 s gammaloop-nextest-core> +new results
  382. 38.35 s gammaloop-nextest-core> ────────────┬───────────────────────────────────────────────────────────────────
  383. 38.35 s gammaloop-nextest-core> 1 │--1/2*cas(2,coad(8))*dot(P(0,mink(4)),P(0,mink(4)))*gs^2*ε^(-1)
  384. 38.35 s gammaloop-nextest-core> 1 │+1/2*cas(2,coad(8))*dot(P(0,mink(4)),P(0,mink(4)))*gs^2*ε^(-1)
  385. 38.35 s gammaloop-nextest-core> ────────────┴───────────────────────────────────────────────────────────────────
  386. 38.35 s gammaloop-nextest-core> To update snapshots run `cargo insta review`
  387. 38.35 s gammaloop-nextest-core> Stopped on the first failure. Run `cargo insta test` to run all snapshots.
  388. 38.35 s gammaloop-nextest-core> test finit_part_ghlo ... FAILED
  389. 38.35 s gammaloop-nextest-core>
  390. 38.35 s gammaloop-nextest-core> failures:
  391. 38.35 s gammaloop-nextest-core>
  392. 38.35 s gammaloop-nextest-core> failures:
  393. 38.35 s gammaloop-nextest-core> finit_part_ghlo
  394. 38.35 s gammaloop-nextest-core>
  395. 38.35 s gammaloop-nextest-core> test result: FAILED. 0 passed; 1 failed; 0 ignored; 0 measured; 5 filtered out; finished in 0.33s
  396. 38.35 s gammaloop-nextest-core> system-err
  397. 38.35 s gammaloop-nextest-core> The application panicked (crashed).
  398. 38.35 s gammaloop-nextest-core> Message: snapshot assertion for 'finit_part_ghlo' failed in line 557
  399. 38.35 s gammaloop-nextest-core> Location: /nix/store/30svmzr0z0zpcqjyynjn7w21wgx18y4b-vendor-cargo-deps/c19b7c6f923b580ac259164a89f2577984ad5ab09ee9d583b888f934adbbe8d0/insta-1.47.2/src/runtime.rs:719
  400. 38.35 s gammaloop-nextest-core>
  401. 38.35 s gammaloop-nextest-core> ━━━━━━━━━━━━━━━━━━━━━━━━━━━━━━━━━━ BACKTRACE ━━━━━━━━━━━━━━━━━━━━━━━━━━━━━━━━━━━
  402. 38.35 s gammaloop-nextest-core> 1: <color_eyre[51793ea62743adbd]::config::PanicHook>::panic_report<unknown>
  403. 38.35 s gammaloop-nextest-core> at <unknown source file>:<unknown line>
  404. 38.35 s gammaloop-nextest-core> 2: <color_eyre[51793ea62743adbd]::config::PanicHook>::into_panic_hook::{closure#0}<unknown>
  405. 38.35 s gammaloop-nextest-core> at <unknown source file>:<unknown line>
  406. 38.35 s gammaloop-nextest-core> 3: std[bcb96dfbba0ab899]::panicking::panic_with_hook<unknown>
  407. 38.35 s gammaloop-nextest-core> at <unknown source file>:<unknown line>
  408. 38.35 s gammaloop-nextest-core> 4: std[bcb96dfbba0ab899]::panicking::panic_handler::{closure#0}<unknown>
  409. 38.35 s gammaloop-nextest-core> at <unknown source file>:<unknown line>
  410. 38.35 s gammaloop-nextest-core> 5: std[bcb96dfbba0ab899]::sys::backtrace::__rust_end_short_backtrace::<std[bcb96dfbba0ab899]::panicking::panic_handler::{closure#0}, !><unknown>
  411. 38.35 s gammaloop-nextest-core> at <unknown source file>:<unknown line>
  412. 38.35 s gammaloop-nextest-core> 6: __rustc[6c289b9f9c454d21]::rust_begin_unwind<unknown>
  413. 38.35 s gammaloop-nextest-core> at <unknown source file>:<unknown line>
  414. 38.35 s gammaloop-nextest-core> 7: core[940e698046960fd5]::panicking::panic_fmt<unknown>
  415. 38.35 s gammaloop-nextest-core> at <unknown source file>:<unknown line>
  416. 38.35 s gammaloop-nextest-core> 8: insta[307a548ac79ef4d9]::runtime::assert_snapshot<unknown>
  417. 38.35 s gammaloop-nextest-core> at <unknown source file>:<unknown line>
  418. 38.35 s gammaloop-nextest-core> 9: <test_renormalization[9b33d9b78f5a79c8]::finit_part_ghlo::{closure#0} as core[940e698046960fd5]::ops::function::FnOnce<()>>::call_once<unknown>
  419. 38.35 s gammaloop-nextest-core> at <unknown source file>:<unknown line>
  420. 38.35 s gammaloop-nextest-core> 10: test[75d6903177b1d7e9]::__rust_begin_short_backtrace::<core[940e698046960fd5]::result::Result<(), alloc[2ea6bcb46fca0c42]::string::String>, fn() -> core[940e698046960fd5]::result::Result<(), alloc[2ea6bcb46fca0c42]::string::String>><unknown>
  421. 38.35 s gammaloop-nextest-core> at <unknown source file>:<unknown line>
  422. 38.35 s gammaloop-nextest-core> 11: test[75d6903177b1d7e9]::run_test::{closure#0}<unknown>
  423. 38.35 s gammaloop-nextest-core> at <unknown source file>:<unknown line>
  424. 38.35 s gammaloop-nextest-core> 12: std[bcb96dfbba0ab899]::sys::backtrace::__rust_begin_short_backtrace::<test[75d6903177b1d7e9]::run_test::{closure#1}, ()><unknown>
  425. 38.35 s gammaloop-nextest-core> at <unknown source file>:<unknown line>
  426. 38.35 s gammaloop-nextest-core> 13: <std[bcb96dfbba0ab899]::thread::lifecycle::spawn_unchecked<test[75d6903177b1d7e9]::run_test::{closure#1}, ()>::{closure#1} as core[940e698046960fd5]::ops::function::FnOnce<()>>::call_once::{shim:vtable#0}<unknown>
  427. 38.35 s gammaloop-nextest-core> at <unknown source file>:<unknown line>
  428. 38.35 s gammaloop-nextest-core> 14: <std[bcb96dfbba0ab899]::sys::thread::unix::Thread>::new::thread_start<unknown>
  429. 38.35 s gammaloop-nextest-core> at <unknown source file>:<unknown line>
  430. 38.35 s gammaloop-nextest-core> 15: start_thread<unknown>
  431. 38.35 s gammaloop-nextest-core> at <unknown source file>:<unknown line>
  432. 38.35 s gammaloop-nextest-core> 16: __clone3<unknown>
  433. 38.35 s gammaloop-nextest-core> at <unknown source file>:<unknown line>
  434. 38.35 s gammaloop-nextest-core>
  435. 38.35 s gammaloop-nextest-core> Run with COLORBT_SHOW_HIDDEN=1 environment variable to disable frame filtering.
  436. 38.35 s gammaloop-nextest-core> Run with RUST_BACKTRACE=full to include source snippets.
  437. 38.35 s gammaloop-nextest-core>
  438. 38.35 s gammaloop-nextest-core> 2. gammalooprs::test_renormalization::finite_part_ghost_2loop
  439. 38.35 s gammaloop-nextest-core> failure: test failure with exit code 101
  440. 38.35 s gammaloop-nextest-core> system-out
  441. 38.35 s gammaloop-nextest-core> running 1 test
  442. 38.35 s gammaloop-nextest-core> ━━━━━━━━━━━━━━━━━━━━━━━━━━━━━━━ Snapshot Summary ━━━━━━━━━━━━━━━━━━━━━━━━━━━━━━━
  443. 38.35 s gammaloop-nextest-core> Snapshot: finite_part_ghost_2loop-3
  444. 38.35 s gammaloop-nextest-core> Source: crates/gammalooprs/tests/test_renormalization.rs:464
  445. 38.35 s gammaloop-nextest-core> ────────────────────────────────────────────────────────────────────────────────
  446. 38.35 s gammaloop-nextest-core> Expression: align_to_rqft(&a, &model).to_bare_ordered_string()
  447. 38.35 s gammaloop-nextest-core> ────────────────────────────────────────────────────────────────────────────────
  448. 38.35 s gammaloop-nextest-core> -old snapshot
  449. 38.35 s gammaloop-nextest-core> +new results
  450. 38.35 s gammaloop-nextest-core> ────────────┬───────────────────────────────────────────────────────────────────
  451. 38.35 s gammaloop-nextest-core> 1 │-(-1𝑖/32*ε+1𝑖/16)*(cas(2,coad(8)))^2*dot(P(0,mink(4)),P(0,mink(4)))*gs^4*ε^(-2)
  452. 38.35 s gammaloop-nextest-core> 1 │+(-1𝑖/16+1𝑖/32*ε)*(cas(2,coad(8)))^2*dot(P(0,mink(4)),P(0,mink(4)))*gs^4*ε^(-2)
  453. 38.35 s gammaloop-nextest-core> ────────────┴───────────────────────────────────────────────────────────────────
  454. 38.35 s gammaloop-nextest-core> To update snapshots run `cargo insta review`
  455. 38.35 s gammaloop-nextest-core> Stopped on the first failure. Run `cargo insta test` to run all snapshots.
  456. 38.35 s gammaloop-nextest-core> test finite_part_ghost_2loop ... FAILED
  457. 38.35 s gammaloop-nextest-core>
  458. 38.35 s gammaloop-nextest-core> failures:
  459. 38.35 s gammaloop-nextest-core>
  460. 38.35 s gammaloop-nextest-core> failures:
  461. 38.35 s gammaloop-nextest-core> finite_part_ghost_2loop
  462. 38.35 s gammaloop-nextest-core>
  463. 38.35 s gammaloop-nextest-core> test result: FAILED. 0 passed; 1 failed; 0 ignored; 0 measured; 5 filtered out; finished in 3.36s
  464. 38.35 s gammaloop-nextest-core> system-err
  465. 38.35 s gammaloop-nextest-core> The application panicked (crashed).
  466. 38.35 s gammaloop-nextest-core> Message: snapshot assertion for 'finite_part_ghost_2loop-3' failed in line 464
  467. 38.35 s gammaloop-nextest-core> Location: /nix/store/30svmzr0z0zpcqjyynjn7w21wgx18y4b-vendor-cargo-deps/c19b7c6f923b580ac259164a89f2577984ad5ab09ee9d583b888f934adbbe8d0/insta-1.47.2/src/runtime.rs:719
  468. 38.35 s gammaloop-nextest-core>
  469. 38.35 s gammaloop-nextest-core> ━━━━━━━━━━━━━━━━━━━━━━━━━━━━━━━━━━ BACKTRACE ━━━━━━━━━━━━━━━━━━━━━━━━━━━━━━━━━━━
  470. 38.35 s gammaloop-nextest-core> 1: <color_eyre[51793ea62743adbd]::config::PanicHook>::panic_report<unknown>
  471. 38.35 s gammaloop-nextest-core> at <unknown source file>:<unknown line>
  472. 38.35 s gammaloop-nextest-core> 2: <color_eyre[51793ea62743adbd]::config::PanicHook>::into_panic_hook::{closure#0}<unknown>
  473. 38.35 s gammaloop-nextest-core> at <unknown source file>:<unknown line>
  474. 38.35 s gammaloop-nextest-core> 3: std[bcb96dfbba0ab899]::panicking::panic_with_hook<unknown>
  475. 38.35 s gammaloop-nextest-core> at <unknown source file>:<unknown line>
  476. 38.35 s gammaloop-nextest-core> 4: std[bcb96dfbba0ab899]::panicking::panic_handler::{closure#0}<unknown>
  477. 38.35 s gammaloop-nextest-core> at <unknown source file>:<unknown line>
  478. 38.35 s gammaloop-nextest-core> 5: std[bcb96dfbba0ab899]::sys::backtrace::__rust_end_short_backtrace::<std[bcb96dfbba0ab899]::panicking::panic_handler::{closure#0}, !><unknown>
  479. 38.35 s gammaloop-nextest-core> at <unknown source file>:<unknown line>
  480. 38.35 s gammaloop-nextest-core> 6: __rustc[6c289b9f9c454d21]::rust_begin_unwind<unknown>
  481. 38.35 s gammaloop-nextest-core> at <unknown source file>:<unknown line>
  482. 38.35 s gammaloop-nextest-core> 7: core[940e698046960fd5]::panicking::panic_fmt<unknown>
  483. 38.35 s gammaloop-nextest-core> at <unknown source file>:<unknown line>
  484. 38.35 s gammaloop-nextest-core> 8: insta[307a548ac79ef4d9]::runtime::assert_snapshot<unknown>
  485. 38.35 s gammaloop-nextest-core> at <unknown source file>:<unknown line>
  486. 38.35 s gammaloop-nextest-core> 9: test_renormalization[9b33d9b78f5a79c8]::finite_part_ghost_2loop<unknown>
  487. 38.35 s gammaloop-nextest-core> at <unknown source file>:<unknown line>
  488. 38.35 s gammaloop-nextest-core> 10: <test_renormalization[9b33d9b78f5a79c8]::finite_part_ghost_2loop::{closure#0} as core[940e698046960fd5]::ops::function::FnOnce<()>>::call_once<unknown>
  489. 38.35 s gammaloop-nextest-core> at <unknown source file>:<unknown line>
  490. 38.35 s gammaloop-nextest-core> 11: test[75d6903177b1d7e9]::__rust_begin_short_backtrace::<core[940e698046960fd5]::result::Result<(), alloc[2ea6bcb46fca0c42]::string::String>, fn() -> core[940e698046960fd5]::result::Result<(), alloc[2ea6bcb46fca0c42]::string::String>><unknown>
  491. 38.35 s gammaloop-nextest-core> at <unknown source file>:<unknown line>
  492. 38.35 s gammaloop-nextest-core> 12: test[75d6903177b1d7e9]::run_test::{closure#0}<unknown>
  493. 38.35 s gammaloop-nextest-core> at <unknown source file>:<unknown line>
  494. 38.35 s gammaloop-nextest-core> 13: std[bcb96dfbba0ab899]::sys::backtrace::__rust_begin_short_backtrace::<test[75d6903177b1d7e9]::run_test::{closure#1}, ()><unknown>
  495. 38.35 s gammaloop-nextest-core> at <unknown source file>:<unknown line>
  496. 38.35 s gammaloop-nextest-core> 14: <std[bcb96dfbba0ab899]::thread::lifecycle::spawn_unchecked<test[75d6903177b1d7e9]::run_test::{closure#1}, ()>::{closure#1} as core[940e698046960fd5]::ops::function::FnOnce<()>>::call_once::{shim:vtable#0}<unknown>
  497. 38.35 s gammaloop-nextest-core> at <unknown source file>:<unknown line>
  498. 38.35 s gammaloop-nextest-core> 15: <std[bcb96dfbba0ab899]::sys::thread::unix::Thread>::new::thread_start<unknown>
  499. 38.35 s gammaloop-nextest-core> at <unknown source file>:<unknown line>
  500. 38.35 s gammaloop-nextest-core> 16: start_thread<unknown>
  501. 38.35 s gammaloop-nextest-core> at <unknown source file>:<unknown line>
  502. 38.35 s gammaloop-nextest-core> 17: __clone3<unknown>
  503. 38.35 s gammaloop-nextest-core> at <unknown source file>:<unknown line>
  504. 38.35 s gammaloop-nextest-core>
  505. 38.35 s gammaloop-nextest-core> Run with COLORBT_SHOW_HIDDEN=1 environment variable to disable frame filtering.
  506. 38.35 s gammaloop-nextest-core> Run with RUST_BACKTRACE=full to include source snippets.
  507. 38.35 s gammaloop-nextest-core> =========================================
  508. 38.41 s error: Cannot build '/nix/store/xv6l7wp14z4xm05gkaqsp0kipvyasvyi-gammaloop-nextest-core.drv'.
  509. 38.41 s Reason: builder failed with exit code 100.
  510. 38.41 s Output paths:
  511. 38.41 s /nix/store/g869clijr55vrmm4yficyx8bc82mc3as-gammaloop-nextest-core
  512. 38.41 s Last 473 log lines:
  513. 38.41 s > Extracting 3 binaries (including 1 non-test binary), 1 build script output directory, and 2 linked paths to /build/nextest-archive-rrQu5m
  514. 38.41 s > Extracted 18 files to /build/nextest-archive-rrQu5m in 0.49s
  515. 38.41 s > ------------
  516. 38.41 s > Nextest run ID de47d34f-aef8-49f8-bd10-45c54fb310d4 with nextest profile: ci_gammaloop
  517. 38.41 s > Starting 339 tests across 2 binaries
  518. 38.41 s > ------------
  519. 38.41 s > Summary [ 0.737s] 339 tests run: 339 passed, 0 skipped
  520. 38.41 s >
  521. 38.41 s > ========== nextest test summary ==========
  522. 38.41 s > report: target/nextest/ci_gammaloop/junit.xml
  523. 38.41 s > tests: 339, failures: 0, errors: 0
  524. 38.41 s > No failing testcases found.
  525. 38.41 s > =========================================
  526. 38.41 s > Extracting 1 binary and 1 linked path to /build/nextest-archive-9jeTlM
  527. 38.41 s > Extracted 7 files to /build/nextest-archive-9jeTlM in 0.07s
  528. 38.41 s > ------------
  529. 38.41 s > Nextest run ID d99e264e-ef4c-4aa5-850a-3308dba41ac1 with nextest profile: ci_gammaloop
  530. 38.41 s > Starting 19 tests across 1 binary
  531. 38.41 s > ------------
  532. 38.41 s > Summary [ 0.055s] 19 tests run: 19 passed, 0 skipped
  533. 38.41 s >
  534. 38.41 s > ========== nextest test summary ==========
  535. 38.41 s > report: target/nextest/ci_gammaloop/junit.xml
  536. 38.41 s > tests: 19, failures: 0, errors: 0
  537. 38.41 s > No failing testcases found.
  538. 38.41 s > =========================================
  539. 38.41 s > Extracting 1 binary to /build/nextest-archive-YMM6P1
  540. 38.41 s > Extracted 4 files to /build/nextest-archive-YMM6P1 in 0.04s
  541. 38.41 s > ------------
  542. 38.41 s > Nextest run ID bd5cc846-fa9f-4cba-824c-1a830928a54e with nextest profile: ci_gammaloop
  543. 38.41 s > Starting 0 tests across 1 binary
  544. 38.41 s > ------------
  545. 38.41 s > Summary [ 0.004s] 0 tests run: 0 passed, 0 skipped
  546. 38.41 s >
  547. 38.41 s > ========== nextest test summary ==========
  548. 38.41 s > report: target/nextest/ci_gammaloop/junit.xml
  549. 38.41 s > tests: 0, failures: 0, errors: 0
  550. 38.41 s > No failing testcases found.
  551. 38.41 s > =========================================
  552. 38.41 s > Extracting 4 binaries, 1 build script output directory, and 2 linked paths to /build/nextest-archive-uwsXLs
  553. 38.41 s > Extracted 18 files to /build/nextest-archive-uwsXLs in 0.55s
  554. 38.41 s > ------------
  555. 38.41 s > Nextest run ID 5b3bdee4-32a5-40a0-8622-db8bf808b00f with nextest profile: ci_gammaloop
  556. 38.41 s > Starting 456 tests across 4 binaries (61 tests skipped, including 60 tests via profile.ci_gammaloop.default-filter)
  557. 38.41 s > FAIL [ 0.349s] (443/456) gammalooprs::test_renormalization finit_part_ghlo
  558. 38.41 s > stdout ---
  559. 38.41 s >
  560. 38.41 s > running 1 test
  561. 38.41 s > ren part: 1/2*GC_10^2*dot(P(0,mink(dim)),P(0,mink(dim)))*cas(2,coad(8))/ε
  562. 38.41 s > ━━━━━━━━━━━━━━━━━━━━━━━━━━━━━━━ Snapshot Summary ━━━━━━━━━━━━━━━━━━━━━━━━━━━━━━━
  563. 38.41 s > Snapshot: finit_part_ghlo
  564. 38.41 s > Source: crates/gammalooprs/tests/test_renormalization.rs:557
  565. 38.41 s > ────────────────────────────────────────────────────────────────────────────────
  566. 38.41 s > Expression: align_to_rqft(&a, &model).to_bare_ordered_string()
  567. 38.41 s > ────────────────────────────────────────────────────────────────────────────────
  568. 38.41 s > -old snapshot
  569. 38.41 s > +new results
  570. 38.41 s > ────────────┬───────────────────────────────────────────────────────────────────
  571. 38.41 s > 1 │--1/2*cas(2,coad(8))*dot(P(0,mink(4)),P(0,mink(4)))*gs^2*ε^(-1)
  572. 38.41 s > 1 │+1/2*cas(2,coad(8))*dot(P(0,mink(4)),P(0,mink(4)))*gs^2*ε^(-1)
  573. 38.41 s > ────────────┴───────────────────────────────────────────────────────────────────
  574. 38.41 s > To update snapshots run `cargo insta review`
  575. 38.41 s > Stopped on the first failure. Run `cargo insta test` to run all snapshots.
  576. 38.41 s > test finit_part_ghlo ... FAILED
  577. 38.41 s >
  578. 38.41 s > failures:
  579. 38.41 s >
  580. 38.41 s > failures:
  581. 38.41 s > finit_part_ghlo
  582. 38.41 s >
  583. 38.41 s > test result: FAILED. 0 passed; 1 failed; 0 ignored; 0 measured; 5 filtered out; finished in 0.33s
  584. 38.41 s >
  585. 38.41 s > stderr ---
  586. 38.41 s > The application panicked (crashed).
  587. 38.41 s > Message: snapshot assertion for 'finit_part_ghlo' failed in line 557
  588. 38.41 s > Location: /nix/store/30svmzr0z0zpcqjyynjn7w21wgx18y4b-vendor-cargo-deps/c19b7c6f923b580ac259164a89f2577984ad5ab09ee9d583b888f934adbbe8d0/insta-1.47.2/src/runtime.rs:719
  589. 38.41 s >
  590. 38.41 s > ━━━━━━━━━━━━━━━━━━━━━━━━━━━━━━━━━━ BACKTRACE ━━━━━━━━━━━━━━━━━━━━━━━━━━━━━━━━━━━
  591. 38.41 s > 1: <color_eyre[51793ea62743adbd]::config::PanicHook>::panic_report<unknown>
  592. 38.41 s > at <unknown source file>:<unknown line>
  593. 38.41 s > 2: <color_eyre[51793ea62743adbd]::config::PanicHook>::into_panic_hook::{closure#0}<unknown>
  594. 38.41 s > at <unknown source file>:<unknown line>
  595. 38.41 s > 3: std[bcb96dfbba0ab899]::panicking::panic_with_hook<unknown>
  596. 38.41 s > at <unknown source file>:<unknown line>
  597. 38.41 s > 4: std[bcb96dfbba0ab899]::panicking::panic_handler::{closure#0}<unknown>
  598. 38.41 s > at <unknown source file>:<unknown line>
  599. 38.41 s > 5: std[bcb96dfbba0ab899]::sys::backtrace::__rust_end_short_backtrace::<std[bcb96dfbba0ab899]::panicking::panic_handler::{closure#0}, !><unknown>
  600. 38.41 s > at <unknown source file>:<unknown line>
  601. 38.41 s > 6: __rustc[6c289b9f9c454d21]::rust_begin_unwind<unknown>
  602. 38.41 s > at <unknown source file>:<unknown line>
  603. 38.41 s > 7: core[940e698046960fd5]::panicking::panic_fmt<unknown>
  604. 38.41 s > at <unknown source file>:<unknown line>
  605. 38.41 s > 8: insta[307a548ac79ef4d9]::runtime::assert_snapshot<unknown>
  606. 38.41 s > at <unknown source file>:<unknown line>
  607. 38.41 s > 9: <test_renormalization[9b33d9b78f5a79c8]::finit_part_ghlo::{closure#0} as core[940e698046960fd5]::ops::function::FnOnce<()>>::call_once<unknown>
  608. 38.41 s > at <unknown source file>:<unknown line>
  609. 38.41 s > 10: test[75d6903177b1d7e9]::__rust_begin_short_backtrace::<core[940e698046960fd5]::result::Result<(), alloc[2ea6bcb46fca0c42]::string::String>, fn() -> core[940e698046960fd5]::result::Result<(), alloc[2ea6bcb46fca0c42]::string::String>><unknown>
  610. 38.41 s > at <unknown source file>:<unknown line>
  611. 38.41 s > 11: test[75d6903177b1d7e9]::run_test::{closure#0}<unknown>
  612. 38.41 s > at <unknown source file>:<unknown line>
  613. 38.41 s > 12: std[bcb96dfbba0ab899]::sys::backtrace::__rust_begin_short_backtrace::<test[75d6903177b1d7e9]::run_test::{closure#1}, ()><unknown>
  614. 38.41 s > at <unknown source file>:<unknown line>
  615. 38.41 s > 13: <std[bcb96dfbba0ab899]::thread::lifecycle::spawn_unchecked<test[75d6903177b1d7e9]::run_test::{closure#1}, ()>::{closure#1} as core[940e698046960fd5]::ops::function::FnOnce<()>>::call_once::{shim:vtable#0}<unknown>
  616. 38.41 s > at <unknown source file>:<unknown line>
  617. 38.41 s > 14: <std[bcb96dfbba0ab899]::sys::thread::unix::Thread>::new::thread_start<unknown>
  618. 38.41 s > at <unknown source file>:<unknown line>
  619. 38.41 s > 15: start_thread<unknown>
  620. 38.41 s > at <unknown source file>:<unknown line>
  621. 38.41 s > 16: __clone3<unknown>
  622. 38.41 s > at <unknown source file>:<unknown line>
  623. 38.41 s >
  624. 38.41 s > Run with COLORBT_SHOW_HIDDEN=1 environment variable to disable frame filtering.
  625. 38.41 s > Run with RUST_BACKTRACE=full to include source snippets.
  626. 38.41 s >
  627. 38.41 s > FAIL [ 3.372s] (451/456) gammalooprs::test_renormalization finite_part_ghost_2loop
  628. 38.41 s > stdout ---
  629. 38.41 s >
  630. 38.41 s > running 1 test
  631. 38.41 s > ━━━━━━━━━━━━━━━━━━━━━━━━━━━━━━━ Snapshot Summary ━━━━━━━━━━━━━━━━━━━━━━━━━━━━━━━
  632. 38.41 s > Snapshot: finite_part_ghost_2loop-3
  633. 38.41 s > Source: crates/gammalooprs/tests/test_renormalization.rs:464
  634. 38.41 s > ────────────────────────────────────────────────────────────────────────────────
  635. 38.41 s > Expression: align_to_rqft(&a, &model).to_bare_ordered_string()
  636. 38.41 s > ────────────────────────────────────────────────────────────────────────────────
  637. 38.41 s > -old snapshot
  638. 38.41 s > +new results
  639. 38.41 s > ────────────┬───────────────────────────────────────────────────────────────────
  640. 38.41 s > 1 │-(-1𝑖/32*ε+1𝑖/16)*(cas(2,coad(8)))^2*dot(P(0,mink(4)),P(0,mink(4)))*gs^4*ε^(-2)
  641. 38.41 s > 1 │+(-1𝑖/16+1𝑖/32*ε)*(cas(2,coad(8)))^2*dot(P(0,mink(4)),P(0,mink(4)))*gs^4*ε^(-2)
  642. 38.41 s > ────────────┴───────────────────────────────────────────────────────────────────
  643. 38.41 s > To update snapshots run `cargo insta review`
  644. 38.41 s > Stopped on the first failure. Run `cargo insta test` to run all snapshots.
  645. 38.41 s > test finite_part_ghost_2loop ... FAILED
  646. 38.41 s >
  647. 38.41 s > failures:
  648. 38.41 s >
  649. 38.41 s > failures:
  650. 38.41 s > finite_part_ghost_2loop
  651. 38.41 s >
  652. 38.41 s > test result: FAILED. 0 passed; 1 failed; 0 ignored; 0 measured; 5 filtered out; finished in 3.36s
  653. 38.41 s >
  654. 38.41 s > stderr ---
  655. 38.41 s > The application panicked (crashed).
  656. 38.41 s > Message: snapshot assertion for 'finite_part_ghost_2loop-3' failed in line 464
  657. 38.41 s > Location: /nix/store/30svmzr0z0zpcqjyynjn7w21wgx18y4b-vendor-cargo-deps/c19b7c6f923b580ac259164a89f2577984ad5ab09ee9d583b888f934adbbe8d0/insta-1.47.2/src/runtime.rs:719
  658. 38.41 s >
  659. 38.41 s > ━━━━━━━━━━━━━━━━━━━━━━━━━━━━━━━━━━ BACKTRACE ━━━━━━━━━━━━━━━━━━━━━━━━━━━━━━━━━━━
  660. 38.41 s > 1: <color_eyre[51793ea62743adbd]::config::PanicHook>::panic_report<unknown>
  661. 38.41 s > at <unknown source file>:<unknown line>
  662. 38.41 s > 2: <color_eyre[51793ea62743adbd]::config::PanicHook>::into_panic_hook::{closure#0}<unknown>
  663. 38.41 s > at <unknown source file>:<unknown line>
  664. 38.41 s > 3: std[bcb96dfbba0ab899]::panicking::panic_with_hook<unknown>
  665. 38.41 s > at <unknown source file>:<unknown line>
  666. 38.41 s > 4: std[bcb96dfbba0ab899]::panicking::panic_handler::{closure#0}<unknown>
  667. 38.41 s > at <unknown source file>:<unknown line>
  668. 38.41 s > 5: std[bcb96dfbba0ab899]::sys::backtrace::__rust_end_short_backtrace::<std[bcb96dfbba0ab899]::panicking::panic_handler::{closure#0}, !><unknown>
  669. 38.41 s > at <unknown source file>:<unknown line>
  670. 38.41 s > 6: __rustc[6c289b9f9c454d21]::rust_begin_unwind<unknown>
  671. 38.41 s > at <unknown source file>:<unknown line>
  672. 38.41 s > 7: core[940e698046960fd5]::panicking::panic_fmt<unknown>
  673. 38.41 s > at <unknown source file>:<unknown line>
  674. 38.41 s > 8: insta[307a548ac79ef4d9]::runtime::assert_snapshot<unknown>
  675. 38.41 s > at <unknown source file>:<unknown line>
  676. 38.41 s > 9: test_renormalization[9b33d9b78f5a79c8]::finite_part_ghost_2loop<unknown>
  677. 38.41 s > at <unknown source file>:<unknown line>
  678. 38.41 s > 10: <test_renormalization[9b33d9b78f5a79c8]::finite_part_ghost_2loop::{closure#0} as core[940e698046960fd5]::ops::function::FnOnce<()>>::call_once<unknown>
  679. 38.41 s > at <unknown source file>:<unknown line>
  680. 38.41 s > 11: test[75d6903177b1d7e9]::__rust_begin_short_backtrace::<core[940e698046960fd5]::result::Result<(), alloc[2ea6bcb46fca0c42]::string::String>, fn() -> core[940e698046960fd5]::result::Result<(), alloc[2ea6bcb46fca0c42]::string::String>><unknown>
  681. 38.41 s > at <unknown source file>:<unknown line>
  682. 38.41 s > 12: test[75d6903177b1d7e9]::run_test::{closure#0}<unknown>
  683. 38.41 s > at <unknown source file>:<unknown line>
  684. 38.41 s > 13: std[bcb96dfbba0ab899]::sys::backtrace::__rust_begin_short_backtrace::<test[75d6903177b1d7e9]::run_test::{closure#1}, ()><unknown>
  685. 38.41 s > at <unknown source file>:<unknown line>
  686. 38.41 s > 14: <std[bcb96dfbba0ab899]::thread::lifecycle::spawn_unchecked<test[75d6903177b1d7e9]::run_test::{closure#1}, ()>::{closure#1} as core[940e698046960fd5]::ops::function::FnOnce<()>>::call_once::{shim:vtable#0}<unknown>
  687. 38.41 s > at <unknown source file>:<unknown line>
  688. 38.41 s > 15: <std[bcb96dfbba0ab899]::sys::thread::unix::Thread>::new::thread_start<unknown>
  689. 38.41 s > at <unknown source file>:<unknown line>
  690. 38.41 s > 16: start_thread<unknown>
  691. 38.41 s > at <unknown source file>:<unknown line>
  692. 38.41 s > 17: __clone3<unknown>
  693. 38.41 s > at <unknown source file>:<unknown line>
  694. 38.41 s >
  695. 38.41 s > Run with COLORBT_SHOW_HIDDEN=1 environment variable to disable frame filtering.
  696. 38.41 s > Run with RUST_BACKTRACE=full to include source snippets.
  697. 38.41 s >
  698. 38.41 s > ------------
  699. 38.41 s > Summary [ 11.506s] 456 tests run: 454 passed, 2 failed, 61 skipped
  700. 38.41 s > FAIL [ 0.349s] (443/456) gammalooprs::test_renormalization finit_part_ghlo
  701. 38.41 s > stdout ---
  702. 38.41 s >
  703. 38.41 s > running 1 test
  704. 38.41 s > ren part: 1/2*GC_10^2*dot(P(0,mink(dim)),P(0,mink(dim)))*cas(2,coad(8))/ε
  705. 38.41 s > ━━━━━━━━━━━━━━━━━━━━━━━━━━━━━━━ Snapshot Summary ━━━━━━━━━━━━━━━━━━━━━━━━━━━━━━━
  706. 38.41 s > Snapshot: finit_part_ghlo
  707. 38.41 s > Source: crates/gammalooprs/tests/test_renormalization.rs:557
  708. 38.41 s > ────────────────────────────────────────────────────────────────────────────────
  709. 38.41 s > Expression: align_to_rqft(&a, &model).to_bare_ordered_string()
  710. 38.41 s > ────────────────────────────────────────────────────────────────────────────────
  711. 38.41 s > -old snapshot
  712. 38.41 s > +new results
  713. 38.41 s > ────────────┬───────────────────────────────────────────────────────────────────
  714. 38.41 s > 1 │--1/2*cas(2,coad(8))*dot(P(0,mink(4)),P(0,mink(4)))*gs^2*ε^(-1)
  715. 38.41 s > 1 │+1/2*cas(2,coad(8))*dot(P(0,mink(4)),P(0,mink(4)))*gs^2*ε^(-1)
  716. 38.41 s > ────────────┴───────────────────────────────────────────────────────────────────
  717. 38.41 s > To update snapshots run `cargo insta review`
  718. 38.41 s > Stopped on the first failure. Run `cargo insta test` to run all snapshots.
  719. 38.41 s > test finit_part_ghlo ... FAILED
  720. 38.41 s >
  721. 38.41 s > failures:
  722. 38.41 s >
  723. 38.41 s > failures:
  724. 38.41 s > finit_part_ghlo
  725. 38.41 s >
  726. 38.41 s > test result: FAILED. 0 passed; 1 failed; 0 ignored; 0 measured; 5 filtered out; finished in 0.33s
  727. 38.41 s >
  728. 38.41 s > stderr ---
  729. 38.41 s > The application panicked (crashed).
  730. 38.41 s > Message: snapshot assertion for 'finit_part_ghlo' failed in line 557
  731. 38.41 s > Location: /nix/store/30svmzr0z0zpcqjyynjn7w21wgx18y4b-vendor-cargo-deps/c19b7c6f923b580ac259164a89f2577984ad5ab09ee9d583b888f934adbbe8d0/insta-1.47.2/src/runtime.rs:719
  732. 38.41 s >
  733. 38.41 s > ━━━━━━━━━━━━━━━━━━━━━━━━━━━━━━━━━━ BACKTRACE ━━━━━━━━━━━━━━━━━━━━━━━━━━━━━━━━━━━
  734. 38.41 s > 1: <color_eyre[51793ea62743adbd]::config::PanicHook>::panic_report<unknown>
  735. 38.41 s > at <unknown source file>:<unknown line>
  736. 38.41 s > 2: <color_eyre[51793ea62743adbd]::config::PanicHook>::into_panic_hook::{closure#0}<unknown>
  737. 38.41 s > at <unknown source file>:<unknown line>
  738. 38.41 s > 3: std[bcb96dfbba0ab899]::panicking::panic_with_hook<unknown>
  739. 38.41 s > at <unknown source file>:<unknown line>
  740. 38.41 s > 4: std[bcb96dfbba0ab899]::panicking::panic_handler::{closure#0}<unknown>
  741. 38.41 s > at <unknown source file>:<unknown line>
  742. 38.41 s > 5: std[bcb96dfbba0ab899]::sys::backtrace::__rust_end_short_backtrace::<std[bcb96dfbba0ab899]::panicking::panic_handler::{closure#0}, !><unknown>
  743. 38.41 s > at <unknown source file>:<unknown line>
  744. 38.41 s > 6: __rustc[6c289b9f9c454d21]::rust_begin_unwind<unknown>
  745. 38.41 s > at <unknown source file>:<unknown line>
  746. 38.41 s > 7: core[940e698046960fd5]::panicking::panic_fmt<unknown>
  747. 38.41 s > at <unknown source file>:<unknown line>
  748. 38.41 s > 8: insta[307a548ac79ef4d9]::runtime::assert_snapshot<unknown>
  749. 38.41 s > at <unknown source file>:<unknown line>
  750. 38.41 s > 9: <test_renormalization[9b33d9b78f5a79c8]::finit_part_ghlo::{closure#0} as core[940e698046960fd5]::ops::function::FnOnce<()>>::call_once<unknown>
  751. 38.41 s > at <unknown source file>:<unknown line>
  752. 38.41 s > 10: test[75d6903177b1d7e9]::__rust_begin_short_backtrace::<core[940e698046960fd5]::result::Result<(), alloc[2ea6bcb46fca0c42]::string::String>, fn() -> core[940e698046960fd5]::result::Result<(), alloc[2ea6bcb46fca0c42]::string::String>><unknown>
  753. 38.41 s > at <unknown source file>:<unknown line>
  754. 38.41 s > 11: test[75d6903177b1d7e9]::run_test::{closure#0}<unknown>
  755. 38.41 s > at <unknown source file>:<unknown line>
  756. 38.41 s > 12: std[bcb96dfbba0ab899]::sys::backtrace::__rust_begin_short_backtrace::<test[75d6903177b1d7e9]::run_test::{closure#1}, ()><unknown>
  757. 38.41 s > at <unknown source file>:<unknown line>
  758. 38.41 s > 13: <std[bcb96dfbba0ab899]::thread::lifecycle::spawn_unchecked<test[75d6903177b1d7e9]::run_test::{closure#1}, ()>::{closure#1} as core[940e698046960fd5]::ops::function::FnOnce<()>>::call_once::{shim:vtable#0}<unknown>
  759. 38.41 s > at <unknown source file>:<unknown line>
  760. 38.41 s > 14: <std[bcb96dfbba0ab899]::sys::thread::unix::Thread>::new::thread_start<unknown>
  761. 38.41 s > at <unknown source file>:<unknown line>
  762. 38.41 s > 15: start_thread<unknown>
  763. 38.41 s > at <unknown source file>:<unknown line>
  764. 38.41 s > 16: __clone3<unknown>
  765. 38.41 s > at <unknown source file>:<unknown line>
  766. 38.41 s >
  767. 38.41 s > Run with COLORBT_SHOW_HIDDEN=1 environment variable to disable frame filtering.
  768. 38.41 s > Run with RUST_BACKTRACE=full to include source snippets.
  769. 38.41 s >
  770. 38.41 s > FAIL [ 3.372s] (451/456) gammalooprs::test_renormalization finite_part_ghost_2loop
  771. 38.41 s > stdout ---
  772. 38.41 s >
  773. 38.41 s > running 1 test
  774. 38.41 s > ━━━━━━━━━━━━━━━━━━━━━━━━━━━━━━━ Snapshot Summary ━━━━━━━━━━━━━━━━━━━━━━━━━━━━━━━
  775. 38.41 s > Snapshot: finite_part_ghost_2loop-3
  776. 38.41 s > Source: crates/gammalooprs/tests/test_renormalization.rs:464
  777. 38.41 s > ────────────────────────────────────────────────────────────────────────────────
  778. 38.41 s > Expression: align_to_rqft(&a, &model).to_bare_ordered_string()
  779. 38.41 s > ────────────────────────────────────────────────────────────────────────────────
  780. 38.41 s > -old snapshot
  781. 38.41 s > +new results
  782. 38.41 s > ────────────┬───────────────────────────────────────────────────────────────────
  783. 38.41 s > 1 │-(-1𝑖/32*ε+1𝑖/16)*(cas(2,coad(8)))^2*dot(P(0,mink(4)),P(0,mink(4)))*gs^4*ε^(-2)
  784. 38.41 s > 1 │+(-1𝑖/16+1𝑖/32*ε)*(cas(2,coad(8)))^2*dot(P(0,mink(4)),P(0,mink(4)))*gs^4*ε^(-2)
  785. 38.41 s > ────────────┴───────────────────────────────────────────────────────────────────
  786. 38.41 s > To update snapshots run `cargo insta review`
  787. 38.41 s > Stopped on the first failure. Run `cargo insta test` to run all snapshots.
  788. 38.41 s > test finite_part_ghost_2loop ... FAILED
  789. 38.41 s >
  790. 38.41 s > failures:
  791. 38.41 s >
  792. 38.41 s > failures:
  793. 38.41 s > finite_part_ghost_2loop
  794. 38.41 s >
  795. 38.41 s > test result: FAILED. 0 passed; 1 failed; 0 ignored; 0 measured; 5 filtered out; finished in 3.36s
  796. 38.41 s >
  797. 38.41 s > stderr ---
  798. 38.41 s > The application panicked (crashed).
  799. 38.41 s > Message: snapshot assertion for 'finite_part_ghost_2loop-3' failed in line 464
  800. 38.41 s > Location: /nix/store/30svmzr0z0zpcqjyynjn7w21wgx18y4b-vendor-cargo-deps/c19b7c6f923b580ac259164a89f2577984ad5ab09ee9d583b888f934adbbe8d0/insta-1.47.2/src/runtime.rs:719
  801. 38.41 s >
  802. 38.41 s > ━━━━━━━━━━━━━━━━━━━━━━━━━━━━━━━━━━ BACKTRACE ━━━━━━━━━━━━━━━━━━━━━━━━━━━━━━━━━━━
  803. 38.41 s > 1: <color_eyre[51793ea62743adbd]::config::PanicHook>::panic_report<unknown>
  804. 38.41 s > at <unknown source file>:<unknown line>
  805. 38.41 s > 2: <color_eyre[51793ea62743adbd]::config::PanicHook>::into_panic_hook::{closure#0}<unknown>
  806. 38.41 s > at <unknown source file>:<unknown line>
  807. 38.41 s > 3: std[bcb96dfbba0ab899]::panicking::panic_with_hook<unknown>
  808. 38.41 s > at <unknown source file>:<unknown line>
  809. 38.41 s > 4: std[bcb96dfbba0ab899]::panicking::panic_handler::{closure#0}<unknown>
  810. 38.41 s > at <unknown source file>:<unknown line>
  811. 38.41 s > 5: std[bcb96dfbba0ab899]::sys::backtrace::__rust_end_short_backtrace::<std[bcb96dfbba0ab899]::panicking::panic_handler::{closure#0}, !><unknown>
  812. 38.41 s > at <unknown source file>:<unknown line>
  813. 38.41 s > 6: __rustc[6c289b9f9c454d21]::rust_begin_unwind<unknown>
  814. 38.41 s > at <unknown source file>:<unknown line>
  815. 38.41 s > 7: core[940e698046960fd5]::panicking::panic_fmt<unknown>
  816. 38.41 s > at <unknown source file>:<unknown line>
  817. 38.41 s > 8: insta[307a548ac79ef4d9]::runtime::assert_snapshot<unknown>
  818. 38.41 s > at <unknown source file>:<unknown line>
  819. 38.41 s > 9: test_renormalization[9b33d9b78f5a79c8]::finite_part_ghost_2loop<unknown>
  820. 38.41 s > at <unknown source file>:<unknown line>
  821. 38.41 s > 10: <test_renormalization[9b33d9b78f5a79c8]::finite_part_ghost_2loop::{closure#0} as core[940e698046960fd5]::ops::function::FnOnce<()>>::call_once<unknown>
  822. 38.41 s > at <unknown source file>:<unknown line>
  823. 38.41 s > 11: test[75d6903177b1d7e9]::__rust_begin_short_backtrace::<core[940e698046960fd5]::result::Result<(), alloc[2ea6bcb46fca0c42]::string::String>, fn() -> core[940e698046960fd5]::result::Result<(), alloc[2ea6bcb46fca0c42]::string::String>><unknown>
  824. 38.41 s > at <unknown source file>:<unknown line>
  825. 38.41 s > 12: test[75d6903177b1d7e9]::run_test::{closure#0}<unknown>
  826. 38.41 s > at <unknown source file>:<unknown line>
  827. 38.41 s > 13: std[bcb96dfbba0ab899]::sys::backtrace::__rust_begin_short_backtrace::<test[75d6903177b1d7e9]::run_test::{closure#1}, ()><unknown>
  828. 38.41 s > at <unknown source file>:<unknown line>
  829. 38.41 s > 14: <std[bcb96dfbba0ab899]::thread::lifecycle::spawn_unchecked<test[75d6903177b1d7e9]::run_test::{closure#1}, ()>::{closure#1} as core[940e698046960fd5]::ops::function::FnOnce<()>>::call_once::{shim:vtable#0}<unknown>
  830. 38.41 s > at <unknown source file>:<unknown line>
  831. 38.41 s > 15: <std[bcb96dfbba0ab899]::sys::thread::unix::Thread>::new::thread_start<unknown>
  832. 38.41 s > at <unknown source file>:<unknown line>
  833. 38.41 s > 16: start_thread<unknown>
  834. 38.41 s > at <unknown source file>:<unknown line>
  835. 38.41 s > 17: __clone3<unknown>
  836. 38.41 s > at <unknown source file>:<unknown line>
  837. 38.41 s >
  838. 38.41 s > Run with COLORBT_SHOW_HIDDEN=1 environment variable to disable frame filtering.
  839. 38.41 s > Run with RUST_BACKTRACE=full to include source snippets.
  840. 38.41 s >
  841. 38.41 s > error: test run failed
  842. 38.41 s >
  843. 38.41 s > ========== nextest test summary ==========
  844. 38.41 s > report: target/nextest/ci_gammaloop/junit.xml
  845. 38.41 s > tests: 456, failures: 2, errors: 0
  846. 38.41 s >
  847. 38.41 s > 1. gammalooprs::test_renormalization::finit_part_ghlo
  848. 38.41 s > failure: test failure with exit code 101
  849. 38.41 s > system-out
  850. 38.41 s > running 1 test
  851. 38.41 s > ren part: 1/2*GC_10^2*dot(P(0,mink(dim)),P(0,mink(dim)))*cas(2,coad(8))/ε
  852. 38.41 s > ━━━━━━━━━━━━━━━━━━━━━━━━━━━━━━━ Snapshot Summary ━━━━━━━━━━━━━━━━━━━━━━━━━━━━━━━
  853. 38.41 s > Snapshot: finit_part_ghlo
  854. 38.41 s > Source: crates/gammalooprs/tests/test_renormalization.rs:557
  855. 38.41 s > ────────────────────────────────────────────────────────────────────────────────
  856. 38.41 s > Expression: align_to_rqft(&a, &model).to_bare_ordered_string()
  857. 38.41 s > ────────────────────────────────────────────────────────────────────────────────
  858. 38.41 s > -old snapshot
  859. 38.41 s > +new results
  860. 38.41 s > ────────────┬───────────────────────────────────────────────────────────────────
  861. 38.41 s > 1 │--1/2*cas(2,coad(8))*dot(P(0,mink(4)),P(0,mink(4)))*gs^2*ε^(-1)
  862. 38.41 s > 1 │+1/2*cas(2,coad(8))*dot(P(0,mink(4)),P(0,mink(4)))*gs^2*ε^(-1)
  863. 38.41 s > ────────────┴───────────────────────────────────────────────────────────────────
  864. 38.41 s > To update snapshots run `cargo insta review`
  865. 38.41 s > Stopped on the first failure. Run `cargo insta test` to run all snapshots.
  866. 38.41 s > test finit_part_ghlo ... FAILED
  867. 38.41 s >
  868. 38.41 s > failures:
  869. 38.41 s >
  870. 38.41 s > failures:
  871. 38.41 s > finit_part_ghlo
  872. 38.41 s >
  873. 38.41 s > test result: FAILED. 0 passed; 1 failed; 0 ignored; 0 measured; 5 filtered out; finished in 0.33s
  874. 38.41 s > system-err
  875. 38.41 s > The application panicked (crashed).
  876. 38.41 s > Message: snapshot assertion for 'finit_part_ghlo' failed in line 557
  877. 38.41 s > Location: /nix/store/30svmzr0z0zpcqjyynjn7w21wgx18y4b-vendor-cargo-deps/c19b7c6f923b580ac259164a89f2577984ad5ab09ee9d583b888f934adbbe8d0/insta-1.47.2/src/runtime.rs:719
  878. 38.41 s >
  879. 38.41 s > ━━━━━━━━━━━━━━━━━━━━━━━━━━━━━━━━━━ BACKTRACE ━━━━━━━━━━━━━━━━━━━━━━━━━━━━━━━━━━━
  880. 38.41 s > 1: <color_eyre[51793ea62743adbd]::config::PanicHook>::panic_report<unknown>
  881. 38.41 s > at <unknown source file>:<unknown line>
  882. 38.41 s > 2: <color_eyre[51793ea62743adbd]::config::PanicHook>::into_panic_hook::{closure#0}<unknown>
  883. 38.41 s > at <unknown source file>:<unknown line>
  884. 38.41 s > 3: std[bcb96dfbba0ab899]::panicking::panic_with_hook<unknown>
  885. 38.41 s > at <unknown source file>:<unknown line>
  886. 38.41 s > 4: std[bcb96dfbba0ab899]::panicking::panic_handler::{closure#0}<unknown>
  887. 38.41 s > at <unknown source file>:<unknown line>
  888. 38.41 s > 5: std[bcb96dfbba0ab899]::sys::backtrace::__rust_end_short_backtrace::<std[bcb96dfbba0ab899]::panicking::panic_handler::{closure#0}, !><unknown>
  889. 38.41 s > at <unknown source file>:<unknown line>
  890. 38.41 s > 6: __rustc[6c289b9f9c454d21]::rust_begin_unwind<unknown>
  891. 38.41 s > at <unknown source file>:<unknown line>
  892. 38.41 s > 7: core[940e698046960fd5]::panicking::panic_fmt<unknown>
  893. 38.41 s > at <unknown source file>:<unknown line>
  894. 38.41 s > 8: insta[307a548ac79ef4d9]::runtime::assert_snapshot<unknown>
  895. 38.41 s > at <unknown source file>:<unknown line>
  896. 38.41 s > 9: <test_renormalization[9b33d9b78f5a79c8]::finit_part_ghlo::{closure#0} as core[940e698046960fd5]::ops::function::FnOnce<()>>::call_once<unknown>
  897. 38.41 s > at <unknown source file>:<unknown line>
  898. 38.41 s > 10: test[75d6903177b1d7e9]::__rust_begin_short_backtrace::<core[940e698046960fd5]::result::Result<(), alloc[2ea6bcb46fca0c42]::string::String>, fn() -> core[940e698046960fd5]::result::Result<(), alloc[2ea6bcb46fca0c42]::string::String>><unknown>
  899. 38.41 s > at <unknown source file>:<unknown line>
  900. 38.41 s > 11: test[75d6903177b1d7e9]::run_test::{closure#0}<unknown>
  901. 38.41 s > at <unknown source file>:<unknown line>
  902. 38.41 s > 12: std[bcb96dfbba0ab899]::sys::backtrace::__rust_begin_short_backtrace::<test[75d6903177b1d7e9]::run_test::{closure#1}, ()><unknown>
  903. 38.41 s > at <unknown source file>:<unknown line>
  904. 38.41 s > 13: <std[bcb96dfbba0ab899]::thread::lifecycle::spawn_unchecked<test[75d6903177b1d7e9]::run_test::{closure#1}, ()>::{closure#1} as core[940e698046960fd5]::ops::function::FnOnce<()>>::call_once::{shim:vtable#0}<unknown>
  905. 38.41 s > at <unknown source file>:<unknown line>
  906. 38.41 s > 14: <std[bcb96dfbba0ab899]::sys::thread::unix::Thread>::new::thread_start<unknown>
  907. 38.41 s > at <unknown source file>:<unknown line>
  908. 38.41 s > 15: start_thread<unknown>
  909. 38.41 s > at <unknown source file>:<unknown line>
  910. 38.41 s > 16: __clone3<unknown>
  911. 38.41 s > at <unknown source file>:<unknown line>
  912. 38.41 s >
  913. 38.41 s > Run with COLORBT_SHOW_HIDDEN=1 environment variable to disable frame filtering.
  914. 38.41 s > Run with RUST_BACKTRACE=full to include source snippets.
  915. 38.41 s >
  916. 38.41 s > 2. gammalooprs::test_renormalization::finite_part_ghost_2loop
  917. 38.41 s > failure: test failure with exit code 101
  918. 38.41 s > system-out
  919. 38.41 s > running 1 test
  920. 38.41 s > ━━━━━━━━━━━━━━━━━━━━━━━━━━━━━━━ Snapshot Summary ━━━━━━━━━━━━━━━━━━━━━━━━━━━━━━━
  921. 38.41 s > Snapshot: finite_part_ghost_2loop-3
  922. 38.41 s > Source: crates/gammalooprs/tests/test_renormalization.rs:464
  923. 38.41 s > ────────────────────────────────────────────────────────────────────────────────
  924. 38.41 s > Expression: align_to_rqft(&a, &model).to_bare_ordered_string()
  925. 38.41 s > ────────────────────────────────────────────────────────────────────────────────
  926. 38.41 s > -old snapshot
  927. 38.41 s > +new results
  928. 38.41 s > ────────────┬───────────────────────────────────────────────────────────────────
  929. 38.41 s > 1 │-(-1𝑖/32*ε+1𝑖/16)*(cas(2,coad(8)))^2*dot(P(0,mink(4)),P(0,mink(4)))*gs^4*ε^(-2)
  930. 38.41 s > 1 │+(-1𝑖/16+1𝑖/32*ε)*(cas(2,coad(8)))^2*dot(P(0,mink(4)),P(0,mink(4)))*gs^4*ε^(-2)
  931. 38.41 s > ────────────┴───────────────────────────────────────────────────────────────────
  932. 38.41 s > To update snapshots run `cargo insta review`
  933. 38.41 s > Stopped on the first failure. Run `cargo insta test` to run all snapshots.
  934. 38.41 s > test finite_part_ghost_2loop ... FAILED
  935. 38.41 s >
  936. 38.41 s > failures:
  937. 38.41 s >
  938. 38.41 s > failures:
  939. 38.41 s > finite_part_ghost_2loop
  940. 38.41 s >
  941. 38.41 s > test result: FAILED. 0 passed; 1 failed; 0 ignored; 0 measured; 5 filtered out; finished in 3.36s
  942. 38.41 s > system-err
  943. 38.41 s > The application panicked (crashed).
  944. 38.41 s > Message: snapshot assertion for 'finite_part_ghost_2loop-3' failed in line 464
  945. 38.41 s > Location: /nix/store/30svmzr0z0zpcqjyynjn7w21wgx18y4b-vendor-cargo-deps/c19b7c6f923b580ac259164a89f2577984ad5ab09ee9d583b888f934adbbe8d0/insta-1.47.2/src/runtime.rs:719
  946. 38.41 s >
  947. 38.41 s > ━━━━━━━━━━━━━━━━━━━━━━━━━━━━━━━━━━ BACKTRACE ━━━━━━━━━━━━━━━━━━━━━━━━━━━━━━━━━━━
  948. 38.41 s > 1: <color_eyre[51793ea62743adbd]::config::PanicHook>::panic_report<unknown>
  949. 38.41 s > at <unknown source file>:<unknown line>
  950. 38.41 s > 2: <color_eyre[51793ea62743adbd]::config::PanicHook>::into_panic_hook::{closure#0}<unknown>
  951. 38.41 s > at <unknown source file>:<unknown line>
  952. 38.41 s > 3: std[bcb96dfbba0ab899]::panicking::panic_with_hook<unknown>
  953. 38.41 s > at <unknown source file>:<unknown line>
  954. 38.41 s > 4: std[bcb96dfbba0ab899]::panicking::panic_handler::{closure#0}<unknown>
  955. 38.41 s > at <unknown source file>:<unknown line>
  956. 38.41 s > 5: std[bcb96dfbba0ab899]::sys::backtrace::__rust_end_short_backtrace::<std[bcb96dfbba0ab899]::panicking::panic_handler::{closure#0}, !><unknown>
  957. 38.41 s > at <unknown source file>:<unknown line>
  958. 38.41 s > 6: __rustc[6c289b9f9c454d21]::rust_begin_unwind<unknown>
  959. 38.41 s > at <unknown source file>:<unknown line>
  960. 38.41 s > 7: core[940e698046960fd5]::panicking::panic_fmt<unknown>
  961. 38.41 s > at <unknown source file>:<unknown line>
  962. 38.41 s > 8: insta[307a548ac79ef4d9]::runtime::assert_snapshot<unknown>
  963. 38.41 s > at <unknown source file>:<unknown line>
  964. 38.41 s > 9: test_renormalization[9b33d9b78f5a79c8]::finite_part_ghost_2loop<unknown>
  965. 38.41 s > at <unknown source file>:<unknown line>
  966. 38.41 s > 10: <test_renormalization[9b33d9b78f5a79c8]::finite_part_ghost_2loop::{closure#0} as core[940e698046960fd5]::ops::function::FnOnce<()>>::call_once<unknown>
  967. 38.41 s > at <unknown source file>:<unknown line>
  968. 38.41 s > 11: test[75d6903177b1d7e9]::__rust_begin_short_backtrace::<core[940e698046960fd5]::result::Result<(), alloc[2ea6bcb46fca0c42]::string::String>, fn() -> core[940e698046960fd5]::result::Result<(), alloc[2ea6bcb46fca0c42]::string::String>><unknown>
  969. 38.41 s > at <unknown source file>:<unknown line>
  970. 38.41 s > 12: test[75d6903177b1d7e9]::run_test::{closure#0}<unknown>
  971. 38.41 s > at <unknown source file>:<unknown line>
  972. 38.41 s > 13: std[bcb96dfbba0ab899]::sys::backtrace::__rust_begin_short_backtrace::<test[75d6903177b1d7e9]::run_test::{closure#1}, ()><unknown>
  973. 38.41 s > at <unknown source file>:<unknown line>
  974. 38.41 s > 14: <std[bcb96dfbba0ab899]::thread::lifecycle::spawn_unchecked<test[75d6903177b1d7e9]::run_test::{closure#1}, ()>::{closure#1} as core[940e698046960fd5]::ops::function::FnOnce<()>>::call_once::{shim:vtable#0}<unknown>
  975. 38.41 s > at <unknown source file>:<unknown line>
  976. 38.41 s > 15: <std[bcb96dfbba0ab899]::sys::thread::unix::Thread>::new::thread_start<unknown>
  977. 38.41 s > at <unknown source file>:<unknown line>
  978. 38.41 s > 16: start_thread<unknown>
  979. 38.41 s > at <unknown source file>:<unknown line>
  980. 38.41 s > 17: __clone3<unknown>
  981. 38.41 s > at <unknown source file>:<unknown line>
  982. 38.41 s >
  983. 38.41 s > Run with COLORBT_SHOW_HIDDEN=1 environment variable to disable frame filtering.
  984. 38.41 s > Run with RUST_BACKTRACE=full to include source snippets.
  985. 38.41 s > =========================================
  986. 38.41 s For full logs, run:
  987. 38.41 s nix log /nix/store/xv6l7wp14z4xm05gkaqsp0kipvyasvyi-gammaloop-nextest-core.drv
  988. 38.53 s [0 built (1 failed), 0.0Run failed.